##TITLE=1H_AM AEAPTMS
 CDCl3, 8 sc, 
 7.06.2021
##JCAMPDX= 6.0         $$ Bruker NMR JCAMP-DX V2.0
##DATA TYPE= NMR FID
##DATA CLASS= NTUPLES
##ORIGIN= UXNMR, Bruker Analytische Messtechnik GmbH
##OWNER= root
$$ XWIN-NMR		Version 3.5
$$ Mon Jun  7 10:14:21 2021 Russian Standard Time (UT+4h)  she@DPX200
##.OBSERVE FREQUENCY= 200.131506
##.OBSERVE NUCLEUS= ^1H
##.DELAY= (6, 6)
##.ACQUISITION MODE= SIMULTANEOUS
##.ACQUISITION SCHEME= undefined
##.AVERAGES= 8
##.DIGITISER RES= 18
##SPECTROMETER/DATA SYSTEM= spect
##.PULSE SEQUENCE= zg30
##.SOLVENT NAME= DMSO
##.SHIFT REFERENCE= (INTERNAL, DMSO, 0, 15.7039)
##AUDIT TRAIL= $$ (NUMBER, WHEN, WHO, WHERE, WHAT)
$$ ##TITLE= Audit trail, XWIN-NMR		Version 3.5
$$ ##JCAMPDX= 5.01
$$ ##ORIGIN= Bruker BioSpin GmbH
$$ ##OWNER= she
$$ F:/spectra/data/she/nmr/H-F/1/audita.txt
$$ ##AUDIT TRAIL=  $$ (NUMBER, WHEN, WHO, WHERE, WHAT)
(   1,<2021-06-07 10:12:45.82 +0400>,<she>,<DPX200>,
      <created by zg, POWCHK disabled, PULCHK disabled
       configuration hash MD5:
       00 E9 B6 7A A2 85 ED C7 34 08 36 98 17 FE 4E 26
       data hash MD5: 16K
       D7 D8 D9 54 AA 5B B9 30 B2 8A E6 DB 25 8E 85 18>)
$$ ##END=
$$ 
$$ hash MD5
$$ DD AA 22 98 C1 8A B8 A4 E9 B0 E1 1A BC AD 71 B4
##$RELAX= 
##$RELAX= 
##$RELAX= 
##$RELAX= 
##$RELAX= 
##$RELAX= 
$$ Bruker specific parameters
$$ --------------------------
##$DU= <F:/spectra>
##$EXPNO= 1
##$NAME= <H-F>
##$PROCNO= 1
##$TYPE= <nmr>
##$USER= <she>
##$AMP= (0..31)
100 100 100 100 100 100 100 100 100 100 100 100 100 100 100 100 100 100 
100 100 100 100 100 100 100 100 100 100 100 100 100 100 
##$AQSEQ= 0
##$AQ_mod= 1
##$AUNM= <au_zg>
##$AUTOPOS= <>
##$BF1= 200.13
##$BF2= 200.13
##$BF3= 200.13
##$BF4= 200.13
##$BF5= 200.13
##$BF6= 200.13
##$BF7= 200.13
##$BF8= 200.13
##$BYTORDA= 1
##$CFDGTYP= 0
##$CFRGTYP= 5
##$CHEMSTR= <none>
##$CNST= (0..31)
1 1 145 1 1 1 1 1 1 1 1 1 1 1 1 1 1 1 1 1 1 1 1 1 1 1 1 1 1 1 1 1 
##$CPDPRG= <>
##$CPDPRG1= <>
##$CPDPRG2= <>
##$CPDPRG3= <>
##$CPDPRG4= <mlev>
##$CPDPRG5= <mlev>
##$CPDPRG6= <mlev>
##$CPDPRG7= <mlev>
##$CPDPRG8= <mlev>
##$CPDPRGB= <>
##$CPDPRGT= <>
##$D= (0..31)
0 1.2 0 0 0 0 0 0 0 0.06 0 0.03 0 0 0 0 0.0002 0 0 0 0 0 0 0 0 0 0 0 0 
0 0 0 
##$DATE= 1623046365
##$DBL= (0..7)
120 120 120 120 120 120 120 120 
##$DBP= (0..7)
150 150 150 150 150 150 150 150 
##$DBP07= 0
##$DBPNAM0= <>
##$DBPNAM1= <>
##$DBPNAM2= <>
##$DBPNAM3= <>
##$DBPNAM4= <>
##$DBPNAM5= <>
##$DBPNAM6= <>
##$DBPNAM7= <>
##$DBPOAL= (0..7)
0.5 0.5 0.5 0.5 0.5 0.5 0.5 0.5 
##$DBPOFFS= (0..7)
0 0 0 0 0 0 0 0 
##$DE= 6
##$DECBNUC= <off>
##$DECIM= 32
##$DECNUC= <off>
##$DECSTAT= 4
##$DIGMOD= 1
##$DIGTYP= 9
##$DL= (0..7)
0 120 120 120 120 120 120 120 
##$DP= (0..7)
150 150 150 150 150 150 150 150 
##$DP07= 0
##$DPNAME0= <>
##$DPNAME1= <>
##$DPNAME2= <>
##$DPNAME3= <>
##$DPNAME4= <>
##$DPNAME5= <>
##$DPNAME6= <>
##$DPNAME7= <>
##$DPOAL= (0..7)
0.5 0.5 0.5 0.5 0.5 0.5 0.5 0.5 
##$DPOFFS= (0..7)
0 0 0 0 0 0 0 0 
##$DQDMODE= 0
##$DR= 18
##$DS= 0
##$DSLIST= <SSSSSSSSSSSSSSS>
$$ [...]
##$SUBNAM2= <"">
##$SUBNAM3= <"">
##$SUBNAM4= <"">
##$SUBNAM5= <"">
##$SUBNAM6= <"">
##$SUBNAM7= <"">
##$SUBNAM8= <"">
##$SUBNAM9= <"">
##$SW= 20.0188882624521
##$SWIBOX= (0..15)
0 0 2 0 0 0 0 0 0 0 0 0 0 0 0 0 
##$SW_h= 4006.41025641026
##$TD= 16384
##$TD0= 1
##$TE= 0
##$TE2= 300
##$TE3= 300
##$TEG= 300
##$TL= (0..7)
0 120 120 120 120 120 120 120 
##$TP= (0..7)
150 150 150 150 150 150 150 150 
##$TP07= 0
##$TPNAME0= <>
##$TPNAME1= <>
##$TPNAME2= <>
##$TPNAME3= <>
##$TPNAME4= <>
##$TPNAME5= <>
##$TPNAME6= <>
##$TPNAME7= <>
##$TPOAL= (0..7)
0.5 0.5 0.5 0.5 0.5 0.5 0.5 0.5 
##$TPOFFS= (0..7)
0 0 0 0 0 0 0 0 
##$TUNHIN= 0
##$TUNHOUT= 0
##$TUNXOUT= 0
##$USERA1= <user>
##$USERA2= <user>
##$USERA3= <user>
##$USERA4= <user>
##$USERA5= <user>
##$V9= 5
##$VALIST= <valist>
##$VCLIST= <CCCCCCCCCCCCCCC>
##$VD= 0
##$VDLIST= <DDDDDDDDDDDDDDD>
##$VPLIST= <PPPPPPPPPPPPPPP>
##$VTLIST= <TTTTTTTTTTTTTTT>
##$WBST= 1024
##$WBSW= 4
##$XGAIN= (0..3)
0 0 0 0 
##$XL= 0
##$YL= 0
##$YMAX_a= 457131
##$YMIN_a= -513822
##$ZGOPTNS= <>
##$ZL1= 120
##$ZL2= 120
##$ZL3= 120
##$ZL4= 120
##$ABSF1= 10
##$ABSF2= 0
##$ABSG= 5
##$ABSL= 3
##$ALPHA= 0
##$AQORDER= 0
##$ASSFAC= 0
##$ASSFACI= 0
##$ASSFACX= 0
##$ASSWID= 0
##$AUNMP= <proc_1d>
##$AZFE= 0.1
##$AZFW= 0.1
##$BCFW= 1
##$BC_mod= 2
##$BYTORDP= 1
##$COROFFS= 0
##$CY= 11.3945322036743
##$DATMOD= 1
##$DC= 2
##$DFILT= <>
##$DTYPP= 0
##$F1P= 15.9154993809931
##$F2P= -4.1035820241983
##$FCOR= 0.5
##$FTSIZE= 0
##$FT_mod= 4
##$GAMMA= 1
##$GB= 0.15
##$INTBC= 1
##$INTSCL= 1
##$ISEN= 128
##$LB= 0.24
##$LEV0= 0
##$LPBIN= 0
##$MAXI= 10000
##$MC2= 0
##$MEAN= 0
##$ME_mod= 0
##$MI= 1.114404
##$NCOEF= 0
##$NC_proc= 0
##$NLEV= 6
##$NOISF1= 3.799351
##$NOISF2= 2.8
##$NSP= 1
##$NTH_PI= 0
##$NZP= 0
##$OFFSET= 15.70392
##$PC= 1
##$PHC0= -11283.88
##$PHC1= 16.80101
##$PH_mod= 1
##$PKNL= yes
##$PPARMOD= 0
##$PSCAL= 0
##$PSIGN= 0
##$REVERSE= no
##$SF= 200.130013532006
##$SI= 16384
##$SIGF1= 3
##$SIGF2= 2
##$SINO= 400
##$SIOLD= 16384
##$SREGLST= <1H.CDCl3>
##$SSB= 0
##$STSI= 0
##$STSR= 0
##$SW_p= 3612.71676300578
##$SYMM= 0
##$S_DEV= 0
##$TDeff= 0
##$TDoff= 0
##$TI= <>
##$TILT= no
##$TM1= 0
##$TM2= 0
##$TOPLEV= 0
##$USERP1= <user>
##$USERP2= <user>
##$USERP3= <user>
##$USERP4= <user>
##$USERP5= <user>
##$WDW= 1
##$XDIM= 8192
##$YMAX_p= 0
##$YMIN_p= 0
$$ End of Bruker specific parameters
$$ ---------------------------------
##NTUPLES= NMR FID
##VAR_NAME=  TIME,          FID/REAL,        FID/IMAG
##SYMBOL=    X,             R,               I
##VAR_TYPE=  INDEPENDENT,   DEPENDENT,       DEPENDENT
##VAR_FORM=  AFFN,          ASDF,            ASDF
##VAR_DIM=   8192,          8192,            8192
##UNITS=     SECONDS,       ARBITRARY UNITS, ARBITRARY UNITS
##FACTOR=    0.0002496,     1,               1
##FIRST=     0,             0,               0
##LAST=      2.0444736,     0,               0
##MIN=       0,             -513822,         0
##MAX=       2.0444736,     457131,          0
$$ Real data points
##PAGE= N=1
##DATA TABLE= (X++(R..R)), XYDATA
0@%%%%%%%%%%%%Qj6J6j6K4l2L2m0N3o1P2q8J02j15J33j56J77k01K32k64K96l34
34a78L79m26M75n31N94o58P28q11Q99r93J098j210J331j468J621j784J962k163
52a135K385k632K913l232L593m010M507n099N813o701P841r359J1477j4632J9798
67A1527k9605N4153k16353l33544P15263J08580l67176q9361j41K27963J60782
78B42088l26930r5165K02173K2882O886K5000j78975j03311K93081K32648m05469
89h5092k90987M25342K66869k71821k73023K5821L86280R7351m57410n0918L20614
100I3026M607l5039r6093j45257K03374J14110j13294k9001j69182Q0871M05849
111C13971k17215m23657K40289K99511p7866k01622j36027J68172K64511j23502
$$ plain form
0 0 0 0 0 0 0 0 0 0 0 0 0 0 8 -8 8 -8 16 -16 16 -24 29 -32 40 -48 54 -61 72 -84 93 -108 124 -140 156 -178
34 -178 201 -225 250 -281 313 -345 383 -428 471 -522 576 -634 697 -771 850 -934 1028 -1135
52 -1135 1250 -1382 1531 -1701 1892 -2118 2389 -2710 3103 -3598 4243 -5116 6361 -8271 11527
67 11527 -18078 36075 -180278 -513822 201441 310021 -57155 -146516 -146657 81306 242088
78 242088 -84842 -180007 22166 45048 51934 76934 -102041 -205352 87729 320377 -85092
89 -85092 -376079 49263 316132 44311 -228712 -202891 183389 280740 -176670 -227588 93026
100 93026 97633 62594 -33499 -178756 24618 138728 25434 -3567 -172749 -91878 313971
111 313971 96756 -326901 -86612 212899 135033 -66589 -202616 -34444 230067 106565
121A06565k99337N1425K74430o807j55056j6738p2465J07501K83575k65293l11818
132c04018L27397J70836j56041o0999j50199J16779L38533k31729k91531K07269
142c3703J33658j4279l9624j88694K3130K64617J4366k33140j10237J71184K00442
153A87720r4670k40809j4765K53313J13987k47520j39816J69910J08425k779j05689
164a2693j58032J43263J89862j18846j05248m6739L8862K69607p1816l80139J24240
175a27679L13782p0035j72797r5421Q5515K50192o9675k89787N9399K15955j4369
186H5080q7392m7587n0324J02085J65421j37034k14149J23332J81943j8510j23218
197b0353j56285J15182K96242j53364l01405J48209J91585l5635p9239j26508
$$ plain form
121 106565 -192772 -141347 133083 126276 -28780 -45518 -117983 -10482 273093 7800 -304018
132 -304018 23379 194215 38174 -22825 -173024 -56245 282288 50559 -240972 -33703
142 -33703 99955 85676 46052 -142642 -119512 145105 159471 -73669 -183906 -12722 187720
153 187720 93050 -147759 -162524 90789 204776 -42744 -182560 -12650 95775 92996 -12693
164 -12693 -170725 -27462 162400 43554 -61694 -108433 -69571 200036 128220 -251919 -127679
175 -127679 186103 116068 -56729 -152150 -66635 183557 113882 -175905 -116506 99449 85080
186 85080 -2312 -49899 -100223 1862 167283 30249 -183900 -60568 121375 102865 -20353
197 -20353 -176638 -61456 234786 81422 -219983 -71774 119811 84176 4937 -121571
207a21571M3509K16360m9476j74020J7953N2568P3265N9035j66927j18323J98342
218C0715J39692j46981j48773L6403J60521R0207j77363j80360J83035J94861
228A81957j41981j40905L1960P4437J11004m7690k03416M9876J85180k3222p9891
239b691o7579l0769J82232Q4049k41062q7711J95469R0958p1399j28389o0183
250a37075J82587J35186k04699j39531J53153J04378l3780p7068j00342P5738
260d1453J79023p6461j68671L5621R3728N9922j4981j71137k5875K31843L5375
271A36934k02610n1741J00488J01428J4737j68818q4742K04753R3585j63653p2475
282i2114M7857O7889Q6258r1770j64728J07852J57355o4762r7394m2895M6548
$$ plain form
207 -121571 -78062 138298 88822 -85198 -67245 -14677 58588 117623 -49304 -167627 30715
218 30715 170407 23426 -125347 -88944 71577 161784 -15579 -195939 -12904 181957
228 181957 39976 -100929 -68969 5468 116472 68782 -134634 -84758 100422 77200 -2691
239 -2691 -70270 -101039 81193 165242 -75820 -163531 31938 122896 51497 -76892 -137075
250 -137075 45512 180698 -24001 -163532 -10379 93999 60219 -16849 -117191 -41453
260 -41453 137570 61109 -107562 -71941 21787 81709 66728 -104409 -130284 101559 136934
271 136934 -65676 -117417 -16929 84499 99236 -69582 -154324 50429 144014 -19639 -92114
282 -92114 -44257 23632 109890 18120 -146608 -38756 118599 53837 -43557 -86452 -39904
293c9904J61929l1678k20066K8714J89964M279j01426p5935J2598J53327L9766
304A21568j86593n4181J47607N6956m6877p3958o7522J07737J39521j27317j41290
315a24349R1320R7015R723o0028j28471N8650J92335o6627j67095L3604Q5884
326B1961N2897j3400j47992j6932J87522K2073j46009m0510N0898Q5330M3651
337I9489j35499r8819J51823J06394j08806q9149J1492P7295R7210q4442j62464
348a35476Q8367J53947n2313r3946l6095L5202J37108j2368j87938R964J55484
359F1936J2637o6372p3093k0419J41860O3818j67740o7701J22776O4906k5422
370D7186q0149p3060J07188J26266j13343j21028P0157Q3594J9422n1274j13754
$$ plain form
293 -39904 122025 90347 -129719 -101005 88959 93238 -8188 -84123 -71525 81802 121568
304 121568 -65025 -119206 28401 85357 38480 -35478 -103000 4737 144258 16941 -124349
315 -124349 -33029 63986 73709 13681 -114790 -56140 136195 69568 -97527 -63923 21961
326 21961 74858 61458 -86534 -103466 84056 106129 -39880 -80390 -29492 55838 99489
337 99489 -36010 -134829 16994 123388 14582 -74567 -63075 14220 111430 26988 -135476
348 -135476 -47109 106838 54525 -39421 -75516 -40314 96794 84426 -103512 -93548 61936
359 61936 74573 8201 -64892 -85311 56549 120367 -47373 -115074 7702 72608 47186
370 47186 -32963 -106023 1165 127431 14088 -106940 -36783 46811 66233 14959 -98795
381i8795M1646J62707l6758j42145O854P4094N8974m693j31932l1691J66323L7935
393A02519j32016m2616M3878P0066M9847j11123j00280J28009R6728q5878o9073
404d9939q365N6581J05154o6118j49703O7025J28081k6597p2539n1364K5817J25235
416H3268l786j52350q450J19578L0934m7538o9849k8738J10916P6663j28352q4603
428a02307R6088O8243j3849o0931q1090P5740J32512q7277j16248N2690O2484
439B6055L2484k4816j20136J9917J51205j7527j14348j8173M8078Q0384M376j29958
451f2459l2817J35704M9046r6765o2355K9606P4035M4080q4467r6126Q5948J02964
463H6394n6024p0193j8963L8082J10843l7325j58065M9288J27823k3674n4123
$$ plain form
381 -98795 -57149 105558 68800 -73345 -66491 7603 66577 61884 -70048 -101739 64584 102519
393 102519 -29497 -72113 -28235 41831 91678 -19445 -119725 8284 105012 19134 -49939
404 -49939 -58304 -1723 103431 37313 -112390 -45365 82716 56119 -16420 -67784 -41967 83268
416 83268 79482 -72868 -81318 38260 69194 21656 -48193 -76931 33985 110648 -17704 -102307
428 -102307 -6219 62024 48175 -12756 -93846 -18106 114406 27129 -89119 -36429 26055
439 26055 58539 33723 -86413 -66496 84709 67182 -47166 -65339 -17261 63123 67499 -62459
451 -62459 -95276 40428 89474 -7291 -69646 -40040 33995 78075 -6392 -102518 -16570 86394
463 86394 30370 -39823 -58786 -20704 90139 52814 -105251 -55963 71860 48186 -5937
474e937n2292K963J28654L478j43123P85Q9174K3315j2004o7773m5411R7835P6443
487I6107r2801q8812N8279Q4504k337o6801o5946N4280J19086n4540j19883M3219
499c5645O6377R655o015q6829j5142J27310Q087r3295k3806J7497P9676L5677
511H3547j31727m4982J27494M3070o9323o1286K286Q6693M0184q9469o0225O1556
523a2182O5204j7255n1969l7369K4079R7512n154j37564M891J21062L346n2004
535B597n2565j4402J23136K7780j50696m095R8606J29m925l8633o2373P9956P7871
548H2386p5859o9781K6060O6625L4241o4676p9886N0948J08130k9503j13275R325
560e5265Q4154J8342l0425o0309j2224R3798K4238p9308k8807J6646N9241M6668
$$ plain form
474 -5937 -58229 -55266 73388 76866 -66257 -65472 23702 47017 35013 -32760 -78171 19664 96107
487 96107 3306 -85506 -27227 57277 54940 -11861 -77807 -23527 95559 41019 -78864 -35645
499 -35645 30732 40387 34372 -52457 -67599 59711 67798 -25497 -49303 -31806 47870 83547
511 83547 -48180 -93162 34332 77402 8079 -53207 -50921 35772 75956 -13513 -73738 -12182
523 -12182 53022 35767 -16202 -53571 -29492 68020 62866 -74698 -69807 51255 54601 2597
535 2597 -49968 -64370 58766 86546 -64150 -68245 30361 30490 25565 -13068 -75441 4515 82386
548 82386 6527 -63254 -37194 29431 63672 -1004 -80890 -29942 78188 48685 -64590 -55265
560 -55265 28889 47231 16806 -43503 -55727 38071 62309 -16999 -45806 -29160 30081 76749
572G6749j03735o5946J13226N3505o2871n2699j1609P8136N6447r6018n6049P2621
584A757L7390j3995k3923m6782J4525Q7527j96j03149j6673Q9417L5273m5638
596A5533o5167p297J06775L3329j30941k1478J02159K567k6862j1852m5034M1089
608g179O9020m7374n2039N629L2048O0373k9871j09167L0985J21622j6350j08296
620e0599j3730Q2459M4903n1345o7224K1432P2640j968n1867r494L591K4772N0714
633E4284m5925q0874N1203P8893j9002o7950m1449P1993R1276q4517j00801P8207
645a4662P5890l9085m4396j5403K5357N4416j4802n9839P66L4455K4022O738n5330
658b1873m4958Q2505O5965q8183o7473O1875O3220j1100o6731l6778P5731N7047
$$ plain form
572 76749 -26986 -92932 20294 73799 10928 -41771 -53380 24756 81203 -14815 -70864 1757
584 1757 39147 25152 1229 -45553 -31028 56499 56303 -46846 -63519 25898 61171 15533
596 15533 -49634 -56931 49844 83173 -47768 -69246 32913 35480 8618 -3234 -48268 -7179
608 -7179 61841 14467 -37572 -31943 105 60478 30607 -78560 -47575 74047 57697 -50599
620 -50599 -64329 18130 63033 11688 -55536 -34104 38536 36568 -15299 -24793 -21202 3570 54284
633 54284 8359 -72515 -21312 57581 38579 -29371 -70820 1173 92449 7932 -92869 -14662
645 -14662 61228 22143 -22253 -37656 -12299 42117 27315 -32524 -31758 2697 26719 33457 -21873
658 -21873 -66831 15674 81639 -6544 -74017 -12142 51078 39978 -26753 -63531 12200 69247
670F9247p0428m6867L7246K5831J5330j2316o0177P910P4973R91n7238k5078K3501
683a7075O0688N962r0437k0202R4574K3527o5262k9705J5440M5849K8250o2277
695a0668m6554N8152M2413k4760l4104k4177L2425O2749l2664p5085K1998O2623
707C2348L327l8110l6700J3449O3559L929p0847j4724N0577K6564j0559m6652
719b3839k8213O7374M5458o8552m2767L7270L9483J2140m8592m8757N8317N4500
731E3822m6589l9573Q806K4755L5553j7235o3055R065O5913P408m9090l0239K0733
744a9726N4748J0027p5244l0166Q1389L3830o0112l0465J4555L7057L0301n2211
756f017m6240N3130L3706k2084j7188k7052J5397O1770j8072o4591N340M7313
$$ plain form
670 69247 -1181 -48048 -10802 15029 30359 18043 -42134 -34224 40749 41740 -15498 -40576 -17075
683 -17075 43613 49575 -40862 -61064 33510 57037 -8225 -37930 -22490 23359 51609 -10668
695 -10668 -57222 930 43343 18583 -15521 -39698 -7273 55476 22812 -52273 -30275 32348
707 32348 35675 -2435 -39135 -25686 37873 41802 -29045 -43769 6808 33372 22813 -23839
719 -23839 -52052 15322 60780 -7772 -50539 -13269 26214 38354 -10238 -58995 -678 53822
731 53822 7233 -32340 -23534 1221 36774 19539 -43516 -34451 31462 38870 -10220 -40459 -19726
744 -19726 35022 45049 -30195 -60361 21028 54858 -5254 -35719 -21164 15893 46194 -6017
756 -6017 -52257 873 34579 12495 -4693 -31745 -16348 45422 27350 -37241 -31901 15412
768A5412K5529k8964n6359J4894P1413K44o8765j6617N3024K8916k5871l7147
780b4291o202M4341K7596m4224k8087K2746J7448J9886j5856n9092K4102O8408
792D6775k1378m9428q679K8041N1288k2058p6731K2112P0664j0812m6189j3540
804b9935K1468L5101k469m2176j3763L4640K4472j5394k6869j5110K5497M8469
816D3931k7287o7167K6355O0202q139l9817k8385K7916O0514k8993o3849K5302
828a9417L9604k227j1456k9554l242M6657R309l7965j9261J3600L4937J2241m6945
841a3719l2487M8659M5911l9434m9207K0218M2948Q228l3960l6299K9125M8578
853C8561k3178l6974M744J3639K6304K887n1656o775N2582J0807k9816k5599J395
$$ plain form
768 15412 40941 11977 -44382 -29488 41925 42169 -26596 -43213 9811 38727 12856 -24291
780 -24291 -30493 13848 41444 -2780 -30867 -8121 9327 29213 13357 -45735 -21633 46775
792 46775 25397 -24031 -32710 -4669 46619 24561 -52170 -30058 40606 29794 -16395 -29935
804 -29935 -8467 26634 24165 -18011 -31774 2866 27338 11944 -14925 -30035 -4538 43931
816 43931 16644 -50523 -24168 36034 27895 -11922 -40307 -12391 48123 19130 -44719 -19417
828 -19417 20187 17960 6504 -23050 -26292 20365 29674 -8291 -27552 -13952 20985 33226 -13719
841 -13719 -46206 2453 48364 8930 -40277 -20059 22889 31117 -2843 -39142 -10017 38561
853 38561 15383 -21591 -16847 -3208 23096 25983 -25673 -32448 20134 30941 1125 -24474 -23079
866b3079M6349J6093n6112k2262M5857K5156k0687k9481p165L2566K7922l0165
878D992l7123J9465L3825k8k2932k4903J1904M5418n513n0094n92L5132J3554
891B3105j1013l3353p860M7598J5300m4186j7648K1601K3423P474l3555k8200
903c7314L8639L4096k9668l0270O250K5055K1065k2357l9171J8277M1245p334
915A8513l0125j1458J4096L2044l05m4634r236M2882J6748k6734k4916L103L4262
928A4240J7724l9981k7474L5094K6481j5384k2039j2458K1565L4086k2171l8205
940b8522J4429K8003O436j5322l1287Q839M5172m228m1198n855K5873K1996r300
953A5036l5705l771L9519J4141l2494k1197J7001K4186M022k4663k4167K4240
$$ plain form
866 -23079 23270 39363 -16749 -39011 6846 32002 11315 -18166 -25331 7235 35157 4992
878 4992 -32131 -12666 21159 21131 -1801 -26704 -14800 30618 25105 -24989 -25581 9551 23105
891 23105 12092 -21261 -29121 18477 33777 -10409 -28057 -6456 16967 24441 -9114 -37314
903 -37314 1325 35421 5753 -24517 -18267 6788 27853 5496 -33675 -15398 25847 18513
915 18513 -11612 -23070 -8974 23070 22765 -21869 -31105 11777 28525 1791 -23125 -20022 14240
928 14240 31964 -8017 -35491 -397 26084 10700 -11339 -23797 -2232 31854 9683 -28522
940 -28522 -14093 13910 20346 5024 -26263 -17424 27748 23520 -17678 -23533 2340 24336 15036
953 15036 -20669 -24440 15079 29220 -3274 -24471 -7470 16716 20738 -3925 -28092 -3852
965c852L4024j9227k9402L056J7725K2223j1152m2119J0668M2586n611k6365j1932
978a9378Q896L2999q55m1861k772L2534J0536j4445k2122j919K8532J3909k5578
991a524k3197J5783K7335k348k4057j5090J6858L2668j2367m0053Q495L0748L417
1004A6668j3316k4170K450L9835j507l5804j403J5336J4911M787l0998j3877L4792
1017G704J6974k2533k2265M196K8768J0948k8670k1991K1086L0078j0853l0740
1029a7298K93K1235J3926p552k9137n82L4415M453k2839j2841L046K8507R686
1042B5312l8721j1649L1597J3394j0951k2207p562L1597J4934k9275j6031J4179
1054e383J8107M129k0242j7411J6557K5737p791k9485j544K5219J0581j2503k2470
$$ plain form
965 -3852 30172 10945 -18457 -15401 2324 24547 13395 -28724 -18056 24530 18919 -7446 -19378
978 -19378 -10482 22517 21662 -20199 -22971 9563 20099 5654 -16468 -18387 10145 24054 -1524
991 -1524 -24721 -8938 18397 16049 -8008 -23098 -6240 26428 14061 -25992 -17497 13251 16668
1004 16668 3352 -20818 -18368 21467 19960 -15844 -17247 -1911 13000 17787 -13211 -27088 7704
1017 7704 24678 2145 -20120 -15924 12844 23792 -4878 -26869 -5783 24295 13442 -17298
1029 -17298 -17005 4230 18156 10604 -18533 -19115 15300 19753 -3086 -15927 -12881 15626 25312
1042 25312 -13409 -25058 6539 19933 8982 -13225 -20787 10810 25744 -3531 -19562 -5383
1054 -5383 12724 16853 -3389 -20800 -4243 21494 13703 -15782 -17326 7893 18474 5971 -16499
1067a6499j248L3840P161l4629p342J9103J1614K803k2510j6656K9304J8373k2109
1080A205j6630L305J8570J3982k0885k2317J5948K3728l995k2431q819J7509J7962
1093A7132p789k3896l386K5363J1729j9244j7578N830K3941P353k8395j3472K4166
1106A754J4159r021j6227q515K0684J8224k0208j8029R280J4670Q697j3240k3682
1119b1454J2137K9962o654k8046l231K1647J4307j2505k3016K983K7392M461k4377
1132f394q576J2913J1963L332j5996j6576J7778K2058j2133k1347j454J9825J6561
1145B1954j8888k5603J5438K6285p075k1262m728J4333J4837p111j9399l84J6680
1158E077Q143q223j5963k804K2046J1819k3516j7185J7770J9620o472k1289n819
$$ plain form
1067 -16499 -17747 16093 23254 -11375 -18717 386 12000 14803 -7707 -24363 4941 23314 1205
1080 1205 -15425 -12120 6450 20432 -453 -22770 -6822 16906 12911 -9520 -18339 -830 17132
1093 17132 9343 -14553 -17939 7424 19153 -91 -17669 -11839 12102 19455 -8940 -22412 1754
1106 1754 15913 6892 -9335 -17850 2834 21058 850 -17179 -7899 6771 15468 2228 -21454
1119 -21454 -9317 20645 13991 -14055 -17286 4361 18668 6163 -16853 -13870 13522 17983 -6394
1132 -6394 -14970 -2057 9906 13238 -2758 -19334 -1556 20502 8369 -12978 -14432 5393 21954
1145 21954 3066 -22537 -7099 19186 12111 -9151 -13879 454 15291 8180 -11219 -11603 5077
1158 5077 13220 4997 -10966 -13770 8276 20095 -3421 -20606 -2836 16784 10312 -10977 -16796
1171a6796K1552J3818j8194j6015R579J3682K464r613j3881M478K0452J577k0507
1184g404q851J4547J6850n429k4236k555K7087P378k2245j0599J0763J4436J740
1197A1482j7436r700J5527J2486o340j3038o594J3372J7440j1728k2610O334K2802
1210A1997K147j9141j0601J2463J7530m352k1201k008J9046O502r969j0454k753
1223a0794J5510J2651j7650j6371J2596J6653p65j7438j0944J8184J6921j4443
1235D110j7448N114J6035N464j3391j2635P682J5334J276j5338j0008J2063J5897
1248A4155n007j9314m020K0476J0574j7492j3448Q562J4741L038j6663j0702J5514
1261D14J1544p493r806n579R402J6159r245j9542M830J7057M233j3289j3486R244
$$ plain form
1171 -16796 4756 18574 380 -15635 -6056 7626 10090 477 -13404 -8926 11526 13103 -7404
1184 -7404 -16255 -1708 15142 9713 -14523 -17078 10009 17387 -4858 -15457 -4694 9742 11482
1197 11482 -5954 -15654 -127 12359 6019 -7019 -13613 -241 17199 5471 -17139 -10805 11997
1210 11997 14144 -4997 -15598 -3135 14395 10043 -11158 -13166 5880 12382 2413 -8041 -10794
1223 -10794 4716 17367 -283 -16654 -4058 12595 11830 -5608 -16552 1632 18553 4110
1235 4110 -13338 -8224 7811 13275 -116 -12751 -5069 10265 11541 -3797 -13805 -1742 14155
1248 14155 9148 -10166 -14186 6290 16864 -628 -14076 -5514 9227 12265 -4398 -15100 414
1261 414 11958 4465 -5341 -10920 -1518 14641 5396 -14146 -9316 7741 11974 -1315 -14801 -5557
1275e557J8253l408j8686l496J5860Q744r832j0898J88J1693R529j1517j4733
1288a3860Q085J4510O86j2300j1873J1346J8724r043j8466K151J4747P968j1283
1301A392j5180P732J6151j141j2535p384P952J3905k546j5643m083J3340J1299
1314A3259q928j5469K444J5992O006j4252j3462J1452J6230n727j4167l328J0699
1327G49J2407p875j6499M040J4169K923q829j1111L575J6266J025j5930o444J1182
1341c52J2124m878j5894j805J5989Q112j3034j2902P609J4582p82j3021o834R583
1355a503J2348n259j3632p10J0637P804n817j4051R95J6162L889j3443r465P743
1369d302J4283j455j6519l883J4560Q006q916j1003J801J1949M891j0080r623
$$ plain form
1275 -5557 12696 9288 -9398 -12894 2966 11710 1878 -9020 -8832 2861 12390 873 -13860
1288 -13860 -5775 8735 9421 -2879 -14752 -3406 15318 6275 -12191 -10040 4707 12675 1392
1301 1392 -13788 -6056 10095 8954 -3581 -10965 -3013 10892 8346 -7297 -11380 1960 13259
1314 13259 4331 -11138 -8694 7298 13304 -948 -14410 -2958 13272 7545 -6622 -9950 749
1327 749 13156 5281 -11218 -7178 6991 9914 1085 -10026 -6451 9815 10840 -5090 -11534 -352
1341 -352 11772 6894 -9000 -10805 5184 13296 262 -12640 -5031 9551 8769 -4252 -11086 -1503
1355 -1503 10845 5586 -8046 -8756 1881 9685 3868 -10183 -9188 6974 10863 -2580 -12045 -4302
1369 -4302 9981 8526 -7993 -11876 2684 10690 1774 -9229 -7428 4521 9412 -668 -10291
1382a0291N508J1713J059j1113p951Q573J3232m211j5442j292J4575O978j0715
1395F23j1411N113J3878R76j3284o066R664R510l247j1016m116J1036R742q284
1409C118j2331K515J2733M898j1698j0922R059J3470l716j2931l454J0847R649
1422A1237p554j2321K127J1862M519r604r996N655J2451J6j2214o398J0302J0651
1436A0733o509j1722R2J0627P032r070j1527N896J1710m4r557p415P166J2417
1450I829m395j2922o46J0310P161p561j1460M073J1460J402r002p866O349J1501
1464H233k810j1035k742Q085R293n261j2924J933J2202L320q990r313O014J2243
1478H248k493j0474l236P052R506m201j2034J034R866M308n458j0282K059J3233
$$ plain form
1382 -10291 -4783 6930 7989 -3124 -11075 -2502 10730 6519 -8923 -10215 4360 11338 623
1395 623 -10788 -5675 8203 9179 -4105 -10171 -507 9003 5756 -5260 -9376 1660 11402 3118
1409 3118 -9213 -6698 6035 10933 -765 -11687 -2628 10842 7126 -5805 -9259 1588 11237
1422 11237 3683 -8638 -6511 5351 9870 266 -9730 -4075 8376 8392 -3822 -10220 82 10733
1436 10733 4224 -7498 -7406 3221 10253 1183 -10344 -4448 7262 7218 -2339 -9754 -2588 9829
1450 9829 5434 -7488 -8134 2176 9337 1776 -9684 -5611 5849 7251 -1751 -9617 -3268 8233
1464 8233 5423 -5612 -8354 -269 9024 3763 -9161 -7228 4974 8294 -696 -10009 -3995 8248
1478 8248 5755 -4719 -7955 -903 8603 4402 -7632 -6598 3268 7576 2118 -8164 -6105 7128
1492G128R06j1012n459O529J0765k878j2661m82J0034N495n614j0499K189J2025
1506F466J069q894n869M143J0914n54j2325k588R123P130m520j1496J002J2085
1520E686K346q395p218L500J1909m80j2361k427Q207O587k768j1010j002J1833
1534D407L492q061p104K704J0329J287j0323m539O377Q199j585j1108k011J0475
1548B539M812o059q465J160J1112K023j0146m534N462P822m73j0210k429Q754
1562A368M683l688p551j811J0049M965r125o571M451Q593J019r966m723Q806P019
1577G518m688q694J08R030L362o424n984J636Q566K741r296n135O528P020j111
1592E177r026l844J0015O350p578p500K569Q390K591q399n660N960P054j356p527
$$ plain form
1492 7128 8034 -2978 -8437 -1908 8857 5979 -6682 -7164 2870 8365 2751 -7748 -5559 6466
1506 6466 7535 -1359 -7228 -3085 7829 7275 -5050 -7638 1485 8615 4095 -7401 -6399 5686
1520 5686 8032 -363 -7581 -4081 7828 7348 -5013 -7440 767 7354 4586 -6424 -7426 4407
1534 4407 7899 -162 -7266 -4562 5767 7054 -3269 -7808 -1431 6768 5183 -5925 -7936 2539
1548 2539 7351 1292 -7173 -6013 5099 7122 -3024 -7558 -2096 5726 5253 -4957 -7386 1368
1562 1368 6051 2363 -5188 -6999 3050 8015 -1110 -7681 -3230 5363 6382 -3584 -8307 499 7518
1577 7518 2830 -5864 -5756 3274 6636 212 -5772 -4136 4430 7171 -2125 -7260 -732 6288 5177
1592 5177 -3849 -7693 2322 8672 1094 -6406 -3837 4553 7144 -1255 -6915 -955 6099 4743 -2784
1607b784l485O875O816m383q411K17Q657L894p229p069M058Q755N0r403l392P744
1623I10N540l867p070j172P858N074p315o816M109P059P59o783n499N829Q136
1638F752l599q454j29O963M113m457p357J449Q771J632p818m395M813O619q48
1653D055p839k871P622N287n303o267J252O508K963n650n965L609P249l90o600
1668b340l335M717O871k326q662j31Q120K927n558n551K159P651P73p750k793
1683e228N193M616r87o164k869O734N284n071o455J603O905K489o468n847M950
1698a315P705k611p641l33N691L455k519o437l69P769K184o286l679K170N633
1713C417K163p577m794P511N494m681n621M3N811L722n395n660L231O034j03n287
$$ plain form
1607 -2784 -6269 606 7422 3039 -5372 -5155 3502 7396 167 -6902 -2844 5911 5961 -3442 -6834 910
1623 910 6450 2583 -4487 -5659 2199 7273 -42 -6858 -2749 4310 5069 -1714 -7213 -1384 6752
1638 6752 3153 -5301 -5430 1533 5646 1189 -6168 -4719 4052 5684 -2134 -6529 -1716 4903 4055
1653 4055 -3784 -6655 967 6254 951 -5316 -4064 2444 5407 -243 -6208 -2599 4650 4260 -2340
1668 -2340 -5675 -958 5913 3587 -5075 -5206 2914 5841 283 -5268 -3109 4542 5315 -2435 -5228
1683 -5228 -35 4581 3594 -2570 -5439 1295 6579 1508 -4947 -3344 3561 6050 -418 -6265 -1315
1698 -1315 6390 3779 -3862 -4195 1496 4951 2432 -4005 -4374 3395 5579 -707 -4386 -2216 3417
1713 3417 5580 -1997 -6791 720 6214 1533 -4088 -4045 1766 5488 93 -5567 -2336 3698 3595 -1692
1729a692l232L477N711r20p123j704O961L628m741n264J245O807J567p121l051
1744e452N069L876r91m837k985N665M795m444m868R78M587L431m572o323L954
1759b117P111j899o085j085M341L990j962n854l40O354K081m778l127J341M177
1774B148K809n432n323N623N586l369m720p48M245M609m036o215L122N252k20
1789C331l619l302K086N558l75o043j575M775L683k567n320k38O220K523n999
1804h62l779L972M157o57m286k903M308M832l616m643R94L360K917k628o020K088
1820b766O722j004n309j368K870M213p89o136n30N939J605l865k708O84L843K370
1836C771m681m035M198M294k039l577j539L303M531l061n679K284M899j63l013
$$ plain form
1729 -1692 -4924 -1447 4264 3344 -3779 -5483 1478 5106 365 -4899 -3654 3153 4720 -2401 -5452
1744 -5452 -383 3493 2502 -2335 -5320 345 5140 696 -4172 -3194 1393 4824 252 -6071 -2117
1759 -2117 4994 3095 -2990 -4075 266 4256 2294 -3560 -3900 2454 4535 -243 -3370 -2029 2148
1774 2148 4957 -475 -5798 -175 5411 2042 -2678 -3426 819 5428 1392 -4823 -1701 3551 3331
1789 3331 -288 -3590 -1504 4054 3679 -2364 -3939 836 4519 1952 -3368 -3606 2614 5137 -862
1804 -862 -4641 -669 3488 2831 -1455 -4358 -50 4782 1166 -3477 -2483 877 3794 1166 -4854 -2766
1820 -2766 3956 2952 -2357 -3725 -855 3358 2569 -3567 -4097 1842 3447 -418 -3126 -2442 1401 3771
1836 3771 -910 -4945 -747 3547 1508 -2069 -3608 -305 4226 1165 -4514 -2230 2669 2506 -507
1851e07k648J203N199k41n613n91M036J977j239l648j411N235K638m997k831K740
1867f98L055P16l656l331L954M344l099l776O58K832K375j959m606J305N031l19
1883B826l782j372J527L459N26n105j725N232K019l317k285p8L318K817m516l656
1899d112M190K870j743k068j897K180M212k364m576J468L288P21j814l274O26
1914b293M851K24n048r89L640J830j214l027j215M132K459m308k056K265J537
1929G88J178k012l773K895M191k571k817L11J405L085j282m911J484M541p74k669
1945i31r50Q28K792O45l930j332L752J715k231j642m16K090L026l054l761L218
1961a81K869j577j434j567J217M023j811m150J716K212L70n39l072J12M384r6
$$ plain form
1851 -507 -3155 -1952 3247 3006 -2607 -3198 838 2815 1576 -2072 -3483 1752 4390 -607 -3438 -698
1867 -698 2357 3073 -583 -3914 40 4384 1285 -2491 -1833 999 3374 1415 -3191 -1886 3145 2826
1883 2826 -956 -2328 -801 2658 3184 -1921 -3646 1586 3605 288 -1997 -2075 1243 4060 -456 -4112
1899 -4112 78 2948 1205 -863 -2760 -580 3632 1268 -3308 -1840 1448 2169 355 -2919 -2293
1914 -2293 2558 2782 -2266 -3255 385 2215 1001 -2026 -3241 891 3350 -958 -3014 -749 788
1929 788 1966 -46 -3819 -924 3267 696 -2121 -1810 -405 2680 1398 -3513 -2029 2512 1738 -931
1945 -931 -1881 -1053 1739 2384 -1546 -2878 874 2589 358 -1284 -1700 390 3416 362 -3399 -181
1961 -181 2688 1111 -323 -1890 -673 3350 1539 -2611 -895 1317 1687 1148 -1924 -1812 2572 2476
1977B476l718n95J989J788q8l113j181L606J826l253j669J464J275J166j414l497
1993b938K082L881k273k382M79N03K678k27m922J088M477j289k155k93r8K559
2009A170J008l895q44L183Q71j462j128q76J967K506k493l111K464K447j122j364
2025f79j327J089L415j545l694J809J952l51L1k179n78L946ol349J87J304R03
2042I28Q97k759j588L576J471k886r92J032Q94J221j295k721J901K862j884j523
2058h66M52J32J935K32l853M77L760r26j758m9m46K035J265l517p72L124Q5j052
2076B58n14j197J644K365k533k216K135J310n34p29j588Q42K971j422k961J502
2092f67J416k79J45j835p03L340Q3l088M40J014L05J094j970j890L214J212k747
$$ plain form
1977 2476 -1242 -1837 152 1940 1852 -1261 -2442 1164 2990 -263 -1932 -468 807 1973 559 -2938
1993 -2938 -856 3025 752 -1630 -1151 -648 2030 1803 -3119 -2031 2446 1157 -998 -1291 -1389 1170
2009 1170 2178 -1717 -2561 622 1493 31 -1097 -1973 -6 2500 7 -3104 -640 1807 685 -679
2025 -679 -2006 -917 2498 953 -2741 -932 1020 669 700 -1479 -2057 1889 1883 -1466 -1279 25 928
2042 928 1825 -934 -2522 1054 2525 -361 -1353 -321 573 1794 499 -2222 -321 2541 657 -866
2058 -866 -414 -282 1653 1885 -1968 -1491 2269 1343 -415 -464 -910 1125 2390 -1127 -1899 1225 1310 258
2076 258 -256 -1453 191 2556 23 -2193 -58 1252 718 -11 -1599 -757 2214 792 -2169 -667
2092 -667 749 470 615 -1220 -1923 1417 1500 -1588 -1148 -134 171 1265 -705 -2595 619 1831 -916
2109i16m09Q19L69J332j050k598K021K213j848q90K77l2J776J40l140N42K903
2126A509q43j183n2m62J778J148l117l80K701k46q40p1j110J282K109k310j583
2143a670K148M43m33M6j577M72K724j341k309J522P24k66N73j690o81K907j18
2160A474k508N94Q56j29J042j458j669K534J069k330p9P00k67J343n62k451J660
2177a81J911j795n48L77m72J577K72k846P09K318j138p01K76q45J429J074k649
2194a232k50K273n23n89J47j056R74J828k065j240K024J14o62M71j326K20K379
2211A487j279j893J654L60m94Q66j408p33K709k80k208Q93O09l37J044j195j299
2228a504K315N07k015M20O54n47J145m38j973J574J512j760j65N68o24J255K74
$$ plain form
2109 -916 -1325 -506 -137 1195 145 -2453 -432 1781 -67 -957 -680 -712 1064 1204 -1936 -1394 1509
2126 1509 666 -517 -569 -1031 747 1895 -1222 -1602 1099 853 13 -58 -1168 114 2223 -87 -1670
2143 -1670 478 921 488 534 -1043 -571 2153 812 -1497 25 749 483 1056 -634 -1315 1592 1474
2160 1474 -1034 -440 416 287 1329 -129 -1798 736 1805 -525 -604 96 -171 1172 610 -1841 -181
2177 -181 1730 -65 -613 -236 -708 869 1141 -1705 -996 1322 184 -517 -241 -1086 343 1417 -1232
2194 -1232 -1482 791 268 -321 -174 -1230 -256 1572 -493 -1733 291 405 -257 214 -1112 -892 1487
2211 1487 208 -1685 -31 329 -165 701 -707 -1440 1269 989 -1219 -326 283 -54 990 -205 -1504
2228 -1504 811 1318 -697 -277 377 -170 975 537 -1436 138 1650 -110 -275 293 -331 924 1198
2245A198k523Q82K059j453m72O71q75J072J005k392L1K044q63n39N02j136Q00
2262A1J678k028r70J953r0o45M23j140K81K030j321j683J690K72p42P35j021o09
2280a176K283m25k103J177N12n13Q20j027j157K361K37k183O84O40n38R38n34
2297dj672J776J069j953M5Q14o32J125j5k173J184J890j705n08Q24o81J040O31
2315A055k267M12K101j094o44O64q56Q54J302k121n43K158l84q10N78j006N33
2332f8J758j671j331K039O2q35O19r67k52K200q87j889J325N81o10O82j079q27
2350a150K380k2k358Q19R21n98P58p62j420K067P56k259L29Q10m97R49l32k100
2368a709J532J692j910l71P91m76R89K20k379P90K184j283q60N77n59R57J031
$$ plain form
2245 1198 -1325 -443 1616 163 -309 362 -513 559 1564 -828 -797 1247 384 -155 347 -789 11
2262 11 1689 -339 -1309 644 554 -91 332 -808 -527 1503 182 -1501 189 461 -281 454 -567 -1176
2280 -1176 1107 682 -1421 -244 268 -245 575 -452 -1609 752 989 -1194 -510 130 -408 530 -4
2297 -4 -1676 100 1169 -784 -739 75 -557 568 553 -1620 -436 1454 -251 -759 65 -616 424 1055
2315 1055 -1212 -800 1301 207 -437 227 -629 225 1527 -594 -1137 1021 637 -173 405 -601 -68
2332 -68 1690 19 -1312 727 789 -46 573 -394 -646 1554 667 -1222 103 684 74 756 -323 -1150
2350 -1150 1230 1208 -1150 -331 590 -8 750 -12 -1432 635 1391 -868 -539 271 -226 723 391 -1709
2368 -1709 -177 1515 -395 -766 25 -451 538 758 -1621 -831 1353 70 -790 -213 -772 185 1216
2385A216k387k95K411m86j050M84p82O67J716k055j184K258J89j039N08j106K09
2402g26K317j301j966J668P10o86L90j107l86K559m69k346R86J110m87M53q51
2419a32j162K179P14k391K20J059l75Q57n39j989J820J684k136m71Q76k54J055
2436A015j53k335J129K115j552q16O42m61J115O79k389j86K361m26j068K01p47
2453h76R78J701k301j324K477K09j063K24j003M62K183j603j877J814O59p18L51
2470B93j235l07K546m26k435Q80J060k92M50j192j064K465P82k644P7J187j22
2487B3P30p72j917J970J722k141o97R86j74J134n9k560J050K405j368r56L31k57
2505e50J440N13k624j2K561m00j145J6n74J270J412k383j066K297L58r83J13j089
$$ plain form
2385 1216 -1171 -1466 945 459 -591 -107 -889 -222 1494 -561 -1745 513 702 -337 171 -935 -726
2402 -726 1591 290 -1676 -8 702 16 406 -701 -1087 1472 1003 -1343 -357 753 266 719 -132
2419 -132 -1294 885 1599 -792 -572 487 112 969 430 -1559 261 1945 -191 -662 214 -40 1015
2436 1015 862 -1473 -344 1771 219 -597 45 -416 699 1378 -1011 -1197 1164 738 -330 -129 -876
2453 -876 102 1803 -498 -1822 655 864 -199 25 -978 -516 1667 64 -1813 1 660 -58 293
2470 293 -942 -1249 1297 871 -1564 -684 376 84 534 -658 -1722 743 1525 -1119 -1042 145 23
2487 23 753 -19 -1936 34 1756 -385 -1082 -96 -270 864 805 -1755 -705 1700 332 -624 -293 -550
2505 -550 890 1403 -1221 -1233 1328 928 -217 -201 -775 495 1907 -476 -1542 755 1113 130 243 -846
2523h46N76K338j681k062J864O79n71M47j762j15K704m19k680J190P05M11L86
2540A164j574j152K792M69k694M0J285j38P92r63k273K438J789k146r43P92j29
2557d51J599k50k840Q18K987j386j373K38j66J637N37k895R4K727n90j168m9p11
2575a242J617J475k520j222K276M35p82j93j447Q33L032k178k100J660J179l62
2591D61j39j457K1K811o28k560Q62J153j00N19j593j115K768Q85k512k68Q57N87
2609E52R71j412k074K335J747k066q66M59L69J488o18k692J251K292j187r19j23
2626d93l27J970N09k941k09K544j6j102m39o96J621J629k681j313K338N91o98
2643B87k93j468Q71K702j795k226J419J090Qp1k049J68L010n50k613N24J069M99
$$ plain form
2523 -846 -270 2068 387 -1675 189 868 297 744 -1018 -1133 1571 1152 -1528 -338 367 778 1164
2540 1164 -410 -1562 1230 1699 -995 -955 330 192 984 21 -2252 186 1975 -171 -1114 -322 -451
2557 -451 1148 898 -1942 -1124 1863 477 -896 -658 -824 813 1350 -1545 -1451 1276 686 -482 -531 -1242
2575 -1242 375 1850 -670 -1892 384 819 37 -156 -1603 -770 2262 84 -2016 -356 823 461
2591 461 322 -1135 -1114 1697 1069 -1491 -629 524 424 943 -650 -1765 1003 1888 -624 -892 -35 552
2609 552 1523 111 -1963 372 2119 53 -813 -354 15 1503 885 -1807 -556 1736 549 -370 -493
2626 -493 -820 1150 1659 -1282 -1491 1053 1037 -65 -504 -1200 421 2050 -631 -1944 394 985 287
2643 287 -6 -1474 -603 2099 304 -1922 -503 587 595 524 -1525 -1357 1653 1103 -1510 -986 83 582
2661E82M48j932j101K829Q10k343n05P11O66J275j465k388K278K014j835r73J99
2678g30L08J993n80l072J130K570q88j068m03k73K229O42l180k73K603J98r28
2695B78p78q96J945J702k478j584K131Q47m63m77j665J007K793j582k444J300
2711c64J123K15k3k172j76L290m67k599L88Q08P17P69k273j174K855Q60k158o22
2729a003L98P73J472j440k498J969K195j622j103l9L64J961l07l147P20K633n60
2746G66j041n91n76K395R36l220n60K517L28o33r98j122K070J956k599j433J648
2763a57R92N7p77k022J087K955j404k443Q45J042Q65M0k541j38L247J4k687jO44
2782c82Q76J307k351j775L236J043k065o93q1J336J727j716k552J759K156j046
$$ plain form
2661 582 1030 -902 -2003 826 1636 -707 -1212 -501 165 1440 -25 -2413 -135 1879 44 -929 -730
2678 -730 -422 1571 991 -2081 -951 1619 731 -337 -740 -1013 1216 1858 -1322 -1595 1008 1206 278
2695 278 -500 -1396 549 2251 -227 -1811 320 1167 704 227 -1438 -431 2362 780 -1664 -364
2711 -364 759 974 951 -1221 -1397 1893 1426 -1173 -785 23 740 1509 -764 -1938 917 1777 -381 -1003
2729 -1003 -605 168 1640 200 -2298 -329 1866 244 -859 -898 -534 1427 1120 -2027 -1307 1326 766
2746 766 -275 -866 -1442 953 1889 -1331 -1891 626 954 321 -677 -1799 271 2227 -372 -1805 -157
2763 -157 835 892 115 -1907 -820 2135 731 -1712 -867 175 1040 1080 -1461 -1599 1648 1662 -1025 -1026 -382
2782 -382 494 1801 -550 -2325 911 1954 -111 -804 -885 451 2178 462 -2090 -331 1825 779
2798G79j162m70M14K223n17k988M32K692j62j137p70p61K569J091l227q35K513
2815F84L65l18j128j365J828K257k468j794J704P93N63o45k422J241K626j006
2831I15k414M96Q79J614l01k761j59L025Q3k482J09N14J332M76k112j457K457
2848B14J420j518r76l12O68K543j445l168J952K090n73j375j058M94K798n51k917
2865a714L78K297J95o65j575j75J936J469k922j123J928P20Q8q98j857J530K964
2882B576k263k185J582J198L29l98k313N48L176j203k006k9J019J213L36k841
2898a261q02L289P63k030r30Q9J421J770k581j891K324J856j771j190n26J326
2914a44K360j587l016J557K183o60j098r48O7K901l2l430K75K249J84m50j345
$$ plain form
2798 779 -383 -853 -439 1784 1267 -1721 -1289 1403 1241 104 -666 -1427 1142 2233 -994 -1829 684
2815 684 1049 731 -397 -1762 66 2323 -145 -1939 -235 558 1121 476 -1946 -705 1921 915
2831 915 -1499 -1003 -124 1490 1189 -1572 -1731 1294 1377 -1105 -996 -482 850 1326 -786 -2243 214
2848 214 1634 116 -860 -1172 -504 2039 594 -2574 -622 1468 895 -480 -1538 -1044 1754 1203 -1714
2865 -1714 -1336 961 1156 491 -1084 -1259 677 2146 -776 -1899 29 749 837 -61 -1918 -388 2576
2882 2576 313 -1872 -290 908 1237 839 -1474 -926 2250 1047 -959 -988 31 1244 1580 -1261
2898 -1261 -2063 1226 1989 -41 -971 -882 539 2309 -272 -2163 161 2017 246 -944 -1470 -144
2914 -144 2216 629 -2387 -830 1353 693 -405 -1353 -1286 1615 1583 -1847 -1572 677 861 411 -934
2931i34r86K671J389k872j228J663J018M64j595j942K059K601j903k065P19J234
2947B93J025n40k685M96L202n25k326j23O79J627N68k924j035L361P39k023p85
2964i76j19J605J660k405k148K477J653j032j157r59J087K591j284l046J117K283
2980A347o5j115j538K31K905J27l237j23K190N00l66j515j223K682J595k743j299
2997a647J405J077O90j407k471J994K760j800k107N57J119J340o25k856N38L123
3013A690m26k099l57M25J647R07k821j291K902J106j645j181l20J731J958k366
3029a40k391K234J912r79j186j113R67K656j022k958Q28K044J87o17j867j97K974
3046A332O41l088o92J890J138n4j941j491K829J898k606j609J160J295R87j410
$$ plain form
2931 -934 -1920 751 2140 -732 -1960 -297 721 1185 -410 -2352 -293 2308 405 -1660 -941 293
2947 293 1318 778 -1907 -1411 1791 1266 -1060 -1183 -504 1123 1691 -1233 -2268 1093 1832 -191 -976
2964 -976 -1095 510 2170 -235 -2383 94 1747 715 -442 -1401 -314 2277 993 -2053 -936 1347
2980 1347 1282 167 -1371 -1140 1765 1892 -1345 -1468 722 1222 856 -659 -1882 800 2395 -348 -1647
2997 -1647 -242 835 1525 118 -2353 -359 2401 601 -1506 -949 170 1510 885 -1971 -1433 1690
3013 1690 1264 -835 -1192 -767 880 1787 -1034 -2325 577 1683 38 -1143 -1463 268 2226 -140
3029 -140 -2531 -297 1615 636 -550 -1663 -696 1960 938 -2020 -1192 852 1039 422 -1445 -1642 1332
3046 1332 1973 -1115 -1807 83 1221 1167 -774 -2265 564 2462 -144 -1753 -593 702 1689 279
3062B79k526J638K874j296k145N6J003J797k99l161J17L348R5k195p65L96J928
3079A144R87l017j399K967J244j470j292o78J877K145k305k521J911J986n84j221
3095b26j391R14K785q26l001M33K038N78n67k043n83L122R19l191q97J783J359
3112A206R0k131j519K705J930k506j433Q60J148J139j104k597J175K725o39j837
3128g88p25P89K345l2l421k59L347O14k192j200M92K161Q58k946j247K649J066
3145A511j097r29j008J289K578j613k855J199K038L85j201k347Q82L633q40l531
3161a906M53K291P53r00k017k29K829P44k460r95J162J212O87j647k296K092K775
3178B548j709k401L46J618J774j505l161J546L124j057k050l47P98K016j05k939
$$ plain form
3062 279 -2247 -609 2265 969 -1176 -1120 -117 1680 1381 -1780 -1663 1685 1780 -415 -1180 -784 1144
3079 1144 2131 -886 -2285 682 1926 456 -836 -1514 363 2508 203 -2318 -407 1579 995 -226
3095 -226 -1617 -703 2082 1256 -1745 -1312 726 1304 737 -1306 -1889 1233 2152 -1039 -1936 -153 1206
3112 1206 1296 -835 -2354 351 2281 -225 -1658 -798 350 1489 385 -2212 -1037 1688 1049 -788
3128 -788 -1513 -724 1621 1589 -1832 -2091 1256 1870 -322 -1522 -1030 1131 1989 -957 -2204 445 1511
3145 1511 414 -515 -1523 -234 2344 731 -2124 -925 1113 1498 297 -2050 -1168 2465 1625 -1906
3161 -1906 -1453 838 1591 691 -1326 -1555 1274 2018 -442 -1437 -275 937 1624 -23 -2319 -227 2548
3178 2548 839 -1562 -1216 402 2176 671 -2490 -944 2180 1123 -927 -1274 -476 1540 1435 -1504
3194a504k03K431P56j186j448m50K341J553k754k029K288J847q50j578j096J623
3210b59K521j754k710J272J917R2q46j973K28L266j68l030p4J487J232K8k428
3227a199r67K926J357k322j461Q28J650J057j981k262J932K641j277k153j62J449
3243E6J942r44l175P42L156l16j798r20K91K379O46l197q06K521J089q68j697
3260h99r12K476J979k691k233J897K111m17j754j350J504K631j356k793P70J882
3276H45N17o64k159k08L170M48k841q65J426J689L49k759j429L150J678k444j621
3293a718O77J783J101j979k225J819K337j011j725n17R87K118m09l081N6K867
3309A080M90j718j472K22K729P91l313j112K679J223j047j541p80K185J788k135
$$ plain form
3194 -1504 -1707 724 1480 294 -1154 -1604 737 2290 -464 -2493 -205 1642 792 -786 -1882 -259
3210 -259 2262 508 -2202 -930 987 1079 233 -1740 -1512 1754 1586 -1444 -1518 -31 1201 1229 -1199
3227 -1199 -2166 760 2117 -205 -1666 -838 812 1869 -112 -2374 -442 2199 922 -1231 -1393 56
3243 56 1998 1054 -2121 -1379 1777 1461 -337 -1257 -966 1413 2059 -1138 -1944 577 1666 798 -899
3260 -899 -1811 665 2644 -47 -2280 -383 1728 1311 -443 -1793 -289 2342 986 -1807 -1037 845
3276 845 1362 698 -1461 -1669 1501 1949 -892 -1757 -331 1358 1707 -1052 -2481 669 2347 -97 -1718
3293 -1718 -1041 742 1843 -136 -2361 -542 1795 784 -941 -1458 -471 1647 1238 -1843 -1787 1080
3309 1080 1570 -148 -1620 -1398 1331 2122 -1191 -2303 376 1599 552 -989 -1769 416 2204 69
3325F9k066J342J661L88j206k177J020L115p10k954p6J984J355p73k762o1L584
3342A733M07k894r23J394J580M23k291j657K522J896j667j708j66J700J995j656
3358F88l116J450K975m93k254r05J265K441n54l320K26K711M79j421j455r0K466
3375A093J091k804j499J963J691l27k004j457K311K473k254k433J183J935N12
3390A474j443k127J003L001n93k671k14J464J523k32k695p66L243J217k646j403
3406a865R26K006Q23k531j866K498K051j480j771k49J517J955j277k889Q91K731
3422A470R2j892j467R24K746r0l329l32K651R78j184j826m02K593J441k737j632
3439a996J651J674K23j857j937K071K752j738k647N31K089J059j287k623Q76L129
$$ plain form
3325 69 -1997 -655 1006 1394 188 -1989 -969 2146 1436 -1518 -1594 390 1745 972 -1790 -1851 1733
3342 1733 2140 -754 -1677 -283 1297 1720 -571 -2228 294 2190 523 -1185 -1351 349 2344 688
3358 688 -2428 -978 1997 1504 -750 -1655 -390 2051 1497 -1823 -1597 1114 1593 172 -1283 -1373 1093
3375 1093 2184 -620 -2119 -156 1535 1208 -796 -2253 58 2531 277 -2156 -973 962 1474
3390 1474 31 -2096 -1093 1908 1315 -1356 -1570 -106 1417 1185 -1510 -2276 967 2184 -462 -1865
3406 -1865 -939 1067 1890 -641 -2507 -9 2042 562 -1209 -1458 59 2014 737 -2152 -1261 1470
3422 1470 1562 -330 -1797 -873 1873 1783 -1546 -1878 773 1751 567 -1259 -1661 932 2373 -364 -1996
3439 -1996 -345 1329 1552 -305 -2242 -171 2581 843 -1804 -1273 816 1875 588 -2035 -1159 1970
3455A970k32k652o66J379J740R2k820j044L054J482k177j838N48K068J343k522
3471b75k314K307K412j293j891o02J553K155j178l037P04K628L83j609j767N34
3487a290K890K25l224p73K417J384r07k089n44K537J572k417j839J359J807L63
3503A471j738k049J656K854j129k633L4J829J571j035k852M48L220J40k447r85
3519a645J000K070L60k813j223K809J587j617j911r1K144J723k261k560J856K558
3535A986o84j970j055J351K601r03l175L02K690O14j410j902J11K976O53l120
3551i35j160K175J629m51k280j137K676J962k354k163J057K016P87j967k166J508
3567h03K928q93k624l45J811J775q49k977Q3L244N42k396j312Q60K193O20k857
$$ plain form
3455 1970 1738 -914 -1580 -201 1539 1631 -1189 -2233 821 2303 126 -1712 -1164 904 2247 -275
3471 -275 -2589 -282 2130 837 -1054 -1656 -103 2052 874 -2163 -1459 1169 1552 -57 -1824 -1290
3487 -1290 1600 1825 -1399 -2172 245 1629 722 -1367 -1911 626 2198 -219 -2058 -699 1108 1471
3503 1471 -267 -2316 -660 2194 1065 -1568 -1534 295 1866 831 -2021 -1573 1647 1787 -660 -1645
3519 -1645 -645 1425 1785 -1028 -2251 558 2145 528 -1383 -1474 670 2393 132 -2428 -572 1986
3535 1986 1302 -668 -1723 -372 2229 1326 -1849 -1547 1143 1757 347 -1555 -1444 1532 2185 -935
3551 -935 -2095 80 1709 1258 -1022 -2159 517 2479 125 -2038 -981 1035 1822 -145 -2311 -803
3567 -803 2125 1232 -1392 -1737 74 1849 1000 -1977 -1894 1350 1892 -504 -1816 -956 1237 1857 -1000
3584a000j421K663J712j441j844m45K077K005k126k582J582K396k25j816j421
3599a886J229K659p12k933j0K375J006j203k033m8K784R83k850j333J769J740
3615A537q5k165j491K460K204j978k164N90J893J178j605k530J250K908m84k456
3631i38p51J548K099n60l006l00L101R15k164j663O96K317P67k754j617K358J914
3648A962j072j889p88J949K227j815k821J160K456K70j865j870J244K993p61l070
3664a690l4K240J072r70k234j50K808R23k446j488J251J982K65k176j760K189
3680b18K593j733k554M86K063J259j639k552J197K914m87k175p20J188J936j66
3696A392k757n30K594J254j577j954J70K552J087k624j929K101K215r30k088o69
$$ plain form
3584 -1000 -2421 242 1954 513 -1331 -1776 301 2306 180 -2402 -820 1576 1351 -465 -1886
3599 -1886 -657 2002 1290 -1643 -1653 722 1728 525 -1508 -1556 1228 2211 -639 -1972 -203 1537
3615 1537 1452 -713 -2204 256 2460 482 -1682 -1092 801 1979 374 -2156 -906 2002 1518 -938
3631 -938 -1689 -141 1958 1398 -1608 -1908 1193 2108 -56 -1719 -1023 1294 2061 -693 -2310 48 1962
3648 1962 890 -999 -1787 162 2389 574 -2247 -1087 1369 1639 -226 -2096 -852 2141 1380 -1690
3664 -1690 -1724 516 1588 618 -1616 -1766 1042 1965 -481 -1969 -718 1264 1529 -647 -2407 -218
3680 -218 2375 642 -1912 -1426 637 1896 257 -2295 -1098 1816 1329 -846 -1566 -378 1558 1392
3696 1392 -1365 -1895 699 1953 376 -1578 -1408 1144 2231 -393 -2322 -221 1994 1064 -1024 -1693
3712a693J923J998j590k394Q22K015M16j270j875M72K964M1k787q34J859J790
3728A857o16k777m98L262J074k600j619J301K016K20k202j496J893K268j184k235
3744a336j17J666J758j157k923N31L124K45k475j275J248K510k82l152m86K869
3760G48J126j718j683K3K249J221k269j810J564J928j67j934j325J677K548j278
3776I00k802M18K451P56j582k034P36K854m9k732o87J764J525l64k267q23K595
3793F59J487k029j810P10K003Q52j957k161J824K444q48k232m83J679J981j143
3809I76k871M85K827M34k031j459P05K531K74k927r03K319J505j149j954l40K242
3826F64J576k050k251J276K215J06j919j664J489K765j003k960J64K304J113j441
$$ plain form
3712 -1693 230 2228 638 -1756 -934 1081 1497 227 -1648 -1176 1788 1829 -958 -1792 67 1857
3728 1857 1241 -1536 -2034 1228 2302 -298 -1917 -616 1400 1620 -582 -2078 -185 2083 899 -1336
3744 -1336 -1453 213 1971 814 -2109 -1578 1546 1791 -684 -1959 -711 1799 1517 -1635 -2121 748
3760 748 1874 156 -1527 -1504 745 1966 -303 -2113 -549 1379 1212 -722 -2047 -370 2178 900
3776 900 -1902 -1484 967 1723 141 -1893 -1157 1697 1648 -1084 -1771 -7 1518 1154 -1113 -1936 659
3793 659 2146 117 -1693 -983 1020 1872 -85 -2246 -422 2022 1174 -1058 -1541 138 2119 976
3809 976 -1895 -1410 1417 1851 -180 -1639 -934 1597 1871 -1056 -1959 360 1865 716 -1238 -1578 664
3826 664 2240 190 -2061 -785 1430 1536 -383 -2047 -558 2207 1204 -1756 -1592 712 1825 384
3842C84k291M59K967K59k587j051J470J816k2k430j040K321J790j480k262K14
3858a483K273J305k213k406J725K838q60k476m12J669J903j030k716M72K502L01
3874A392j435j367J62K351Q36k535j574J960K056o99k327p29K489J834k253k285
3890b124J440K244j65j785j260J252K132n15k196m82J580J566n20k521n29K945
3906A062J257k567j775J295K433J10k920j083K656J651j759j680J91J633J244
3921A748j438k110P48K440J69j934j513J167K698l32l270m54L005J050j932j833
3937a791O28K401N56k521j282J840J561m75j721j113J780K126j300k507L67K353
3953I02R54j959k128J354K763n22k684n27J999J513q07k303k03K539R72j920j631
$$ plain form
3842 384 -1907 -1448 1519 1778 -809 -1860 -390 1426 1404 -1026 -2066 255 2045 565 -1697 -1483
3858 -1483 790 2095 -118 -2524 -799 2039 1179 -1297 -1709 -40 1863 833 -1883 -1411 1091 1392
3874 1392 -43 -1410 -1248 1103 1939 -596 -2170 -210 1846 1147 -1180 -1909 580 2414 161 -2124
3890 -2124 -684 1560 1395 -390 -1650 -398 1734 1219 -977 -1459 121 1687 1167 -1354 -1883 1062
3906 1062 2319 -248 -2023 -728 1705 1815 -1105 -2188 468 2119 360 -1320 -1129 504 1748
3921 1748 310 -1800 -1052 1388 1557 -377 -1890 -723 1975 1643 -1627 -2081 924 1974 42 -1791
3937 -1791 -1163 1238 1794 -727 -2009 -169 1392 917 -804 -1917 -137 1989 689 -1818 -1451 902
3953 902 1856 -103 -2231 -877 1886 1364 -1320 -1847 152 1665 858 -1445 -1648 891 1863 -57 -1688
3970a688P78J990P43k319j721K118K151j232k011l01J859J698j598k391R99K302
3986A377J33j695j439R82K350j08k804n84K373J315j371j940J12K335J004k305
4002b65j620J588J760k30j775j287J639K278j178k476J43K103J270j648k404R65
4018a137K824p3k646p86J745J807o70k427l50K277J261j587j822K90K211J043
4034A960k200k091J750K472p98k361n90K049J893j579k570R36K400J21j727j325
4050a660P66K315Q5k542q63J985J590p83k214m54K543J479k427k000J492K282
4066A594k06k081j203J780K139j235k155J11J780J166j161k143L31K657M56k285
4082d55j337J326K198j82k682p84K566J422j716j941M70K103Q85k032j756J453
$$ plain form
3970 -1688 -910 1080 1823 -496 -2217 -99 2052 820 -1191 -1492 367 2065 467 -1924 -925 1377
3986 1377 1510 -185 -1624 -642 1708 1600 -1204 -1788 585 1900 529 -1411 -1299 1036 2040 -265
4002 -265 -1885 -297 1463 1233 -542 -1829 -190 2088 910 -1566 -1423 680 1950 302 -2102 -1137
4018 -1137 1687 1614 -1032 -1818 -73 1734 1064 -1363 -1713 564 1825 238 -1584 -1294 917 1960
4034 1960 -240 -2331 -581 1891 1093 -1268 -1858 191 2084 505 -2065 -1129 1271 1392 -335 -1660
4050 -1660 -894 1421 1506 -1036 -1899 86 1676 893 -1321 -1775 768 2247 -180 -2180 -688 1594
4066 1594 1388 -693 -1896 -116 2023 788 -1367 -1256 524 1690 529 -1614 -1283 1374 1830 -455
4082 -455 -1792 -466 1732 1550 -1132 -1916 650 2072 356 -1585 -1115 988 1873 -159 -1915 -462
4098d62K010k94j932r82J469K141r61k592J14K402Q60j641j936O03K718K40k744
4115i87r51J996J555p14k108n37K275J464j940j857Q36J977N93j860j829J404
4131f83K580q16k419m03J998J551j198k483L83K727M75k279j292J221K018kk413
4148a035q94K120J649j296j954k4K066J314j865k113J332K265k38k067j000J515
4164b25K156r83k454J62K151Q31j306j839M27K446L67k284j161J557J770m52k153
4181i90p47K210J609j653k067O71J985O72j758j764J278K325n28k203o16J637
4197F1J728q86k399n8K529Q13j987j470Q42K057L37k331j194J895J773r15k070
4214a275l12J986J459j592k232R27K295J71j886j351J296K170n51k533k22K092
$$ plain form
4098 -462 1548 1254 -678 -1660 -191 1950 989 -1603 -1489 913 1773 132 -1804 -1201 1517 1757 -987
4115 -987 -1938 58 1613 899 -1209 -1746 529 1993 53 -1804 -968 1009 1602 -258 -2087 -683
4131 -683 1897 1081 -1338 -1741 257 1808 610 -1873 -1490 1237 1712 -567 -1859 -638 1380 1378 -1035
4148 -1035 -1929 191 1840 544 -1410 -1434 632 1946 81 -2032 -700 1565 1327 -740 -1740 -225
4164 -225 1931 948 -1506 -1344 807 1638 332 -1507 -1080 1366 1733 -551 -1712 -155 1615 1163 -990
4181 -990 -1737 473 2082 429 -1638 -967 1018 1690 -68 -1832 -554 1771 1243 -960 -1576 61
4197 61 1789 903 -1496 -1554 975 1788 -199 -1669 -827 1230 1567 -764 -1958 -63 1710 795 -1275
4214 -1275 -1587 399 1858 266 -1966 -1039 1256 1427 -459 -1810 -514 1656 1105 -1428 -1650 442
4230D42J181j169k060J72K476P41k264j369J320J965j51k225r90K022J843j395
4246E39k101K85K072Q87j597j862R85K353j82k184q27J523J733n19k347l53K387
4263G92J018j622j604M61K103N88k193j342J604J902o64j903o49J760J639j306
4279E84k116N05K031N31j606j510Q75K212j63k285o32J745J410q44k096j21K247
4296G67J032j881j614Q75K029J62j956j347J687K005r77k126m1J753J333j390
4312C11k066O86K283K07j967j106J182J976l44k325m82J986J299j341j793J63
4328a331K214Q82k040j630J446J966m27j925p69J667J757j122k195K82K096O86
4344A557j471j687P43K267J18k325q60J671J591o56k164k72K204J119j666j690
$$ plain form
4230 442 1623 454 -1606 -1434 1042 1783 -481 -1850 -530 1435 1284 -941 -1931 91 1934 539
4246 539 -1562 -1277 795 1682 85 -1777 -792 1561 1379 -805 -1632 -109 1624 1105 -1242 -1595 792
4263 792 1810 188 -1416 -955 1148 1736 -457 -1799 -195 1707 1043 -860 -1509 251 1890 584
4279 584 -1532 -1027 1004 1535 -71 -1581 -706 1506 1343 -942 -1574 171 1581 737 -1359 -1480 767
4296 767 1799 -82 -1696 -821 1208 1370 -586 -1933 -246 1759 782 -1344 -1385 368 1701 311
4312 311 -1755 -1069 1214 1421 -546 -1652 -470 1506 1162 -1163 -1645 341 1640 299 -1494 -1331
4328 -1331 883 1765 -275 -1905 -459 1507 1080 -845 -1614 53 1810 688 -1507 -1225 871 1557
4344 1557 86 -1601 -858 1409 1527 -798 -1658 13 1604 948 -1216 -1488 716 1835 169 -1521
4360a521P33J897M09j860j360J443J956o19k067l51J628J391j055k130L89K245
4376A128M07j827j180R18J943q7k217p32J888J279q76j829j14J965J052j787j604
4393a673R29J946jj830j022J345J916p71k175p1J978R10j255j751L35K271M71
4410A552k133j138J392J805l64k171o33K043J314j379j736L69J848O85j658j470
4426a674J090J957k15j977p11J541J683r31k140P1K265O36j725j338Q20J905O9
4443A326k019q21J604J361o52j664m30J658J366j371j800N69K036L49j813j303
4459a604J310J986p14k055k09J808R15j036j641K92J809N64j584j212Q46J649
4475A124J76j880j122J722J683j120j926J23J897Q63j589j615J001J893j84j735
$$ plain form
4360 -1521 -788 1109 1518 -342 -1702 -259 1697 1078 -989 -1340 288 1679 624 -1506 -1117 1128
4376 1128 1535 -292 -1472 -554 1389 1302 -915 -1647 241 1520 644 -1185 -1299 666 1718 -69 -1673
4393 -1673 -744 1202 1201 -629 -1651 -306 1610 839 -1336 -1407 571 1481 226 -1525 -1190 1081 1552
4410 1552 -581 -1719 -327 1478 1114 -1057 -1690 353 1667 288 -1448 -1079 769 1454 -204 -1674
4426 -1674 -584 1373 1158 -819 -1530 11 1694 763 -1377 -1306 959 1595 -130 -1468 -648 1257 1326
4443 1326 -693 -1514 90 1451 799 -865 -1295 363 1729 358 -1442 -873 1163 1512 -301 -1604
4459 -1604 -294 1692 978 -1077 -1286 522 1437 401 -1240 -948 861 1425 -159 -1371 -525 1124
4475 1124 1300 -580 -1702 20 1703 583 -1343 -1220 677 1540 -49 -1664 -663 1230 1046 -689
4491f89o96J142J485m01j914l35J753J141j194j736L19K075N21j979j215J477
4507b46J658n87j793m48J678J230j150j677L68J684O58j453j421Q40J984j37k052
4524h64o59J642J434r33j924K1K182O58j733j322R40J708L3j702r74J403J573
4541A483p60j691j81J583J080j171j766O72J913J54j692r36J108J598m12j865
4557h83m26J719J064j105j560K88J771N24j571j277J046J623j91j778o67J528
4573A05J339r75j634P9J633P55j250j588P90J869j3j844p20J259J425m45j914
4590a129k78J970Q16j386j328N46J647K91j432j227J227J491l98j620m71J462
4606A81J262r23j870L43J877M78j602j185J018J667k99j743m92J487J124q82j467
$$ plain form
4491 -689 -1385 -243 1242 841 -1073 -1408 345 1486 292 -1444 -1125 950 1471 -508 -1723 -246
4507 -246 1412 825 -968 -1416 262 1492 342 -1335 -967 717 1375 -78 -1499 -659 1325 1188 -864
4524 -864 -1523 119 1553 620 -1304 -1283 899 1557 -176 -1498 -558 1150 1183 -519 -1493 -90 1483
4541 1483 723 -968 -1149 434 1514 343 -1423 -751 1162 1316 -376 -1312 -204 1394 982 -883
4557 -883 -1309 410 1474 369 -1191 -903 868 1392 -179 -1456 -410 1213 1022 -756 -1423 105
4573 105 1444 469 -1165 -1086 547 1302 52 -1536 -746 1123 1110 -734 -1454 -195 1230 785 -1129
4590 -1129 -1407 563 1379 -7 -1335 -789 858 1149 -283 -1510 -283 1208 810 -810 -1281 181
4606 181 1443 520 -1350 -1007 870 1348 -254 -1439 -421 1246 947 -796 -1288 199 1323 441 -1026
4623a026OJ616P80j346j423Q15J662J09j599j085J446J610q49j828M6J675Q78
4640A487j336j477O83J761Mj527p78J027J322k61j574n39J472J099r63j541K61
4657h80J617O55j545j286J077J628m61j612l50J332J013q70j392J36J436N65j072
4674ij138M11J587K15j558r20J164J528o23j759j94J704R46j342j333O66J533
4691H78R3j381q83J060J328l71j482l63J206J158p69j651J77J716N91j457j289
4708a439R84J648k46j754l98J510R36q99j286J25J386O49j157j182N94J452J31
4725A054j379q56J070J476o26j719p3J638P08j137j327N59J692J7j529o76J048
4742f0J141l32j407l98J314R89r31j384K66J510M41j324j089Q74J504l17j485
$$ plain form
4623 -1026 -1020 596 1376 30 -1393 -578 1084 1193 -406 -1491 -45 1565 716 -1112 -1066 609 1487
4640 1487 151 -1326 -643 1118 1122 -405 -1183 -156 1166 905 -669 -1208 264 1363 400 -1141 -880
4657 -880 737 1392 -153 -1439 -362 1266 805 -807 -1157 175 1188 318 -1074 -938 498 1063 -9
4674 -9 -1147 -736 851 1066 -492 -1412 -248 1280 657 -1102 -1296 408 1354 12 -1321 -655 878
4691 878 971 -410 -1293 -233 1095 724 -758 -1121 85 1243 474 -1177 -1000 716 1307 -150 -1439
4708 -1439 -455 1193 947 -807 -1205 305 1241 342 -944 -819 567 1216 59 -1123 -529 923 1054
4725 1054 -325 -1181 -111 1365 739 -980 -1053 585 1293 156 -1171 -612 1080 1097 -432 -1108 -60
4742 -60 1081 749 -658 -1056 258 1247 316 -1068 -802 708 1149 -175 -1264 -390 1114 797 -688
4759f88m52J270J042p57j471J02J472N24j081j112N71J445J28j508p30J178J138
4776A071n77j367j48J281Q47r34j283L98J433K82j279r94R35J486l36j606k55
4793a046J269R62r49j304K87J490L74j343q60P69J234kj379o44J214J175p09j482
4811i44J4J456P44j218j269P43J595j61j471o28J243J036o06j297q3J240O86q87
4829A93j106K89J404L44j314r74R21J365l21j550k63J390Q28j009j207L75J341
4846G06K16j116q38P08J194k00j167n40R69J064m83j457p1J504O33j168j151N85
4864f12J510rj480o36J182J055n96j255o7J145O94p79j185L11J391K39j161q67
4882a120P58J333j68j573k84J285Q84q34j224K12J357M19j218q61P45J144o6j229
$$ plain form
4759 -688 -1140 130 1172 415 -1056 -954 518 1042 -39 -1151 -580 865 993 -515 -1245 -67 1071
4776 1071 494 -873 -1021 260 1107 173 -1110 -712 721 1003 -276 -1270 -335 1151 815 -791 -1046
4793 -1046 223 1185 236 -1068 -781 709 1083 -260 -1120 -351 883 881 -498 -1142 72 1247 538 -944
4811 -944 -930 526 1270 52 -1217 -474 1121 960 -511 -1139 104 1140 534 -763 -846 394 1080 193
4829 193 -913 -624 780 1124 -190 -1164 -243 1122 801 -749 -1012 378 1206 197 -1010 -635 706
4846 706 922 -194 -1032 -324 870 670 -497 -1037 -68 996 513 -944 -1015 489 1122 -46 -1197 -612
4864 -612 898 889 -591 -1227 -45 1010 414 -841 -908 237 931 152 -1033 -722 669 908 -253 -1120
4882 -1120 -362 971 803 -770 -1054 231 1115 281 -943 -731 626 1045 -173 -1034 -289 855 789 -440
4900d40n50J050J025n81j345j7J380O07j012j187N95J408Mj417n48J019J091m65
4918F17j366j42J330O33q93j091L48J253L16j228q36Q50J229l97j225l43J190
4935B45Q12q04j093J91J181L13r78q56N95J193q1j274m18R64Q90m78j194q5J212
4954C35N64q93j026M95J133J24j067o96P67J135l49j211k54J115Q07q06j146L34
4972f39J246K74j135o87O48J148k12j177l83R87R26n96j139n7J281N91j053j019
4990i96N96J231m7j181n09R09R74m75j142j49J172N87p64j120M45J156K18j139
5008b34o63P47J056k46j255k54J132O96p05j098K24J174L86j116p37O53J085k15
5026F30j096l48Q59Q85n29j221J22J186L93r51q58N50J061N6j176m74Q84Q70m53
$$ plain form
4900 -440 -990 60 1085 504 -841 -858 522 1129 117 -1070 -475 933 937 -480 -1028 -9 1082 617
4918 617 -749 -891 439 1072 179 -912 -564 689 1005 -223 -1059 -209 1020 623 -602 -945 245
4935 245 1057 253 -840 -649 532 845 -133 -989 -394 799 718 -556 -974 -10 880 402 -792 -877 335
4954 335 899 6 -1020 -525 608 732 -335 -1031 -264 871 522 -689 -943 172 979 173 -973 -639
4972 -639 607 881 -254 -941 -293 855 643 -534 -917 70 996 400 -739 -796 485 1076 23 -996
4990 -996 -400 831 784 -397 -906 3 977 502 -640 -789 383 970 206 -914 -469 687 905 -234
5008 -234 -897 -150 906 660 -595 -849 283 979 274 -824 -600 574 960 -156 -893 -240 845 630
5026 630 -466 -814 45 930 401 -820 -698 488 881 -70 -928 -378 683 739 -437 -911 -27 843 390
5045C90j100p9J031O34q46r22L45J075J41r38o94O97J027k33j119k67R81P09n58
5064B74j049Q2J212K48r24p12N53J082r8j135l79R28Q56o01r83k3J064N51q93
5083E3q92M45J127oj007o14Q42J005m65j175r6J160N69p84r36L17J132J12j028
5102b41o10P07R25k21j069k98R53P71o57r92K12R84L36q46q23O30J025k17j022
5121d53l26Q57P52m62j010k5J060L64q18p32M10R56R5j017n42Q74P67m07r46j06
5141g09R22N08o97q67M21R10J63q90o47O44J000k77j036k52R02O50n82q81J48
5160e70J032L10q72o43M55R18or05n33Q34P96m29r93J5Q90N28p09r09M31J051
5180F91k2r14m47O32Q50k97j035k06J066M92o46q32K39R59L02j013o35O74R34
$$ plain form
5045 390 -710 -789 242 876 30 -892 -547 528 669 -269 -963 -266 761 528 -591 -858 123 832 274
5064 274 -775 -693 519 767 -157 -869 -316 766 668 -467 -846 82 938 337 -646 -669 395 946 53
5083 53 -839 -394 733 727 -280 -894 -52 953 488 -687 -783 377 946 162 -774 -457 675 787 -241
5102 -241 -851 -144 781 560 -509 -807 146 917 260 -732 -520 464 800 -46 -869 -239 786 569 -453
5121 -453 -779 78 830 368 -642 -667 393 757 -61 -793 -383 573 668 -349 -891 -17 750 343 -603 -709
5141 -709 213 721 24 -843 -422 488 651 -239 -886 -242 758 481 -555 -807 95 745 163 -718 -570
5160 -570 462 772 -100 -743 -288 630 624 -281 -814 20 816 387 -606 -591 299 827 118 -791 -360 691
5180 691 669 -245 -692 -60 790 493 -542 -748 318 810 164 -668 -429 530 832 -181 -816 -142 792
5199G92j81j033l44R11P07n80r52J41J006K28p66o96M93R69p9j007l32P40P76
5218G93m88q76j15R99M46q55o25L22Q76R3q08n20O11Q64m23q37r3Q00N07n98q34
5239g61K54R13J86q14m57M46P89l7j006k87Q85O10n26q01P0Q85L82q21o78N31
5259b37Q95j58q08l54O78P32l70r40mQ55M14n35q17K79R75J02q81n25O16P82j51
5280E48j001k09R27N43p06p61K61Q35K49p48n77N13Q24k52q05l06O81O82l45r79
5300f26Q3R23L31p32p19M61R13p0r81k46P19O02m40p39p5Q14M61o54p24L48Q20
5321D69M7p06n46N28Q79l04r32o5Q06M34n20p52J18R22J27o78m75M43O35Mp57
5342c23m14P89N58l87p35oP68L97o02p50M26Q83p8q30l07N57P44k78r03OP85L96
$$ plain form
5199 792 611 -422 -766 145 852 272 -680 -539 467 695 -71 -767 -274 695 616 -391 -723 17 793
5218 793 305 -571 -686 313 759 -96 -721 -399 477 570 -238 -758 -147 717 294 -543 -636 164 671 73 -761
5239 -761 -507 406 592 -222 -679 -233 556 519 -487 -774 111 721 195 -606 -536 349 731 -90 -768 -237
5259 -237 658 500 -308 -662 16 748 378 -562 -566 289 703 168 -649 -370 605 707 -174 -699 -83 699 548
5280 548 -453 -662 265 808 102 -659 -398 437 686 -62 -639 -126 698 446 -359 -665 16 698 353 -626
5300 -626 -543 380 711 -21 -740 -279 634 564 -417 -663 56 658 218 -521 -596 218 679 25 -699 -351 469
5321 469 516 -190 -736 -208 671 367 -565 -630 176 610 90 -662 -544 378 505 -173 -648 -205 430 434 -323
5342 -323 -737 52 610 223 -512 -518 250 647 45 -705 -279 604 526 -304 -611 -54 690 412 -491 -485 300 696
5364F96n86o48K02Q19J58q07m50N77O85k07p92k70P71N86n92p03J94Q00K08o39
5384Bo74M65Q75j87q92k04P16N27m02p81L4Q93K66o88n80L02P83P2p91m59O59
5405f4O44k78p67q4O97N74o82p15K76R09l5p25l29M15O07j43p89j18P42L94l83
5426A46o99M9P48L95p11o06M75O71m3p58l06P01O08m72q22L02N50L09m98n62J96
5447c27P85L3o48l57L90O68p3q25k30Q06N13o03o36K19P41J74p15n73O52O11k34
5468C71p51j45O25N36l79p77J04P79K25n94n51L03Q46m2r17k42P17M78l31p21
5488d66m0Q29K53o05n74L83O28N7o52m58N35P39l73p52j0O92M32n08p00J29Q82
5509D21J38p82l33M11N66Lq16k47P52M79m81o60N3P57K84o72n84M83P20j60o12
$$ plain form
5364 696 110 -538 -336 483 641 -166 -616 -39 646 439 -353 -623 148 734 142 -561 -367 433 641 2
5384 2 -672 -207 668 481 -411 -615 101 628 226 -555 -521 372 638 -50 -630 -328 455 527 -264 -723 -64
5405 -64 580 302 -465 -549 148 722 40 -675 -399 510 475 -250 -579 -164 443 300 -489 -607 135 529 146
5426 146 -553 -504 244 639 -72 -678 -203 468 425 -333 -639 62 670 198 -624 -322 228 537 39 -523 -327
5447 -327 458 491 -157 -514 -124 544 471 -354 -584 222 735 132 -504 -285 456 630 -85 -658 -6 605 371
5468 371 -380 -525 100 636 257 -520 -416 363 588 -6 -557 -254 592 550 -367 -609 108 586 255 -466
5488 -466 -506 323 576 -29 -603 -220 408 465 -187 -645 -110 629 256 -496 -506 186 618 110 -590 -461 421
5509 421 559 -223 -556 -145 421 424 -392 -639 113 592 111 -549 -496 261 545 -127 -711 -228 492 332 -280
5530b80k97M49P01k97p61L0P36K95m90o27K23Q09O2p98l04N76O11k33p03j51O42
5551A93M14m26o89K52O44J64n01o06L26Q72j48q42j44N72N28l19p91N7Q47J77
5571E80p14l93L56O11M9p70l11N85N95l29o61k0N57M49n59o94L50Q16o4o72l60
5592e99N17O96k36q76K0O68L39m53o31J11Q07J59p35m06M90N27j0p26k84O86N46
5613F10m85o32J82O39J71m68o44L41Q04j63o80j95N11N44k54p59k3P87K99n86
5633am78K35O64J46p09m07N42O19k81o61q3O07N01n18o68K03P58N5o04m51L77
5654a54P43r4q53j46N88N23l65o56n5P84L12n84n98L04O88L1o43m68O27O04l53
5675B35p32O9O05L81m02q27K27Q94N8p93l30N13N30j05p51k02Q37L27m72n86J03
$$ plain form
5530 -280 -577 -128 573 276 -485 -455 281 576 86 -541 -318 491 553 -245 -549 27 638 405 -298 -449 193
5551 193 607 181 -508 -256 388 552 51 -555 -229 643 495 -347 -491 81 609 290 -501 -444 403 580
5571 580 -134 -527 -171 440 489 -281 -592 -7 588 259 -402 -422 135 584 25 -669 -319 497 433 -239 -599
5592 -599 -82 614 378 -498 -478 190 529 76 -555 -444 363 522 -213 -619 -129 398 388 -338 -622 64 610
5613 610 125 -507 -325 314 485 17 -627 -286 518 355 -325 -520 -9 535 281 -478 -501 286 585 -1
5633 -1 -479 -244 420 566 -143 -550 -8 611 330 -331 -414 193 694 176 -492 -289 469 524 -80 -531 -154
5654 -154 589 495 -358 -504 84 607 242 -414 -469 315 627 43 -555 -251 437 468 -175 -643 -16 588 235
5675 235 -497 -428 177 558 156 -671 -444 450 508 -285 -615 -102 428 323 -428 -630 207 534 62 -524 -421
5696d21P20K16o85m68M96O11j16o54k81N93N73l45q29J96P22J79n06n46K62P19
5716D36M3q01k23N96M36k18o61j68Q03L73n71n62K86O14J57n95n41M83P46l01
5736C32o80q1N64M88l63p43J02P44J92n51m87L41O05O5q16k95P09N15m37o10n5
5757d61P21L21n67o10L71P25r1o26l63N03O73k89q01LO99K89m53o49J68Q46J41
5778E50p81l43M52N86j02o97l16P43N06n54o36K01O63K85n78o37M35P42j31p04
5798c16j99N42N57l73p33M5P91K36o15m79K99O81J07q14l02O21M90l14o21%N66
5819A69N08n84o55L15O82P6o60l34L47P23j70p62l6N91L59l41o36PP77K34o90
5840h0m57L77O73n5p63k88O45N80m48o45Q0O48L45n67o53L42P88r0p31k81M70
$$ plain form
5696 -421 299 515 -170 -638 -142 469 353 -301 -582 11 584 239 -590 -394 328 507 1 -545 -283 436
5716 436 479 -322 -545 51 487 269 -392 -560 243 616 45 -517 -231 383 540 -55 -596 -113 633 332
5736 332 -348 -429 135 623 260 -483 -381 363 555 4 -483 -142 463 528 -288 -583 126 641 204 -406 -461
5757 -461 260 581 14 -596 -225 500 409 -217 -580 -77 596 307 -494 -491 208 497 44 -605 -437 409 550
5778 550 -231 -574 -122 464 362 -335 -651 92 598 44 -592 -391 272 557 -21 -658 -223 519 388 -316
5798 -316 -515 27 584 211 -522 -477 314 550 -65 -544 -245 436 543 -271 -573 48 538 224 -397 -397 169
5819 169 677 93 -562 -247 435 511 -149 -483 -136 587 417 -345 -381 210 569 228 -408 -401 376 610 -80
5840 -80 -537 -160 513 458 -305 -593 52 632 184 -461 -381 267 612 45 -608 -266 522 432 -299 -580 -110
5861a10N85j55q35m8Q47K41n23n44K03O58J95q10l63N79O40l23o55j74O86M82
5881E76m56p29K65P06P0n46m97L91P65j32p86q3N24M36l15o70J2P85K73o66m95
5902e72K99O81N2o95l87O13O19l62o84oO45L33m08o61K78P36j0o52k87L73O37
5923E42j31p66j29P03L85m48n72R3P04K43p03m67M37O40j72n65l20N89N53m25
5943A91p38J16P19K36n05n66K30P97j2p79k82N52N66k76o75j52P76M15o68n06
5963e61K28O61J30o43n01N76O83k94p28q5N84N47m34p16J62Q16M9o29m24L79P39
5984E39r5q62j90P48M35m12o02O6O27L46o48n21M58N86l7n61m47N13P32l62p84
6005d71O0O38L53n30n92K42Q73o6p46k43N12M93j22o81k09P09L58m39o35J96P51
$$ plain form
5861 -110 475 320 -515 -563 284 525 2 -542 -339 319 514 -296 -659 -80 560 237 -418 -592 94 576
5881 576 120 -609 -344 362 432 -114 -611 -220 545 413 -373 -456 68 504 189 -481 -469 316 589 -77 -572
5902 -572 -273 408 460 -235 -622 -9 610 248 -436 -442 203 536 128 -533 -255 481 471 -181 -468 -95 542
5923 542 411 -355 -484 219 604 156 -416 -323 381 624 -79 -546 -109 531 359 -206 -526 63 616 191
5943 191 -547 -431 288 524 19 -547 -317 480 468 -311 -593 -41 525 249 -426 -578 198 613 -55 -561
5963 -561 -333 328 458 -185 -686 -110 573 279 -449 -534 50 597 163 -553 -391 425 474 -155 -579 -200 539
5984 539 444 -418 -608 140 575 163 -439 -373 254 600 -48 -569 -111 475 438 -123 -570 -57 675 313 -471
6005 -471 -411 227 580 50 -542 -300 573 507 -239 -482 30 523 401 -280 -489 220 578 139 -496 -300 451
6026D51J27o56n97O06N30Rq52M2K82P72o23p56K77N71M21n78o15K10Q79J22r08
6047b86m42O83O43k83p76nO83M18p55n36K90P88J3n96m40N46N96k65p73m8O62
6068A17M52n00o23J21Q33J45o96m68N22N34j6p63k74P43M95m66p04J45O90K85
6088E72o22n27L38P98j72p05j74N57N06l18p35M7P52K29n65n04K51O89R3o79m19
6109e88N89N33j91p52j16P15M54n26o81L33O48J24o32m66L61P40j76p32j41N77
6129G3N04l73p68J18P68K81o68n18L18P45m5p03m18P12O00m77o28M7O58L46n62
6150A0o88L76P47k5o86l41N10O46k52q04l5Q29K63n08o03J48Q22J61p75m82O60
6171b7O21k39p10k45P14N37m64p90K63P82O3n75n24L77P74j28q06j32O03M50k53
$$ plain form
6026 451 578 -78 -675 -69 461 470 -382 -340 -58 714 91 -665 -388 183 604 26 -589 -379 500 622 -286
6047 -286 -728 -45 598 315 -461 -466 217 635 -120 -656 -366 422 435 -161 -601 -55 541 276 -497 -545 117
6068 117 569 69 -554 -433 400 545 -151 -619 -97 437 421 -342 -616 127 622 156 -548 -403 287 572
6088 572 -50 -577 -239 559 387 -318 -492 65 571 253 -482 -435 317 546 -19 -523 -272 417 510 -169 -588
6109 -588 1 534 343 -409 -525 190 644 118 -563 -230 418 542 -90 -556 -195 545 369 -363 -504 73
6129 73 577 204 -564 -446 322 603 -65 -583 -265 480 435 -268 -686 26 626 149 -479 -432 226 572 10
6150 10 -678 -302 445 420 -266 -607 -97 549 297 -507 -542 287 550 42 -561 -413 409 570 -205 -687 -27
6171 -27 594 355 -355 -600 114 651 187 -603 -340 442 505 -70 -594 -217 557 429 -377 -509 94 544 291
6192B91o73j02Q65K12o64m44L25O66K0o92m01O83N97m22o39K3N92M28m99p15L09
6213b40O87P6o05m32L81P95k55q11k30Q53L76m85o21J44P42K12o61n38M90N85
6233D63q5o44k70N30N73l92p82J34P86K03n33o58L36R03j06p94k88N65O21l13
6253B49p29p9R10K15n98n65L45O75R5o90n02N67P59l28q06l8O73M90n87p33L30
6274c47Q11J5o55m14M31P40j33q47j25P07M57n25o10N9P38L61p01n92M71O81p8
6295D44o78l76N93P05m03p74J22O58K52m45o38K39Q27Rq48k30N11O24k14p78k00
6316f00Q00M05n72n90K11O69K47p43n28N65P28k86p01j49N68N43m36p47J21Q76
6336C81R6n71n06K86Q48r1q17k59O49N35l02p39p5Q24M05o93o31M09P31M0p57
$$ plain form
6192 291 -382 -484 381 593 -71 -515 -190 476 496 -196 -597 86 683 261 -378 -355 237 665 166 -549 -240
6213 -240 447 523 -82 -514 -133 662 407 -404 -634 219 595 110 -511 -367 375 587 -74 -612 -122 463
6233 463 378 -266 -536 -6 567 175 -607 -473 313 516 -17 -675 -339 564 458 -336 -624 -59 562 249
6253 249 -480 -559 351 566 -32 -597 -252 423 518 -172 -674 -107 652 324 -482 -520 153 643 56 -677 -347
6274 -347 464 479 -176 -590 -159 581 448 -399 -524 183 640 115 -495 -436 302 663 -38 -630 -159 522 444
6295 444 -234 -610 -17 688 285 -489 -367 291 543 98 -540 -301 526 535 -313 -543 -32 592 378 -400 -600
6316 -600 200 605 33 -557 -346 323 570 -173 -701 -136 592 306 -395 -544 24 567 131 -616 -495 381
6336 381 477 -94 -600 -314 534 443 -374 -633 16 551 249 -490 -565 259 664 -29 -660 -251 480 520 -237
6357b37l87O25O85l86q28N8O99L45m64p32K31Q67P0p26l84M57P14k48p81p7P51
6378B52M34n62o48J42P60J98o73n20N28O58j29p70j46M55O63l93p59R1P96K12
6398E89o01n34K55Q42l9q04k75O02N42k70p34q3P21M80o77o08L26O66N1n76n73
6419g00N23P30k16q16j13P30M24m17p67J15Q79J03o70m70M26P18q2p31l11P15
6439G0N46m52o44jP70M01o90p00M27Q77j28o82l64N24O95k69q95M5P22L30n16
6460F6n78K33P52J34p91m67O09O76k66p08j99P49N16o40p26L73P00J42n96n76
6480e97M25P83k14q19j62P20M87m01p24L3Q25K48o64n12L79O90l8p51l41P16N36
6501F19l58p54O7O57L93n69p04L45P68j1o97l64M69O92j79q69o2P25L26l95o52
$$ plain form
6357 -237 -624 1 686 300 -528 -470 229 574 110 -622 -391 476 546 -180 -564 -107 607 359 -422 -499 252
6378 252 686 124 -524 -382 378 576 -97 -617 -89 569 440 -330 -476 -21 642 249 -510 -419 377 589
6398 589 -12 -546 -291 551 512 -292 -567 35 577 307 -427 -510 211 691 14 -594 -268 398 449 -127 -700
6419 -700 -177 553 337 -479 -592 138 562 145 -622 -507 372 475 -195 -665 -239 479 397 -334 -645 70
6439 70 616 164 -480 -481 289 690 0 -700 -273 604 476 -206 -570 -46 649 380 -515 -470 252 582 66
6460 66 -512 -279 473 607 -184 -651 -42 634 368 -340 -539 210 726 86 -640 -267 433 575 -21 -597
6480 -597 -172 611 397 -422 -584 136 623 222 -502 -469 356 604 -60 -572 -193 497 459 -292 -633 83 619
6501 619 261 -493 -426 231 624 55 -649 -304 464 453 -244 -608 -139 553 374 -495 -557 168 494 99 -553
6522e53J19Q32J55p44n04N46P09j57p40l07P43N76n36p19J69P63K21o34n25M45
6542a41P06j02q20k57O52N86l28p72k8Q22L88p05o03L35P81L1p48m19O42O18l66
6563B72p25o1P04M42n18o59J90Q18M2o61m27M47O84r8q25j55P55M06m12p50Q7
6584d44Q13K56p62m79M56O39qp48l21O25N81m00p15M5P54K86n48o33K68Q45k9
6605D81p71k33M70N92k52p44j39Q07L89o01o09K18P67J68p07n14N57O82k48o57
6625c44k60P00N19m76p88K37P96K00o40n95M48P54j13p66k57O65N50m10o82lP82
6646C17L49o57n83L82O83L6p41m07O21O79m22o84l5P29L66n00p17K27Q77M4p68
6667b04l28M76O09j59p82j55O62N14n10o52J21P35L14p11n72M52P68j80o89k97
$$ plain form
6522 -553 -434 398 553 -191 -695 -149 560 403 -337 -644 99 675 139 -580 -411 352 573 -61 -586 -141
6542 -141 565 463 -357 -614 38 624 296 -476 -504 318 706 1 -602 -267 514 545 -203 -622 20 638 272
6563 272 -453 -514 190 632 114 -545 -355 463 505 -156 -583 -136 548 450 -375 -530 225 631 219 -531 -444
6584 -444 369 625 -137 -616 -160 479 471 -277 -598 27 608 208 -507 -462 292 578 30 -603 -335 510 481
6605 481 -290 -523 -53 539 287 -457 -596 211 600 -1 -610 -392 375 543 -164 -678 -121 561 313 -344
6625 -344 -604 96 615 139 -649 -412 384 584 -56 -651 -203 551 438 -328 -585 80 630 220 -462 -465 317
6646 317 666 9 -574 -192 491 527 -214 -621 0 679 257 -427 -462 267 633 133 -584 -357 520 564 -204
6667 -204 -532 -56 553 394 -388 -543 119 633 123 -529 -408 327 641 -70 -642 -190 578 398 -291 -588
6687e88O01N75l04q42J32P49J76n44m82K47P53Rp92k74N04O75l98o74r1P63L74
6708E69n75n85K93O75J45o53n42N42O76k31p61j37O62N56m66p34J45Q10J35o14
6728i0m82M54O49n6p22l81P18M87l17p75P9O82M25o61o38M00P32n5o63l38N52
6749@O00k83q05L5Q18K03n02n88J94P47J49q23l04N31N82k10p12j28O46M67n08
6770A09o75K70P09M7n60n19M89O60j73p78p3N62M92m00o08K5P19K74o61m78K98
6791b71P13k5o73l60O19N40l04p08k2P30K79n10n90L28O15N5o50l74M54P04j87
6812C63p89j36P32M32m95o44J85P58J65p81l82M81O15j48p21j94O72N40m54o87
6832d88J11O96L05o53n77M16O77l9p44k85N81N98l10p67M9P35K98n95n56K78O62
$$ plain form
6687 -588 13 588 284 -558 -426 323 499 -45 -527 -280 473 482 -310 -584 -80 595 197 -477 -568 195 569
6708 569 -6 -591 -298 377 522 -131 -673 -131 545 314 -447 -584 78 634 168 -566 -421 389 524 -90
6728 -90 -572 -118 531 475 -247 -628 90 577 260 -515 -436 246 671 10 -628 -228 504 449 -214 -552 0
6749 0 600 317 -488 -453 365 568 66 -522 -328 419 568 -255 -559 -28 554 344 -368 -496 150 617 109
6770 109 -566 -296 413 460 -100 -619 -130 530 357 -421 -494 68 560 160 -448 -423 296 570 -91 -569 -271
6791 -271 442 417 -256 -616 3 543 239 -469 -491 239 518 8 -582 -254 361 416 -234 -608 -154 550 363
6812 363 -426 -562 170 602 107 -537 -352 406 571 -210 -592 -111 504 356 -365 -559 113 653 199 -488
6832 -488 -377 319 624 -29 -606 -190 487 448 -296 -581 0 598 288 -479 -430 305 603 8 -548 -270 392
6853C92J58p23l65N26N91l53o33o7O20M40m87o76L14O47R7o40l80M45O02j48p12
6874c52j00O22L45l86o09R2P63J42o63m78L91N97N3p43k33O31M11k50o48n7O80
6895B08K83m72o52L80P31j4n97m35N44N68m08n75m6P24L28m97m78L0O61K37o73
6916a53m77N95N80k09o67k4M98L68l11n63j68Q00K89n56n13L14O17J8q50q8N90
6937I0M56m19l98q3O79K80q67k62M06O18o7o21l66O22M21l61n21j02P31L13n48
6958Am82J53O21K59q70j29M45M13po22k13N19L59m17m08j8P51K69q58l22M03M91
6980C38o2n83j53L44O68l32o53k03R20R9l81m72O4O82L36r08r0L13O72l99o06
7001d06j44O19N81m44o24M21JJ57n02m14O98L78k04m86J76M26K7p0m22j63Q65
$$ plain form
6853 392 550 -173 -538 -12 579 226 -407 -474 146 586 99 -577 -263 384 481 -159 -539 -94 508 360 -352
6874 -352 -452 170 515 129 -480 -388 375 517 -146 -624 -233 364 417 -326 -559 72 483 233 -415 -472 208
6895 208 491 19 -633 -253 478 464 -133 -568 -24 544 136 -439 -485 239 567 70 -408 -378 283 520 -153
6916 -153 -630 -35 545 336 -331 -355 143 511 200 -363 -531 269 558 2 -511 -197 420 438 -412 -500 90
6937 90 546 127 -271 -354 325 605 -262 -524 -118 500 433 -188 -554 68 489 128 -393 -495 236 549 1
6958 1 -481 -328 293 552 -318 -447 -2 411 404 -218 -431 88 447 30 -378 -396 355 624 -234 -556 -153 338
6980 338 276 -307 -460 -116 552 220 -433 -636 284 383 2 -470 -406 276 612 -296 -386 -73 599 200 -406
7001 -406 -550 69 650 206 -418 3 4 161 -341 -755 -57 321 117 -369 -193 233 260 190 -232 -395 470
7022D70J33o93k58L47O24j82o37j71N93P00p90l51J0L15N77k60r03J28R58k06
7042D04o07m83Q60O02j60q18k30Q35K83m25n85J35O98m2p01j26M28M12j63q17
7062e00j37Q91J47j2j108L16O63K57m63j118J088Q02r12n91L52N41J57j21n63
7081c11R6P25J9o95j97J38P86k60p24l3M93N03j75p04j11R73K4m34k85R0L53o9
7103B02m02n53Q00M55m59l35Q5P00q3j87o60M58K57m6k42l44K08L91r2k67j62
7124b76M85K21L8p84n18N61Q82p43k30L05J82M0j54j58M69J70o83j49K19MP16
7145E97o34j28j2J28L52p57L84R8L68j82m89j94P41M2l62k95R9M79j58Jp05Q47
7167B20J38N18j283j71J007N7n30m17L17M5M43m71m35N80M98m99K6l98P69L9n22
$$ plain form
7022 470 603 -90 -348 -1 623 441 -196 -367 226 926 136 -215 -205 110 687 427 -476 -348 610 404
7042 404 -203 -686 174 776 616 -202 -432 403 686 261 -324 -189 509 467 -234 -360 68 480 317 -500
7062 -500 -637 254 401 389 -719 -403 260 517 54 -1064 24 826 -86 -677 -325 216 373 252 -311
7081 -311 -215 510 529 -166 -363 -225 561 301 -423 -456 37 540 365 -339 -450 523 547 113 -172 -82 271 202
7103 202 -200 -753 47 502 43 -292 -207 493 410 223 -437 21 278 232 -10 -354 -146 245 153 -114 -276
7124 -276 209 430 468 -316 -834 -273 609 -134 -364 -59 123 163 9 -149 320 490 -193 -342 -123 -119 597
7145 597 -37 -165 -177 -49 303 -454 -70 28 396 214 -275 -469 272 314 -48 -343 -244 235 77 78 -627 220
7167 220 358 876 -407 -578 429 486 -44 -461 -144 -99 344 -127 -562 18 516 17 43 -355 414 453 -69
7188f9j97K00j13M44m61j28J77N54q6m54k70N16P8J51p26r9M56M46p19M1l4M43
7210A50J19M0l80j99N04r9p25J95N40J76j73n53L23K94j20J41o25P83P7j45l99
7231g6j90J58N16o65k22K5P06l51L08m49J72K81j55J86o89O37J8k06l34j59M49
7252d0L04m00r7l60M97P88q38m40N39K34no29j86Q77O44q60m39L20L09N51r98
7273b29j79N65L57j17p42R7K50O43m99m43M26K54o6k23m92O33O29l64r38J09O23
7294B94L82l07m02m54R14K50n37k48k73O73k86K7k65M69L40k34l42k92N41P8m50
7315a22k71L01M84K51n02m22K37N2P27r16l0M37J23m07n12M38J88J77j04k79l8
7336a88M47J68l20p07O21O56n93n20M52K91J24p26K66k57M28N79o93l83K33M79
$$ plain form
7188 -69 -266 -66 -179 265 -196 -324 -147 407 321 -133 -403 113 191 342 -384 -483 -27 419 -300 -259 -293 150
7210 150 269 309 -71 -270 234 135 -590 -395 145 321 148 -405 -82 212 92 233 -392 391 468 323 -76
7231 -76 -266 -108 408 -257 -479 -454 252 -99 209 -240 -68 213 58 244 -445 192 210 4 -330 -489 -40
7252 -40 264 -136 -233 -593 -96 692 -146 -586 -47 187 182 -447 -633 244 888 28 -411 -91 218 769 -229
7273 -229 -408 157 514 397 -345 -248 2 645 146 -297 129 383 317 94 -398 235 864 500 -438 -329 294
7294 294 676 369 -33 -487 427 677 140 -108 -381 292 6 33 -232 237 577 343 1 -291 250 328 -122
7315 -122 -393 -92 392 643 141 -281 -44 8 735 -181 -211 226 349 -58 -570 -132 56 233 129 -150 -188
7336 -188 259 427 107 -600 21 677 84 -436 16 307 431 -295 -29 -286 142 721 28 -355 -122 357
7356C57j88n89J38L41L10j30n86J6P08j04o47K05K9M82j23k21l71L71K97k97r8
7377a00o7O33k71o31K26K44L98n54l0l45Q62K48k31l59J08k5J91o03p09Q73M15
7398B73j40j11o19L88O75k76m14n1N84K74m65p56L21N41K97p29j09K3M55J70o19
7419b88j10L95O97o25J8l66M12q3J16o24M46M07k6l08o32L43N16k16l10k61N95
7440I6Qq8k8O7o9O4k11k66K29O56l03m53j88O83M24n87l00J93J44K06m36K4Q5
7463e0N36n60Jj76L7N13r5k20j98N15K25o05j74M64j37K11k82m15L80M44l32k19
7485a37j9K28P1N4m18K02K41p9n1k56L55j35J79k67m53O19P3l16j21J94K85J14
7507C63m27J15O3j0o8k50j11L67K44j03n06l54P79o2j14j80J19L26m3j85l64O38
$$ plain form
7356 357 169 -420 -282 59 369 239 -347 -331 377 273 -374 -169 -140 342 219 -2 -373 -2 295 -2 -100
7377 -100 -167 466 195 -436 -210 34 432 -122 -152 -497 365 613 382 23 131 106 297 -306 -1015 -142 273
7398 273 133 22 -597 -209 466 190 -224 -275 309 583 118 -638 -317 224 521 -208 -317 -294 161 331 -288
7419 -288 -398 -3 694 69 87 -279 133 50 166 -458 -12 395 369 61 -571 -228 288 72 -238 -499 96
7440 96 104 16 -12 55 -14 50 -161 -427 -198 458 155 -298 -486 197 621 34 -266 -73 71 277 -159 -135 -50
7463 -50 486 -74 -73 -249 -212 301 206 -14 -212 303 528 -77 -251 213 76 287 5 -410 -30 414 82 -137
7485 -137 -156 72 143 197 -221 -19 222 143 92 -164 191 56 235 -32 -485 134 207 -109 -230 -36 249 363
7507 363 -64 51 114 104 36 -214 -325 42 286 183 -323 -677 102 40 -74 -254 -135 191 148 -37 -401 237
7529B37l31m3k37l80Q32L42n13p5k22P51K30o88k2J90J77j96l75J36k73P93m21
7550h8j61K08L86k90k11M7k50M70k28j07J1J84M63n29O5k15M48k3k22J68j85l1
7572i0kp9J66J42J93n66J68L0L7K21j71m39L74K52jm54pM18r6j23K56k58J45J37
7596B53o0k86j28K62j0m65k00O83Q3L20p43Q9J27L90k65Qk05L95n4l97n6J48K94
7619A83l98K7q9L91J74k85n08N45J53P9l39l08L59L71qo41o7L85J09J11m16J84
7641A2J39P4j8k48k30L37L34m98l81L31P43n02k67N5J70M31j68m45K74o8J45r6
7663A24m36k5P31m07l04L86j86J65K33m10j81M45J58m95K47k3K94J8l31l88J49
7684b36N73j79j80j26L97k07K04m33j23N99j79J82m84L5M05l38j45J35J78J13
$$ plain form
7529 237 -94 -137 -374 -754 78 420 -93 -168 -390 361 591 -97 -119 71 248 52 -323 -187 -460 333 -88
7550 -88 -249 -41 345 55 -156 -109 -359 111 -117 -224 -213 -29 434 -95 -30 -245 203 180 -42 126 -59 -90
7572 -90 -92 -171 -5 137 330 -236 -68 -38 -1 220 49 -390 -16 236 235 -219 -226 192 96 -27 229 -29 116 253
7596 253 193 -93 -221 41 31 -434 -634 49 132 452 -291 -202 -75 315 50 58 -147 248 194 -203 -259 -111 183
7619 183 -215 -188 -277 114 288 3 -505 40 193 272 -67 -375 -16 355 347 -294 -361 24 133 244 -172 12
7641 12 151 225 207 -41 -271 66 400 -98 -479 -148 595 93 -174 -119 51 482 314 -131 143 75 220 124
7663 124 -312 -337 394 -13 -317 69 -117 48 281 -129 -310 135 293 -202 45 22 316 334 3 -385 -236
7684 -236 337 158 -22 -148 249 42 246 -187 -310 289 110 292 -192 -157 248 -90 -235 -100 78 191
7704A91o2q4P2R9k67Q7l07J70M6L10n44M5J95K75k01k63jO99n20j61m2Q8M28l34
7728h1q8Q1K01j5L61m06j37M43j84k17J28m46L80J49j79l77L59K36K0l93P9L27
7750B41k3k15O5j77o6L38m7n42N26j42J33l53K49j22O72p63k54K9O15K59m74J36
7772H5m68P79j26k15k4J61J3J38k42q0K29j07j79M2j00K08J96n24J90k46L0Q33
7794E93o00M8Q6j39r3L0KJ07k18mn3J22M02q4m48k0L24K59l75j72L91n1J60n09
7818b42p0RM71n2m10N0J53J75p1l8k90J35L36j81n7k1N81o89J97r5L6J58J70q
7842B47m38L36J06j54l49J26K73R2k58k55K55K69k85N5M1QN7Oj21l5o9J29k9r1
7866h4m0K22r3k3j16K17J7L3l13L2L5J57N8j69lJ01J3j57J27o7J12O7r7j25J26
$$ plain form
7704 191 129 45 117 216 -51 36 -271 -101 -55 255 -289 -244 -49 226 25 -238 -239 460 -60 -221 -263 -175 253 -81
7728 -81 -169 -88 113 98 459 53 -84 359 175 -42 86 -360 20 169 -10 -387 -28 208 228 -165 -86 241
7750 241 218 3 68 -109 -175 163 116 -426 100 -42 91 -262 -13 -135 537 -226 -480 -451 164 423 -51 85
7772 85 -383 396 270 55 31 192 205 343 101 21 250 143 -36 6 -94 114 310 -214 -24 -270 -240 593
7794 593 -7 41 127 -12 -105 -75 -73 34 -184 -188 -241 -119 283 199 -249 -269 55 314 -61 -233 158 107 267 -242
7818 -242 -312 -303 168 116 -294 -244 -91 84 13 -25 -315 -180 156 -25 -82 -103 478 -211 -14 -109 -73 85 255 247
7842 247 -191 145 251 97 -252 -126 147 239 -19 -274 -19 250 -35 20 61 69 126 132 11 -24 -93 36 7 -84
7866 -84 -124 98 5 -18 -134 83 100 133 -180 -148 -113 44 102 -67 -70 31 44 -113 14 -53 59 126 29 -96 30
7891C0L2l4j38j9J36O9j03j20J45K08p4k02j3J57R7j70q4K9J60L2j73q7J50P7
7915A05j26m1l9J32Q2m3j39k2J58L7o8j10K0R3J02j54j13J39Q7l7p2p0R3N9m6
7940B7q1L2K2Q9j10r2P2J16J1j49m0Q5J20p8q7k3J52N3q4q1nJ91p8r6o8J09J12
7967A19p0j65L9J26N5q9q5N2P0N5j48p8J42J01r1r7m0J41Ll6r1PJ42K5j00j32
7993a45R2J34n0l3p4P1N5jj46QR7K5m1m2N4K3O2j16l9P7J6N8j31OO7N2k7j32N5
8022b5N4K5k7m2M1K3m3n4O5J6J1K6p5n4J02M9j20nL7L7o8J1k6JR7m7k7m1O9jK1
8053C0j07J9J40jp5K2o4M5L1p8L3lN9Kj48K4J21k5m1l1RO9n7O4j10P5J5Oo3n6
8083i5R8O1q3n3N0L2M3r6K7J7J8L8r1%J6O8n2n7J4O2J0o2J8J5P1o8k9J3pR9m6
$$ plain form
7891 30 62 28 -110 -129 7 76 -27 -147 -2 206 132 -70 -83 74 171 1 -83 -54 106 138 -35 -122 28 105
7915 105 -21 -62 -101 31 113 70 -69 -91 67 104 36 -74 -54 39 141 -13 -126 13 100 63 -9 -79 14 73 27
7940 27 -54 -22 0 89 -21 -113 -41 75 86 -63 -103 -18 102 24 -63 -86 66 119 35 -46 -51 140 62 -34 -102 7 119
7967 119 49 -116 -77 49 104 15 -70 -18 52 107 -41 -119 23 124 33 -64 -104 37 40 4 -87 -80 62 87 -13 -145
7993 -145 -53 81 31 -2 -76 -5 50 49 -97 -89 8 33 -8 -50 4 27 89 -27 -66 11 27 85 -46 -40 27 79 52 -80 -25
8022 -25 29 54 27 -15 26 49 6 -48 17 33 44 70 -5 -59 43 92 -28 -33 4 41 -27 -16 -42 -41 56 9 -18 -59 10 9 30
8053 30 -77 -58 82 81 6 28 -36 9 40 -38 -5 -8 51 53 -95 -71 50 25 -16 -47 -38 31 -26 38 -72 3 18 24 -39 -95
8083 -95 3 64 -19 -72 -22 10 53 -43 -16 1 19 57 -34 -34 -18 50 -2 -59 -45 17 27 -35 -17 -2 69 1 -28 -15 -22 77 31
8114C1k6J4L7l4K4m9j9N1Jj1k0nN3l8j5kj9J06q6jl1N1K6k2ql7K0j5N4Lm1M8o7
8147b7L4kML9Qn4J5lJ4J13j79L7K3K2q1N7j0l3O4k1p3O9m5N8k5j1m7J8kM2Mo5
8179e7P9k5J9r7M5N3L5q3J3L1L7k0
$$ plain form
8114 31 5 19 56 22 46 -3 -22 29 30 19 -1 -6 47 9 -6 -8 -27 79 -7 -8 -39 12 38 16 8 -29 -9 -24 30 33 -8 40 -27
8147 -27 7 5 9 48 56 2 17 14 28 141 -38 -1 22 44 -37 20 10 -23 41 20 -53 16 -29 29 4 -7 -54 -36 -38 4 8 -57
8179 -57 22 -3 16 -81 -36 17 52 -31 -18 13 50 30
8191C0
$$ Imaginary data points
##PAGE= N=2
##DATA TABLE= (X++(I..I)), XYDATA
0@%%%%%%%%%qJ6j6J6k4L3m1N6p2Q8j04J20j44J69k00K40k80L25l75M34m98N70
31C05o55P47q46R56j081J217j364J527j705J899k112K346k601K881l186L515l876
48b033M276m715N193n718O302o949P668q478R394j0438J1643j3051J4720j6736
62h922J9231k2410K6617l2485M1301n6175Q7563k63490L45876L20025o33215k2717
74a98801J32780J76446R2581k80692j58892L03191M0194q6253q775r2673o3642
85a44536K45867J61620l45699k81051M39954K79613l66016k60610J50284L18235
95A97661O3440m43116q5483M16484J6048j82905l3073q2999J64348J50108j89165
106h652o3406j5451L3932L10085j51315m42295K52676L67752j77165k40445l4078
$$ plain form
0 0 0 0 0 0 0 0 0 0 0 -8 8 -8 8 -16 17 -24 32 -40 48 -56 64 -80 89 -111 129 -151 174 -201 233 -265 305
31 305 -350 397 -449 507 -574 643 -721 806 -899 1000 -1112 1234 -1367 1514 -1672 1843 -2033
48 -2033 2243 -2472 2721 -2997 3305 -3644 4024 -4454 4940 -5498 6145 -6906 7814 -8922
62 -8922 10309 -12101 14516 -17969 23332 -32843 54720 -208770 137106 457131 -176084 -198801
74 -198801 -66021 110425 203006 -77686 -236578 66613 106807 20554 11779 -80894 -144536
85 -144536 101331 262951 -82748 -363799 76155 355768 -10248 -270858 -120574 197661
95 197661 261101 -182015 -267498 148986 165034 -17871 -50944 -133943 30405 180513 -8652
106 -8652 -72058 -87509 -53577 256508 105193 -337102 -84426 283326 106161 -134284 -168362
117a68362J81045K14100j50928k90659Q7657K94848k3396k30026k608N0339M9337
128A1347J92152j85590l25917L20705K51879k71238r8815M270O9227K72404j80844
139E9580l41292K44490K13095j24470p3285r7980K7288K44694j2588k56929n7838
150a75235K02992J60582j36591k26512M3163K48408P0377k55156j37725K21328
160A5631J26056r4135r9418q7625J24192J93585j46621j54685N2658O1203J62059
171A52900m4362l47209J04914L65755j14620k42893m628J18348J82939p2051k86591
182a87498O8182K63634m0826j54810j6396J8072P6543J13474j22948k00275J39446
193d3402K06437q3193j50271o5192J10421K38719j33020l17620J62486K54628
$$ plain form
117 -168362 12683 226783 75855 -214804 -127147 167701 144305 -85721 -88329 -37990 11347
128 11347 203499 17909 -308008 12697 264576 -6662 -105477 -101207 -31980 240424 59580
139 59580 -281712 -37222 175873 51403 -21882 -119862 -92574 152120 139532 -117397 -175235
150 -175235 27757 188339 51748 -174764 -131601 116807 187184 -67972 -205697 15631
160 15631 141687 47552 -51866 -139491 -15299 178286 31665 -123020 -70362 -9159 152900
171 152900 108538 -238671 -133757 231998 117378 -125515 -130143 -11795 171144 99093 -187498
182 -187498 -119316 144318 103492 -51318 -67714 -49642 26901 140375 17427 -182848 -43402
193 -43402 163035 79842 -70429 -135621 -25200 213519 80499 -237121 -74635 179993
203A79993j04665j28281m7036N1512J86973m6704k10575M1876J17180K2536Q533
214G1342j24663r5153J92864J31841j82436j44546R6587J53686K7971j68846j43101
225a84454J83345J97911j70744j73833R4767J04934M0039n5219j68857M8277K08605
236A24771m3950j38930j5066J9903J26750O5728k23251q9400K31338Q6169j39217
247D845j05348J662J56172J06907k00958j45044J89207J23723r9496q7480l6077
258i1887P3912J50143p8705j84725O3408J35831O735n1204j17537j0816K11518
269A06673L2555k28674m0083J57553P2404m0123j35469n7510J94333R5893j94953
280c7401q3568J12724O6197K1998p7513j35837J04457J71088r5517j29946J6896
$$ plain form
203 179993 75328 -52953 -99989 -48477 138496 91792 -118783 -76907 40273 62809 71342
214 71342 -53321 -148474 44390 176231 -6205 -150751 -54164 99522 127493 -41353 -184454
225 -184454 -1109 196802 26058 -147775 -53008 51926 91965 36746 -132111 -83834 124771
236 124771 80821 -58109 -73175 -53272 73478 139206 -84045 -173445 57893 144062 4845
247 4845 -100503 -98841 57331 164238 -36720 -181764 7443 131166 31670 -55810 -91887
258 -91887 -17975 132168 53463 -131262 -67854 67977 74712 23508 -94029 -104845 106673
269 106673 139228 -89446 -129529 28024 100428 60305 -75164 -132674 61659 157552 -37401
280 -37401 -120969 -8245 57952 79950 2437 -133400 -28943 142145 46628 -83318 -66422
291f6422O7854J05900l5080k01819L1495K15459j7722j49363l6610N3831J17222
302H4745J8989j78181n0483J76353N5029j02643o2813j2419Q9828J11616j22200
313G821j48943J17947J21608m7311p4823p1674N5290J70770o4919j90353N7397
324f7190J29317M526m5282j03770p050J77501K0025j76270k7998J01824O0188
335F5821n86j12106p7517J50078J07663j38349r8857O5001Q0936M5094p9092j38248
347a30162Q9349J67251p7159j27200J3365O1281Q9165j9092j72119J1271J81899
358H7849l331j14300l8898J9257J09851M8442j62856o8736J54088O5094p7677
369A8783o9777k7042R3989J07262j15083j29986R8813J03978k9291o4885o9266
$$ plain form
291 -66422 1432 107332 72252 -129567 -98072 117387 99665 -49698 -86308 -32477 84745
302 84745 103734 -74447 -124930 51423 106452 3809 -59004 -71423 18405 130021 7821
313 7821 -141122 -23175 98433 51122 -23701 -95375 -40085 130685 65766 -124587 -67190
324 -67190 62127 66653 21371 -82399 -89449 88052 108077 -68193 -96191 5633 65821
335 65821 65235 -46871 -124388 25690 133353 -4996 -103853 -38852 42084 87178 8086 -130162
347 -130162 -40813 126438 49279 -77921 -64556 -3275 85890 66798 -105321 -94050 87849
358 87849 84518 -29782 -68680 -49423 60428 108870 -53986 -122722 31366 96460 18783
369 18783 -50994 -78036 15953 123215 8132 -121854 -23041 80937 51646 -13239 -82505
380h2505M4085J46557m0622j60769K6517J11379K2616l6799r7432j8451J56708
391G1284L7099j58003l8398R2053N3120N756r0954q2261J25290J04037j15094
402C929q3297M2884N9217O0344n9973j36217P0155J45819n2959j01595r877M6119
414a5451R1846j2309j46310k249J42648J7533q6443m8911P580R1381N7651j24539
426b7573q5348J19250P7364n9853o1653l5667O6274J14979q4895j32127P7437
437c1812R0652j4483l9221q0285J9500J45030k1193j39623M639Q1764M8177j8613
449D4532j09229k0945J39089M1764j20985n5745O5464O8455Q104p9444p4502Q7553
461e889J05924p6310q9505K3692N1365O6463l3552j43479M4946J52127m3510r2015
$$ plain form
380 -82505 -38420 108137 67515 -93254 -66737 44642 67258 30459 -66973 -85424 71284
391 71284 108383 -49620 -88018 4035 57155 62911 -28043 -110304 14986 119023 3929
402 3929 -79368 -36484 22733 83077 23104 -113113 -42958 102861 49902 -51693 -61570 -15451
414 -15451 76395 64086 -82224 -84473 58175 75708 -10735 -59646 -52066 39315 96966 -27573
426 -27573 -112921 6329 83693 23840 -37813 -73480 -7206 107773 22878 -109249 -31812
437 -31812 58840 44357 5136 -75149 -55649 89381 68188 -71435 -66796 14968 63145 44532
449 44532 -64697 -85642 53447 95211 -25774 -81519 -16055 52400 60504 -18940 -93442 -5889
461 -5889 100035 23725 -65780 -42088 9277 75740 42188 -101291 -56345 95782 52272 -39743
473c9743r999K2778R5020M643j45659M64J22569P016n0056m5031k0435Q6567O3650
486I1784r9724q4760P8591Q8860l2813p6443l1455N8701R6955n3734j27570N2712
498c8896R7716k2552l3275m8669j0466J15415J1993j19245j0576N6310M8246J4818
510F0819j10304m4610J38032M2555j02787m9540L3887P5144K2420r2113n2353
521g8850P8452O4684m0732o1185q830L8667O7745j2018j22650L507J37658m432
533F2016r0356k2587J4358Q8953K8451j46144j7086J33994l222n2389j5376l5164
545e4552O2724P5667q4862p4133N4774O7178N081o6531n9212N9575R6265m0284
557D1690j14350J9474J03225K661n8273l8079N539Q0845K1593r3934k4832N1759
$$ plain form
473 -39743 -49742 -26964 68056 72699 -72960 -72496 50073 57089 7033 -37998 -58433 28134 91784
486 91784 -7940 -92700 -14109 74751 41938 -34505 -65960 -7259 89696 35962 -91608 -38896
498 -38896 58820 36268 2993 -45676 -56142 59273 71266 -47979 -58555 -2245 46001 60819
510 60819 -49485 -94095 43937 86492 -16295 -65835 -31948 43196 65616 -26497 -78850
521 -78850 -398 64286 23554 -37631 -46461 -7794 59951 47933 -74717 -71210 66448 62016
533 62016 -28340 -50927 -36569 52384 80835 -65309 -82395 51599 48377 -4012 -19388 -54552
545 -54552 8172 83839 -1023 -75156 -20382 46796 51877 -14654 -73866 -14291 81974 41690
557 41690 -72660 -53186 50039 52700 -5573 -43652 -38113 42732 64325 -29609 -54441 -2682
569b682M0196J8776q2636o2524J15778O0973r4648m9353K4844O3486L9926r0928
581a8792o0738R0051M6916m5777k9682j8075J9369P0087q042r8776q294J00227
593C8474K5325p0720m8319J7940Q5641K5324j23853l0965J24076J0046o7894k958
605a7883j3357K6368O3875m9754o3536L2097M0165K7096k9084q9033L1561J19778
617G8293k6282j17215K569R6343L0026o7215n7661L5675P2602j0202o5958m022
629c3047L0466J5976K4946l5433p0160N2418Q2993m0028p2565r729O7734P0340
641H3911p8650j01649Q5417R1126o2261n9200J1933L3196L8447j9768o1554R001
653c0051N0337J0288j4616l9284k7390P0531N8176q8966o8506P9100O4939l8139
$$ plain form
569 -2682 37514 56290 -26346 -88870 26908 87881 -6767 -56120 -31276 32210 72136 -18792
581 -18792 -79530 10521 57437 11660 -18022 -36097 -16728 53359 45317 -53459 -61753 38474
593 38474 63799 -6921 -55240 -37300 48341 73665 -50188 -81153 42923 52969 -14925 -17883
605 -17883 -31240 -4872 59003 9249 -54287 -22190 17975 45071 15987 -73046 -41485 78293
617 78293 52011 -65204 -62635 33708 63734 -3481 -61142 -25467 47135 36933 -29025 -33047
629 -33047 -2581 13395 38341 2908 -67252 -14834 68159 28131 -44434 -54163 13571 83911
641 83911 5261 -96388 -10971 80155 17894 -41306 -29373 3823 42270 22502 -39052 -30051
653 -30051 20286 30574 15958 -23326 -50716 19815 77991 -10975 -79481 -381 64558 26419
665B6419o3575j5121P1497N1209p6185n4883N7466L6100j1862j7580m0576R655
677b7436P1927m990o9457j1062M0970M2294p343p7675j5165R6611K2391q3851
689b2786k5459M1195L6667Q715n5316m1020O3784M6200m4850l7698N87L2273M6211
702D8503l3176p2512K9195P1269j1006n1100j9866K5250N1779l621p0401r793
714d5479O4107J9927l1988l5516j0524N8084M0101p1694m5524N6750M0006j2983
726B5267m2524l3780N4922N5530n6100m8221L0328L1182J4331k0269n2307J3975
738b7666O7436j809n9386j8314L5928M2572m851o5865k2121Q1080L3951p4613
750a3658l1791L9247L1955J0122m4703m2735N6135M2360m1614k4309k180J4496
$$ plain form
665 26419 -37156 -52277 19220 70429 -5756 -60639 -3173 32927 21065 3485 -37091 -27436
677 -27436 44491 39501 -29956 -41018 -48 42246 34903 -42772 -57937 38674 61065 -22786
689 -22786 -48245 -7050 29617 38332 -16984 -58004 5780 51980 7130 -30568 -29981 2292 48503
702 48503 15327 -57185 -27990 43279 32273 -18827 -38693 -13443 38336 34715 -35686 -45479
714 -45479 18628 38555 6567 -28949 -39473 18611 58712 -12982 -58506 -1756 38250 25267
726 25267 -17257 -51037 3885 59415 3315 -44906 -14578 16604 30935 10666 -41641 -27666
738 -27666 39770 37961 -21425 -39739 -3811 38761 33910 -31955 -54076 27004 60955 -13658
750 -13658 -45449 -6202 25753 35875 -8828 -51563 4572 46932 5318 -18991 -21171 -6675
762f675M7925j7590o6974J4329N7080Q713l7549m2397K1679O6229p724p2087q616
775d3657O2368K3452m0788l3363R523M0910J9213m6184l0348L6673K2751l051
787A7499j4901m1973J9725O8203k5772o1120R635L7271L0220k3011o7835K2666
799b9393P7335j8710n9386n32L3206K5653j1430m0675n992M0074K0135k6505k6647
812b2867J418K6155L2457k5910o0771K8138O6702j9941n0246q736L1978M6885
824D5262k7603o6347K9086N4076j6153k4372j4047K246M1313O565m5332j3206
836b8512K6734K6841q6m2020k3160M9328M0251m5392m8929L1032M7151o843l8187
849a1792k3302L1046M5290k7088m5381J5928K5424J0079l744m1170n887N5680
$$ plain form
762 -6675 41250 23660 -43314 -28985 28095 36808 -741 -43138 -21459 44770 37046 -35041 -43657
775 -43657 18711 42163 1375 -31988 -22465 18445 37658 -8526 -38874 -2201 20550 17499
787 17499 2598 -39375 -19650 48553 22781 -38339 -28704 8567 38787 15776 -52059 -29393
799 -29393 47942 29232 -30154 -30686 2520 28173 16743 -23932 -29924 10150 30285 3780 -22867
812 -22867 -21449 4706 37163 11253 -49518 -21380 45322 25381 -24865 -33601 -1623 45262
824 45262 17659 -48688 -19602 34474 18321 -6051 -20098 -17852 23461 30026 -15306 -28512
836 -28512 -1778 25063 24977 -17043 -40203 9125 49376 3984 -44945 -13913 33238 26395 -11792
849 -11792 -35094 -4048 41242 14154 -31227 -15299 10125 20204 16460 -24710 -30597 25083
861B5083P781m3263j6847J4918L6241R062n3567k0225N3463K3595l4495k7197
873b5451O397L1301J8912l2401l4254K5996L6838j0819k9005j2251J7007L6493
885B8763q294n0290L029M4564N883k3228k3171K23M2064J2899m8624j6377L4702
898B143J9716o713k8441j9545L7442L2995l6217l2769J9276K7403P863k3520l1818
911c2185K0918M2315j3859l6796j283K2229K2142o594l9790m899M5755J3073l6201
924e175k0562J5171K9649Q328l7904k4241L9379K8011k6845k4136J682K1264K4997
937B9618k2301l8499J9956L4202n398k1175j9356J1283M0382o865m5217P9L4213
950A0922J3570j7219k9793K243L8983R300l7366j8212K5636K3158o915k4549j4934
$$ plain form
861 25083 32864 -10399 -27246 -12328 23913 32975 -20592 -40817 12646 36241 1746 -25451
873 -25451 -19054 12247 31159 -1242 -35496 -9500 27338 16519 -12486 -24737 -7730 28763
885 28763 20469 -29821 -26792 17772 23655 427 -22744 -22521 19543 32442 -16182 -32559 2143
898 2143 21859 15146 -13295 -32840 4602 37597 1380 -31389 -12113 15290 23153 -367 -32185
911 -32185 -11267 31048 17189 -19607 -20890 1339 23481 16887 -22903 -27802 17953 31026 -5175
924 -5175 -25737 -10566 19083 27411 -10493 -34734 4645 32656 5811 -18325 -16643 4621 29618
937 29618 7317 -31182 -11226 22976 17578 -3597 -22953 -11670 28712 21847 -23370 -23291 10922
950 10922 24492 7273 -22520 -20277 18706 28006 -9360 -27572 -1936 21222 14307 -10242 -25176
963b5176K4528L0991k2838l3415J2703K3618R044j3396l4023J0645M5087r523
975A8245l5714j850J6803K2991l768l9633r64L9124N827k3702j6377N689K6444
988A3115Q354k8193j8875K1208K6193r514k6562n812K0377K4453j4054l8300J0876
1001a6734L7400l945k2039j3266O512L3800j211m0505J159K6739O995m176k3565
1014a2836j0732L5203J5557l0285j9106J3372K5981M029k9871j6782K5575K6592
1026B6697j5910l1721N784K7069O305j4204k1851K431L3706K567l0601p513J2874
1039d367K0295M913l5362j1602L7494J1747k1998j7016L65K7656J2627l2368j5692
1052b3308K2759J6774m804j9550j1597J9156K2144j2592k8420K958K8623N846
$$ plain form
963 -25176 -648 30343 7505 -25910 -13207 10411 19455 6059 -27964 -17319 27768 18245
975 18245 -17469 -19319 -2516 20475 16707 -22926 -23890 15234 21061 -2641 -19018 -13329 13115
988 13115 21469 -6724 -25599 -4391 21802 12288 -14274 -20086 291 24744 10690 -27610 -16734
1001 -16734 20666 16721 -5318 -18584 -12072 21728 20517 -19988 -18829 7910 14905 10729 -12836
1014 -12836 -23568 11635 27192 -3093 -22199 -8827 17154 21183 -8688 -25470 105 26697
1026 26697 10787 -20934 -15150 11919 18224 4020 -17831 -15400 18306 20873 -9728 -17241 -4367
1039 -4367 15928 20841 -14521 -26123 11371 23118 1120 -15896 -15531 12125 24752 -7616 -23308
1052 -23308 -549 16225 11421 -8129 -19726 -570 21574 8982 -19438 -16480 12143 17989
1064A7989j9664j6186M956K8815N310l6256p381K8638Q444p943j6643j1466K7311
1077E924J8637k7644j7299J3372J7221O243k0242j9230J9504K3518j0453k3289
1089a3738k709K0663J3850j3089k1397K061K5482Q109k3360j4774J3154K0609
1101A4861J484k6781j1398K7771J4164j7610j4704j94J8570J4767k1591j9029
1113a9690J6118J6329n80j3650j7065J2924K7988j0018k9831K114K5407Q812j7277
1126A581j9211P664K5957J095k6909o835J9516J0108m884j3929j0782J7394K0343
1139B1108j6114k2112N898K0489R260j9450k2050J7646K6823j1950k4216J234
1151a3434J7930J0219j0758j7953L313J8892M224j3067j2168K735J9424P664k3572
$$ plain form
1064 17989 -1675 -17861 -12905 15910 21220 -15036 -22417 6221 14665 6722 -9921 -21387 5924
1077 5924 24561 -3083 -20382 -7010 10211 16454 -3788 -23018 -3514 20004 9551 -13738
1089 -13738 -16447 4216 18066 4977 -16420 -14359 11123 19232 -4128 -18902 -5748 14861
1101 14861 16345 -10436 -21834 5937 20101 2491 -12213 -12407 6163 20930 -661 -19690
1113 -19690 -3572 12757 12177 -1473 -18538 -5614 22374 12356 -17475 -15361 10046 18858 1581
1126 1581 -17630 -9966 15991 17086 -9823 -16658 2858 12966 8082 -5847 -16629 765 21108
1139 21108 4994 -17118 -11220 9269 18529 -921 -22971 -5325 21498 9548 -14668 -13434
1151 -13434 4496 14715 3957 -13996 -10683 8209 12433 -634 -12802 -10067 9357 17021 -6551
1164f551j4997K1615J8595j2665k0502J34K1633J0607k0480j5624J4536J5251
1176A1552l736j1816q441P145J7894j498k1335n036J8188J2749r981k0771J083
1189a4003K6503N434k5693r026J7122J2446m166j6294o407J7391J1632j1727j2793
1202i581OJ3334J2545j2947k0695R549K3294k308k1468o431J6142J4334q403j9874
1216a2503P51K1020M536j5380q395L718J2939Q397j7239j5299J6188J6568p213
$$ plain form
1164 -6551 -21548 67 18662 5997 -14505 -14371 7262 17869 -2611 -18235 -3699 11552
1176 11552 7816 -4000 -12441 -5296 12598 11100 -10235 -15271 2917 15666 5685 -15086 -14003
1189 -14003 12500 17934 -7759 -16785 337 12783 8617 -7677 -14084 3307 14939 3212 -9581
1202 -9581 -9575 3759 16304 3357 -17338 -7789 15505 13197 -8271 -14702 1440 15774 7371 -12503
1216 -12503 -11752 9268 13804 -1576 -9971 -6253 6686 15083 -2156 -17455 -1267 15301 8088
$$ [...]
8191G
##END NTUPLES=NMR FID
##END=
