##TITLE=1H_AM A515B
 CDCl3, 8 sc, 
 2.8.2019
##JCAMPDX= 6.0         $$ Bruker NMR JCAMP-DX V2.0
##DATA TYPE= NMR FID
##DATA CLASS= NTUPLES
##ORIGIN= UXNMR, Bruker Analytische Messtechnik GmbH
##OWNER= root
$$ XWIN-NMR		Version 3.5
$$ Fri Aug  2 15:24:12 2019 Russian Standard Time (UT+4h)  she@DPX200
##.OBSERVE FREQUENCY= 200.13155
##.OBSERVE NUCLEUS= ^1H
##.DELAY= (6, 6)
##.ACQUISITION MODE= SIMULTANEOUS
##.ACQUISITION SCHEME= undefined
##.AVERAGES= 8
##.DIGITISER RES= 18
##SPECTROMETER/DATA SYSTEM= spect
##.PULSE SEQUENCE= zg30
##.SOLVENT NAME= D2O
##.SHIFT REFERENCE= (INTERNAL, D2O, 0, 15.7039)
##AUDIT TRAIL= $$ (NUMBER, WHEN, WHO, WHERE, WHAT)
$$ ##TITLE= Audit trail, XWIN-NMR		Version 3.5
$$ ##JCAMPDX= 5.01
$$ ##ORIGIN= Bruker BioSpin GmbH
$$ ##OWNER= she
$$ F:/spectra/data/she/nmr/H-F/1/audita.txt
$$ ##AUDIT TRAIL=  $$ (NUMBER, WHEN, WHO, WHERE, WHAT)
(   1,<2019-08-02 15:23:09.48 +0400>,<she>,<DPX200>,
      <created by zg, POWCHK disabled, PULCHK disabled
       configuration hash MD5:
       00 E9 B6 7A A2 85 ED C7 34 08 36 98 17 FE 4E 26
       data hash MD5: 16K
       09 5D 2A 6B 0A FE 97 44 18 FB 54 D9 38 5B 71 F7>)
$$ ##END=
$$ 
$$ hash MD5
$$ 93 E2 14 B1 9B B8 2E 3F FE 5B A1 AC 17 16 FB 9B
##$RELAX= 
##$RELAX= 
##$RELAX= 
##$RELAX= 
##$RELAX= 
##$RELAX= 
$$ Bruker specific parameters
$$ --------------------------
##$DU= <F:/spectra>
##$EXPNO= 1
##$NAME= <H-F>
##$PROCNO= 1
##$TYPE= <nmr>
##$USER= <she>
##$AMP= (0..31)
100 100 100 100 100 100 100 100 100 100 100 100 100 100 100 100 100 100 
100 100 100 100 100 100 100 100 100 100 100 100 100 100 
##$AQSEQ= 0
##$AQ_mod= 1
##$AUNM= <au_zg>
##$AUTOPOS= <>
##$BF1= 200.13
##$BF2= 200.13
##$BF3= 200.13
##$BF4= 200.13
##$BF5= 200.13
##$BF6= 200.13
##$BF7= 200.13
##$BF8= 200.13
##$BYTORDA= 1
##$CFDGTYP= 0
##$CFRGTYP= 5
##$CHEMSTR= <none>
##$CNST= (0..31)
1 1 145 1 1 1 1 1 1 1 1 1 1 1 1 1 1 1 1 1 1 1 1 1 1 1 1 1 1 1 1 1 
##$CPDPRG= <>
##$CPDPRG1= <>
##$CPDPRG2= <>
##$CPDPRG3= <>
##$CPDPRG4= <mlev>
##$CPDPRG5= <mlev>
##$CPDPRG6= <mlev>
##$CPDPRG7= <mlev>
##$CPDPRG8= <mlev>
##$CPDPRGB= <>
##$CPDPRGT= <>
##$D= (0..31)
0 1.2 0 0 0 0 0 0 0 0 0 0.03 0 0 0 0 0 0 0 0 0 0 0 0 0 0 0 0 0 0 0 0 
##$DATE= 1564744988
##$DBL= (0..7)
120 120 120 120 120 120 120 120 
##$DBP= (0..7)
150 150 150 150 150 150 150 150 
##$DBP07= 0
##$DBPNAM0= <>
##$DBPNAM1= <>
##$DBPNAM2= <>
##$DBPNAM3= <>
##$DBPNAM4= <>
##$DBPNAM5= <>
##$DBPNAM6= <>
##$DBPNAM7= <>
##$DBPOAL= (0..7)
0.5 0.5 0.5 0.5 0.5 0.5 0.5 0.5 
##$DBPOFFS= (0..7)
0 0 0 0 0 0 0 0 
##$DE= 6
##$DECBNUC= <off>
##$DECIM= 24
##$DECNUC= <off>
##$DECSTAT= 4
##$DIGMOD= 1
##$DIGTYP= 9
##$DL= (0..7)
0 120 120 120 120 120 120 120 
##$DP= (0..7)
150 150 150 150 150 150 150 150 
##$DP07= 0
##$DPNAME0= <>
##$DPNAME1= <>
##$DPNAME2= <>
##$DPNAME3= <>
##$DPNAME4= <>
##$DPNAME5= <>
##$DPNAME6= <>
##$DPNAME7= <>
##$DPOAL= (0..7)
0.5 0.5 0.5 0.5 0.5 0.5 0.5 0.5 
##$DPOFFS= (0..7)
0 0 0 0 0 0 0 0 
##$DQDMODE= 0
##$DR= 18
##$DS= 0
##$DSLIST= <SSSSSSSSSSSSSSS>
##$DSPFIRM= 0
$$ [...]
##$SUBNAM2= <"">
##$SUBNAM3= <"">
##$SUBNAM4= <"">
##$SUBNAM5= <"">
##$SUBNAM6= <"">
##$SUBNAM7= <"">
##$SUBNAM8= <"">
##$SUBNAM9= <"">
##$SW= 24.9336996594482
##$SWIBOX= (0..15)
0 0 2 0 0 0 0 0 0 0 0 0 0 0 0 0 
##$SW_h= 4990.01996007984
##$TD= 16384
##$TD0= 1
##$TE= 0
##$TE2= 300
##$TE3= 300
##$TEG= 300
##$TL= (0..7)
0 120 120 120 120 120 120 120 
##$TP= (0..7)
150 150 150 150 150 150 150 150 
##$TP07= 0
##$TPNAME0= <>
##$TPNAME1= <>
##$TPNAME2= <>
##$TPNAME3= <>
##$TPNAME4= <>
##$TPNAME5= <>
##$TPNAME6= <>
##$TPNAME7= <>
##$TPOAL= (0..7)
0.5 0.5 0.5 0.5 0.5 0.5 0.5 0.5 
##$TPOFFS= (0..7)
0 0 0 0 0 0 0 0 
##$TUNHIN= 0
##$TUNHOUT= 0
##$TUNXOUT= 0
##$USERA1= <user>
##$USERA2= <user>
##$USERA3= <user>
##$USERA4= <user>
##$USERA5= <user>
##$V9= 5
##$VALIST= <valist>
##$VCLIST= <CCCCCCCCCCCCCCC>
##$VD= 0
##$VDLIST= <DDDDDDDDDDDDDDD>
##$VPLIST= <PPPPPPPPPPPPPPP>
##$VTLIST= <TTTTTTTTTTTTTTT>
##$WBST= 1024
##$WBSW= 4
##$XGAIN= (0..3)
0 0 0 0 
##$XL= 0
##$YL= 0
##$YMAX_a= 20077
##$YMIN_a= -17579
##$ZGOPTNS= <>
##$ZL1= 120
##$ZL2= 120
##$ZL3= 120
##$ZL4= 120
##$ABSF1= 10
##$ABSF2= 0
##$ABSG= 5
##$ABSL= 3
##$ALPHA= 0
##$AQORDER= 0
##$ASSFAC= 0
##$ASSFACI= 0
##$ASSFACX= 0
##$ASSWID= 0
##$AUNMP= <proc_1d>
##$AZFE= 0.1
##$AZFW= 0.1
##$BCFW= 1
##$BC_mod= 2
##$BYTORDP= 1
##$COROFFS= 0
##$CY= 11.3945322036743
##$DATMOD= 1
##$DC= 2
##$DFILT= <>
##$DTYPP= 0
##$F1P= 20.1537800932815
##$F2P= 0.134698688090026
##$FCOR= 0.5
##$FTSIZE= 0
##$FT_mod= 4
##$GAMMA= 1
##$GB= 0.15
##$INTBC= 1
##$INTSCL= 1
##$ISEN= 128
##$LB= 0.24
##$LEV0= 0
##$LPBIN= 0
##$MAXI= 10000
##$MC2= 0
##$MEAN= 0
##$ME_mod= 0
##$MI= 1.114404
##$NCOEF= 0
##$NC_proc= 0
##$NLEV= 6
##$NOISF1= 3.799351
##$NOISF2= 2.8
##$NSP= 1
##$NTH_PI= 0
##$NZP= 0
##$OFFSET= 15.70392
##$PC= 1
##$PHC0= -9130.98
##$PHC1= 13.00097
##$PH_mod= 1
##$PKNL= yes
##$PPARMOD= 0
##$PSCAL= 0
##$PSIGN= 0
##$REVERSE= no
##$SF= 200.130013532006
##$SI= 16384
##$SIGF1= 3
##$SIGF2= 2
##$SINO= 400
##$SIOLD= 16384
##$SREGLST= <1H.CDCl3>
##$SSB= 0
##$STSI= 0
##$STSR= 0
##$SW_p= 3612.71676300578
##$SYMM= 0
##$S_DEV= 0
##$TDeff= 0
##$TDoff= 0
##$TI= <>
##$TILT= no
##$TM1= 0
##$TM2= 0
##$TOPLEV= 0
##$USERP1= <user>
##$USERP2= <user>
##$USERP3= <user>
##$USERP4= <user>
##$USERP5= <user>
##$WDW= 1
##$XDIM= 8192
##$YMAX_p= 0
##$YMIN_p= 0
$$ End of Bruker specific parameters
$$ ---------------------------------
##NTUPLES= NMR FID
##VAR_NAME=  TIME,          FID/REAL,        FID/IMAG
##SYMBOL=    X,             R,               I
##VAR_TYPE=  INDEPENDENT,   DEPENDENT,       DEPENDENT
##VAR_FORM=  AFFN,          ASDF,            ASDF
##VAR_DIM=   8192,          8192,            8192
##UNITS=     SECONDS,       ARBITRARY UNITS, ARBITRARY UNITS
##FACTOR=    0.0002004,     1,               1
##FIRST=     0,             0,               0
##LAST=      1.6414764,     0,               0
##MIN=       0,             -17579,          0
##MAX=       1.6414764,     20077,           0
$$ Real data points
##PAGE= N=1
##DATA TABLE= (X++(R..R)), XYDATA
0@%%%%%%%%%%%%%%%%%%%%%oJ4j6J6j6J6j6J6k1K9l2L2l4M0m6M9n5O2o9P5q3R2
43D7j00J14j27J39j56J75j95K19k48K85l32L92m72N90p75J114j949P752J3604
62B0077q445j1856o090N344P997N796j82m729p089k304N690R114J434q858j0109
77d210M65J0096Q620j963r421q350j437M984Q186N323l403j1369r392K181J1297
92A607P653l764j0109n688K420O102L782j201n598o101p66P067Q904R77r522j0785
108a5022r17R639J0430K093o466q384l966L099Q222P121m68q297p491K254R783
123A630O411l284q201l818L821P448N173p84o648p732j563P921J1176L612p937
138G225j1362l474O809R203L130m058o394l753J402N575N137j172p846o656K431
$$ plain form
0 0 0 0 0 0 0 0 0 0 0 0 0 0 0 0 0 0 0 0 0 0 0 -6 8 -8 8 -8 8 -8 8 -13 16 -16 16 -18 22 -24 25 -30 32 -37 38 -45 47
43 47 -53 61 -66 73 -83 92 -103 116 -132 153 -179 213 -259 331 -444 670 -1279 6473 20077
62 20077 11632 -224 -6314 -970 7027 12823 12641 7912 823 -1481 4209 13323 14757 5899 -4210
77 -4210 -3745 6351 14971 13008 3587 -4763 -6200 -1216 6970 12293 8890 -2479 -11871 -9690 1607
92 1607 9260 5496 -4613 -10301 -7881 -1779 2003 802 -4796 -10897 -11663 -4596 4308 5285 -4237 -15022
108 -15022 -15939 -6300 4130 6223 -243 -8627 -12593 -9494 -1272 5849 5381 -2916 -10407 -8153 1630
123 1630 8041 4757 -3444 -7262 -3441 4007 9180 8396 1748 -5984 -7547 374 11550 15162 7225
138 7225 -4137 -7611 -802 8401 11531 7473 1079 -2674 -1272 4303 9440 8268 422 -6234 -3803
153c803R484O135m112r949o180K292P593O483N85o137q747m224M639R449M731
168H239m905r233m014M486P159K175m177n993k619K902O486M783k028q532p292
183a2563J838R875Q249j041q422p516m41O138P387K858l735p082l606L763P686
198C388L731m119p325k427N221P595K721m248p232m212K557P966P266l21q330
213B231q539m65P714P853P62n787o137j295L804N296K045l455o297l027M015P493
229F211L198n231q756l800M599Q186M168k971p215n961k97N857P079J715n801
244I81p615j670N493O157L26n339n278k69M699N509J510m293p005l548L952Q479
260B089N221l134q549n593K308P541N585n77n269n110o21M539N721J370m607n618
$$ plain form
153 -3803 5681 11816 7704 -2245 -8425 -6133 1460 7943 8528 2391 -6356 -10580 -5941 3508 8239
168 8239 3334 -5899 -9913 -5427 1732 3907 -270 -6263 -8882 -5980 506 5289 3261 -5271 -12563
183 -12563 -10725 -850 7399 6358 -2064 -9580 -10021 -3883 3504 6362 2627 -4455 -8061 -4298 3388
198 3388 7119 3000 -4325 -6752 -1531 6064 8785 4537 -2695 -6907 -4350 3616 10882 10561 2231
213 2231 -6308 -6773 941 8794 9556 3769 -2368 -3663 141 5437 7482 4027 -2270 -5297 -1282 6211
229 6211 9409 4178 -4578 -8378 -3779 4407 8575 5604 -1611 -7572 -7869 -2012 5067 6782 981
244 981 -6634 -8304 -2811 3346 3672 -1667 -6945 -7214 -2515 2994 4504 211 -6794 -10342 -6390 2089
260 2089 7310 4176 -4373 -9966 -7658 -117 5468 4891 -378 -5488 -6109 -1570 4151 5521 914 -4704
276d704l93N732O177M66n636o317j267N040P292L537l371p551n045K049P258N668
292H935j148o327n024P03N083M168m86m553m519k39M550N336M53n837o759j056
308f720N695O864J599m844p042l466K555O210M526j219n940n214N24N355M575
323C458j163n499l916J542N399L950r90n145m981m81N072O725K211m679p320k874
339h691M230P135L439k670n570l323J678M911L634p42m444l608J200N314M298
354F791j282n927m777J088O056N583L72m995o091k103L688O197L156k809n988
369a041l243K205N044K736k078m802k843J667M785L104j817n455m258J101N717
384H22N055m66n705n829r20M387N622K019l029n361k863K198M966K708k380m894
$$ plain form
276 -4704 -5097 635 6812 7278 1642 -4675 -5942 -902 6390 9927 6556 -995 -6040 -3991 3267 8935
292 8935 7787 1460 -3564 -2861 2222 6390 5904 1351 -3168 -3407 1143 6479 6932 1095 -5664 -6720
308 -6720 -1025 5839 7438 2594 -4448 -7914 -5359 851 5377 4158 -1782 -6996 -6472 -1117 3458
323 3458 2295 -3204 -7120 -5578 -179 3771 2781 -2364 -7345 -7826 -2754 3971 6182 1503 -5817 -8691
339 -8691 -4461 2674 6113 3443 -2127 -5450 -3772 1139 4773 4031 -413 -4021 -2821 2493 6791
354 6791 5509 -418 -5195 -4107 1949 7532 7904 2909 -3182 -5285 -1597 4600 7756 4947 -1041
369 -1041 -4284 -2079 2965 5701 3623 -1179 -4022 -2355 2430 5534 3717 -1738 -5996 -4895 822
384 822 5877 5411 -294 -6123 -7043 -2656 2966 4985 1956 -3405 -6268 -4070 896 3604 1224 -3670
400c670k143K753M960K224k533n062l096J770N458M524n11n292n397m60N051N846
416D422J280m020n109j403L061M394J747k133l932j887K352M596K327k712n413
431b430k669K736N817L604j768n494m369L58M604M767Q10l715m850j441L091M527
447C578J301l089m334j144K975M086J177l019m647k083K617N232K982k162n627
462b157m080J035M998M380M9m130m433p72L212M004Q66l032l810o99L205M056
478B692P83l404m427j254L153M948K399k248n181l403J496N256M175o30m444l922
494d011J09L697L607L68k905l260l24L045L638N09l301m298r14L608N035J724
510F327l206n157k511K069M664L155q95m127l663J20L611L488j11l534l365J16
$$ plain form
400 -3670 -5813 -3060 1900 4124 1591 -3471 -6567 -4797 661 5185 4674 -618 -6015 -6475 -1424 4422
416 4422 5702 1682 -3427 -4830 -1769 2625 4372 2239 -1693 -3580 -1228 3368 5695 2983 -2430
431 -2430 -5099 -2363 3454 7058 5290 -204 -4573 -4215 389 5156 5966 2251 -2599 -4040 -949 3578
447 3578 4879 1790 -2544 -3688 -713 3373 4550 1531 -3116 -5199 -2582 2650 5632 3470 -2157
462 -2157 -6237 -5202 -204 4176 4225 95 -4338 -5110 -1898 2106 2972 -60 -3870 -4569 -1364 2692
478 2692 3475 71 -4356 -5610 -2457 2491 4890 2642 -2539 -5942 -4446 810 4985 4355 -89 -4011
494 -4011 -3902 -205 3402 3770 865 -2395 -2719 326 3964 4473 1172 -3126 -4040 -432 4603 6327
510 6327 3121 -2036 -4547 -2478 2186 5341 4446 319 -3344 -3224 387 3875 3764 230 -3135 -3019
526c019L436L131k92l627l681k02L459M189J041l196m919k250K343M945K951j597
542B712m390l094Q55L604K900m73l235k697N26L427K931n10l571l299K65L767
558b82M071O29l388m468j436K876M740K297j900m257k650J286L863K515q46l224
574a74k287Q36L202K440q19l607l079N95L982L739p3l866m272q26L003M244J587
591D625k221m058k232J418L552K291j192l486k280J200L367K087j431l677k282
606d319J118L711L027m73l676l898n09L320M285J351k609m037j669J959L576J804
622B961j521l136j528J514L175J791j412l397k137J373L894K875q78l862l367
637c655K09L550L805P43k800l814j308K179L431J472j708l101j409J617L072J317
$$ plain form
526 -3019 417 3548 3256 -371 -4052 -4254 -795 3394 4435 1239 -3680 -5930 -3587 1358 4309 2712
542 2712 -1678 -4772 -3917 -313 2587 2114 -1121 -3818 -3292 135 3066 2556 -1015 -4314 -4049 -282
558 -282 3789 4418 1030 -3438 -4874 -1998 2742 5039 3139 -1118 -3768 -2482 1381 3896 3050 -174
574 -174 -2461 -1625 1577 4017 3198 -409 -3488 -2893 1089 4828 4755 889 -3383 -4209 -1206 3038 4625
591 4625 2404 -1654 -3886 -2468 1084 3375 2183 -1303 -3583 -2383 984 3071 1640 -2037 -4319
606 -4319 -3201 510 3537 3064 -612 -4510 -5019 -1699 2586 3937 1328 -2709 -4378 -2419 1157 2961
622 2961 1440 -1696 -3224 -1710 1465 3256 1844 -1553 -3690 -2317 1577 4452 3574 -288 -3655
637 -3655 -3446 104 3909 4652 1852 -1962 -3270 -1091 2340 3812 2104 -997 -2406 -789 2283 3600
653C600j818l432j781J738L774K271j332l974l040N14L576L333J63k988l455q80
669c731K213L266J157j998l149j111J964K963J026k117l194j148K078L491J828
684C538j677l756k535R05L683L262l2l247l325l82K694L120N63k157k684n36K063
701e03K719P23k085l035r35K223L459J515j952l752k124J440L728K675o99l242
717A55k913l7K682K813L95k242k695l83K191K576K68k377k847n23K462L215J028
734C768k272l655j670J618L540K252r64l229k676K40K785K599Pk482k442j24K283
751d22K378j3k458k558q7K528K956N75k450l297j323J895L572K066j223l375k305
768c541P57K916K311l30k415k064L63K359K044j81k342k257J00K595K852L16k519
$$ plain form
653 3600 1782 -1650 -3431 -1693 2081 4352 3020 -954 -3994 -3480 96 3429 3592 604 -2851 -3731
669 -3731 -1518 1748 2905 907 -2242 -3353 -1389 1574 2600 483 -2711 -3859 -1781 1710 3538
684 3538 1861 -1895 -4430 -3525 158 3420 3388 141 -3184 -3566 -872 2248 2811 654 -2030 -2566 -503
701 -503 2216 2939 854 -2181 -3116 -893 2566 4081 2129 -1623 -3747 -2307 1421 4096 3397 155
717 155 -2758 -2795 -113 2700 3095 853 -1842 -2225 -34 2542 2810 433 -2414 -2937 -475 2740 3768
734 3768 1496 -2159 -3829 -2211 1329 3581 2617 -612 -3288 -3048 -263 2336 2343 -139 -2581 -2705 -422
751 -422 1956 1943 -515 -3073 -3160 -632 2324 2899 449 -2848 -4171 -2276 1296 3362 2139 -1236 -3541
768 -3541 -2784 132 2443 2113 -302 -2366 -2003 356 2400 2219 -123 -2380 -2280 315 3167 3483 964
785I64l252q48K375L450J392j661l177j900R81K819K014n56k491j987M36K329
801H88J889o02k559k135M46K747K355k32k758k949m50K291L088J091j859l213
817a962j609J282K814J690r08k547j709P73K369J600q01k456j667Q29K651K140
833B489m53k701k576p9K604L082P96k054k983j203J574K824J501j137k446j249
849b011J066K291J300r56k313j471R35K683J900p58k850k319K71K730K660K59
865C417k293k835q35J736K579R99j271k400j227J109K202J056j272k423j223J294
881a387K577J436j181k767j995O27K637K386o1k402k587n03J928K544P86j555
897D83k365p49J408K189P62j394k121p84J451K449J193j292k652j621R79K786
$$ plain form
785 964 -2288 -3136 -761 2689 4081 2420 -757 -2657 -1676 1143 3157 2601 110 -1877 -1441 888
801 888 2777 2175 -384 -2519 -2073 674 3029 2797 39 -2910 -3360 -1069 2019 3110 1251 -1962
817 -1962 -3571 -2289 525 2215 1307 -1240 -2949 -2176 193 1793 992 -1464 -3131 -2302 349 2489
833 2489 2036 -665 -3241 -3320 -716 2366 3162 1108 -1875 -3078 -1504 1320 2821 1684 -762 -2011
849 -2011 -945 1346 2646 1690 -623 -2094 -1159 1524 3424 2666 -184 -2503 -2232 498 3158 3417
865 3417 1124 -1711 -2546 -810 1769 2768 1497 -903 -2130 -1021 1181 2237 965 -1458 -2681 -1387
881 -1387 1190 2626 1445 -1322 -3317 -2690 -53 2333 2272 -130 -2717 -3220 -1292 1252 2038 483
897 483 -1882 -2631 -1223 966 1728 334 -1787 -2571 -1120 1329 2522 1230 -1422 -3043 -2064 722
913G22K165l37k465k339r7K165K332M26j677k072m55J481J992N18j459k066o07
930a773J569K340Q95j517k634j324J190K716J725p64k568k037J67K076K030K04
946B295j785k006l80J536J866K18j670j947k93J706K118M78j733k472r27J387
962a609K542J419r52k460j791M07K247J905j18j928j788N5J746J620j1j636j658
979b010N2J757J917K62j715k223o38J613K535J173j171k451j443P90K226J602
995B276l72j815j529K75J647J552k37j673j501J72J771J810j8j914k073l21J801
1012a49K301P03j470k304j222R29K145J353o31j913j428L89J655J275m48j775
1028e90j340M07J860J469l72k013j797l3J790K084M74j537k271q87J163K141J113
$$ plain form
913 722 2887 2550 85 -2254 -2351 -186 2146 2572 895 -1177 -1632 -151 1841 2359 900 -1166 -1773
930 -1773 -204 2136 3031 1514 -1120 -2444 -1254 1462 3187 2423 -145 -2182 -2015 61 2091 2295
946 2295 510 -1496 -1876 -340 1526 1744 74 -1873 -2166 -460 1658 2136 403 -2069 -2996 -1609
962 -1609 933 2352 1400 -1060 -2851 -2444 -197 1708 1590 -338 -2126 -2071 -325 1295 1284 -352 -2010
979 -2010 -1958 -201 1716 1978 263 -1960 -2598 -985 1550 2723 1552 -899 -2342 -1552 674 2276
995 2276 1904 89 -1440 -1165 482 2034 1797 124 -1377 -1205 566 2376 2358 444 -1629 -1950 -149
1012 -149 2152 2855 1385 -919 -2141 -1212 933 2286 1655 -258 -1686 -1297 358 1633 1185 -590
1028 -590 -1930 -1523 337 1806 1434 -579 -2376 -2409 -619 1465 1939 402 -1869 -2756 -1593 548 1661
1045A661q58j900j093O24J722J096n61j662j002O23J790J287m64j865j558K74
1061a886J960J986K40j675k030n31J370K002Q51r32j746q97Q30J632Q57o99j608
1078b76q86O96J760J049p07j926j335M56J922J568j48j794j894l39J412J819N71
1095A948j144j769p48Q68J499O58r59j566o61R07J602P46r02j838j087O46J890
1112I0J457l58j761j632r3J538J811L36j238j652m15J153J478M84r38j372l77
1129a489J026J540O43r50j704q28Q97J935J185m79j826j440K21J618J551N2j316
1146F36j387k30J097J337K37j051j337l22J066J437L37j132j677n89R99J722Q68
1163B011q30j835j202L95J589J309j01j391j357j29J168J221M6j161j204n6J198
$$ plain form
1045 1661 803 -1097 -2190 -1566 156 1252 691 -971 -1973 -1350 440 1727 1263 -602 -2160 -1886
1061 -1886 74 2060 2300 625 -1405 -1936 -566 1436 2287 1355 -391 -1288 -458 1174 2031 1332 -276
1078 -276 -1162 -466 1294 2343 1636 -290 -1625 -1169 753 2321 2173 379 -1515 -1854 -442 1377 1948
1095 1948 804 -965 -1713 -845 654 1312 353 -1213 -1874 -967 635 1381 479 -1359 -2446 -1800 90
1112 90 1547 1189 -572 -2204 -2297 -759 1052 1388 150 -1502 -1917 -764 714 1198 260 -1112 -1489
1129 -1489 -463 1077 1720 770 -934 -1762 -865 1070 2255 1776 -50 -1490 -1269 349 1900 1952 636
1146 636 -751 -981 116 1453 1690 639 -698 -1020 46 1483 1820 688 -989 -1578 -579 1143 2011
1163 2011 1181 -654 -1856 -1461 128 1437 1336 -55 -1412 -1541 -373 848 894 -267 -1471 -1527 -329
1180c29J242J68j248j456l57J169J631O87r01j667r45N92J648J168k89j425j126
1197a438J67J280J075p4j112r62J04J200J076Kj196j309j40J236J540N01j036
1214I14j660p52Q13J559Q96m95j365r34L06J160R29k26j180q97J88J179J013k24
1232A224j321j159M2J301J320J48j151j547m94Q70J444P63o14j402q33L81J202
1249A74P83l94j159p46M23J210P78m01j283r64K39J266J199N5j189j365l11J004
1267f81J435N58p98j246o40N94J196O28m74j064o04N69J098O81m84j206q12M01
1285h49J327J083j71j263j209r6J087J304L24q39j188m45O34J110M68n71j024
1302c18n37N82J085N02o19j212o45N05J234Q85l69j313j093Q0J109J151J45r53
$$ plain form
1180 -329 913 1081 -167 -1623 -1980 -811 820 1507 606 -1061 -2006 -1414 234 1402 1113 -312 -1438
1197 -1438 -1271 9 1084 1010 -102 -1064 -960 240 1316 1318 122 -1187 -1327 -91 1449 1950 914
1214 914 -746 -1498 -685 874 1770 1275 -90 -1024 -718 442 1371 1145 -35 -932 -744 435 1448 1224
1232 1224 -97 -1256 -1214 87 1407 1555 404 -1143 -1637 -767 677 1440 826 -576 -1409 -1028 174
1249 174 957 563 -596 -1342 -919 291 1069 668 -615 -1579 -1340 -74 1125 1180 -9 -1374 -1685 -681
1267 -681 754 1312 514 -732 -1372 -778 418 1046 572 -492 -1096 -527 571 1252 768 -438 -1250 -849
1285 -849 478 1561 1390 127 -1082 -1178 -91 1213 1537 698 -490 -935 -301 809 1277 706 -318
1302 -318 -855 -273 812 1314 695 -517 -1162 -657 577 1462 1093 -220 -1313 -1233 -124 1027 1172 219
1320B19j157l40P22J041L53p31r72l05O69J000L26o79j082n24O18J196P37m74
1338F17j205r12K53J169J011K4r64j024j21Q55R65K19o68q65j80P06R60K16p20
1357C36j025l40Q04J181N52o18j205p49M11J146Q73j69r85q86jQ22Q56N5p65q45
1377e52r7P10Q29J00q49r31j62P68J031K78o84j195n56N16J032P82l04j036q14
1396a134J26Q61P54m8p91p33P0P62P56l9q13q30qQ45R30K28p48j040m20O35J124
1417D87O00m22j004o33K97Q51O99j56p76n83J61P79O20j22p92p39R2Q66Q51P1
1437A147p98j036k51P39R53M16n33q90n53L35Q23N77k73p94n36K10P35N58k69
1456E60q39n96K12Q11P39r3q90q55j12P38R48K69n60r13m63M67Q10M41l85p18
$$ plain form
1320 219 -938 -1278 -556 485 838 107 -865 -1170 -501 499 825 146 -936 -1460 -842 354 1091 617
1338 617 -588 -1500 -1247 -78 933 957 -7 -1031 -1152 -297 668 887 219 -646 -826 -120 840 1056 336
1357 336 -689 -1029 -225 956 1508 890 -315 -1064 -653 493 1366 1197 212 -674 -675 147 1003 1058 293 -552
1377 -552 -649 61 890 990 141 -790 -952 -184 847 1125 441 -754 -1310 -794 238 1020 716 -320 -1134
1396 -1134 -1008 -147 607 559 -232 -965 -895 -133 623 584 -229 -1059 -1067 -222 708 936 188 -852 -1272 -637 487
1417 487 1087 665 -339 -972 -675 176 875 719 -57 -640 -479 300 920 798 6 -733 -641 225 1076 1147
1437 1147 349 -687 -938 -199 754 1170 637 -253 -806 -471 352 929 656 -138 -674 -464 271 829 560
1456 560 -279 -875 -663 148 887 794 -96 -951 -1063 -325 623 892 332 -581 -1044 -577 233 674 289 -429
1476d29m27L30P58M18l25p78m69K95Q25N89j51q29p61L7Q21Q34J66o47q38k57
1496h38N09P96L19m13o66l12M11O65L32l97p39l61L59Q47N17k87q59o53J38P89
1516A57P13O4p00p52j41N09P45J77m62o85k51M38O47K46n00p24k67M47P85L61
1536H07m28p95n69K66P69O38o6o97o72r8O01O39J12n07n97j21N17N72J42m60o47
1557e94j89N26P06K97m18p75m19L43Q43M93j87p11n96J06O40N69M4n33n35j1M70
1578F9N38M5n19n62p3N32O25J95n15p36k96L70P77L99k72p12n04J44O08M69o3
1599E19n21m79mM78M50m4n47m75L7M98N62M8n46o31k00M43P20K96l09o95l97K11
1621e86O31M31j39n40m06J34N38L99j11n37l89Q6N92M72K7n59n63j06N32O73K29
$$ plain form
1476 -429 -856 -526 232 650 325 -453 -922 -627 198 787 636 -193 -954 -917 -96 738 904 257 -581 -838
1496 -838 -329 467 786 373 -293 -605 -194 471 803 406 -333 -694 -335 512 1029 742 -117 -770 -632 157
1516 157 870 934 234 -518 -659 -150 595 772 310 -375 -626 -188 459 705 205 -519 -786 -339 446 807
1536 807 379 -416 -985 -719 50 688 622 -75 -747 -845 -244 395 507 0 -597 -718 -201 371 513 53 -594
1557 -594 -783 -257 449 746 328 -447 -866 -523 320 813 626 -85 -681 -575 65 634 678 145 -390 -401 69
1578 69 607 652 133 -429 -502 30 655 850 335 -401 -697 -327 450 849 577 -135 -639 -495 113 582 519
1599 519 -2 -481 -485 -7 443 399 -148 -623 -586 -88 474 522 -24 -655 -855 -412 308 604 295 -400 -797 -586
1621 -586 45 476 337 -203 -609 -475 63 462 351 -186 -575 -489 103 575 602 43 -520 -626 -94 579 808
1642H08m28o76k99K85O43L22j83n46l43K06M72L24j61n09m00J72N62M59j54n72
1662a8n27JN37N45J11m60o04k28L65N26K60k53n25k76K14N03K25k45m76l15K34
1683d06N89L09j98n55m28R5N34M98P7m71n65j12L92N35J61k99m62k09K97N00J58
1704D40k71m35k03K74N44K25k51n27l52K12N53M17p0m76m93m6M45M50J30l53m38
1725b25j25L25M16N3k54m68j44L13N18J73l03n24k92K13N18L47j36n18m20K7M29
1746g7M17J9l80m18l8L34L82L4k90m06r9L49M53J02l04n45j77L47N00K90k30m97
1768b34l40J61M29L86l7m09l33M3L78L06j4l54l09J2L54M08O2l78m79q8L67M82
1790D13J95k91m91k45J99M38K74o2m10l16M5L83K51q4l36k84J8L81L51o1m00m28
$$ plain form
1642 808 380 -296 -595 -310 333 655 472 -74 -417 -211 261 585 424 -85 -485 -313 249 708 554 -18
1662 -18 -545 -544 -7 538 649 189 -415 -643 -278 248 508 255 -270 -546 -332 171 396 151 -325 -640 -406
1683 -406 183 492 294 -261 -689 -594 -60 438 515 44 -521 -633 -241 294 455 156 -306 -515 -218 282 440
1704 440 169 -266 -469 -195 349 574 323 -204 -556 -344 209 626 556 80 -413 -459 -14 436 566 213 -225
1725 -225 -350 -25 391 444 190 -278 -422 -109 409 582 279 -245 -537 -324 194 541 405 -113 -533 -506 -77
1746 -77 340 359 -21 -439 -477 -143 239 273 -17 -423 -522 -173 280 382 78 -467 -644 -297 203 493 263 -234
1768 -234 -574 -413 16 402 365 -44 -377 -334 44 350 336 -18 -327 -315 39 447 509 131 -348 -436 -69 413
1790 413 608 317 -174 -419 -220 218 492 430 20 -296 -251 132 383 299 -37 -321 -303 78 429 368 -32 -460
1812d60JL57M42J03k78m93k18K34M61J70j28l96k79J54L28K71j25l45k51J08L93
1833D9K74o0m32l30Q0M25L42Q7l38m49r6K85M48J80k41l58k08K14L42K11j59l49
1855h3j89J42M06K01j39l86k64Q3L92L50o4l42m10m4L10L84R9k77l34j71K03L69
1877B36J04j96l68j35J97L37J73j94m42k12J79L93K83q8m07l15kL78L27K8k68
1898Hl57q0K78K98J36k46l14r1K71L43J09k27l96j46K22L89K57j75l79k89R4L94
1920I9L15k8l38k86mL07K39N4k57l05j0K83K93J4k75l45j05K88L79J29k32m25
1942b10j73J52L43K85j37l29k67N1L07K27l2k88k56L6K57L13j9l52k93k4L18L18
1964B27J48k59m08j59K19L61J89j20l58j89R4K98K07m0l25k14J18K87J98l7l33
$$ plain form
1812 -460 -459 -102 340 443 165 -328 -546 -312 149 319 191 -205 -484 -330 -2 269 144 -201 -452 -344 49
1833 49 323 263 -169 -499 -419 6 348 435 97 -352 -448 -163 285 465 224 -134 -342 -128 214 425 266 -83
1855 -83 -272 -130 276 477 338 -48 -312 -229 163 513 449 107 -303 -347 -37 347 446 169 -165 -336 -133 236
1877 236 340 144 -224 -359 -162 175 348 154 -288 -500 -321 72 355 267 -140 -455 -457 -79 248 276 8
1898 8 -349 -429 -151 147 283 37 -277 -368 -97 246 355 128 -268 -414 -192 197 454 279 -100 -389 -295 99
1920 99 414 386 48 -238 -242 65 304 358 101 -204 -214 69 362 376 101 -244 -349 -61 318 447 215 -210
1942 -210 -383 -231 112 397 260 -69 -336 -285 22 249 217 -71 -327 -291 -34 279 260 -92 -385 -409 -91 227
1964 227 375 116 -292 -451 -232 129 318 198 -160 -349 -255 43 250 210 -115 -329 -211 76 274 237 -96
1985i6k10qL47L36Mk82l49j04K72L29J48j59l58j46J35L17J39j38k57j71J00L11
2007A60J99j29k96k62R0L64K61n0l44k93k5K72L09J09k20l34j13J39L23J11j60
2028A11k63j52J83K71J17j37l25k00J40L74K24j34l11k82lL28K95K5k46k82j06
2049c73K35K92P6j76l21m4K14L10N1j77k99j19J86L53J70j48l37k20Q8L18L02
2070C81p0k49k95J0K13K71Q1k33k74j4K00K51N6k48k70m1J92L21J19k06l50j89
2092c44J27L52J91o8l06k40K7K65K29l4k53k27LK34K47k0k55k52l1K27L17O7k30
2115B6l27j24J89L48J38j08k90k17P2L23K40p2k55j90O1K39K21q6k07k20K6K66
2137E3K96Lk35l08p6K22L20J02j67k71j47J13K75J47j02k63j76R6K76J71j14k81
$$ plain form
1985 -96 -306 -314 33 369 373 91 -258 -362 -90 239 387 228 -130 -276 -141 176 315 177 -80 -251 -151 160
2007 160 359 230 -66 -328 -238 126 387 337 -7 -300 -325 -53 256 365 145 -189 -302 -163 160 271 111
2028 111 -152 -304 -121 150 267 130 -195 -395 -255 119 343 209 -102 -384 -387 -59 236 261 15 -267 -373
2049 -373 -138 154 230 54 -267 -311 -97 213 264 87 -212 -331 -145 208 378 230 -107 -327 -239 79 381
2070 381 311 62 -233 -223 -10 261 342 109 -165 -179 21 272 328 80 -190 -231 -39 282 401 195 -155 -344
2092 -344 -217 135 326 258 -48 -288 -261 4 233 199 -54 -281 -278 -44 203 183 -72 -324 -355 -128 189 256 26
2115 26 -301 -425 -236 112 250 142 -148 -365 -293 30 270 198 -57 -247 -186 53 274 188 -19 -239 -213 53
2137 53 349 352 117 -191 -267 -45 275 377 210 -61 -208 -95 180 327 225 -38 -214 -118 158 329 215 -66
2159f6j79M4K57K70m5l28k73oK40L00Q7k42k88j12J71K42J29j35k87q8J27K73
2181I1R3j19k53j53R4L13K08j00k86k19L8K77K96Ok11k77r1K10K87N6j67k68l0
2204b05J76K28P7j49k80r6J79K93J21j30l02j99J31K85K15n0k66k41l0K37K41
2225B35K3k12k19l0J86K17J1j67k48p0K04K76O3j32l59j45J33L09K03o5l11k07
2247c05K2K31K62j2k49j81OJ76K59j8k46k02LK08K70P0k41k51r9K09K59J40r2
2270B19l05j64M1L00J95m0k73j69O1K25J44j6k39j70J7K34K46j3k57k59j8J85
2292e6K75J04j65k75j69J60K50J53q5k79j47R6J96J55o8k22j95O1K81J83o0k59
2314f6k61K5K45K68O0k15k91o4J49K74J07j34k32j30J15K40R5q5k25j61J09K76
$$ plain form
2159 -66 -245 -201 56 326 281 -47 -320 -326 -86 214 301 59 -229 -341 -170 72 201 66 -221 -309 -182 91
2181 91 184 65 -188 -341 -247 66 274 174 -112 -331 -293 -16 280 286 75 -202 -293 -83 204 260 93 -175 -205
2204 -205 -29 199 276 127 -153 -249 -70 223 344 214 -88 -287 -156 129 344 294 28 -213 -243 -6 235
2225 235 258 46 -173 -203 -17 200 211 44 -204 -274 -70 206 269 137 -222 -367 -234 75 278 213 -98 -305
2247 -305 -283 -52 210 198 -51 -232 -226 -50 209 191 -55 -257 -254 -46 224 294 53 -198 -297 -88 171 311 219
2270 219 -86 -250 -209 91 286 246 -27 -196 -135 90 234 218 -21 -191 -174 60 306 293 36 -223 -241 -56
2292 -56 219 323 158 -117 -286 -126 124 277 192 -87 -234 -138 58 213 145 -77 -272 -211 70 253 193 -66
2314 -66 -327 -302 -57 211 271 56 -235 -299 -150 124 231 97 -135 -265 -150 90 185 100 -125 -286 -177 99
2336I9J72j05k52j97N3K39K55kk12l04j9K01K75M9j48k41p0J61K02J21j73k21
2358a17j02J58K47J33j56k95j24J03K21K34l9k59k14nK27K00M8k05k40n8J85K18
2380A60M5j33k74n0J39K57R9j86k37j34J31K81J53p3k73k27Q8K29J68K0k01k03
2402b21oJ95K01Pj72k37lK22K03N2j88k57q6K12K35J70j39k86j52Q7K49J73m7
2425B12k13j79L1K33J58Jk16j98j2K42K09pk21k19p3K13K68Q4j77k76j62J30K62
2448I0J51q3k44j41N8J81K01p9k38j75O2K46J89j4k52k40K8J81L02J5j82k81q3
2471c08J74K22J41r3k52j01R2K06J27j01j98j37Q0K21J89p6k24k16M7K64K06%
2493B63j62k68q9K14K38N5j20k45r8J55J80J01j09k12j34J33K42J22j00k60j71
$$ plain form
2336 99 271 166 -86 -283 -230 9 264 262 50 -254 -273 -72 203 252 104 -137 -207 -46 156 277 104 -117
2358 -117 -219 -61 186 319 163 -132 -256 -153 68 302 263 4 -210 -215 12 212 260 55 -185 -243 -58 160
2380 160 205 72 -202 -252 -113 144 243 57 -180 -314 -183 98 251 178 -95 -322 -234 -5 163 183 -18 -221
2402 -221 -227 -32 169 176 4 -233 -236 -14 189 241 53 -204 -290 -78 157 327 188 -98 -250 -163 86 259 212
2425 212 -1 -180 -149 84 242 243 27 -171 -183 59 268 261 40 -179 -252 -39 229 313 136 -140 -302 -172 90
2448 90 241 158 -86 -227 -169 12 213 134 -104 -279 -217 29 218 204 -48 -288 -260 -79 223 238 56 -225 -308
2471 -308 -134 88 229 136 -116 -217 -125 81 208 107 -91 -228 -148 73 262 186 -38 -254 -207 57 263 263
2493 263 101 -167 -256 -42 196 251 131 -114 -212 -57 123 224 115 -97 -231 -98 144 266 166 -94 -265
2514b65R5K31K07j7k45k26j5J63K36N3j64k37m7J59K19M3j50j70j13J30K41Q6
2536B14j05k54j42J07K53J60n0k36j98J5K27K11Qj83k12j6J76K08J3j45k00n4
2558b03J71K17P9j68k47p6J53K41R6j14k28j70P9K52J74l5k24j72JJ80K15nk16
2581@j55l4J93J84K4j94j93q1J90K23P6j29k37j34Q0K42J78o3k41j74L3K18J52
2604A58rj96j65J1K02J68qj85k23K7J92K07Q0j59k49j00Q8K94J03r1k17j62J02
2627a32J63J96m6k16j54O2J68J66ok32j83K1J76K40M4j71k53q4J55K45R0j05k17
2650g3j49J18J78J08m6j94j29R1J52J70r3j99j60M8K06J68J3k16j99m2J55K83
2672A90J0j10k35m4N5J89J36q3k31p8Q0J80J19q8j48j58O2K13J79k8k21k14K3
$$ plain form
2514 -265 -170 61 268 251 6 -220 -235 -72 164 217 53 -184 -231 -72 147 190 40 -130 -243 -113 128 214
2536 214 109 -145 -287 -180 73 233 183 -53 -251 -236 -9 202 210 27 -185 -201 -25 183 196 51 -149 -203
2558 -203 -32 185 264 96 -151 -227 -74 167 263 149 -79 -249 -170 82 256 221 -3 -175 -174 6 221 216 0
2581 0 -155 -189 4 188 212 18 -175 -256 -66 157 233 104 -133 -267 -187 55 233 170 -71 -245 -212 6 158
2604 158 149 -47 -212 -201 1 169 161 -24 -247 -220 -28 179 259 100 -149 -249 -161 133 236 145 -72 -234 -132
2627 -132 31 227 181 -35 -189 -127 41 207 201 -31 -214 -193 -17 223 267 96 -157 -241 -86 159 249 144 -73
2650 -73 -222 -104 74 182 136 -58 -187 -96 56 226 133 -66 -226 -178 28 196 209 -7 -206 -248 -93 190
2672 190 200 90 -145 -189 -134 55 191 108 -123 -201 -121 59 178 90 -58 -216 -154 59 238 210 -11 -225 -202
2695b02J63K06N1j51j98p9J78J49R2j17k46j1R5J89P3j01j78j38O1K33J82p3k10
2718c2j95L0J81K25qj76j71l4J37J68M1j43j52l1J39J59O4j55j84q7J09K14J04
2741B03o5k02j66O6J98J65m1j41j78m2J93J58K2j26k01m8J70J80M2j52j61o8J48
2764d6J78P7j09k09j02N1K31J38n3j80j56LJ67J69j1j43j53j7J34K25j1j70j58
2787a45o3J67J94M6j10k30r3J45J80J36j20j59j18L3J68J37n8j30j73Q3J38J37
2809A65k7j37j73OJ41J92K4j60j80r6J64K07O5q5k07r3M3K06J11o9j52j12L4J67
2833C4J58m3j48j95K3J98J39K3j79j43r0J60K00N5r6j80r4N5K24P5o5j67q7O3
2857h0J74O8j4j68j45K9J66J87l3j72j96j7J38K32J3j32j52q4J05J36Q3p9j45
$$ plain form
2695 -202 -39 167 218 67 -131 -210 -32 117 209 92 -154 -165 -70 119 192 91 -87 -225 -164 69 251 178 -32
2718 -32 -227 -197 -16 209 201 25 -146 -180 -43 125 166 23 -129 -160 -21 138 202 47 -137 -224 -115 99 203
2741 203 138 -64 -230 -164 34 199 158 17 -161 -203 -10 148 170 44 -157 -205 -35 145 187 35 -126 -194 -46
2764 -46 132 209 100 -109 -211 -160 71 209 156 -24 -180 -177 -10 159 148 5 -148 -165 -31 194 183 13 -145
2787 -145 -208 -41 153 199 89 -141 -234 -89 91 227 107 -52 -170 -137 31 168 110 -20 -193 -110 28 165
2809 165 138 1 -172 -166 -25 167 191 31 -149 -245 -81 126 191 106 -101 -194 -151 55 166 97 -55 -167 -133 34
2833 34 192 149 1 -194 -171 27 166 189 10 -133 -223 -63 137 192 96 -84 -178 -123 101 176 111 -56 -143 -80
2857 -80 94 162 148 -20 -165 -136 30 217 184 12 -184 -201 -63 169 182 50 -102 -186 -81 55 138 59 -86
2880h6o7O0J53R9q1j68r2P8J46J17j2j82j59L8J60J66j1j39j56l5J11J64N4j14
2904D4j16j01J09K09K3p9j77o3O2K01J01q1j84j24N4J69J42l4j31j49k2J36J57
2927A46J2r3j65m7J03J69J6r4j64j00J43J59P5r0j86p5N9J74J14m9j60j20J7J31
2951b5J45J5j32j38k7R1J52M2j15j58l8J55J57K4p8k16l4Q0J78R7j9j69j58K5
2975a46J50J20%q0j36qJ39J08L2j49j75J5R8J57N8j51j70m7J00J76J07q5j86r0
2999a63O7J34J19o2j31j11J6J37J10j8j12j64QJ48J38J5j24j68LP8J64J02j10
3022G6j95l4N1J61R0o7j07j18N1J31J01m4j19j33KJ67J25Qj42j39k3J35J64J3
3046A54r6j83l1R1J30P5n7j19j20R3J29P5n9j46q5M5J63J01j8j45j75K5J31J41
$$ plain form
2880 -86 -153 -93 60 159 78 -90 -182 -104 42 159 147 -35 -194 -156 4 170 159 20 -136 -171 -60 104 158 44
2904 44 -72 -173 -64 145 168 89 -88 -151 -89 112 213 132 -52 -176 -122 47 189 155 24 -125 -147 -11 146
2927 146 158 65 -100 -147 -44 125 141 47 -117 -217 -74 85 160 70 -116 -191 -132 42 156 107 -53 -173 -156 -25
2951 -25 120 135 3 -135 -162 -71 81 123 8 -150 -188 -33 124 148 70 -146 -180 -100 78 175 156 -13 -171 -146
2975 -146 4 124 124 44 -92 -100 39 147 179 30 -145 -130 -32 125 183 32 -138 -185 -85 91 198 113 -73 -163
2999 -163 -96 38 157 95 -36 -147 -131 6 116 98 -14 -178 -170 -22 116 131 7 -161 -158 -80 84 186 76
3022 76 -119 -153 -102 59 149 82 -25 -143 -92 39 140 96 -23 -156 -154 13 138 146 4 -135 -158 -23 141 154
3046 154 58 -125 -156 -65 65 140 83 -36 -156 -63 66 141 82 -64 -149 -104 59 160 142 -3 -178 -153 -22 119
3070A19L3j41j28l2Q3J68Qm9j44n8J15J02O3p3j34r8Q4J51R5m4j47j01J1J05J53
3095A41Jj47j42pQ8J62N0j12j41m4J06J14M0p1j55n1R4J36N7n5j45j03J3J65J54
3120A48j6j54j52J1J66J01K9j25j19k5Q6J32L1r7j21k8J22J55J1p8j35r4R6J35
3144G9P8j1j57j22K1J49R8k6r6j24j6J05J39pp5j12l7J11J11L9r7j68p9J12J57
3169G2L6l8j30j28N7J10J56o0j11j09LJ56P8J2j25j03k4J29J24J3j02j28m2J11
3193d3J34P6j21q4j13J05J05J00m0j42r4L3J29J02l0j08q9l6J53J09J0j54r6m3
3217a37J36J01K2n0j54n6M1J77N9n1j53n6M1R7Q4j6j29j06L5J43J11o0j32j15
3241a68L1J09J25rq0j42k3R1J34Q3j21j04o6P4J23Q6n6j48o7O0Q2J14l7j50l3
$$ plain form
3070 119 152 11 -117 -149 -66 102 110 61 -83 -141 -26 76 139 66 -68 -166 -82 69 164 120 -27 -128 -117 -12 141
3095 141 142 -5 -147 -154 -66 96 146 34 -107 -151 -45 69 109 38 -117 -168 -74 62 119 64 -81 -184 -171 -6 148
3120 148 132 -22 -174 -163 3 104 133 8 -111 -136 -50 82 113 16 -105 -133 -11 144 155 77 -58 -152 -56 79
3144 79 157 146 -11 -133 -112 37 135 109 13 -111 -127 -22 117 110 35 -77 -114 -3 108 147 50 -118 -197 -85 72
3169 72 108 70 -60 -188 -131 -21 135 75 -36 -145 -142 14 92 104 -21 -124 -148 -19 105 118 16 -112 -154 -43
3193 -43 91 167 46 -38 -151 -46 59 159 119 -23 -117 -84 45 147 117 9 -80 -116 37 146 156 2 -94 -137
3217 -137 -1 100 122 72 -82 -138 -97 80 139 88 -65 -121 -80 17 101 85 -44 -150 -115 28 139 79 -53 -168
3241 -168 -137 -28 97 88 8 -134 -157 -66 68 151 30 -74 -140 -66 57 143 87 -61 -128 -68 14 128 91 -59 -92
3266i2K0Q8J20Rj31j20oJ01J05L2q0j08k3L4J23P9j08j13o5O2J14J21r6j22p6
3291a32jJ50Q1L5j81j23O7Q0Q3L6p6j16l4P7J13K4r0p7l2M7J45N2p3j21p2N6J20
3318C8N5L8j60j32P8Q0R7K0j13q7l3J24Q6nm5j42J2P9J08J2r3o5r7J05J19O2p8
3345F3j41n1M1J26R8p1q3p2j2P8J22%j20r2K1R8P1J7j03q5l7J26O5Q2q3j17l5
3372i4J3J35P7m4j17n1J4R2O0pj06m0oQ5P4j7o9r6j5J12R5J5n6j21n4O2J09O3
3400A13o6q7n3L4R2P9k7j37o4N7Q4J01n9o0j20J9J15Q9%j01p3o8R5J01M1m8j05
3427d8o0O5Q3M4j0j13n6O2P9N4j9r1q4kJ36O4j3j12q3LJ00P1Km5j08j4M7R7K9
3456G8l9r5p1Q9J11L7p7r5p2O1O8Q2K0j02r6l1J03R6j4l0j04k7Q1J15k8n7o3k1
$$ plain form
3266 -92 -72 16 136 145 14 -106 -112 -11 94 126 46 -62 -85 -51 72 151 43 -70 -135 -73 41 162 66 -56 -132
3291 -132 -133 17 98 133 -48 -171 -104 -24 59 95 19 -97 -131 -54 59 83 -7 -84 -116 -69 76 128 55 -66 -138 -82 38
3318 38 93 131 -29 -161 -83 -3 94 114 1 -86 -119 5 91 86 41 -101 -89 -10 98 110 17 -48 -145 -40 79 141 63
3345 63 -78 -129 -88 38 136 65 -18 -90 -102 -24 98 98 -22 -114 -93 5 76 93 -10 -95 -132 -6 59 141 58 -59 -94
3372 -94 -81 54 131 87 -30 -81 -67 25 85 78 -28 -68 -74 11 85 68 -1 -97 -112 0 95 110 54 -67 -121 -59 50 113
3400 113 47 -40 -93 -59 33 112 85 -52 -116 -59 25 126 67 7 -113 -94 21 110 110 9 -64 -132 -37 64 105 57 -48
3427 -48 -108 -43 40 84 74 -39 -95 -33 46 100 81 -10 -94 -96 40 104 91 -21 -104 -101 -1 70 72 27 -81 -95 -48 49 78
3456 78 39 -56 -127 -38 73 110 33 -62 -134 -73 -5 77 97 -5 -101 -132 -29 67 53 23 -81 -108 -27 88 60 3 -60 -81
3484h1M2P7O6p1p7l1K9J31K8n0p0j13O2Q6O9K3j31o2oN5R0Oo3q6k8J06P4mn5j11
3514i5MO6R0j8j8p4n2L6Q0M9Kr7o5k4J34L8j5k6p7l4R5N8J5r7p1j1J00P7M6j14
3544Bo1o3R2Q7J9l0r2k9oR8O4j1p9n2MJ03N1l2l8j02jQ9O1K5q1p4m4P3Q7L8n3
3575D5r7l6J6R6N4m7o6k4J1N3P1k9n3q0lQ9Q7k3q9o0J2Q5J5P5r2p5n7P8R9N2j05
3606Bo4j7L0N2L9j2o9n8K6J17K9kq7n7jO9Q3k7pj15J1L6Q9J7m8q6l2O8N6L1k2
3637E1j24J5JR2K6rj12k5L9K0R4Pp1n9k4N4Q8j6n0q5M2J5N6L9m2q8o1Q1P7L9m3
3668B7o5o4K9J04O8k0j05n7%P9N7L4j15j7j5K8Q2Ol0r3oP0N2K0l0q6j9M2M2M6
3698F4k9p3l9J4Q7O3m0o8m2KQ0L7np4n8MQ1P6J1q0o4pK4P9M6l8r1k5K6N6P7n5
$$ plain form
3484 -81 -39 38 104 33 -44 -75 -46 85 113 63 -7 -120 -58 28 97 120 -11 -73 -79 -24 66 72 9 -77 -105 1 75 71 16 -95
3514 -95 -91 -25 65 47 29 -45 -97 -61 19 68 70 -27 -92 -116 18 56 41 15 -62 -96 -1 57 72 -25 -96 -107 -7 70 116 2
3544 2 -59 -122 -30 57 76 46 -46 -75 -81 17 81 70 -9 -61 -57 46 97 65 27 -75 -76 13 74 99 18 -56 -100 -27 60 98 45
3575 45 -52 -88 -72 24 78 31 -35 -59 -48 5 76 47 -6 -86 -89 0 87 64 -25 -85 -73 12 27 102 10 -65 -122 -44 55 107 2
3606 2 -62 -79 -49 3 42 30 -39 -97 -71 46 75 73 -14 -71 -72 -3 80 53 46 -69 -58 -22 67 84 36 -50 -82 -14 42 73 51
3637 51 -73 -58 -57 35 61 52 -60 -85 -46 -26 68 75 4 -55 -79 -25 63 47 -3 -88 -46 -31 25 64 22 -66 -127 -46 31 70 27
3668 27 -38 -102 -73 31 99 79 -26 -83 -83 -4 53 87 -28 -45 -60 -32 50 56 26 -67 -73 -3 49 69 39 -47 -66 -24 18 64
3698 64 35 -38 -77 -63 24 87 47 -21 -63 -61 19 56 51 -23 -81 -77 4 80 91 11 -53 -60 -36 43 89 51 -40 -65 -39 17 94 39
3730C9q7rj0P4P0k7n5o2MP3P7k4o7k7m3K6R4N2n1p6jqM6N6k3r4mKP5O5j5n0r2
3763g2J9O3M2Pq0n0j8Q1O6Oo3n7m9P3L9N6k6o0k3lN7M1l6m9j0j1O5O0l9l3o4K6
3795d2N7N9j6m6m8j1J1J17j5m2o8j9N2M6J9j0q0m0L0N5N1l2n4n4M2K5Q1jj05l
3825d1j7P0M1k5J2o4l3L5Q0Jk1p5k2K3Q2Kj8m4k5MN0M2l7Nq4K9N8K1J9m7n6J7
3857a8M3K7lk4o8k1N5P4Nk4q2k0J6O5N6l1n8o7K6P0J5J8n0q3J4M0O4J8p2l6j4
3888f5N6N5jm1k8n4N5MN4kp3k9K5O2J5L5q0m7K2LO4J6l2p2j5Q5K3M9q5m7lN5M8
3921E2Pj4m9o1M0P4J9n9Pn8J3M4O2l8n2p9J8R1J9Rm4n8j5N3N8j7On7k6K3L8J3
3953A9Pl6m5PP6K3m7k2n5L1L7M1Pn8l4oM9Q6k7m3l3m1M8N0J4j5n3j7M4J1L0J2
$$ plain form
3730 39 -48 -57 -67 7 77 50 -5 -67 -63 10 87 63 -4 -31 -74 -48 46 98 47 -29 -30 -38 8 64 41 -53 -57 -55 20 85 70 20 -72
3763 -72 -53 10 52 59 -21 -71 -89 -8 58 64 1 -56 -105 -32 7 63 37 -23 -46 -49 8 49 13 -36 -46 -57 8 68 29 -4 -68 -42
3795 -42 15 74 58 12 -36 -47 -36 81 66 24 -44 -63 -11 35 54 44 -36 -76 -46 9 60 28 -26 -80 -38 -13 68 67 -38 -41
3825 -41 -58 12 53 28 40 -24 -57 -22 58 59 38 -37 -59 -36 46 48 30 -14 -39 -35 15 57 20 25 -59 -30 28 49 68 21 -35 -18
3857 -18 25 52 49 25 -43 -64 -9 65 70 46 -36 -56 -40 25 81 50 -8 -75 -49 21 36 54 4 -79 -65 -25 39 57 -15 -51 -65
3888 -65 -9 46 45 4 -24 -78 -23 -19 35 33 -40 -69 -44 18 33 68 -12 -59 -37 -34 30 46 14 -58 -73 12 35 84 -1 -48 -51 4 52
3921 52 59 45 -4 -65 -25 49 68 9 16 -42 -29 15 77 39 -13 -92 -74 17 36 45 1 -57 -72 -19 39 22 28 -29 -55 -32 6 19
3953 19 26 -10 -55 -48 28 51 4 -18 -73 -42 -5 36 43 -15 -49 -55 -6 80 53 10 -23 -64 -16 34 48 33 -20 -37 7 18 48 60
3985F0q9m0L8Q3k%p2l0MM9O4k8m4mn3N0L6N2p4o0lN3L9J4lr0l2K5J23k9k6m8n9
4018i6M5L4O5Lm5o4L5J8J8K9j3p3PP0N2k1o9k1k6N1O1ppo9m6L5M7M1m3j2o7J6
4050e2Q9J0Op8j0m1R9J6K0m8l6l7L8L3L1n4k1n1P9K4L5m8l7l0M6K4L2J0n1k3k6
4081e1M8K5nk3j5qM4N1j2o2rj8J2N7N4n8l7oqO8Jj8j7o2K2K9L0K1o8k4J7L4RK1
4115D2k4o7OPQ6k1J0j02j7L5O8%rj8m1J1O8kl4j3k7l1M7M9j0j8n6L2K0O4j3m3
4147am0LK3L3M0k0k3o9R0k9O0m4l9lrN9JQl6k5k4M2N1J1m4p1K6L6K9J4j2q5J7
4180c1LN0J6k5k8k0K0K9M9n1m7k4J8Q0LQp6k6J6K5P2k2k9m9J8J4L1K9o9j8Pj3
4212d0P5ono0j5N3OM9K4j15j6KR7Rl0l6m6j7N5L9K9o9l5K6%N5J8n5m4l2K4O8K0
$$ plain form
3985 60 -29 -69 -31 52 50 50 -22 -52 -48 1 65 37 -7 -11 -64 -14 22 74 0 -60 -63 -10 29 43 40 -50 -82 -57 66 37 11 -37 -96
4018 -96 -51 -17 48 51 6 -58 -23 -5 13 42 29 -44 -37 33 85 64 -5 -26 -52 -1 60 53 46 -23 -69 -34 13 54 11 -1 -68 -52
4050 -52 37 47 53 -25 -35 -76 23 39 59 11 -25 -62 -24 9 40 -14 -35 -86 -7 17 52 4 -33 -63 -17 7 39 49 -2 -25 -51
4081 -51 -3 22 17 -6 -21 -29 15 66 54 -8 -17 -35 -23 34 88 30 -7 -13 -21 47 48 30 13 -49 -27 2 32 53 -15 -39 -22 12 21 42
4115 42 18 -49 -43 -36 50 29 39 -63 -80 -45 23 23 14 -4 -45 -34 34 32 -2 -15 -42 -73 -26 23 13 -5 -61 -29 -9 55 42 -1
4147 -1 -41 -38 -15 18 58 38 15 -54 36 7 67 23 -16 -19 -28 31 32 40 4 -21 -45 -3 48 59 15 -56 -30 6 35 49 37 -48 -31
4180 -31 -28 22 38 13 -15 -35 -15 14 63 12 -35 -59 -41 39 42 50 -26 -52 -36 -11 61 39 10 -39 -21 -7 24 53 -16 -34 -27 -40
4212 -40 35 29 24 -36 -51 2 8 57 81 -34 -50 -48 49 58 28 -8 -54 -71 -16 23 52 -17 -52 -26 -26 29 47 -8 -52 -84 -60 8 28
4245B8J2q2l1L6N5N1m2n2m1J3Q1L4j0m0m0kL1K5Rm7l1JM1L8K1m9m5kK2M4M9n5
4277B2l7n3L8JP8j8l9l8K3L3L9Ql3n7k5R3j1L4m5q2OK6M5M4j8o0l0L3L2L8l2m4
4309b9l7K3O4K8j5o4m1J6N0N8rk3m1k7M6K6%K0n4m8J2O3M3k8p9PNQ0nqm8m1L9
4342a7J1M8kp7j2J1L1O8rk8p1lM6N4Ql4n6l7N0K5%J0n2l1J6L8O5Mo6m4L9J7N5
4375E7pk0p6k0P8K7kk4m2k7M1K4M5k2p4J0j5P2J8K1o6o7O5J8L0J8o9k6J9K4K4
4406C4Qj0q0k0N6L9L3m1m4l3J4P6L4k2o2n7KJ03J1k5l8mj5J1O1Lk5m6lL0L6J5
4438D1j9o0j3L3N5K2k2p3k8L6N4L0m6n2l0L0O4N4n3k5k6k7O0M4L2j03l0KL3N8
4468D1J1n2m3j1L1M0L8k0o8j4J8L7M2k2n3oj4P0J3J3p4k6K0K8M6k1l7l5j8O0K6
$$ plain form
4245 28 40 -42 -73 -37 18 69 27 -25 -66 -53 28 62 52 12 -28 -30 1 26 35 -12 -43 -42 -1 37 58 9 -36 -38 -16 28 77 22
4277 22 -15 -68 -30 -29 49 31 -8 -46 -23 10 49 57 24 -33 -58 35 24 58 13 -69 -63 -37 8 52 34 -26 -56 -23 9 47 15 -29
4309 -29 -66 -43 21 49 34 -30 -71 -55 -5 53 44 21 -20 -47 -1 25 25 45 -9 -57 -45 18 61 33 -46 -39 -34 46 41 33 -15 -56 -17
4342 -17 -6 42 40 -37 -49 -38 -7 61 52 24 -47 -50 -4 50 58 24 -32 -69 -19 6 6 16 -36 -67 -51 -13 52 56 -10 -54 -15 2 57
4375 57 50 30 -46 -66 12 39 37 13 -29 -56 -15 9 54 32 -42 -32 -47 25 43 64 -2 -69 -4 14 44 62 -7 -33 -14 10 34
4406 34 42 32 -48 -68 -12 27 60 19 -25 -58 -44 32 66 44 -18 -75 -73 30 41 16 -22 -26 -41 -30 31 34 9 -37 -40 -10 26 41
4438 41 22 -38 -51 -18 37 59 37 -36 -64 -28 26 56 10 -42 -72 -42 22 76 23 -2 -28 -55 5 49 81 -22 -52 -50 -17 41
4468 41 52 0 -43 -54 -23 17 55 35 -33 -47 -29 8 50 28 -25 -31 -45 25 38 51 -23 -49 -29 -1 45 24 -13 -48 -66 -6 20
4499B0N9n3m7l8N2K5M8j7n3m4K7L8J5Rl3l8rN2L5k8om1k2N4L6l1Ll5n7O5K4M2
4531E2n8j9k7K7N3Qk1l0o5M9K4K3kk1m6J4L0L8Oj7p6J1L8L7Kj5m6j3L2M2%pm8
4564b5l5L9N2L0Nq0k5j2L8N4J0n9k0j0K7N8k3Mo9MN1M5l3j3n2j9N4L1J6Rr0l5
4596g3N6M0L6l1n6j6PN3MJ8n1l5k2P4L1J0o1Nk0J3L2M1k2o6prN1M1Km6l4PM9p
4630A4M3o0k3oN0J7j7l1qk5N4L2oop3j0L5O1qj3j3o4L6L8L7j8m8k3J8J3L5j2L
4663B2m2k1L3M5Ro6mqjO0oj6qn1M1K4L5j9k6l0K4L0OK7l9m9J1N9jLk9l0k0O3L4
4698F0k1k6k6j1L6K3k5J4n7k0N2J2J5K4o9n5K8M8M9l7l5j6J2L6J2M0r5noL9L0
4729B6J0l8nl1jM5J3km5j1%L9K6j7jn3J3L6L2Jl7k6NK8J6L4m6j6qKL9L6l8n0l
$$ plain form
4499 20 79 26 -21 -59 -7 18 66 49 -4 -48 -21 17 32 41 8 -30 -39 13 48 20 14 -27 -49 5 41 10 13 -22 -79 -14 10 52
4531 52 -6 -25 -52 -25 28 36 15 -15 -80 -31 -7 16 14 -7 -53 -39 -9 29 35 18 -58 -47 -9 28 30 15 -31 -44 -12 30 30 23 -25
4564 -25 -60 -21 31 61 66 -14 -39 -51 -13 41 51 -8 -28 -38 -11 47 24 28 -41 -37 14 59 26 13 -39 -58 -4 27 43 52 -38 -73
4596 -73 -17 23 59 28 -28 -44 -37 16 20 38 -13 -48 -70 4 35 45 -16 -11 -31 -18 14 55 33 -33 -40 -49 2 43 45 -1 -35 -28 21 14
4630 14 57 -3 -26 -32 18 35 18 -13 -21 -46 8 40 34 28 -45 -55 -20 41 33 20 7 -57 -21 17 54 36 -12 -35 -17 -4 31 19 22
4663 22 -20 -41 -8 37 46 -20 -24 -32 -33 27 21 5 -3 -54 -13 11 46 27 1 -29 -5 25 31 58 19 -30 -19 40 39 42 13 -17 -37 26 60
4698 60 39 13 -13 -24 12 35 10 24 -33 -53 -1 11 26 50 -19 -74 -46 2 51 14 -21 -37 -25 11 23 63 -32 -37 -43 -4 26
4729 26 36 -2 -7 -38 -39 6 19 17 -28 -39 -39 0 26 9 8 -45 -32 4 36 37 0 -26 -21 7 23 57 11 -5 -13 -11 28 64 26 -24 -27
4764b7JM7J8k5m1k1ON4J8Ol0m4oN1K9j6j6l6rM1J4L8m0m1k8K5L9K4j6m4k1J3P1
4797C4J7l4m5J7j2J3P7k2m6k7k0M2M1l2M3m1k4JN1Kqm3m2L7L9J7k3m1J5LpO2l0
4830A4k1j3rM5Qj3m1Lj5L5K3Pk4m0RJ8N5lj1m0m0M8M7k4Pk1j8J6J5K3j0n2k3Q
4864c7M3K6Ppo7K1J3O6n3Lk5k3J2L1Jj6k0LK0QJ9ok8l6J0M0O4m5j8%Kk6M7%m5
4899a6j9rN9LJ3nm9l9N0L6pJ6k4n3J6M7J2j2pj0j6O8pmk1m7J8OJ7nkom9N3K4L3
4935F4l1n1K5k0K7K0J0p9jK9K0Pnl3mQL9k5K7j2m5qK3J8M0k3o9K5QM9j5ln0j4
4969d9J7L0K0Ll7Lj9JO7j4n1jL3j5N6l4oj5M%N1j3l1j9k%M8K9o4RJ1j0mL4j5m
5005A3m8PJ9J6J0k1k6QJK5lJ4l4j9L0J0K1k1Lj9m7O6L3ll3m4J6K0L7Rk8n5L2J0
$$ plain form
4764 -27 -26 21 39 14 -27 -48 -42 12 30 36 6 -38 -44 7 36 20 4 -32 -41 0 14 52 12 -29 -57 -32 7 31 15 -29 -50 -37 34
4797 34 51 17 -28 -11 -23 -10 67 45 -1 -28 -48 -6 35 3 46 5 -19 -18 33 35 27 -16 -58 -21 18 35 12 -29 -14 -11 -18 44 14
4830 14 -7 -20 -29 16 24 11 -30 -27 -42 -7 16 23 -1 -41 -32 -14 41 38 27 -13 -53 -5 42 18 25 4 -14 2 17 40 30 -22 -45 -37
4864 -37 6 32 39 32 -35 -14 -1 65 12 15 -10 -33 -21 10 11 -5 -25 -22 -2 6 25 19 -9 -45 -35 5 69 24 6 6 8 -18 29 29 -16
4899 -16 -35 -44 15 18 31 26 -23 -62 -12 24 17 33 9 -44 -28 19 31 19 12 2 -14 54 47 43 22 -25 -7 -1 16 11 9 3 -46 7 31 64
4935 64 33 -18 7 -13 14 34 44 -35 -36 -7 13 20 15 -18 -22 -14 25 0 27 15 -30 -38 -15 3 43 20 -49 -24 -16 33 18 15 -35 -49
4969 -49 -32 -2 18 21 -16 -13 -32 -31 36 22 -29 -30 3 -12 44 10 4 -11 -7 -7 44 31 0 -19 -21 -21 27 56 -8 1 12 2 -2 32 17 13
5005 13 -35 -28 -9 7 17 -4 -30 -22 -21 4 1 15 -19 -38 -8 2 23 2 5 -14 -61 5 38 35 2 -42 -26 -6 31 40 12 -43 -11 -1
5039aQJ7j8k6JL0K3J2J2o2k5M5K0j9mqj9Rj3L9Jk1k2NQL0l9J4k7MK0M2rl4qK4
5075Ij3KK4pm3PJ2K9lqK1o6L9L6j2J5k7l0j0J7K7j0Mk2mj3L3L8k3l0rK4K6Ql5
5110FRl9J3K7K4l1k3Jj8K1M9k4j1k1j6L6KmPk6KK3rK5k1l6qK0K1M7m2n6OKN8J8
5146C2ql3lNJ1PPj9nJ5K6nJ8m4j7J7%L4nl1ok0MO0k8j0j7J1j1j2L9j5Mm0NM2K3
5183C1Jm3j6nK0K5j6J7k2j8LJ4M0j6m9RLK2OPl2j0K0PMJ4j5nm1M7QJ3Ll7k7QM9
5220A9K8n6L9m9J5L1Jk6j1oK6Rj3J5l3j7j1K8J7Mpj5QrJ8rKkl9L6lL6m5nj6J6
5256b4kL0Jk7K3l3LM3rj3Rj3pJ6J4qqj2J3J6l%pPlK2k8L0n1J1j2P7m3L0m7n2M6
5293a1oM2%j7j2nj9N4j9K1n9LJ9%J6j2j9oM7k9K9l0k0kK8mL8j8nm4J7J7K1J2r
$$ plain form
5039 -1 7 24 6 -20 -19 11 34 46 58 -4 -29 16 36 17 13 5 -14 -5 -18 21 22 1 -21 -16 -8 22 -17 -3 -30 -26 -6 36 27 -7 -15 9
5075 9 -4 -2 22 15 -28 -21 -9 20 17 9 30 -36 3 39 27 42 15 -15 -25 -8 19 9 13 -9 -13 -26 7 45 22 -8 -17 7 33 41 6
5110 6 15 -24 -11 16 40 9 -14 -13 -31 -10 39 15 4 -17 -33 3 5 1 8 -18 -16 7 -2 23 2 -34 -42 -22 -1 46 4 -52 -46 -44 14 32
5146 32 24 -9 -12 -7 4 11 18 -1 -6 9 35 30 48 4 -13 4 4 38 33 2 -4 -24 -20 40 12 2 -15 -4 -15 -27 12 -3 1 -39 -34 8 31
5183 31 32 -11 -27 -32 -12 13 -3 14 -8 -26 -23 -9 31 15 -34 -25 -22 0 6 13 -19 -29 -9 -2 2 16 1 -4 -45 2 10 23 26 -11 -38 -30 19
5220 19 47 -9 30 -19 -4 27 28 2 -9 -15 11 20 7 22 -11 -28 -39 -11 6 10 3 -12 -4 -13 5 -4 -2 -4 -43 -7 -10 26 -19 -24 -40 -24
5256 -24 -26 4 5 -22 1 -32 -29 14 5 -8 1 -12 -19 -3 11 3 -5 -17 -4 12 9 9 2 9 6 28 0 30 -21 -10 -22 55 12 42 -5 -57 -11
5293 -11 -17 25 25 8 -4 -9 -28 26 7 28 -31 -28 -9 -9 7 -5 -24 -30 17 -12 17 -13 -33 -35 -7 -11 27 9 4 -40 -23 -6 15 27 18
5328A8j6j3K8JL1l4l3QK3kK3m5J6j8K3KL7l9l0mK1MJ9J0k2j7K6k0J2j1J7k4J2
5361COK1l2npJ4j6J8K1j2j1l5pM1OJMk3OJ5j9Pjk6M0k7M3J5l6KpK1j6L4j6n0K
5398b6L1j7M0l9J7l6J5K3MQj8k8M8j0K7l8J5m3rJ5L5J1l8K7j6k1K2MJ3k6m1M0
5430a1nRRNl6K0KK8k4J6j7j4QJ7J3k7j%NmM1k5lplK4JJ6l6lOJ8k6K5nj9kK4kj9
5470bJ2j4k9K7O2k8m9KOpN1j3pj1k7qL5OJ9k6J3k0j2M1j9jQk1j4N1Nj8j7nONL2
5507C3k9K0m8J8JN1m2Om7O1j5qMl2jqM8NJ2l1K2m7O9k7K4o1j1J9mJ3K9k6Jj3k5
5542c9M4LJ1m0j0NK3KJ7l0QQj1J2Nk8J1pJJ5J9k3Lj3K0J2Qnj5k8K7K2J1J7m0q
5578Gl6RL8J8k3j9J9j1L8Jl6mK7l9RJ5Lk8nM5rk5K2n1K1j8OM3j0no3P2l7L0%k
$$ plain form
5328 18 2 -11 17 18 49 15 -18 -10 13 11 34 -11 5 -13 10 12 49 10 -20 -24 -3 1 20 30 8 -9 17 -3 9 -2 15 -9 3
5361 3 9 30 -2 -7 -14 0 -16 2 23 11 0 -35 -42 -1 5 6 10 -13 -7 8 -11 -4 -5 -31 9 -18 25 40 4 6 -1 20 4 38 22 -28 -26
5398 -26 5 -12 28 -11 6 -30 -15 8 12 20 2 -26 22 12 39 1 16 -27 -36 -21 14 25 -13 14 -2 -23 -1 3 16 -10 -51 -11
5430 -11 -16 -7 2 7 -29 -9 -7 21 -3 13 -4 -18 -10 7 20 -7 -8 -8 -3 -7 34 9 6 -1 -4 20 21 37 1 -2 4 22 -4 21 16 -3 -5 19 17 -2
5470 -2 10 -4 -33 -6 56 28 -21 -19 -13 -20 31 18 11 0 -27 -35 0 6 25 -1 12 -8 -20 21 2 1 9 -12 -26 25 30 12 -5 -10 -4 1 33
5507 33 4 24 -24 -6 -5 46 4 10 -37 24 9 1 5 -27 -28 -36 12 17 29 -2 20 -27 42 15 39 -22 -33 -14 -18 -5 24 -2 -1 -14 -39
5542 -39 5 8 19 -21 -31 -26 -3 -1 16 -14 -6 2 -9 3 8 -20 -9 -16 -15 0 19 -4 -1 -14 6 18 26 21 6 -22 5 27 38 55 15 7
5578 7 -29 -20 18 36 13 -6 13 2 40 41 5 1 28 -11 -2 13 16 -12 -17 28 19 -6 16 -35 -14 -32 -26 17 7 2 -61 11 -26 4 4 2
5614B%l3K0JM7j4k7NnK3j7J8k0j2RL9k0j1pk1pM6k0nOL2l2K7J2m2Rk3K8RokJl9
5652b9qM5pl5L9l6K0k1K1J1Jk0J4J8Qj7Qj2k9L1j7PJ2m4K5Kj7L3lOj1L2m1L6R
5687C1j6pk6K1M3j1j5nJk1OJj4J7lLj8L9l3nl0M3KNJ0k1j1LMJ4lm6K2nJ3KJ4k
5725Bk2J4k0K4jjl1K8j1PJ4k2J0pML9j2Omjk2J0K8j4K0l8j9KJ5J0j2JJ3j6QJ1
5761A3k4J2J2Qj0j4j5M5ol3k1M4%j6J4k7k4M3Oj5j0L5k3J1mnoRkj8K9j2Jj4J9
5796BkJ5ml7J0pLN3j9j1jj5J9K4j4M%lj9K9K0m2J4j0jOJ1lj3k3J2mJ7qK8k9j5
5833a3J8N%J9m7j7K2j5L0J7n5L5k2J8Qkl0J9k7K2N0k3k9lK9j8KQJ4lk7L1k5L2
5867B3j5j5QJ3L1k9jroj9L4j4j1NjJ1j0J8Pj3k6k1M1K0l2lkRojj0N1m3qmQJpJ
$$ plain form
5614 2 2 -31 -11 -10 37 23 -4 1 -4 19 2 20 0 -12 -3 36 16 5 -2 -23 -30 16 -4 -9 -3 29 -3 24 36 -6 3 -20 8 17 11 9 10 -29
5652 -29 -37 8 1 -34 5 -31 -11 -32 -11 0 1 -19 -5 13 21 4 12 0 -29 2 -15 -8 4 -40 -15 -13 -30 3 0 6 -5 27 -14 22 31
5687 31 15 8 -18 3 46 35 20 15 16 -5 1 2 -12 5 2 5 -13 26 -7 -12 -42 1 3 8 18 -3 -14 -11 -7 7 4 -42 -20 -25 -12 -10 4 2
5725 2 -20 -6 -26 -2 -3 -4 -35 -7 -18 -11 3 -19 -9 -16 -12 27 15 21 17 16 -6 4 32 18 38 0 -19 -17 -2 8 -4 -3 10 -6 2 13
5761 13 -11 1 13 21 11 -3 -18 27 21 -12 -33 11 11 -5 9 -18 -42 1 7 -8 -18 17 -6 5 1 -4 -10 -1 -3 -21 8 -4 -3 -17 2
5796 2 0 15 11 -26 -16 -23 -20 33 14 3 2 -13 6 30 16 20 20 17 -2 27 47 5 19 9 8 14 25 22 9 -14 -2 -6 11 3 31 2 -13
5833 -13 5 10 10 29 -18 -35 -13 -28 2 19 -36 -1 -23 -5 3 1 -29 -10 -37 -15 35 12 -17 -20 9 -9 -7 1 15 12 -15 16 -9 23
5867 23 8 -7 1 14 45 16 15 6 0 -19 15 1 -10 -5 -6 5 -5 13 20 7 -19 -40 1 21 -11 -14 -16 -7 -13 -14 -24 27 -16 -24 -28 -20 -19 -26 -25
5906b5K5j4K2qj4M9j8k5j0QL7m7l1L8mM1mm5RRj1NJ9K7l0jjnJ6qpk1j9M5J9rL6
5943D8n0kK7k2lJ9j3j4j8J1Rk4J2L8j7rlK6j4j7J3%K3o1M4k3L7oLK5m6lJ3k3L5
5978A5k3J8m6J7K8k7L6nj9j5K8oK2j9Rl7J1PL6j5k0kLK2J1k6pj7J9OJ7j5j7k6
6012c7K6J0Rk1j7RMmJ6lk0J9noJ5RJ9o0K1K7pmK0j0k0Nj6L2k3M0l4KK3nj7Qk0
6049a5L0k5M0kmk3nJ4j5J0j6L4k4mj5J3J9Kj6k9K5j3K2k1J2Rk7Oj3LML4l6J4J1
6084aqKl1L1RJ2j8Nj0j0N3j6k9L2k8j4LM0j4J9k8Ql1J4J5J3pl5L9j2J0rMj4j4
6119b0OK1JK0n1K0NLK3j2j2nj3rL2j1k4J4j7K2jJ4J3j7l5K5J3j5J8j1l4L0j4L7
6153A6m0K7J5nLj8Klm1M2J5J0j8nLjjK3Ok7J0Ok6OJ1j4Nm9L9K3pj2pk0K8nJK9
$$ plain form
5906 -25 0 -14 8 0 -14 35 17 -8 -18 -10 27 -20 -51 -13 -17 24 20 -25 -16 -7 -18 -13 6 33 3 2 1 -4 12 4 -3 -24 -43 2 21 12 48
5943 48 -2 -4 23 1 -2 17 4 -10 -28 -17 -8 -32 -20 18 1 -8 -11 15 1 -16 -3 -3 20 -41 3 -20 17 11 14 39 -7 -10 3 -20 15
5978 15 -8 10 -36 -19 9 -18 18 13 -6 -21 7 1 23 4 13 -24 -13 -6 30 15 -5 -7 -4 18 29 3 -4 -21 -2 4 21 6 -11 -37
6012 -37 -11 -1 8 -13 -30 -21 -17 -21 -5 -8 -28 -9 -14 -20 -5 4 23 -37 -16 11 4 0 20 10 -10 -5 -21 11 -12 28 -6 -4 19 14 -3 5 -15
6049 -15 15 -10 30 28 24 1 -4 10 -5 5 -11 23 -1 -5 -20 -7 12 14 -2 -31 -6 -19 3 -18 -6 3 -24 -18 -31 -28 -24 10 -26 -12 -1
6084 -1 -9 -7 -38 -7 2 14 -4 1 -9 -19 34 18 -11 21 -7 -21 -18 22 8 27 -1 7 -24 -10 5 18 11 -24 15 3 13 4 8 -6 -20
6119 -20 -14 7 8 28 -23 -3 2 5 28 16 4 -1 -14 -23 9 -2 -26 -12 -29 -7 -8 6 19 2 -33 -8 5 -10 8 -3 -37 -7 -21 16
6153 16 -24 3 18 13 16 -2 0 -3 -44 -2 13 23 5 0 3 2 1 24 30 3 13 19 -7 -1 10 -4 1 -48 -9 14 7 -5 -12 -32 -4 -9 -8 21
6191B1J8l9J3Kjj7j8%j1J1K4J9j3pk0PKMK8l5j4J5K1lJ6l7J5K2j5J2l7k2N0kj8
6226iJ0PQl2K0qJ0KJ3j8k8K2mK4pj3J2k5jK1J2lm7MJ9L4l5K5l3J0j3ML6o3K1J6
6262ij6J9Nj4J6j9L2kl3L2J5p3L2K4KrPj7qLJ7J0j3J4k5L3j8QrJ9k7k4J6J8J4
6297B0k5J8k1jJ6j2MKo3N3J6J7oj4k2j6L1J3j0kn1M2K5l4L0k6LMJ1%k0OK3k6K3
6332Hl6J1L3pk7J7j4L2Nk6J2l6N1Jj7Nj9L1J1k8K1k7KOmoJ3Pl5K1OrJ6j8Pl4K0
6369gj7M5j4k1j2K2rK8l0j3KqM5qll7K1l3O5Rl0m3M0K5k3M0k3Pj6K1j0qK4l8q
6404a7mM4pmj1J9k0K0m1N1mk2Jj1K7j8JJ0Mk4j5K3Ml1PKj1nM5j0qj9j7JJ7L8P
6441B2k9KkK3j3J6p0K6K3k8N4j1l7L1k6K9nrqj3N8k5J9k5k5L3o%J9Jl0K3k1J5
$$ plain form
6191 21 39 0 13 15 14 -3 -21 -21 -32 -21 3 22 9 2 -18 -11 -9 -5 23 -12 -26 -11 10 7 23 -14 1 23 8 20 -17 -39 11 9 -9
6226 -9 1 8 16 -16 4 -4 6 8 21 3 -25 -3 -7 17 10 -3 9 -16 -17 4 16 13 -34 -30 -11 23 -12 13 -20 -10 -23 -19 17 -46 -25 -9
6262 -9 -25 -6 -1 -15 1 -18 14 12 -21 11 26 -47 -15 9 11 2 9 -8 -16 -13 4 14 1 15 -10 23 5 13 4 23 -4 -28 -12 6 20
6297 20 -5 13 -8 -9 7 -5 -1 1 -62 -9 7 24 18 4 -18 -34 -3 10 0 -2 -53 -11 14 -20 10 -16 -13 -9 2 2 -18 -12 11 -15 8
6332 8 -28 -17 16 9 -18 -1 -15 17 22 -4 8 -28 23 24 7 12 -7 24 35 7 28 1 3 9 5 -1 12 19 -16 5 11 2 18 0 7 -27 -7
6369 -7 -24 21 7 -14 -26 -4 -13 15 -15 -28 -26 -34 11 3 0 -37 -16 -49 16 25 -5 -48 -8 17 -6 34 11 18 2 23 13 5 29 -9 -17
6404 -17 -21 23 16 12 1 20 0 20 -21 30 26 4 5 -6 21 3 4 14 18 -6 -21 2 6 -25 -18 -16 -27 -32 13 3 -5 -24 -41 -40 -23 15 22
6441 22 -7 -5 -7 16 3 19 -51 -25 -2 -30 24 13 -24 7 -19 10 5 -4 -12 -25 33 8 27 2 -23 10 4 4 23 24 -6 17 -4 11
6475A1Lk4jRLmpOLm4M4K3o7L5K3j4j2K0l2J4Nlk0J0j2K7ojOrJ5mpJ6j6j0K2J4
6513A6lJ2m5L2Rk8J7jK6m8Qj6K9Qqj5nmK4kolj2J0LL3m3Oj0MK3Jrl5j0J5L5j4
6551fJ0qjk5QQK6j9k2J2L4lJ0l7L6j3l4J6J4jrj5QJ4K9l2K7l6NJ3Lj8N3l7k7L3
6587A6rK9K5m7j9J3J1Pkrl7J9LJ7k3k1J3kQrrOoK3L0m1L9p6J0L4k1L0Nj7m1M3
6623hqlJ7K0kqk3L1nMj4j0m4N2K7k2j9j1J8j1M1LNo0LRM1Pk7k6lJ8KK2J3k1m6
6660c8K7j0M2pJ4l4lMj0J2kl5k2L8PK2mJ6l6J9L3k0J6k4l0j5L1J4M4n2J6%l5M6
6694B4%j8Rl4J0K4qM0km7M1k7qmj2j5J9K2Kj3Ool0J5J2NlJ0l1J5J5L5l4l8mJ6
6730a4QK2j5j8j2KM2k8KMK8k0OL4m4PMk8K6J9pj6MJ3k2rM7l2Pj3nK0M1m1J1j3
$$ plain form
6475 11 14 -10 -11 -2 1 -3 -10 -4 -1 -45 -1 22 -45 -10 13 -1 -13 7 -25 -11 -6 -9 -29 -19 -31 -4 -10 -11 -5 -14 1 -3 -10 6 -10 -20 2 16
6513 16 13 25 -20 12 21 -7 10 9 35 -13 -5 -21 8 16 8 -7 -12 -16 8 6 0 -3 -15 -5 -2 31 -12 -6 -16 -12 11 12 3 -32 -42 -27 8 -6
6551 -6 4 -4 -5 -30 -22 -14 12 -7 -29 -17 17 14 24 -13 23 10 -24 -8 6 5 -4 -19 -11 3 32 0 27 -9 -4 9 12 -6 47 10 -17 16
6587 16 7 36 61 14 -5 8 19 26 24 15 -22 -3 0 17 -6 -27 -14 -16 -8 -17 -26 -20 -26 -3 27 -14 25 -51 -41 -7 -28 2 7 -10 -51 -8
6623 -8 -16 -19 -2 18 16 8 -15 16 11 15 1 -9 -53 -1 26 4 -15 -26 -8 -19 22 25 30 -30 -27 -18 23 30 3 -23 -26 -8 -6 16 29 8 -38
6660 -38 -11 -21 21 14 28 -6 -9 -5 -15 -3 -5 -40 -62 -24 -17 5 1 17 -19 0 33 13 29 5 -25 -40 -9 5 49 -3 13 13 -22 24
6694 24 24 6 15 -19 -9 15 7 47 45 -2 39 12 4 0 -12 -27 -8 14 16 3 9 3 -27 -12 0 5 2 12 -19 -4 11 46 12 -26 -30 -14
6730 -14 -6 16 1 -17 -29 -27 15 -13 -11 -7 21 1 7 41 -3 4 8 -20 6 25 18 2 6 19 -3 -12 35 3 10 -3 -8 12 53 12 23 10
6766A0j3K3J1n7L1k6mK0OJ7k1j2j0J3L6lqQk2K9k1Ok8J9knJ8j4Mqqj2J5OoK8m1
6803b1l9P3J0j0J1o1K7k6M1K1kk6k4J6J0L3k4Rj2kK5pPk7k4QK4qj1L1J5n6J5L2
6837B8l2MpMj3J0N5o4qK2pRJ1Qol2Jj0L7Lnl0K6rJ5MMm2kK7nL0j6m6QJ3K7j0J2
6876A4Kj8l0L4QM0l5J3l4lPJ0J0j7j4J3NK7j7j2j5%NM0k1jk0qL5k5K0nl1QJ3r
6912a1K7nj4k7RK6J8Kl5jj2L9Rj3om1K2qN1l3oKJ9kJ6j9K2l8j1L0mkJ0nj1jL9
6949C6k9Jjjpl5M6j4j7jJqM8j0J6m4%%K3K4n5J1nMK0K7m0j0k8J5L8QRl4K0k1J4
6986AN0k4K5o6J2JL0j8jol6RJ9L0oj5k6JPL8J1jp3M3%J7j4l3LMK2%J9j0k3POp
7024dJ9j4Lll8J3L9ol4j7kL8kQk6pJ8K0L5m0K5m1k0N1kK8m2jk0OL6j6L4l4j1R
$$ plain form
6766 10 -3 20 31 -26 5 -21 -25 -5 1 18 -3 -15 -25 -12 24 21 13 21 -1 28 7 13 -15 4 2 -3 15 1 5 -3 -11 -23 -8 -2 -8 20 -21
6803 -21 -60 13 23 13 24 -37 -10 -36 5 26 24 -2 -26 -10 0 33 9 18 6 4 29 22 29 2 -22 -14 10 2 -9 22 37 -19 -4 28
6837 28 -4 0 -7 -3 -16 -6 49 -15 -23 -1 -8 1 12 20 14 -18 -17 -27 10 13 8 -22 4 -5 10 14 18 -24 -26 1 -4 26 10 -36 -28 -15 12 2 14
6876 14 16 -2 -32 2 10 50 15 28 -6 -9 -2 8 18 1 -13 0 5 32 15 3 -12 -12 -7 33 12 11 -9 -17 18 -7 13 8 -23 -15 -2 -11
6912 -11 16 11 -3 -30 -21 5 23 25 -10 -11 -23 16 25 12 6 -35 -13 -21 30 -3 -9 -7 12 10 26 7 29 -9 -20 10 6 4 14 9 -2 -3 36
6949 36 7 8 7 6 -1 -36 10 -4 -21 -22 -21 -29 19 9 25 -19 -19 -19 4 28 -27 -16 -21 -17 3 30 -10 -20 -48 -33 5 13 22 -12 8 -13 1
6986 1 51 27 52 -14 -2 -1 29 11 10 4 -32 -23 -4 26 20 5 -21 -20 -13 25 36 35 -38 5 5 22 8 -25 -22 -18 4 4 23 13 -10 -3 3 -4
7024 -4 15 1 4 1 -37 -24 15 9 -25 -42 -44 -6 -8 0 -26 -33 -15 5 40 0 25 -16 -36 15 13 41 -1 -2 -22 -16 20 4 38 4 -7 2
7060BJ5j2mNRmk0L8om6J4J6k5K9J5qm4rJ3J2L6k4k0j0PJ3N5j9m5j9K5kNJ0NJk6
7097a8K9PNqj6J2k1OO3n9k8L2k6J2L3oKl6J2K7KKm1J4J6k2J4J9Jn5M5NK4km5r
7133a0Nk9K2L4k9K0l7j4M2J4j0On4M8mlJ0Ll8K3%M6m0qL2o4RL1J4rm0QnK9L4j5
7169B1k6j6J7RJj0MJ0nlJ6K6n9L4l3K1M5k0mm1l1K0M1j7J0l7j0pL4J4k1npk1K7
7204b3M1j5k3Nl5M5K4mJ1k5l1L1K2J9k4m0RJ8J5QK0l9k5LM7Qj7m2K7j6PRL0%l3
7239Gl7M0K2j1j7l0K7j5N6lk2nm0J9L5L8p7j0pj1L4M1k3l5Mj9nL9K5k0l5pRM1
7273Hkj3Ll3L1L9j8J0j7k7nJ2M6k1k1j3L3%%j1K8l4LK9Npj6m7JRO1k3Ll9j5M4
7309CL2j1Ln5Ok2J6K9L2k0k5kk7N1J7l4Jl0L2K2L0m6j2l3K7K6Mklo3K5M7J9L0
$$ plain form
7060 2 17 5 1 6 15 11 -9 29 23 -23 -9 7 -18 11 26 18 -26 -35 -22 -10 26 2 -18 -28 -21 -8 47 28 -17 -36 -11 -13 -8 2 7 8 -18
7097 -18 11 18 23 15 -1 11 -10 -4 59 0 -28 4 -22 -10 23 17 19 -17 -5 22 24 26 -15 -1 15 -7 7 26 27 -28 17 22 46 44 -1 -10
7133 -10 -5 -34 -12 22 -7 13 -24 -38 4 18 8 14 -40 8 4 1 11 14 -24 -1 -1 45 5 -3 29 -35 -26 5 19 10 -30 -22 -27 2 36 21
7169 21 -5 -21 -4 5 6 -4 0 10 5 2 18 44 -15 19 -14 7 52 32 28 -13 -44 -24 17 0 10 -27 -37 -44 -10 4 -17 -22 -29 -50 -23
7204 -23 18 3 -20 -15 -50 -5 19 15 26 1 -30 1 23 42 18 -22 -13 5 20 28 48 9 -16 -13 34 42 25 -17 10 -6 1 10 40 40 7
7239 7 -30 10 32 21 4 -26 1 -14 42 39 17 12 -28 -9 26 64 -13 -23 -30 -41 -7 34 11 -24 -20 -39 -44 -5 20 0 -35 -42 -33 8
7273 8 6 -7 -4 -37 -6 33 15 25 8 -19 -24 -12 34 13 -8 -21 12 12 12 1 29 -5 -2 27 32 25 9 -38 -37 -28 33 10 13 -26 -41 3
7309 3 35 24 27 -28 -22 -44 -28 1 33 13 -12 -14 -41 10 27 -7 -6 -36 -4 18 48 2 -10 -43 -16 10 14 12 9 -54 -29 18 37 67
7343F7o4m2L8K3K3l3Pm0j4K5L4K7l3k5j2J2K9J1rl2j9MM4pj5j8j6J1RK7J6j8p7
7376f7PP4K2qj5k7J6j4L5K5l2l6l2M0K2jjl6J3j4L8K0j4On8M2K2J8j4j5m7J4m
7409b1M9J4j6m7PK9J9J5j2l7m2K6M2rJ6l1n7J6K5M2qm2l5K3N5k9N1n4j9K7MK8
7441B9j1k5J1o5L9L4K3l5kj6%L3Mj7k0J2m0M6L1j4j0l4J0L7K1Pk8k6j4jM9J0j5
7474B3l0n8N1M6NJ0q1kL4J2L4m6J1k6k0L0L4Lm5l5K4K1MJ3k6n5L9j7N4J7Qn1j4
7507c3%J7M2oj6n2J1M6J1J3l6k8pM3RL1j5l3k4L9K4k3Pl9k0J5N5%k7k5Mk7O1J9
7541C6l0rn0L4J9O0l5nm9j1J6J9O0l2o0%nJ00n5K7k9o8L7J2N8k6k6jj9J7J5N3
7573E3q3Rj5N2%K2pm7l2M2K6J7%l9l2K0J3J1J5m1J8j4k3P9Ko7l1L9j3M2j4olk5
$$ plain form
7343 67 3 -39 -1 22 45 12 19 -21 -35 -10 24 51 18 -7 -19 -7 22 33 24 -8 -27 -23 21 14 -1 -19 -35 -24 -15 12 28 10 -67
7376 -67 -60 14 36 28 13 -14 2 -12 23 48 16 -20 -52 -12 10 9 8 -28 -15 -29 9 29 15 21 -37 5 27 45 31 16 -31 -17 -21
7409 -21 28 42 26 -21 -14 15 34 49 37 0 -42 -16 26 17 33 2 -55 -39 -14 28 20 -22 -57 -34 21 -8 43 -11 -30 -3 1 29
7441 29 18 -7 4 -61 -22 12 35 0 -2 -18 -18 15 19 2 -18 -6 -46 0 31 17 7 -27 -17 20 41 48 20 -6 -20 -21 28 38 23
7474 23 -7 -65 -14 32 37 47 -34 -36 -2 10 44 -2 9 -17 -37 -7 27 30 -15 -50 -26 -5 -1 12 -14 -69 -30 -47 7 24 32 -19 -33
7507 -33 -33 -16 26 20 4 -48 -37 9 20 33 -3 -31 -38 5 14 45 30 -3 -27 12 36 13 20 -19 -39 -24 31 31 4 -21 -17 -44 17 36
7541 36 6 -3 -53 -19 0 60 25 20 -29 -40 -24 -5 55 23 -37 -37 -42 58 3 30 1 -67 -30 -18 40 14 -12 -13 -32 -15 0 53
7573 53 -30 -21 -36 16 16 38 31 -16 -48 -6 20 37 37 -2 -34 -14 -1 10 25 -16 2 -12 -35 44 46 -21 -52 -13 -26 16 2 -4 -7 -32
7607c2J6M5J9o8mk0K5L4KJn0qL1J3pJ2j1k8J4RM4l9qj4k3K3M8oj5k7J9k3L5K1
7641B8j1j8Qj4L1Ork7j7PP1ooo2LnL5Pj9k5J8K3m5L5J3k0j6m2L4L6J7l9j5m3K5
7676d2M1J0L8o2j5mO1l1L1k7j8j3J4K7Nl2l0NL3L5mj9Qo4M0L3K0j0nr1N0L0QL
7710B5jj8Lj1N5k3l0k0J3l8L8MJ1m6K4lJ9M6n3k5%qN4j2kj6n0L5K1K4Nk3l1J3
7744b0J3J7Qj4j3k0K5J5M1l6l4j5mN3pJ5k1j2j4N2K2j0l7l4K7j3O5j4l4k7K1j9
7776b4M5lRm9K2j2K0J8kn7k5K1K2L8J4n0l5J1K3J0K6nl8nKM7Oj8k8k1%N0LK7l6
7811Fm2M2pL7k5j9Jj4L7Llk1k5J1K4RrLl8j6L7L3Ok0k1k2K7K9J6l3nk6rM3K4k7
7847Fqk4j7O0j4Pk3n2N0NM0p%l8l1L3K3K2pj5k8mL3M5k4l0l5K9N6pj6j7l6J6J5
$$ plain form
7607 -32 -16 29 48 -20 -24 -44 -19 15 17 18 -32 -40 -9 4 -3 9 -2 -30 -16 -7 37 -2 -10 -24 -47 -24 24 18 3 -24 -5 -28 7 28
7641 28 17 -1 7 -7 24 30 21 -6 -23 -16 55 49 43 -19 -16 -21 14 21 2 -23 -5 18 -27 8 21 1 -15 -57 -23 13 30 -9 -24 -67 -42
7676 -42 -1 9 47 -15 -30 -34 27 -4 27 0 -18 -31 -17 10 15 -17 -47 -42 -9 26 22 3 11 -53 -13 20 40 30 25 -66 -16 14 22 25
7710 25 24 6 9 -2 53 30 0 -20 -7 -45 -7 -3 8 -38 -14 -17 2 48 -5 -30 -30 -38 16 4 2 -14 -64 -29 -8 16 21 -2 -33 -20
7744 -20 -7 10 18 4 -9 -29 -4 11 52 16 -18 -33 -37 16 9 24 3 -9 -23 29 51 41 4 -30 -3 -16 49 35 1 -26 -5 -24
7776 -24 21 18 27 -22 0 -12 8 26 24 -33 -58 -37 -15 23 37 -13 -48 -37 -14 -4 22 17 -21 -26 -24 23 29 11 -17 -38 -38 12 15 42 6
7811 6 -36 6 -1 36 11 -8 -7 -21 16 19 16 -5 -30 -19 5 14 5 8 -30 -46 -9 24 30 10 -11 -33 -6 23 39 6 1 -25 -34 9 33 6
7847 6 -2 -26 -43 17 3 10 -13 -65 -15 -10 30 23 23 -15 -46 -13 10 32 25 10 -18 -22 11 56 32 2 -33 -4 52 45 29 12 -24 -8 7
7882GK8L9n2n2lL4J6K0l1j7m0M7K4pk2k9K2rM7pRj2o0KP6j4jpn8M7J3%L9p6k0
7917d7L2mL4OKn1J0QK3J5j4qm9L4MM3j0m5J8m0L8J7K2Ml6l7N0J9j4No1J6nN0K6
7952E5m9k2JJN0jOk9m9J9rQ2l2k3l7J6J0O7n4rk7k7K6L6K3m2j2k1K2L6L5j4k2
7985Fm1OL5K8j0l4k0K0K1K9J2l5l1JLO3ql8j2j3J0L1nPl1l3J5M6K9j1l3n1kN8
8019A2L0l8No8K7M0K3Jn4qlK3Pj4L9o5mL0M6lJ9o5k6J5J8M0J9n2m7PK3N2Rm7r
8054a8nk4P0J7jm9ppO7J5j5l6l5PP3K7q6rj7J1L1L9Jl8m5l5M8K4L0j7m6l4N9M6
8088D1j5j0k3j6JJ7N0k8m6k3J1M0K2k0k5L4m0K9M0Nn3l0L3k0N3K5k5p2K1J1L5
8119B2L3m9nooK2k5O0n7k2j3M8J3rj6j5j9M2K5Jl7jj7NO7k0j8k1j9L5L0Nm8lk1
$$ plain form
7882 7 35 74 22 -30 -33 1 17 37 6 -11 -51 -4 20 13 -9 -38 -16 -25 22 15 24 12 -48 -46 30 16 15 8 -50 -3 10 10 49 -27 -47
7917 -47 -15 -19 15 21 23 -28 -18 -10 13 28 14 6 -43 -9 -5 38 28 -17 1 -39 -1 16 38 42 6 -31 19 38 24 29 -32 -16 -21 29 55
7952 55 6 -16 -15 -14 36 35 41 12 -37 -18 -27 55 23 0 -37 -21 -11 56 2 -7 -34 -61 -35 1 24 -18 -30 -51 -29 7 42 28 6
7985 6 -35 -29 6 34 24 -10 -30 -10 11 40 52 17 -14 -13 -10 53 45 7 -5 -18 -8 23 18 25 -6 -39 -24 22 51 40 7 -44 -46 12
8019 12 42 4 9 -59 -32 8 31 32 -22 -30 -33 -10 -3 -17 22 -43 -47 -17 29 26 45 -20 -46 -31 -13 27 46 -6 -53 -46 -23 29 38 -9 -18
8054 -18 -23 -47 23 40 39 -10 -17 -24 43 58 43 7 -28 -21 52 79 -7 -16 -33 -22 9 48 49 11 -34 -69 -21 3 33 16 -30 -64 -5 41
8088 41 26 16 -7 -23 -22 -5 45 17 -29 -52 -41 -1 21 1 -24 10 -30 -1 39 44 -9 -39 -6 -26 27 52 27 -45 -24 -13 22
8119 22 55 6 1 -5 -11 11 -14 46 -11 -33 -46 2 15 6 -10 -25 -44 -2 23 24 -13 -14 -31 -26 41 21 3 -18 -37 -2 28 33 -15 -18 -39
8154c9mM9P0o2m1m2L6QL8L8p8k0J2K5K9ml2njMM7M8n7j2m4J8L8K3jj7o9L3J7L9
8188D4Lk7p6
$$ plain form
8154 -39 -43 6 76 14 -27 -69 -33 -25 13 51 -27 -47 -35 -10 19 15 -17 -22 -23 -19 28 76 19 7 -37 -19 19 42 41 24 -45 -12 5 44
8188 44 47 20 -56
8191e6
$$ Imaginary data points
##PAGE= N=2
##DATA TABLE= (X++(I..I)), XYDATA
0@%%%%%%%%%%%%%%%%%%Qj6J6j6J6j6J6k3L1l2L2l8M6m8N6o4O7p5Q6r6J06j18J29
41F7j42J58j74J95k18K41k68K98l35L79m28M88n62O57p87R71j253J749k879J0607
61H764k02j6132J617Q219R256j33m611p612m241P39P329N412k895j0796o560M701
77g145J1163M006p118j1090m258M292Q274N817k63p723j0072l462Q154J2059L557
92F191q238j0126j536O985P133J411l966n264k329L624Q157N573l638j0361o230
107a2614N544J2341P282l871r781o318J585P386P888K723n116q918l822O067R780
122A0156K621p132q208l89O804O579O76n342p447m116L412R351P186l106j1593
137e48r150K101J0218P443j925p916o221m57M321N357J795m309p583l053N807
$$ plain form
0 0 0 0 0 0 0 0 0 0 0 0 0 0 0 0 0 0 0 0 8 -8 8 -8 8 -8 8 -15 16 -16 16 -22 24 -24 32 -32 35 -40 46 -50 56 -62 67
41 67 -75 83 -91 104 -114 127 -141 157 -178 201 -227 261 -301 356 -431 540 -713 1036 -1843 8764
61 8764 8562 -7570 -5953 2266 11522 11389 6778 -834 -5075 -4336 2993 8405 5510 -5286 -11846 -7145
77 -7145 4018 8024 906 -10184 -14442 -10150 -1876 3941 3678 -4045 -14117 -17579 -9425 2634 6191
92 6191 -2047 -12173 -13709 -6724 409 1820 -2146 -7410 -9739 -6115 2042 7615 3977 -6384 -12614
107 -12614 -7070 5271 12553 8682 -1099 -7417 -5832 1554 9442 12165 7049 -1869 -5691 376 10156
122 10156 12777 5645 -2563 -2952 3852 10431 11107 5765 -1682 -5798 -2386 6965 14151 11045 -548
137 -548 -9698 -7597 2621 10064 8139 223 -5998 -6455 -2134 3223 5018 709 -6874 -9927 -4120
152d120Q822J681p966r431j416P166Q383K669m409p984n743J310Q277Q241K42
167E722q134q042M02P811O547q95o100m614J148N580N626J062n125p597k461O556
183b514J0276L895o161r748l918M789Q394N226j678o599n996J20O247O571J11
198I015o677o204J034P135N646j638p204o085j7O024P339K528n429r480n089M426
214d676R411M933m028q120m525K092N677L823j145n262m866K63N785N798q71p536
230c247o941R23P943P087k11o728p124k033M361P333M563k382p483n390K302P551
246E24M697k624o387l102L054N990L524j878n779m802R49O854P213P09o877q036
262e971j389O496Q031K374m527o541k919K665N785L728j820n814l923K437O432
$$ plain form
152 -4120 4702 6383 -1583 -11014 -12430 -5264 3119 5788 1379 -6605 -12348 -11038 -2761 5480 5722
167 5722 -2412 -10454 -10052 -2241 4306 3411 -2689 -7303 -6155 -575 5051 6113 988 -6609 -9070 -2514
183 -2514 7762 11657 5496 -4252 -8170 -3381 5013 10239 8561 1962 -4034 -3914 2333 8904 9015
198 9015 2338 -3866 -2832 4303 9949 8311 1107 -4978 -4995 1029 8368 10896 5467 -4013 -9102 -4676
214 -4676 4735 9668 5640 -2480 -7005 -4913 764 4587 3442 -1820 -6686 -6423 -638 5160 4289 -3247
230 -3247 -10188 -9265 -1322 5765 5554 -1174 -8298 -10331 -5970 1363 5926 3544 -3939 -9329 -7027 524
246 524 5221 2597 -3790 -6892 -3838 2152 5676 3798 -1981 -6783 -5834 1020 8233 8942 2065 -5971
262 -5971 -7360 -864 7167 9541 5014 -1527 -4446 -1781 4004 7732 5912 98 -3825 -1388 5044
277E044L581l276p000m064K604O813N017j152o675o802j168N576P279K043n026
292B794p233k675L758N765K025l216n196k472K451N215K942k753o561m070K940
307f286P369M672k408p095n309P47N898O070J390m346o139k336L779O269K522
322D797l489n515j479M137N506J509l652n248k151L121O249M307j797o793n586
337f084J180O972O087j95n653n501o33M193M822J296l260m695j671L270N010J541
353F679m060o033j991M105O371K508l577o492m084J600N811M977l67n501n517
368e571n26M544M856L65m086m415m90L668M321O77l942n029j307M066N983K247
384E361l707o477l191K870O241M107j181n133m443P7M479M707M48m096m206K19
$$ plain form
277 5044 8625 5349 -1651 -5715 -3111 3702 8719 7567 892 -5910 -7078 -1502 5777 7820 2794
292 2794 -4439 -7114 -3356 2409 4434 1218 -3978 -6450 -3999 1216 4158 1405 -5156 -9226 -6286
307 -6286 1083 5755 3347 -3748 -9057 -8310 -2412 3658 5048 702 -5437 -7773 -3994 2275 4797
322 4797 1308 -4207 -5686 -1549 3957 5466 1814 -3434 -5585 -2464 3785 8092 6295 -498 -6084
337 -6084 -4904 2068 8155 7960 2307 -3194 -3827 366 5188 6484 3224 -1471 -3142 128 5138 6679
353 6679 2619 -3414 -5405 -1300 5071 7579 4002 -2490 -6574 -4974 837 5814 5447 -54 -5571
368 -5571 -6097 -1553 3303 3668 -418 -4833 -5323 -1655 2666 3343 -599 -5628 -6935 -2869 3114 5361
384 5361 1654 -4823 -8014 -5144 1097 5204 4023 -1110 -5553 -5476 -997 3710 4158 62 -4144 -3925
400c925M403M078k55m303m213j19M252N221J529l648n937k814K983O317L832k084
416E317n812l915J317M713L499o16l814l336J24L669L583k05m386m403P6M775
432E86M979M06m698n566j633L410N475K691k302n198l505J136M581L484r30m447
448a531l230J050M089L012j157m257l384O99M405M297J18m498n168j054M012N511
464B914K146k856n096k705J875M593K981j250l925k629J369M060K716j423m266
479a496k855J421M653L701m94m389m486o15M049N290J618l341n109k113K577M444
495B855K140j822l792k177J449L605K133j570m148k686J473M608L383j296n028
510h73m187L09M287M372O72l402m481j779K333M258J982k113m069j883K038L870
$$ plain form
400 -3925 478 4556 4301 -2 -4215 -4334 -82 5139 6668 3020 -2917 -5731 -2748 3569 7401 5317
416 5317 -495 -4410 -3093 1620 5119 4503 689 -2647 -2523 1146 4729 4524 138 -4265 -4189 586
432 586 5565 5971 1273 -4293 -5926 -2516 2959 5650 3348 -1850 -5355 -4219 362 3846 2916 -1531
448 -1531 -4761 -3711 378 3390 2233 -2024 -5408 -4709 -304 3993 4111 -387 -5555 -6609 -2597 2914
464 2914 5060 2204 -2892 -5597 -3722 871 3852 2602 -1323 -3952 -2583 1477 4193 2770 -1496
479 -1496 -4351 -2930 1723 5424 4930 541 -3945 -4560 -511 4779 6397 3056 -2053 -4166 -1589 2855
495 2855 4995 3173 -619 -2796 -1347 2258 4391 2821 -1327 -4013 -2540 2068 5451 4155 -873
510 -873 -5060 -4751 -464 3908 4580 1178 -3303 -5082 -2749 1509 3491 1378 -2691 -4574 -2536 1334
526A334J682k213l963j864K063M289K601j518m433l486O86M442M376M15l807m348
542c744r52L074M086J407k220l477j289K210L549J348k225l754j476K391M258
557C186K234j942m531l040J214M412L734l00l931m048n42L192L784P83k669l439
573a903r38K207L158Q24k462l561j224K481M086J671k519m632k540J776M378L129
589C931q74l900l456r4L071L517N87k722l335o28K673L308N07k815l273m07K906
606a004L621J102k464m025j935K002M461K929j087m083l268M91L558L273J0k820
622G61k831k7K623K695J37k685k982k98K913L561P23k903m087j506K400M185K161
639D840j659m096k795Q03L492K773m08l013k710O5K618K514k09k889k784J42L034
$$ plain form
526 1334 3016 803 -3160 -5024 -2961 1328 3929 2411 -2022 -5508 -4822 -380 3996 4411 604 -3744
542 -3744 -4696 -1622 2464 3871 1651 -1826 -3115 -905 2644 3992 1767 -1987 -3463 -1072 3186
557 3186 5420 3478 -1053 -4093 -2879 1533 5267 4967 1036 -3012 -3554 -362 3422 4205 1536 -1903
573 -1903 -2841 -634 2524 3348 886 -2675 -3899 -1418 2668 4339 1820 -2812 -5352 -3576 802 3931
589 3931 3057 -843 -4299 -4393 -1322 2195 2782 60 -3275 -3903 -1230 2078 2585 -230 -3503 -3910 -1004
606 -1004 2617 3719 1255 -2770 -4705 -2703 1758 4687 3600 -483 -3751 -3260 298 3571 3581 761
622 761 -2070 -2097 526 3221 3358 673 -2309 -2607 306 3867 4590 1687 -2400 -3906 -1506 2679 4840
639 4840 3181 -915 -3710 -2907 585 3358 2950 -63 -2773 -2708 -90 2424 2215 -674 -3458 -3316 -282
656b82L194K06l122l804r77K674M076J744j992l861k236J192L401K533n02l073
672h29k440N36K940K404n39k905k310O18L134K775j88l073l278m24K857L871J391
689D540k181l901k018J607L582K158j101l006j949R11K645J819p84k824k101P05
705a898L096K558n28l288l184r3L093L528P08k657l665j373J850L294J713j293
721A861k972j878R75K741J647j088k909j714J131L103K143r35l376k752L22L207
737d94L217M15k677l381j030K043L217J514j559k942j452J335K812J430j282k746
753a580j394J438L037J776j227l176k254P93L217L004J06k835l336o81K428L183
769B499J043j804k756j029J544K536R72j520k577j114J488K829J511j402l289
$$ plain form
656 -282 2912 3118 -4 -3808 -4785 -2111 1965 3709 1717 -2144 -4380 -3188 213 2746 2244 -829
672 -829 -3269 -2733 207 2611 2072 -833 -3143 -2525 609 3384 3196 123 -3155 -3579 -722 3149 4540
689 4540 2359 -1542 -3560 -1953 1629 3787 2686 -320 -2269 -1358 1287 3106 2322 -502 -2603 -1898
705 -1898 1198 3756 3228 -60 -3244 -3337 -244 3284 3992 1335 -2330 -3703 -1853 1441 3154 1861
721 1861 -1111 -2989 -2014 727 2374 1286 -1623 -3337 -2206 897 3040 2105 -1271 -4023 -3701 -494
737 -494 2723 3138 461 -2920 -3950 -1907 1310 2824 1265 -1677 -3129 -1794 1018 2448 1166 -1580
753 -1580 -2974 -1536 1501 3277 2050 -1126 -3380 -2587 630 3634 3740 905 -2431 -3112 -684 2499
769 2499 3542 1738 -1018 -2047 -503 2033 3005 1485 -1092 -2206 -718 2111 3622 2220 -1069
784a069k113J007L348K495n98l087k873j99K409K799O51j972k735r06J569K422
800A148P71j700k521q26J823K792J056j819l122j569J397L198K227p10k993k540
816c388J51K626K709L62k087k507m17J911K424N68j839k234m13J966K578P01j866
833A245k843j171J624L221J866j062l072k334M27K714K430k5k249k293j72J954
849B60K019R5j923k134k77J915K387M32k112k844r21J820K993J343j483l089j896
866c415Q32K685K070l22k297k081k9J916J977Jk020j925J01K180K234J8k233k490
884b798m25K093K821J123j588k812j554J146K753J851n55k401j841M74K206J743
900B236l17k003j629M01K112J870k18k243k206j38K237K652P05j894k827j303
$$ plain form
784 -1069 -3182 -2175 1173 3668 3070 -17 -2890 -3089 -680 2119 2770 798 -1937 -2843 -1274 1148
800 1148 1919 219 -2302 -3128 -1305 1487 2543 724 -2398 -3967 -2570 628 2855 2145 -848 -3388
816 -3388 -3237 -611 2098 2460 373 -2134 -2551 -640 1784 2352 513 -1721 -2134 -168 2410 3111 1245
833 1245 -1598 -2769 -1145 2076 3942 2880 -192 -2526 -2099 615 3045 3020 771 -1522 -1694 260
849 260 2279 2374 451 -1683 -1960 -45 2342 2774 662 -2182 -3103 -1283 1710 3053 1570 -1519 -3415
866 -3415 -2583 102 2172 1850 -447 -2528 -2557 -641 1336 1337 -683 -2608 -2507 -327 1907 1925 -308 -2798
884 -2798 -3223 -1130 1691 2814 1226 -1586 -3140 -1994 759 2610 2055 -346 -2187 -1713 493 2236
900 2236 1919 -84 -1713 -1312 800 2670 2452 209 -1997 -2135 102 2754 3459 1565 -1262 -2565
916b565J440K621J497r56k350j504O04K012J375n79k028j530N45K078J650m85
932A825k319k062O4K311K390K70k165k631p84J591K485J177j096k237j383P77
948a787K053J266p78j952j205P99K213J388p88k318j691N28K367K110M1k078k307
965b139n04J747K485R11j312k254r88J081K088R98r24j864r59J014K022J051r29
982A524k166j401P16K335J896k72k256k189k11J920K198N09j514k077p03J172
998e19J849O71j103j828p87J077J858Q55j110k196j210R47K290J520p04k276j925
1015b591J40J957K002K79j579j986n28J292J750N49j240j676n15J292J864N80
1031A590j328k027q02J222K200J258p72k142j608M17K064J862O8j707j774k09
$$ plain form
916 -2565 -1125 1496 2993 2037 -313 -1817 -1213 799 2174 1595 -433 -1963 -1418 660 2310 1825
932 1825 -494 -2556 -2492 -181 2209 2479 314 -2317 -3101 -1510 975 2152 1056 -1181 -2564 -1787
948 -1787 266 1532 754 -1198 -2403 -1604 609 1997 1209 -1109 -2800 -2272 95 2205 2246 168 -2139
965 -2139 -2643 -896 1589 2500 1188 -1066 -2054 -973 1115 2113 1189 -675 -1634 -620 1402 2453 1524
982 1524 -642 -2043 -1327 1008 2904 2632 376 -1813 -2024 -104 2094 2603 1089 -988 -1691 -519
998 -519 1330 2001 898 -930 -1717 -640 1218 2073 963 -1233 -2443 -1496 794 2314 1610 -666 -2591
1015 -2591 -2451 -494 1508 1787 208 -1778 -2306 -1014 736 1285 45 -1631 -2146 -854 1010 1590
1031 1590 262 -1765 -2567 -1345 855 2113 1341 -801 -2409 -1992 72 1934 2002 295 -1479 -1688
1047a688J504J691L35j296j530j86J314J649L49j363j811o02J286K148J034j071
1063A763k190j403O24J999J556l00j703j635m5J480J410L4j416j378j74J296J485
1080A403J24j466j790l87J433J875O62j310k099j072Q62J955J346m83j762j375
1096b084J50J509J321o5j403j249K06J433J381q1j516j482k8J543J851M60j339
1113F07j883p46J074J966J102o06j730j195M46J620J155l00j377j019L25J390
1129H29J074k75j487j354J17J540J633J42j452j845o21J177J816P48q84j715r48
1146a505N34J439R14m96j415r57M08J360R56m65j538j162L42J574J377j28j561
1163c23j645k39J328J699O26r95j612p77P43J506P88n60j380p02P00J378Q07o75
$$ plain form
1047 -1688 -184 1507 1842 546 -984 -1170 144 1793 2142 779 -1032 -1634 -348 1800 2834 1763
1063 1763 -427 -1830 -1206 793 2349 2049 346 -1289 -1334 146 1556 1590 174 -1204 -1378 -82 1403
1080 1403 1527 61 -1729 -2116 -683 1192 1854 544 -1555 -2627 -1765 190 1536 1053 -709 -2084
1096 -2084 -1934 -425 896 831 -572 -1821 -1615 -182 1199 1118 -398 -1880 -1908 -365 1486 1946 607
1113 607 -1276 -2022 -948 1018 2120 1514 -216 -1411 -965 655 1810 1510 133 -886 -561 829
1129 829 1903 1628 141 -1213 -1096 444 2077 2219 767 -1078 -1699 -522 1294 2042 1158 -557 -1505
1146 -1505 -971 468 1382 886 -529 -1486 -1078 282 1238 773 -765 -1927 -1585 -11 1366 1238 -323
1163 -323 -1968 -2207 -879 820 1446 451 -1161 -1938 -1195 311 1099 539 -841 -1543 -843 535 1342 667
1181F67j403q78N54J593J210k53j513j394j0J397J582L62j129j533n09R10J386
1198A039N59p07j225n56O91J228N53p21j361p64O54J555R36m73j618j288J60J427
1216H9J370J18j261j383l22R25J275L79q31j241m31P76J224L78q45j315n48Q22
1234h21J457P14o66j574r73L97J437J235j06j190j273j66J070J189K61q85j106
1251a000j72R11J110K26q85j220l02R34J363O08p65j474p96N41J475J054k61j287
1269F0j118P6J110J086N3r33r89n2Q89R62P9r52j097j87R60J274M15r56j405o37
1289a362O71J358Q33m31j293r70J91J059R21r2r90q98J4R27Q93q7r89j042L9J035
1309b13J110J69j010j269m46P99J351O42n05j241q45L71J123Q11j98r78p32K04
$$ plain form
1181 667 -736 -1614 -1060 533 1743 1490 -23 -1417 -1427 -30 1552 1914 785 -748 -1257 -347 1039
1198 1039 1598 891 -334 -890 -199 1029 1582 861 -500 -1264 -610 945 1881 1408 -210 -1498 -1338 89
1216 89 1459 1577 316 -1067 -1389 -464 811 1190 359 -882 -1313 -537 687 1065 220 -1095 -1643 -821
1234 -821 636 1350 684 -890 -1863 -1466 -29 1206 1100 -90 -1363 -1529 -459 730 991 106 -1000
1251 -1000 -1172 -261 849 1075 190 -1030 -1332 -398 965 1573 808 -666 -1462 -921 554 1608 1347 60
1269 60 -1058 -982 128 1214 1267 334 -655 -707 182 1144 1223 271 -826 -1013 -53 1221 1636 680 -725 -1362
1289 -1362 -691 667 1500 1069 -224 -1194 -1003 56 977 885 -105 -1003 -989 -62 831 744 -245 -1287 -1248 -213
1309 -213 897 1066 56 -1213 -1659 -860 491 1133 628 -613 -1458 -1087 36 847 649 -329 -1061 -857
1327h57J006P34j87r67p73J28J045J059K2j007j130k29R26J278M70o67j228o09
1345i86N01J105O54l75r22o16L04Q94O11l19r79o99K44J058Q64k01j093j066n9
1364a080R31J133K65p83j161m85N64R95N04m57r33n44M00Q67M92m06r78n44L65
1383h55J055P29l21j065q74R2J037R98J37p70j038l53O99R91M41n20r17l50N16
1402c68Q86L65m89q76l79M47J028N66l39j048p58K27J043Q90jr03r50k07P76R01
1422H11K32n85q20k67M91P91K53n44q33l52N46R28M29m94j022o53L27J011P52
1441A001j72r07q66l2P71Q09J35o41p63k02N61P84J51o21p51j90O09Q69L12o32
1461B25r11m44M53R72O22j99r42p40J19P63P70N4o94o77l2O28O72N1o35o72p6
$$ plain form
1327 -857 149 883 696 -271 -1044 -916 129 1188 1210 203 -927 -1156 -230 1048 1518 851 -377 -986
1345 -986 -485 620 1274 899 -23 -639 -335 559 1170 851 -128 -827 -583 475 1339 1138 45 -1021 -1080
1364 -1080 -149 984 1249 466 -695 -1180 -616 379 883 426 -507 -1051 -651 216 708 302 -676 -1220 -855
1383 -855 200 929 608 -457 -1331 -1239 -202 796 933 163 -875 -1228 -529 462 903 383 -534 -884 -368
1402 -368 518 883 394 -482 -861 -414 614 1180 841 -207 -965 -738 305 1195 1194 291 -659 -866 -90 811
1422 811 1043 458 -362 -629 -138 653 906 362 -471 -823 -277 651 1080 586 -436 -1089 -762 249 1001
1441 1001 829 -78 -944 -976 -205 604 739 98 -665 -867 -306 478 629 8 -743 -933 -324 545 857 225
1461 225 -686 -1130 -677 295 917 718 -224 -964 -845 -82 688 742 48 -629 -661 -33 639 690 55 -617 -693
1482f93O85P75J60n86q89l36N35R44N18l69r32n87K22P95O30q9o63o25L5N95N80
1503G05o7o08o16mO65P19N1o92q22k27O09Q50L41m99q38m94L25P41N27j98o80
1524b12n22Q1O70M62q7o12n55J20O61O12o4p11o92m1O08Q23K79n39p79m01M14
1545d85P24M97k55o46m44K18O81L69j81o03m44K45O35N25r9p36o20K5O75P00J71
1566I52n95p58k50M33P16L19l33o57l07K14N60L26k47o15l44K38O53L71k27o82
1586b33n57J18P16N63J4o10o84j37M69O31K41l76o29k38L11N83K51k83n85k54
1606f89L37O16L16l00o09m68K59O69N43o6o10n86o5N65O03J84m63n42j53M11M91
1627D43J59l39n21j55L52N97K06l47o25l39K74O79M02j51o59n44R9N34N31km62
$$ plain form
1482 -693 -8 767 927 341 -548 -884 -349 595 1113 744 -188 -775 -553 242 872 783 120 -505 -470 125 705
1503 705 638 30 -586 -590 75 794 845 153 -669 -896 -287 563 904 405 -433 -927 -602 139 666 468 -212
1524 -212 -734 -653 17 479 392 -220 -775 -655 6 618 554 -157 -849 -890 -282 541 820 281 -498 -899 -485
1545 -485 239 736 481 -165 -609 -391 290 659 478 -125 -569 -324 311 836 737 1 -619 -594 81 781 952
1566 952 357 -401 -651 -218 498 817 484 -173 -480 -266 294 620 373 -242 -586 -348 305 676 449 -233
1586 -233 -790 -672 44 607 621 11 -673 -810 -341 290 531 155 -474 -712 -401 182 433 150 -435 -689
1606 -689 -352 264 580 280 -329 -797 -538 131 674 608 -2 -588 -653 -88 515 699 236 -306 -459 -48 443
1627 443 602 263 -258 -413 -61 536 742 395 -230 -569 -295 384 786 635 -24 -568 -469 65 596 594 132
1648A32n14q5L88M58P4l84m77j42M06N18J21l77o07k91L52O85L02k61n61m46J12
1669e97N67M56nm86m45k9M25M39K5l68m50j3M23M71O2m00n01j38L94N94K59k85
1691C98o14l46K16N56M28j38m87l80R8M04L69j8m51l71J3M64M07l1m27m90p9M36
1713d3N59J13l77n65k19K11N68K79j51m96l53J17M07L36j09m24l33J12M08L66
1733D06j42m21m15M9M56M46Q5l90n48j45L07N41K47k58m72k44J72M51K53j40m40
1754b02k54J81M61K73j38m72l36J24M61M43l9m14m30j27L70N18J83l18m61j74
1774c51K51L89J75k15l91j80K13M15J83j83m36l12J62M78L24r4m73m06mL45M61
1795C51R8l35m37j25K40L78J46k53l71j40K47M08J36k75m10k14K36M81K46j41
$$ plain form
1648 132 -382 -467 -79 379 453 69 -408 -550 -144 374 495 118 -489 -780 -428 257 559 298 -263 -709 -597
1669 -597 -30 426 421 -65 -510 -539 -114 325 350 -18 -468 -481 -58 413 475 75 -426 -564 -170 424 683 398
1691 398 -216 -562 -346 210 638 500 13 -367 -269 135 504 486 35 -336 -323 141 548 517 90 -400 -479 -43
1713 -43 516 629 252 -313 -532 -321 247 526 375 -121 -474 -357 50 386 277 -147 -480 -368 40 406
1733 406 264 -157 -572 -523 -67 379 464 74 -474 -619 -312 229 476 218 -254 -498 -326 125 378 238 -202
1754 -202 -456 -275 186 459 321 -151 -487 -363 98 541 502 88 -342 -469 -99 419 602 284 -177 -351
1774 -351 -100 289 464 249 -142 -322 -109 306 489 306 -130 -442 -280 198 522 428 -45 -451 -455 -110 351
1795 351 449 114 -323 -448 -208 170 316 63 -308 -448 -201 207 343 68 -342 -556 -320 161 407 266
1815B66m68l54J01M17M02K0l85l46n6L00L84O6k54l90k4K69L88Q6k72m09j45L17
1837h7M64J54j74m80l04J88M18L16m7l74l39kL27L18J9l28l20PK86L48j1l12l89
1860c22n2K71M25J00k68m42k18J87M12K88j32l87k83N0L09K91k5l48k69J03K91
1881a9K99o8l22l28K6L29L80P2l07l92j44K60M10K37k06l72k01J08L78K30r7l29
1903e6k08J18L37K11r2l36k60J4L95L61l0l22m02q4K88M17R7k06l87j65J77L34
1925B01J52j33l59j54J13L11J98j68l38k10J10L44K88p2l80l02j0K92M01L0k73
1946D1l19j47K32L03J44j65l53o2J78L01J61k15l00k01J80L86K21j19l90k47O6
1967c05L19L33O5l13l36p6K47L23Q2j92l15m5J79K89R8k46l17q5K44L40J35j66
$$ plain form
1815 266 -202 -556 -455 -38 364 384 -1 -347 -403 -103 281 347 93 -297 -321 -52 336 422 150 -259 -404 -87
1837 -87 377 531 357 -123 -427 -239 179 495 448 74 -265 -267 60 378 397 69 -251 -244 42 390 379 67 -322
1860 -322 -374 -103 322 422 154 -288 -506 -319 93 381 249 -138 -421 -371 -62 229 204 -144 -413 -310 -19
1881 -19 280 212 -110 -438 -412 -83 297 369 62 -330 -474 -214 196 433 227 -145 -346 -238 140 370 273 -56
1903 -56 -264 -146 191 402 310 -26 -286 -272 123 484 454 132 -270 -354 -66 351 448 242 -145 -310 -133 201
1925 201 353 220 -139 -293 -180 131 329 161 -177 -387 -277 67 355 283 -97 -399 -409 -117 284 314 41
1946 41 -278 -425 -193 110 254 89 -264 -326 -148 153 314 99 -201 -402 -222 164 385 266 -124 -371 -305
1967 -305 14 347 412 99 -237 -313 -66 257 339 147 -168 -213 -34 255 353 107 -210 -295 -51 289 424 258
1989B58l84k38J14L67K82q8l14k72QK40K67L1k38k86l5K60K72J6k60k62p6K42
2011i6L32J18k40l85j59K12L27K34j18l56k32N0L07K26k6j97k87L4K63K39k5k76
2033e5k66oK97K86O7k67l45p6K09L50J64j56l01k10J11L09J98q8k71j76P4K59
2055A07K19p1k69k37M6L23K68l1l09k91q7K64L61R1k16l05j66J64K84J58j12l07
2077a16j70Q8K90J60j16k73j65O8L29K00m0l16l03MK85K92O2k62l11p2J91K76
2099A01J22j44k88j02J49K92J15j39k99r5J39K69K06j06l06k60J07K99K72mk77
2120E1k85j3K53K26J14j75k82r0K03K50O9j57k76j36J96L00J22j75k86k26J14
2141b03L28K41q5k98k40k7K79K37kk11k41n4J89K33M4j93k85l9K19K95N2j96l15
$$ plain form
1989 258 -126 -364 -250 117 399 311 -3 -275 -267 -27 240 271 33 -253 -288 -28 244 260 0 -262 -338 -96
2011 -96 236 354 114 -271 -430 -218 109 343 225 -131 -363 -313 -6 220 194 -3 -290 -256 7 246 221 -55
2033 -55 -321 -327 -30 256 323 56 -289 -365 -156 194 358 202 -99 -309 -198 111 309 221 -50 -226 -152 107
2055 107 326 255 -14 -251 -205 118 386 355 46 -245 -332 -68 293 384 168 -137 -303 -139 145 303 191 -116
2077 -116 -286 -198 92 252 136 -137 -302 -234 95 295 255 -61 -364 -360 -75 217 279 17 -294 -366 -175 101
2099 101 223 79 -209 -311 -162 130 245 106 -193 -288 -149 120 326 220 -86 -346 -239 60 332 328 51
2120 51 -234 -247 6 232 346 171 -111 -201 2 252 321 164 -112 -248 -52 248 370 195 -91 -317 -203
2141 -203 125 366 281 -17 -257 -284 -5 232 230 19 -222 -276 -87 146 190 -3 -288 -327 -108 187 239 43 -272
2164b72j15J73L28J89j22l32j89L2K90K44m1k08k05j0K26K53l5k15k21J8K46K21
2186B55P0k05k94q8J57L54J05j14l26j86J32K65K02j04k23j64K5J84K39n6k47
2207a9k07K6K72K06Jk99k31n3K63K39Q7j89k94j30J39L06J46j01k93j59J00K32
2229D2J75q9k62j58N5K97J74n3k69k35N1K43K59M9k43k71q8J84K82J19j24k34
2251i6j34J10K58R2q5k42j45J29K75J59j25k69j90O7K70K62l5k74k49k4K28K58
2273B40Q8k14k21r4J50K27N9j25k53q5J49K48J30j47k96j75J20K91K01p2k89k10
2295b78NK40K49Pk26k51J1J70J92R8j99k21o7J84K28J24k25k58j28J93K99J24
2317B71q7l04j79M8K71K39l3k13k14K0J77K34k2j74k24J5J97K28J9k10k20p5K01
$$ plain form
2164 -272 -387 -214 114 303 181 -151 -340 -308 -18 226 185 -23 -228 -238 -12 241 206 -9 -230 -212 34 255
2186 255 325 120 -174 -262 -105 249 354 240 -86 -272 -140 125 327 223 0 -164 -139 45 284 228 -19
2207 -19 -226 -200 72 278 279 -20 -251 -304 -41 198 285 96 -198 -328 -189 117 263 162 -131 -290 -190 42
2229 42 217 128 -134 -292 -237 60 234 181 -88 -323 -272 -29 230 279 36 -235 -323 -139 143 262 138 -96
2251 -96 -230 -120 138 230 145 -97 -242 -113 162 321 196 -73 -263 -196 74 336 301 27 -222 -246 -18 240
2273 240 328 114 -107 -201 -51 176 235 110 -143 -228 -79 169 299 152 -144 -319 -199 92 293 221 -68 -278
2295 -278 -273 -33 216 223 -3 -254 -243 -73 119 217 18 -203 -270 -86 142 266 41 -217 -345 -152 147 271
2317 271 184 -120 -299 -251 20 259 226 13 -201 -181 -4 230 208 34 -190 -175 22 250 269 59 -161 -236 -35
2340c5K62J16j48l00j59R5K87J94j00k10k09N9J65J69J9k41j75LK59J92J5k62
2362dk30k5J86K94O1k06k57j42J53K57J28j08k24j50P0K14J44n0j90j98O0K65
2384D8J82n8k34k14L4K64K19M8k44k21j03J60K62J30j12k59j24J22K38Q6o8k21
2406f5j38P2K42J69n6k74j89Q3K46J88jk44k52m2K55K55L1j83k27j16J42K39Q1
2429B16j43k17j07J51K41P7j33k43j48R4K82J73n9k57k03MK32K37Oj80k52k6J95
2452f0J89M3j05k11r2J49K64P2j90k30j22J58K79J17m3l01j64R5K12J69J3k07
2474C5k23m9K48J71K5j56k07m5J92J91O0j74k63o8J76K59R9j03l05j50J15K39
2496F7J91p8k01j96K0K30J55Mj67k33%K09J96j0j63k60l7J96K80N5j58k78j18
$$ plain form
2340 -35 227 343 195 -105 -264 -169 118 312 212 2 -207 -148 17 186 205 -36 -211 -208 51 243 258 -4
2362 -4 -234 -259 -73 221 282 76 -181 -323 -170 87 215 107 -117 -267 -197 17 161 111 -79 -277 -217 48
2384 48 230 172 -62 -276 -242 22 241 289 45 -176 -279 -119 143 273 161 -98 -222 -100 138 224 156 -65
2406 -65 -203 -131 111 280 224 -50 -239 -156 90 278 277 33 -219 -261 -6 249 280 97 -130 -246 -104 135 216
2429 216 73 -144 -251 -100 141 218 85 -158 -306 -212 70 243 184 -73 -276 -272 -40 197 203 23 -229 -255 -60
2452 -60 129 172 67 -144 -236 -87 177 249 59 -171 -293 -135 144 261 218 -83 -247 -152 60 229 242 35
2474 35 -188 -237 11 182 207 51 -156 -201 -9 182 242 68 -195 -263 -87 172 271 168 -137 -287 -172 67
2496 67 258 180 -21 -217 -197 33 188 192 25 -208 -208 1 197 187 24 -236 -273 -77 203 258 100 -178 -296
2519b96J63K48J55r5k41j71O2K06J73n4j93j94M0K07J90j6k19j80k0K10K62J3
2541B50j62k64p1J52K34J08j10k29j39J25K22J24j01j93j54O1K28J46n6k14k05
2562b48P1K16K11lk20k44qJ57K46Q4j66k31r7J17K30J16j07k12j24J15J97Q1l5
2585A46k38j45N5J95K13kk35k63K7K10K36L1j76k17r5J62K12Q7j11k15q1J27J80
2608A03J15j11k58p9R2K62J30n0k52j70K2K26K23l0j70k06k3J57K06M4j49j86
2630a04n0J21K00P5j54k32m1J00J97J65j20k53j56O6K35J66jk38j84JJ89J92k1
2653A53j45j94k2J68J58L5j17k28o5J72K25M5r0k12j40P0K61J49m4k00k17Q8J71
2676B1J70J3j85j66rJ63J90L3j97j78LJ29K18L5j31k44j03J54K20J10j03j85j64
$$ plain form
2519 -296 -133 115 270 175 -66 -237 -175 31 204 150 -43 -237 -197 10 200 184 -35 -215 -235 -25 237 250
2541 250 88 -176 -247 -95 139 247 137 -92 -231 -106 116 240 139 -54 -208 -147 81 227 171 -43 -248
2562 -248 -177 39 250 247 27 -217 -225 -68 178 262 96 -135 -232 -115 115 231 124 -88 -212 -97 100 181 146
2585 146 -92 -237 -182 13 226 224 -11 -274 -247 -37 199 230 54 -163 -258 -96 116 203 92 -123 -204 -77 103
2608 103 218 107 -151 -230 -138 124 254 204 -48 -218 -196 30 253 223 53 -153 -176 -19 187 231 82 -104
2630 -104 -154 -33 167 242 88 -144 -185 -85 112 277 157 -96 -252 -186 49 215 214 -24 -208 -207 -18 174 153
2653 153 8 -186 -208 -40 118 153 36 -192 -257 -85 140 185 95 -117 -257 -187 74 223 179 -21 -238 -150 21
2676 21 191 204 19 -147 -156 7 197 230 33 -145 -142 -13 205 240 109 -135 -238 -84 136 246 143 -42 -206
2699b06Q5J63J46k1j96j12j0J59J51oj84j55LJ60K20j0j58k22p0J74J90J04j30
2722G5j88j03M1K31J04n7j39j79Q9J74J11k1j90j65L9K15J48J7j70k19k4J59K22
2745A70P2j62j78j04J19J81J06r9j33j57J03J49J11m2j78j35L8J91J31oj82k14
2767b19j1K24J75M4j31k29o6J16J76J07j21j54j18R3J86J21j11j84j37J32J99
2788I2J03n1k06j36j2J66K21L4k02j71n3J46K02O8j21j73o4R1J67N3o0j77j00
2811a83Q2K01J45j08k30j22O2K10J50l7j85j58jJ67J53J4j11j74l2J29J45P4j48
2834D3j54p9J53J43Q5o8k13j01Q5J70J52o1j46j56K2J47J24Mj28j39l8J37J40
2857A22N9j78j40o8J57J58M2j09j66p2N6K25P5m9j52j53L7J31J85j3j76j26J0
$$ plain form
2699 -206 -121 42 188 167 -29 -141 -151 8 159 153 -31 -186 -183 -23 197 187 29 -193 -263 -89 101 205 75
2722 75 -113 -216 -175 56 160 103 -36 -215 -126 48 159 138 -52 -217 -178 37 185 202 32 -187 -211 -52 170
2745 170 242 80 -98 -202 -83 98 204 105 -28 -185 -82 67 178 136 -42 -177 -139 52 183 177 -5 -219
2767 -219 -230 -6 169 213 82 -147 -213 -97 79 186 65 -89 -207 -114 72 193 82 -102 -239 -107 92
2788 92 195 144 -62 -198 -210 -44 177 211 9 -162 -215 -69 133 201 80 -93 -157 -66 101 154 94 -83 -183
2811 -183 -101 100 245 137 -93 -215 -153 57 207 170 -15 -173 -174 -7 146 160 49 -125 -157 -28 117 191 43
2834 43 -111 -190 -37 106 191 123 -90 -191 -106 64 216 155 9 -147 -125 22 146 150 22 -117 -155 -18 122
2857 122 181 3 -137 -205 -48 110 152 43 -123 -195 -139 86 161 112 -40 -193 -156 -25 160 147 -29 -155 -145
2880a45J60J38l1j19j54JJ45J35N8j24j97p1J39J99P0r8j61j38P7J76J08%j79
2903a1j53M9J52J18l7j06j33J5J32J59oj67j44l3J29J55N7r7j80q2R2J58R8l1
2927A34j99r9K2J80R0k0j64j20J5J49J72j3j43j93j9J81J61N6j40j70m0O7J65
2950G2Q9p4j73n8O2J34J16q0j69m7M2J72R2k7j60j53L5J09J70P5j81j80l2J14
2974e2J74L6q1j43p7Q8J34R3p3j47q9O2J29J18p6j36j49N5J44J38Kj47j71k3J37
2999e4J64J2r1j60l3R1J44O2q4j23q1Q0J49P1n4j94j05J09J43J24nj94j14J3J20
3024a0J74m8p8j46j8P5J74L2j14j34l8O8J56O4n5j95m8L8J88P2j4j45j52pJ85
3049B4J35j1j40j48j7J56J16J8j09j36J7P0J63Nj17j55l0N8J90P8p5j69q6N7J21
$$ plain form
2880 -145 15 153 122 3 -151 -150 -5 130 188 64 -133 -204 -65 134 204 106 -55 -193 -116 60 168 168 -11
2903 -11 -164 -115 37 155 118 12 -121 -106 26 185 179 12 -132 -165 -36 119 176 79 -101 -183 -91 67 165 134
2927 134 -65 -164 -142 38 128 108 -56 -176 -161 -12 160 147 4 -189 -208 -27 134 190 50 -120 -160 -93 72
2950 72 161 87 -86 -144 -82 52 168 88 -81 -128 -86 86 178 151 -9 -162 -127 -18 152 227 46 -134 -166 -52
2974 -52 122 158 77 -66 -143 -55 79 172 99 -48 -137 -75 54 172 96 -40 -189 -134 10 148 150 3 -168 -191 -54
2999 -54 110 122 31 -129 -162 -71 73 135 51 -72 -153 -73 76 147 93 -101 -206 -97 46 170 165 -29 -143 -130 -10
3024 -10 164 116 38 -108 -126 -51 123 155 41 -93 -131 -63 93 157 102 -93 -141 -103 85 157 143 -2 -154 -161 24
3049 24 159 148 8 -140 -157 -1 115 133 24 -112 -95 -25 138 143 26 -129 -159 -101 89 167 92 -77 -163 -106 15
3074A5J07K1j71p9rJ36R2nj09j24qJ38J39j1j31j28j8R6J67O0p2j90r4O5J67R7
3100A51m4j70q8L9J37J13l0j45r5K9J22J21Lj49r5m1J28J65L8j34j41o3J13J00
3124F4J22p7j53r7O2J15R8l7j25r1M3J14Q1J0j28j57M1J04J32L4j27j43k1P8J05
3149D7J03o2j64p1O0J36R3p3j27j12P5R6J22k2j31j33N2J39Q0N2j61j37k5J15
3173d8J42M7j05j21j6M2J51N7n5j56m7N4J32O1k5j43j12N0J63Q2k1j36j07%J05
3198fJ49jj04j28k0Q2J26Mo4j20o2J00J23K3pj69p2N0J67R5o2j31j35N7J05R3
3224I3K2j37r7j9J01J06P4q9j51m0J02J21L0p8j32n5Q2J47P1o4j10j09K0J46J21
3249A55k6j21j11oJ01J25k0p3j03m5J33J11J6j12r6q0J24J37L2q0j26r8P8J38
$$ plain form
3074 15 122 143 -28 -107 -116 20 112 107 -2 -126 -134 4 143 132 1 -127 -145 -49 118 178 106 -84 -178 -113 54 151
3100 151 107 -63 -151 -112 25 138 108 -37 -132 -103 19 140 143 -6 -101 -142 -14 151 189 55 -86 -149 -36 64
3124 64 186 109 -44 -141 -79 36 134 97 -28 -119 -76 38 119 129 1 -156 -115 -11 121 155 28 -115 -136 -58 47
3149 47 150 88 -76 -147 -87 49 142 69 -58 -170 -95 1 123 101 -30 -163 -111 28 108 160 -1 -138 -163 -48
3173 -48 94 141 36 -85 -101 -59 92 149 94 -62 -109 -55 77 138 113 -30 -142 -92 71 153 132 -4 -111 -111 -6
3198 -6 143 142 38 -90 -110 -28 98 102 38 -82 -144 -44 79 102 95 -74 -146 -96 71 166 104 -27 -162 -105 0 93
3224 93 115 -22 -119 -138 -37 69 143 54 -97 -137 -35 86 116 38 -94 -149 -67 80 151 87 -23 -132 -112 34 155
3249 155 129 8 -103 -109 -8 117 97 24 -79 -124 9 120 136 24 -72 -152 -28 109 141 61 -65 -163 -85 53
3273E3J12j02p2j14K6J16R4m8q4o6l2J11J05j3q2j18j4J07J19M0r4j33l4L1J51
3298E9P5n3j01j10N6J03Q4qj29r8P1O2J15qj35j09J3J18J05mr2j13k7R7J12N0
3324A33p9q9q6N4J32O7l0j37j18P7J07R9l8j04p1l0J46N6K3r7r8n0J15R0N4r1
3350C5j01l3O8R4N9p0r2q9N3J24N9k1j42o5L0J26Q5l5q6j28L1R4R1J9j02r3m6
3377a35J01J04N2p5j13l6P2R4K3k8j16n6N4J34O2m4j25n3oJ12P7kr8n4m0J01Q6
3404I1L0r6j07k6P5J02L7p2r3m3P5P0J04o8j22o1JJ29R7n4j03m3k9R9J18k8r2
3431ir0J3Q1Q8mn9j01j1Q0P1O0o9j14n5N2R0O5J5j62l4J7Q0Q7Rj21r1J5J07P6
3460H6K4p6j20oQ2J02K0q6j01jN9R8M9m4j16m4J5R7Q5l4j14m9J7J12K0K6j29q4
$$ plain form
3273 53 165 63 -9 -123 -97 19 113 65 -19 -85 -117 -6 99 86 4 -114 -128 -21 98 138 44 -89 -123 -92 59
3298 59 134 81 -20 -130 -74 29 113 105 -24 -122 -51 11 126 118 -17 -126 -113 5 110 106 14 -99 -126 -29 83 133
3324 133 54 -35 -121 -67 65 132 102 -35 -153 -76 31 130 92 -12 -83 -113 33 89 112 15 -83 -133 -18 72 126 35
3350 35 -66 -99 -31 63 122 52 -40 -129 -76 48 107 86 -56 -121 -91 35 120 85 -1 -129 -98 -4 87 106 4 -89 -135
3377 -135 -34 70 122 47 -66 -102 -30 64 87 59 -57 -113 -59 75 137 93 -32 -85 -91 21 98 96 -2 -56 -96 5 91
3404 91 121 25 -82 -108 -33 69 106 34 -59 -102 -27 43 147 79 -43 -104 -103 26 123 69 -34 -77 -106 -7 111 83 -9
3431 -9 -99 -86 -5 83 79 20 -81 -92 -12 59 119 50 -64 -119 -67 23 88 103 -59 -93 -76 4 91 100 -21 -112 -97 10 86
3460 86 110 34 -86 -92 -10 92 112 26 -75 -76 -17 81 130 86 -30 -74 -59 38 123 89 -25 -74 -57 55 75 101 -28 -112
3488a12J4J06P8L5j21q1j4O3R9Ok8j25k5Q1L5P2k5r7l6J6P2N1Kq7p0K1O5J12k9
3517G8r3j00J3Q6Q8M1q2q6j5M8R1M5n9r5n8N1Q9N0m7p3o9M7J01J7pp8p8L1J04
3546D0N4K5j04q0j1R5R0j1n8r9LK9P1N8p1q0m1L9J20jnr0p4L4P0J13l3j08l8p
3576g0P8M7M1j06o1j3N3O3O8o8j04jM2N9O2l7p3q6N8R9O2n3q1p1K5P7N0J0r5o8
3606i3K4O8M4L0p1n5k5O6M5N3m3q4m0O8O4L1qj06o1M5P9M9j1o3p1%P1O6j2n2o6
3637e8k3N8R0j2m4r7J4N7N3N5p2p2m7N0Q0L7j9q7m5L2L8R0k6o3m9mO9M0k3k5q0
3668h3j3N2R8Nl7r7kK5P7K7k4p4j5KO6O6j3p7k4j5O8P0Kp2n9kN3O0J5m8q6qQ7
3701B4K5K5m5q9k3N3M7M7j3r0l7K7R3J9l2m7o6K3M2M9pn4l1l0R0K2L7o7l7l2P3
$$ plain form
3488 -112 -98 8 86 121 0 -81 -95 -32 67 73 45 -80 -105 -24 11 83 58 -39 -75 -59 13 64 66 -21 -91 -70 -5 107 78
3517 78 -15 -115 -102 -16 72 113 31 -55 -70 -22 69 114 55 -40 -98 -47 42 92 45 -28 -97 -50 51 68 61 -17 -95 -64 40
3546 40 94 119 15 -65 -76 19 109 98 40 -59 -56 -27 44 102 31 -49 -90 -51 69 68 63 -27 -101 -67 3 116 83 -25 -63 -70
3576 -70 8 55 96 -10 -71 -84 -31 32 100 32 -72 -73 -31 28 90 53 -20 -106 -48 51 113 60 -21 -92 -67 10 60 70 -25 -93
3606 -93 -69 -1 43 73 2 -53 -78 -12 33 86 43 -41 -81 -13 51 82 74 -32 -93 -48 31 80 69 6 -65 -65 6 72 60 8 -58
3637 -58 -81 -23 67 55 11 -86 -72 -15 38 93 21 -51 -98 -48 32 69 50 -37 -82 -50 -12 78 52 -11 -60 -64 5 45 22 -3 -83
3668 -83 -96 -44 54 59 22 -75 -77 -52 25 52 28 -46 -61 -59 7 73 60 -17 -41 -56 12 82 84 12 -47 -49 4 64 79 31 -55 -63 24
3701 24 49 74 29 -60 -83 -30 17 64 51 -39 -76 -49 44 63 31 -16 -82 -59 -17 32 25 -29 -60 -90 0 22 59 -8 -45 -77 -4
3732dK2L6l7n0n4L6R4K8j9q7o5N2Q8K3m0n1j3MN8M8Pr6lj9M3O0k3k8n7mK0J06
3764G5j0l5r3k4N8O2N2n8l8m1K6N6J6j4l0l0m5P3L5M2n9r7K7M0O9J2p6j5k5kJ03
3795E4J3l4p7k6J1O1L3J7m5m8mN8N0%o8n7K8J4Q2mn4m2j7M1N1L4l9n4m4L6O6L2
3827F8k4n7n6J7N7M0k0l4k1oL7Q0J0r8n6QQ0M8l1k9m3m7M4J05J0l2n6k4J1N2J3
3858D6nm5k6RM4O0k9o3m8J4N2N1k4m4k7l7N7M8J5jj02%L1L6L8j6m5m4K2M2N2J
3890F2o9l5m4R3M6J3n2o5J0L0P0j7j8n8JK8RQ2o4m7k1M1L2P4m5p4k7M9J4N0k9
3921C9k6o4NM1Q3k5n8rj7QM8K8l1l1l2j2Q0M1m6l2n5K9P9Nrq2Qj3O4K5%l4p1%
3955f4L7P5j3m4l7J0N1L3j3l1l9PNN4N7k2p8j9k4R6nLm3l0J0J7O3J1p4k9%L8L3
$$ plain form
3732 -4 18 54 17 -33 -87 -51 43 71 52 -35 -100 -48 40 63 23 -28 -41 -37 21 69 76 -20 -23 -42 1 61 38 10 -47 -51 -31 75
3764 75 65 30 -63 -87 -29 33 85 27 -11 -52 -26 30 46 32 2 -28 -73 0 35 77 18 -79 -52 -12 57 69 -7 -22 -47 -49 54
3795 54 67 33 -44 -70 -59 2 35 52 7 -41 -45 13 63 63 -5 -62 -34 -20 62 58 4 -38 -55 -14 37 71 32 -22 -66 -30 36 68
3827 68 44 -13 -69 -52 5 45 25 -9 -30 -36 1 81 91 -7 -63 -55 25 73 42 13 -30 -77 -33 72 82 50 -6 -30 -19 33 46
3858 46 41 -4 -30 -21 23 83 54 -9 -57 -43 9 60 36 -8 -35 -72 -15 33 48 47 -55 -55 -24 12 50 34 -11 -55 -33 9 61 62
3890 62 -7 -42 -86 7 53 66 14 -51 -41 -11 59 42 24 -34 -33 -5 4 86 22 -25 -46 -5 27 101 56 -18 -45 4 18 68 39
3921 39 13 -51 -46 -5 78 53 -5 -14 -31 -23 25 53 22 -9 -41 -53 27 68 22 -10 -65 -36 43 48 39 -43 -35 -48 16 41 41 7 -64 -64
3955 -64 -27 48 35 -9 -46 -36 15 48 35 4 -35 -28 -23 31 88 66 -12 -31 -55 41 36 39 -4 -34 -24 -7 56 67 -7 -36 -36 2 35
3988C5M4o4m1oM1J6M7p5k2l1MO0O1m5l4n6K3O0J6J1n8l6j5N1P2Po7k7m4O4N3K4
4020F8n8o9K3J6M8Qpk1p0N3ON6m8Jn0LP3Pon5l8J8M0K7Mm9j5jL5M3L4n4m5k5J7
4055c1M1J3No0k0J4K8O6m5j8l5J3J7M5J8k2o0j3K2N1M4p9l1j6j4J05K4m5n3l8
4085g4M8K9O3n0j6p1M4M1L7k3l0m0nN7L2k3k5m6pM2M7L6m6o2j6N1M1N2n7n6oJ1
4117b2O3L7l4l6q7O2K6M0Mo7j4k3L0Q1j4mq8LM6L8Rqo4m3K6M7P5n4l3k3j0O4M4
4150G1l6j6n3j3L0Q2k2l9p1L9K6N0K2n8o2J0M2L1L0l4o9j5L1M2L4Lo3k4mM6M1
4181E1J6n8n9LO4L8j5j3o9j8O6M5kj6p3k0L6L8N1l5n9k4M5M6llj2n0LQ9pJ2q5
4214a8k4nO9RJ7k3q8J7L0L4M7o2j7n2L9P3J0k6o8J8m3Q5L8m7l6m4K1N2N3k2m6
$$ plain form
3988 35 79 15 -26 -32 9 25 72 -3 -25 -56 -52 8 69 24 -10 -66 -43 17 33 44 -14 -50 -65 -14 58 65 -2 -29 -73 -9 44 68
4020 68 10 -59 -36 -20 28 36 29 8 -62 -9 -3 53 5 6 -44 -41 32 39 33 -22 -60 -42 -2 25 29 -20 -35 -36 -1 42 76 22 -23 -48 -31
4055 -31 10 23 28 -32 -52 -38 -10 56 11 -7 -42 -29 -12 33 51 29 -31 -44 -22 29 73 -6 -37 -53 -67 38 62 17 -36 -74
4085 -74 -26 3 66 16 0 -71 -27 14 51 28 -2 -42 -47 10 42 19 -6 -52 -59 -17 30 66 20 -42 -58 -7 34 86 29 -27 -33 -22
4117 -22 41 78 44 8 -79 -17 9 49 53 -14 -28 -51 -21 60 46 42 -46 -43 3 41 50 42 -22 -65 -39 8 83 29 -4 -27 -37 27 71
4150 71 35 19 -34 -47 -17 65 43 4 -67 -28 -2 48 70 12 -50 -40 2 33 63 29 -40 -55 -24 18 52 55 -8 -32 -36 10 51
4181 51 67 9 -50 -47 17 55 40 27 -42 -60 6 51 49 33 -40 -60 -24 14 65 30 -29 -53 -8 38 35 32 20 -30 -27 62 55 67 -18
4214 -18 -42 -47 22 31 48 25 -63 -46 -16 18 65 3 -14 -66 -27 46 56 30 -38 -20 -63 22 60 13 -23 -67 -46 6 59 37 -9
4245in8M1K2M7L9p2m7j3M7L1L1m5o2k3M6M3J7rl3l3K3L7J6ln4j9kN7L5J1m5q3
4277f7N8j3L6J4j1n2j7L3L9K5np3lj8N0M3Lp1j2j3O2M5J0q0m7M1J9K6K2j8o2N
4309c1J4M4J1j0m7l4L5N8M%p8k7M5M0L4k3o6k4L2L1K5Rm9j8l6N8M5Nl6pn5M9N9
4342E7lj7l9n1K0O6OKn3l3L4L0K8l3ol6l3P5L1pk4o3k3Q0K0L0m1n3k0K0N4J9k6
4375A1n7J3lM5O7o0k7k4J3K8P3n9m2j2K7J6O2j7k5p5j1N1K4K2l0j9m6K4P7L7n6
4406B7m5j3qM6L4Qn0m4J6L7N5j4mr2qM0N7K2n2n3nM9N1k3l6k0j6L2J5M3jp8pK2
4440a5L1M0j1l7o8K6N0L4J6p7l5oJ6P4On7j0j2K1N6K0k7n9l0J3Q3k1J6m2m1J2
4471c4N8%K1k1o9%P3J8j8l9j6j6L3N6Mo9Rj7J8J1M0Kl5p8M0M0L2nn6j8J9N0k7
$$ plain form
4245 -9 -67 -26 -4 43 82 10 -37 -50 -3 28 59 14 -48 -71 -25 18 35 26 -7 -40 -17 20 36 33 -21 -40 -42 15 50 61 16 -67
4277 -67 -9 -22 14 28 17 -35 -52 -19 20 45 40 -33 -36 -54 -4 39 42 -29 -41 -54 8 53 63 -17 -64 -23 -4 22 44 26 -36 -31
4309 -31 -17 27 38 28 -19 -53 -18 40 44 44 -34 -61 -16 24 58 35 -31 -55 -23 8 33 42 -7 -25 -61 -3 42 47 11 4 -51 -2 57
4342 57 54 37 -2 -53 -33 33 39 41 -12 -45 -11 19 47 14 8 -28 -61 14 45 38 14 -49 -72 8 28 58 17 -36 -56 -36 18 37 11
4375 11 -46 -33 -36 9 76 16 -11 -35 -22 6 79 20 -22 -34 -7 9 71 54 29 -46 -57 -6 18 40 10 -9 -55 -31 46 83 27
4406 27 -18 -31 -39 7 41 49 -1 -45 -29 8 63 49 45 -47 -55 -15 42 64 12 -41 -46 3 54 31 -5 -25 -41 -9 6 49 48 -30 -37 -15
4440 -15 16 56 45 8 -60 -34 16 50 66 -11 -46 -52 -36 38 44 -13 -23 -35 -14 42 62 35 -24 -54 -41 42 21 37 -5 -46 -34
4471 -34 24 24 45 24 -45 -45 28 46 28 -11 -27 -43 -10 46 50 -19 -10 -27 -9 2 42 44 9 -69 -29 11 43 38 -18 -36 -17 33 6
4504FN3m0n6nL7M9K8p1k2l0L9M2J0%o0k9K5M5N7l8l2m1qR2K0l8l8m0OM2L0j6N
4537B2p7K1L2N1K1n6l9j1RN5J8j6o4k8M6J5L5lo1q%J5O6k3k0k4n2P8P0m1pp7o
4570e9O0M1Pj1o7k6M3M0M0n3rn4RL6M5J9o5ll5N3O2o1Om4j0L0M7lqo2j7J9P7J0
4604E7kr1j6PM8P4n8m9j3J6K5L5j6j9pj0L8KL0n3o7L1J3P5Nq6jrK0L6M9o0l7j7
4638e0M8J9K6Qo1k3kL7M5Jm6n2K0OM7L8k8p1RJ6L9Lm0m9K0J5M3K5l0Mm9j9M1K7
4672A7J1k8l9j9Q9j3j8M2o9L7%K0Lm3l0j8N7J4K1k2l5k8K0M6J8K5n7n2L2K9J4
4703B4j2Rm9%P3j5J7m3l2k5O0K0L1m4k7J3j3M9jk3n5J8pL7M9j0o3j3kJ8M6rl4
4736a3j7K2K5O4m4m7j4l3N7M6K3l0m6m2L8J8L4Ro9j8kM8KK4m4J4qkM1Mj5n6j4
$$ plain form
4504 6 59 19 -37 -42 -5 44 72 1 -21 -51 -12 30 40 40 -20 -49 -24 21 78 40 8 -33 -41 51 71 33 -5 -45 -39 3 33 17 22
4537 22 -55 -34 -2 49 70 14 -25 -36 -27 28 46 30 -34 -62 -16 -1 34 31 -30 -38 -38 -23 43 20 0 -24 -76 2 72 31 24 -53 -59
4570 -59 1 42 49 38 -29 -55 -12 28 68 15 6 -48 -39 -3 42 61 -4 -7 -42 11 73 12 18 -26 -36 -6 41 38 30 -32 -49 -30 47 57
4604 57 55 -36 -52 -45 3 77 19 -30 -43 -27 -2 33 17 -2 -9 -19 19 21 51 -2 -69 -38 -25 50 55 -31 -32 -41 -21 15 64 4 -33 -50
4638 -50 -2 17 43 51 -10 -33 -35 2 47 48 2 -50 -30 -24 23 61 33 -38 -29 -13 26 29 -11 -60 -40 -25 18 43 13 17 -32 -51 -10 17
4672 17 28 0 -39 -58 31 18 0 42 -27 10 10 30 33 -10 -40 -58 -1 13 34 12 -23 -51 -31 15 33 58 1 -51 -19 10 24
4703 24 12 21 -28 -28 45 30 47 4 -28 -53 7 27 58 14 -13 0 -13 36 35 12 -43 -25 -32 5 54 44 -19 -32 -34 -16 30 21 -13
4736 -13 -30 -8 17 81 37 -10 -24 -57 0 46 69 39 -7 -49 -11 7 41 50 -19 -37 -39 9 11 35 -9 5 -3 -5 36 40 25 -31 -45
4769d5M8K4J9l6m6KJ2O3Mj7o5nM9RK5l3k2k0j0N3L4Ln5m3K4K3K9J6l9k4PK0L4
4802C8K1m1l6l2N3L5lj2l7m5O0j4M0K5n5l5L1j0OK6j2k1ML0K4K1l4p8M2K0j0Q
4834IJ9l7j2N2k2K1j7l4j2J1K4M6po8l6M7j2O9j2j5l0l2J6N2J5j0l4k1M0%J6j1
4866A5m3J5j2M3K3On5qL1JJ5kk2l1k0K9M1j4J0n9J2NN2j2Jk9k9J3O3k0j8l6kL1
4900fQL1n6K5j7m8N3M6Ln6J8j6PM4m8J9k6l2K6M5j9J4j2m1RM0OL8m8j3k3M1K4
4933C6J5l7k0l5M3K5K0l6k9J3l4O0JJm5l0N2J7J5k2k7k3K2J4K0J7n6KJ4J1JJ0
4965A5%l9qK6K0njk9kJ1oP3k3k7l1K6QK5j6j7j4k4L5L0k0Mm6K6J3J6K5l1l3jL6
5000A6J2j5k3jj2RJM9m1l0kJ8L9Nj0j3l7nP3k2Km1nJ2L4qjrRk5J0K4OJl2j2LM4
$$ plain form
4769 -45 3 27 46 10 -36 -34 -22 41 45 28 -37 -42 7 16 41 8 -14 -34 -44 9 43 46 -9 -52 -28 -5 24 40 1 -23 -16 4 38
4802 38 59 18 -18 -50 3 38 35 23 -14 -59 1 -13 27 52 -3 -38 -7 -17 -11 15 3 -18 -14 16 40 61 27 -51 -9 11 1 9
4834 9 28 -9 -21 31 9 30 13 -21 -33 -22 2 48 41 -27 -63 -16 -28 41 29 14 -16 -48 -32 20 35 25 -9 -30 10 10 26 15
4866 15 -28 -13 -25 18 41 47 -8 -16 15 16 31 29 7 -24 -44 -15 26 12 22 -37 -25 -20 32 20 21 -8 -37 -24 39 19 1 -35 -37 -6
4900 -6 2 33 -23 2 -15 -63 -10 36 39 -17 1 -15 -8 36 -12 7 -19 -51 -25 20 1 15 3 -38 -29 11 17 55 7 -6 -29 12 36
4933 36 51 14 -6 -41 2 27 47 11 -18 -5 -39 21 22 23 -22 -52 0 17 32 10 -17 -40 -18 -4 16 33 -23 -21 -7 4 5 15
4965 15 15 -24 -32 -6 14 9 8 -21 -23 -12 -18 55 32 5 -26 0 8 33 17 0 -14 -38 -3 27 7 11 -35 -9 4 20 45 14 -19 -20 16
5000 16 28 13 -10 -11 -23 -14 -13 36 -5 -35 -37 -19 20 25 15 2 -35 -40 33 11 13 -28 -33 -21 13 5 4 -5 4 -21 -11 13 19 20 -12 -24 -21 23
5038B3L3n0jk4j7M8RMj5j9k2J0P8m6Jk4k1N3k6L7m6J7l6QK5Ok2lk7QK9M5k1j5
5072ak9j2N2jL5m7k8JK6J7rpj4k1M4%j0N5m1j9l3N1Rk9J1k5J7L1J2k7J8n3J5L2
5106B0j9K3j7pk8j8O7Rm1kLnL4j4J4k5JmL6Nl0Klj8oL2J7m4oK8j0NL4l0j7j4J5
$$ plain form
5038 23 56 6 5 -19 -36 12 21 25 10 -9 -31 -21 57 11 12 -12 -33 20 -6 31 -15 2 -34 -26 -1 5 -17 -20 -47 -39 -10 35 14 -1
5072 -1 -30 -42 10 9 44 -3 -31 -30 -4 13 4 -3 -17 -38 6 6 -4 51 10 -9 -42 9 18 -11 0 -25 -8 23 35 8 26 -27 -12 20
5106 20 1 24 7 0 -28 -46 21 30 -11 -13 -10 -15 19 5 19 -6 -5 -9 27 32 2 4 1 -17 -23 9 26 -18 -24 4 -6 -1 33 3 -14 -28 -13
$$ [...]
8191b1
##END NTUPLES=NMR FID
##END=
