##TITLE=1H_AM A515
 CDCl3, 8 sc, 
 1.8.2019
##JCAMPDX= 6.0         $$ Bruker NMR JCAMP-DX V2.0
##DATA TYPE= NMR FID
##DATA CLASS= NTUPLES
##ORIGIN= UXNMR, Bruker Analytische Messtechnik GmbH
##OWNER= root
$$ XWIN-NMR		Version 3.5
$$ Thu Aug  1 15:16:49 2019 Russian Standard Time (UT+4h)  she@DPX200
##.OBSERVE FREQUENCY= 200.13155
##.OBSERVE NUCLEUS= ^1H
##.DELAY= (6, 6)
##.ACQUISITION MODE= SIMULTANEOUS
##.ACQUISITION SCHEME= undefined
##.AVERAGES= 8
##.DIGITISER RES= 18
##SPECTROMETER/DATA SYSTEM= spect
##.PULSE SEQUENCE= zg30
##.SOLVENT NAME= DMSO
##.SHIFT REFERENCE= (INTERNAL, DMSO, 0, 15.7039)
##AUDIT TRAIL= $$ (NUMBER, WHEN, WHO, WHERE, WHAT)
$$ ##TITLE= Audit trail, XWIN-NMR		Version 3.5
$$ ##JCAMPDX= 5.01
$$ ##ORIGIN= Bruker BioSpin GmbH
$$ ##OWNER= she
$$ F:/spectra/data/she/nmr/H-F/1/audita.txt
$$ ##AUDIT TRAIL=  $$ (NUMBER, WHEN, WHO, WHERE, WHAT)
(   1,<2019-08-01 15:15:56.06 +0400>,<she>,<DPX200>,
      <created by zg, POWCHK disabled, PULCHK disabled
       configuration hash MD5:
       00 E9 B6 7A A2 85 ED C7 34 08 36 98 17 FE 4E 26
       data hash MD5: 16K
       E0 66 9A 57 C0 66 A9 85 D9 8B 21 0D 4A 57 A0 6C>)
$$ ##END=
$$ 
$$ hash MD5
$$ C8 BB 21 D4 02 B2 FA 7D 7C 65 EE B2 5F E4 8E 75
##$RELAX= 
##$RELAX= 
##$RELAX= 
##$RELAX= 
##$RELAX= 
##$RELAX= 
$$ Bruker specific parameters
$$ --------------------------
##$DU= <F:/spectra>
##$EXPNO= 1
##$NAME= <H-F>
##$PROCNO= 1
##$TYPE= <nmr>
##$USER= <she>
##$AMP= (0..31)
100 100 100 100 100 100 100 100 100 100 100 100 100 100 100 100 100 100 
100 100 100 100 100 100 100 100 100 100 100 100 100 100 
##$AQSEQ= 0
##$AQ_mod= 1
##$AUNM= <au_zg>
##$AUTOPOS= <>
##$BF1= 200.13
##$BF2= 200.13
##$BF3= 200.13
##$BF4= 200.13
##$BF5= 200.13
##$BF6= 200.13
##$BF7= 200.13
##$BF8= 200.13
##$BYTORDA= 1
##$CFDGTYP= 0
##$CFRGTYP= 5
##$CHEMSTR= <none>
##$CNST= (0..31)
1 1 145 1 1 1 1 1 1 1 1 1 1 1 1 1 1 1 1 1 1 1 1 1 1 1 1 1 1 1 1 1 
##$CPDPRG= <>
##$CPDPRG1= <>
##$CPDPRG2= <>
##$CPDPRG3= <>
##$CPDPRG4= <mlev>
##$CPDPRG5= <mlev>
##$CPDPRG6= <mlev>
##$CPDPRG7= <mlev>
##$CPDPRG8= <mlev>
##$CPDPRGB= <>
##$CPDPRGT= <>
##$D= (0..31)
0 1.2 0 0 0 0 0 0 0 0 0 0.03 0 0 0 0 0 0 0 0 0 0 0 0 0 0 0 0 0 0 0 0 
##$DATE= 1564658155
##$DBL= (0..7)
120 120 120 120 120 120 120 120 
##$DBP= (0..7)
150 150 150 150 150 150 150 150 
##$DBP07= 0
##$DBPNAM0= <>
##$DBPNAM1= <>
##$DBPNAM2= <>
##$DBPNAM3= <>
##$DBPNAM4= <>
##$DBPNAM5= <>
##$DBPNAM6= <>
##$DBPNAM7= <>
##$DBPOAL= (0..7)
0.5 0.5 0.5 0.5 0.5 0.5 0.5 0.5 
##$DBPOFFS= (0..7)
0 0 0 0 0 0 0 0 
##$DE= 6
##$DECBNUC= <off>
##$DECIM= 24
##$DECNUC= <off>
##$DECSTAT= 4
##$DIGMOD= 1
##$DIGTYP= 9
##$DL= (0..7)
0 120 120 120 120 120 120 120 
##$DP= (0..7)
150 150 150 150 150 150 150 150 
##$DP07= 0
##$DPNAME0= <>
##$DPNAME1= <>
##$DPNAME2= <>
##$DPNAME3= <>
##$DPNAME4= <>
##$DPNAME5= <>
##$DPNAME6= <>
##$DPNAME7= <>
##$DPOAL= (0..7)
0.5 0.5 0.5 0.5 0.5 0.5 0.5 0.5 
##$DPOFFS= (0..7)
0 0 0 0 0 0 0 0 
##$DQDMODE= 0
##$DR= 18
##$DS= 0
##$DSLIST= <SSSSSSSSSSSSSSS>
##$DSPFIRM= 0
$$ [...]
##$SUBNAM2= <"">
##$SUBNAM3= <"">
##$SUBNAM4= <"">
##$SUBNAM5= <"">
##$SUBNAM6= <"">
##$SUBNAM7= <"">
##$SUBNAM8= <"">
##$SUBNAM9= <"">
##$SW= 24.9336996594482
##$SWIBOX= (0..15)
0 0 2 0 0 0 0 0 0 0 0 0 0 0 0 0 
##$SW_h= 4990.01996007984
##$TD= 16384
##$TD0= 1
##$TE= 0
##$TE2= 300
##$TE3= 300
##$TEG= 300
##$TL= (0..7)
0 120 120 120 120 120 120 120 
##$TP= (0..7)
150 150 150 150 150 150 150 150 
##$TP07= 0
##$TPNAME0= <>
##$TPNAME1= <>
##$TPNAME2= <>
##$TPNAME3= <>
##$TPNAME4= <>
##$TPNAME5= <>
##$TPNAME6= <>
##$TPNAME7= <>
##$TPOAL= (0..7)
0.5 0.5 0.5 0.5 0.5 0.5 0.5 0.5 
##$TPOFFS= (0..7)
0 0 0 0 0 0 0 0 
##$TUNHIN= 0
##$TUNHOUT= 0
##$TUNXOUT= 0
##$USERA1= <user>
##$USERA2= <user>
##$USERA3= <user>
##$USERA4= <user>
##$USERA5= <user>
##$V9= 5
##$VALIST= <valist>
##$VCLIST= <CCCCCCCCCCCCCCC>
##$VD= 0
##$VDLIST= <DDDDDDDDDDDDDDD>
##$VPLIST= <PPPPPPPPPPPPPPP>
##$VTLIST= <TTTTTTTTTTTTTTT>
##$WBST= 1024
##$WBSW= 4
##$XGAIN= (0..3)
0 0 0 0 
##$XL= 0
##$YL= 0
##$YMAX_a= 253201
##$YMIN_a= -299100
##$ZGOPTNS= <>
##$ZL1= 120
##$ZL2= 120
##$ZL3= 120
##$ZL4= 120
##$ABSF1= 10
##$ABSF2= 0
##$ABSG= 5
##$ABSL= 3
##$ALPHA= 0
##$AQORDER= 0
##$ASSFAC= 0
##$ASSFACI= 0
##$ASSFACX= 0
##$ASSWID= 0
##$AUNMP= <proc_1d>
##$AZFE= 0.1
##$AZFW= 0.1
##$BCFW= 1
##$BC_mod= 2
##$BYTORDP= 1
##$COROFFS= 0
##$CY= 11.3945322036743
##$DATMOD= 1
##$DC= 2
##$DFILT= <>
##$DTYPP= 0
##$F1P= 20.1537800932815
##$F2P= 0.134698688090026
##$FCOR= 0.5
##$FTSIZE= 0
##$FT_mod= 4
##$GAMMA= 1
##$GB= 0.15
##$INTBC= 1
##$INTSCL= 1
##$ISEN= 128
##$LB= 0.24
##$LEV0= 0
##$LPBIN= 0
##$MAXI= 10000
##$MC2= 0
##$MEAN= 0
##$ME_mod= 0
##$MI= 1.114404
##$NCOEF= 0
##$NC_proc= 0
##$NLEV= 6
##$NOISF1= 3.799351
##$NOISF2= 2.8
##$NSP= 1
##$NTH_PI= 0
##$NZP= 0
##$OFFSET= 15.70392
##$PC= 1
##$PHC0= -8862.687
##$PHC1= 15.80097
##$PH_mod= 1
##$PKNL= yes
##$PPARMOD= 0
##$PSCAL= 0
##$PSIGN= 0
##$REVERSE= no
##$SF= 200.130013532006
##$SI= 16384
##$SIGF1= 3
##$SIGF2= 2
##$SINO= 400
##$SIOLD= 16384
##$SREGLST= <1H.CDCl3>
##$SSB= 0
##$STSI= 0
##$STSR= 0
##$SW_p= 3612.71676300578
##$SYMM= 0
##$S_DEV= 0
##$TDeff= 0
##$TDoff= 0
##$TI= <>
##$TILT= no
##$TM1= 0
##$TM2= 0
##$TOPLEV= 0
##$USERP1= <user>
##$USERP2= <user>
##$USERP3= <user>
##$USERP4= <user>
##$USERP5= <user>
##$WDW= 1
##$XDIM= 8192
##$YMAX_p= 0
##$YMIN_p= 0
$$ End of Bruker specific parameters
$$ ---------------------------------
##NTUPLES= NMR FID
##VAR_NAME=  TIME,          FID/REAL,        FID/IMAG
##SYMBOL=    X,             R,               I
##VAR_TYPE=  INDEPENDENT,   DEPENDENT,       DEPENDENT
##VAR_FORM=  AFFN,          ASDF,            ASDF
##VAR_DIM=   8192,          8192,            8192
##UNITS=     SECONDS,       ARBITRARY UNITS, ARBITRARY UNITS
##FACTOR=    0.0002004,     1,               1
##FIRST=     0,             0,               0
##LAST=      1.6414764,     0,               0
##MIN=       0,             -299100,         0
##MAX=       1.6414764,     253201,          0
$$ Real data points
##PAGE= N=1
##DATA TABLE= (X++(R..R)), XYDATA
0@%%%%%%%qJ6j6K4l2L2m0M9n8P4q9J05j25J48j70J97k30K65l05L49l97M51n08
30b68N73o48P27q14R11j014J129j258J394j546J714j896K100k327K576k856L171
47A668l524L932m402M949n606O401p383Q646j0333J2717j6377K2764l7121J27830
61A04161m6118k83272R291J84986K32309L1757j51130k31256q6659J22876K44677
72A31622J16826j20507k57326j32481J08036K46328J38717q6134k31460j59522
82b45901N0576K20225J86468k0513k17061k05508L048K09107K09722J8329j81384
93B7108k06298m8281J54737K22299Q6084j39720k38241j01570J40138K42085J06525
104B44866j21037k21125j18313Q1627K08038J54496m1887k13917j89567K4542
$$ y = [0, 0, 0, 0, 0, 0, 0, 0, -8, 8, -8, 16, -16, 16, -24, 25, -33, 41, -48, 57, -68, 80, -90, 107, -123, 142, -163, 186, -211, 240, -268, 305, -343, 384, -430, 481, -533, 596, -662, 732, -814, 900, -996, 1104, -1223, 1353, -1503, 1668, -1856, 2076, -2326, 2623, -2983, 3418, -3965, 4681, -5652, 7065, -9312, 13452, -23669, 104161, 58043, -225229, -215938, -30952, 201357, 233114, 81984, -149272, -235931, -113055, 131622, 248448, 127941, -129385, -261866, -153830, 92498, 231215, 145081, -86379, -245901, -195325, 24900, 211368, 190855, -26206, -231714, -228666, -19559, 190163, 208492, 27108, -179190, -227471, -72734, 149565, 235649, 95929, -142312, -243882, -103744, 138341, 244866, 123829, -97296, -215609, -133982, 74056, 228552, 186665, -27252, -216819, -192277]
114a92277K21298J99418j7433k09728j96473l656J81186J95426L4343j57441k09240
125a54577o7916J42065K23672Q8806j35559k30534j02778J18920K21765J18987
135B22851q9199k13784j46198O0230K15279J67170m3341k10697j71489K7325J90341
146H488J73498L914j66212j88440l7056J57107K09174N7190j55978k16476o4769
157b19560J43945K07892P8053j15084j96977j05188Q0213J96174J36085n6490
167A49063k03150j56530M5408K03180J60721l4082j88215j61788J0783J67958
177f652J72508K0941j55150j90298m3706J49617K00369N9558j34977j98314p8265
188b04369J10594J98353J04948q7504k02718j24629P4887K01375J32790n9793
$$ y = [-192277, 29021, 228439, 211006, 1278, -195195, -198851, -17665, 177761, 212104, 54663, -154577, -222493, -80428, 143244, 232050, 96491, -134043, -236821, -117901, 103864, 222851, 133652, -80132, -226330, -166100, 49179, 216349, 173008, -37689, -209178, -181853, 8488, 181986, 185900, 19688, -168752, -205808, -48701, 160473, 217663, 61685, -154791, -219560, -75615, 132277, 210330, 95246, -101731, -206919, -126706, 69468, 205553, 149063, -54087, -210617, -165209, 37971, 198692, 164610, -23605, -185393, -174610, -6652, 165856, 186797, 31647, -158651, -202357, -52740, 147629, 207187, 72210, -126104, -204369, -93775, 104578, 209526, 122022, -80696, -205325, -130438, 70937, 203727, 143934]
198A43934j88233j39034L4808J72796J53828n827j64271j74511j8977J61008J90141
209A65662L2813j56348j91894m3914J37225J83066O2282j07654j79651r1710Q2344
220a07779J85577J15115o9933j90965j25080O0357J83146J30105m1547j69724
230c0728j42137J5918J60918J58006N942j54235j67684k3230J40645J70250M3667
241A77332j21411j73562o6680J04542J79037Q5631r2189j82719r7380Q0942J78879
252G2422J04816o3431j68027j16572L8636J57944J37273j1556j55971j57421m685
263a66572J56219J66002J5288j45152j61290k9691J22784J59919N3903j01575
273F9835j65194p5797Q9371J71447R0507p8285j70799j01660O2101J66240J13746
$$ y = [143934, -44299, -183333, -148525, 24271, 178099, 172272, 8001, -166510, -185487, -24479, 165662, 198475, 42127, -149767, -193681, -56456, 126610, 188892, 81238, -98413, -190123, -107779, 77798, 192913, 122980, -67985, -193065, -132708, 50438, 180543, 138996, -30728, -172865, -156947, 3971, 161977, 167919, 13684, -154000, -177230, -36585, 133665, 177332, 55921, -117641, -184321, -79779, 99258, 184889, 92700, -90019, -187399, -106457, 72422, 177238, 113807, -54220, -170792, -132156, 25788, 163061, 151505, -4466, -161887, -166572, -10353, 155649, 170937, 25785, -135505, -165196, -42412, 117507, 171410, 69835, -95359, -171156, -81785, 89662, 180169, 101884, -68915, -170575, -108474, 57766, 171512]
284A71512m2947j60301j27966K2951J53180J37919o582j42907j45036j1981J27791
295b4367J47583L1386j13495j54706n2277J02121J61933O5829r5850j64974p4283
306a71100Q4340J57367Q4224o2098j48717j02260L6780J46890J23000j9173j46303
317a7050j34435R271J41712J37669M409j28159j37291k0772J13792J42789M0454
328A52389j00243j48421n6892R0190J53692P2452p8031j53548q4900O1769J51044
339E9501R9000m4742j47331j10960K9665J41092J17204j6292j31269j21783k286
350a28201J17121J29393K2240j09171j41761l8933J04365J47332M7218r6786j45699
361i2882n7897P9539J39372P2668n8522j37043q9849M0533J35998J04124k7499
$$ y = [171512, 128565, -31736, -159702, -136751, 16429, 154348, 147766, 4859, -140177, -152158, -24367, 123216, 154602, 41107, -113599, -165876, -63755, 98178, 164007, 68157, -96817, -171100, -86760, 70607, 154831, 92733, -55984, -158244, -121464, 25426, 148426, 129253, -17050, -151485, -142214, -502, 137167, 141576, 13417, -123874, -144646, -30854, 111935, 152389, 52146, -96275, -153167, -62977, 90715, 163167, 85136, -68412, -153312, -91543, 59501, 158501, 113759, -33572, -144532, -114867, 26225, 143429, 127137, -4132, -125915, -128201, -11080, 118313, 140553, 31382, -110379, -149312, -44947, 102385, 149603, 52817, -92882, -150779, -71240, 68132, 140800, 82278, -54765, -144614, -104081, 31917, 136041, 108542]
372A08542j34422j11955J7657J28888J16377m534j18466j20132j1742J07743J28210
383A06166K9570r7748j33497m4122Q7292J36182N8031p2201j35321p3017N7826
394h0839J36567Q5650m6920j34582r2336L6167J26558R7173k0418j16835j06292
405a16107J213J09782J18467J4594j05723j27731k7742R9696J30713L7144q8487
416D5819j29183m8581P2651J24517O2999n5559j24001p8097M2628J24819Q9298
427A27310l2779j23640r5380K1704J17187J02385p635j09862j09659p542J02431
438a5480J15908K0936r1520j18021l5036P8568J19810N0420o7150j22847o2343
449a26755N8673J23633P0624n0158j21167p6429L7745J14771Q4425k2086j07957
$$ y = [108542, -25880, -137835, -120178, 8710, 125087, 120553, 2087, -118045, -129787, -22044, 106166, 135736, 37988, -95509, -139631, -52339, 83843, 141874, 69673, -65648, -138665, -80839, 55728, 141378, 94458, -40124, -132460, -96293, 30265, 127438, 107020, -9815, -116107, -114894, -5112, 113355, 127949, 22226, -105505, -133247, -33551, 97162, 134306, 45819, -83364, -131945, -59294, 65223, 128222, 72663, -51338, -129435, -86807, 38012, 127310, 94531, -29109, -124489, -102785, 14402, 116787, 109152, -710, -110369, -117911, -15480, 100428, 121364, 29844, -88177, -123213, -44645, 75165, 125585, 58435, -64412, -126755, -68082, 55551, 126175, 76017, -45150, -121579, -83834, 30937, 115362, 93276, -14681]
460a4681r5420N606J02470J06518R151r9441j13948j9025R3576J14248K7732q1551
472C5235j12116l9732O7913J12455N2949n6085j14531o4596M7149J14852P4273
483A17766l6095j12493q4169K4286J09753R1606j2253j03321r7136Q3R5059J00833
495I3919J3555q5704j04151k6005P4858J07889L9546o7235j12126m9774O0672
506e4556J13613N7417n3259j11186o4263M0181J04895P3880k4212j00290q5758
517a03538R902R7433R4241O55r4278r8381q477Q6483R9535J8980p7974j01042
529g6461k9925O8345J02621M1785n8298j04192n3524M8354J05611O3673l7877
540G0112j03969p2779K7297J01478P9625j6652r6253q3886O678Q9414Q6916M971
$$ y = [-14681, -110101, -104495, -2025, 104493, 113644, 14203, -99745, -118770, -25194, 89054, 116786, 35235, -76881, -116613, -48700, 63755, 116704, 60619, -53912, -118508, -71359, 43493, 117766, 81671, -30822, -114991, -90705, 19048, 110654, 98401, -4920, -102056, -101973, -6914, 93919, 107474, 21770, -82381, -108386, -33528, 74361, 113907, 46672, -65454, -115228, -54556, 59057, 116474, 63215, -47971, -112234, -72053, 32842, 106722, 82510, -17780, -103538, -93636, 3797, 98038, 98693, 4415, -93966, -102443, -15960, 83575, 102555, 24581, -76461, -106386, -38041, 64580, 106365, 48067, -56125, -109649, -61295, 44316, 107989, 70112, -33857, -106636, -79339, 22139, 101764, 85112, -11141, -95027, -88349, 1065, 87981, 92952]
552I2952q0102r1731j7983P3368R8455L0359o8389j03441l9005O2577J03746M5727
564A06533n2435r9939n5251L9406R6802O4774k6777r4335p3943J5833R1589Q0829
576I3086p029q8909q5928j327Q3590Q8557J0636p6508r1791k2612O8010R4249
588F4024L3766n8593r6537m4420M8970R5914N4369l8842r5896o2515L0693R4613
600B5546O7957k2474q9653p1389J2764Q3567P6969m5p6847q3861j1871P3320R0234
613G4217K2457o7574r3716l0283O0971R3392L7940n1062r0589m6262L9868Q8681
625C8040N5100k9468q8123o3823K0435Q6567P0482j2812q4388p6526L543P8867
637b106Q0472N961p3315q4110j6558O5027Q5545K6564n6178q6906l7623M7303
$$ y = [92952, 12850, -78881, -96864, -23496, 74959, 105318, 36929, -66512, -105517, -42940, 60806, 106533, 54098, -45841, -101092, -61686, 35116, 99890, 73113, -21222, -95165, -79332, 12257, 93086, 86057, -2852, -88780, -90107, -6517, 82040, 92676, 16168, -75623, -98235, -30225, 64024, 97790, 39197, -57340, -101760, -52790, 43124, 97493, 58651, -37245, -99760, -69067, 25546, 93503, 71029, -18624, -90013, -77249, 6318, 83287, 83242, 6395, -77466, -89337, -16017, 74217, 96674, 29100, -64616, -94899, -33928, 59464, 97404, 46342, -44247, -90509, -50641, 38040, 93140, 63672, -24451, -88274, -67839, 18728, 89210, 76398, -7990, -84516, -80973, -2106, 78366, 84327, 11012, -73098, -89656, -24629, 60916, 87480, 31302, -55604, -93227, -45924]
649d5924Q8542M6615m0371q9407n2705L3960Q7801N8594k5813q3442o3592J5966
661f9776P8760P0448l098p3653p6264q148P0013Q2481J7107o4853q4422k3551
673h4956N8607Q3625L0642m9160q2960l9329M0262Q2464M7755l2025q2519n5928
685h3522K3552Q0568O2793j4857p9242o9225N752P4622P2940J933o8880p4370
697f7936j1692O0658P6528K1280n3797p9362l0291M7975Q1293L8627m1688q2860
709d1265m4772L6107Q1828N0641k7388p7946n6253J7374P3834O3241n735o9944
721b78o9717k780O6758P3581R866o2467p4930j7006N6579P6219K3880m9838p6914
734d7047l2668M2461P6807M0648l3054p7499m9797K5325P6625N5806j7566p4502
$$ y = [-45924, 42618, 89233, 48862, -40545, -93250, -59290, 28511, 87105, 61292, -22150, -85742, -69776, 8984, 79432, 76334, 2681, -73583, -81731, -11718, 70763, 87870, 23017, -61405, -84956, -26349, 57276, 87918, 38758, -44202, -83531, -43269, 39195, 86950, 54925, -27594, -83522, -59970, 20598, 83391, 68534, -10708, -79933, -74181, 441, 73381, 75314, 6434, -67936, -79628, -18970, 57558, 78838, 25041, -54321, -84612, -36637, 44656, 83283, 41595, -41265, -86037, -49930, 31898, 82539, 55151, -22795, -79048, -61674, 12160, 75401, 69666, -278, -69995, -72775, -6017, 67564, 77430, 14963, -59967, -76973, -20394, 55825, 79705, 29867, -47047, -79715, -37254, 39553, 80201, 47147, -30352, -80149, -54824, 21801, 77607, 60041, -14461]
746a4461o0769J0287P0248O3968k458o4771o6458n925N9560O8679J5119n2960
758B0059p2525k4390M8391P6528L1952m3387p7306l7472L6584P5295M2962k7684
770D9007p1749m9451J8265O8885N5452r836o6489o0995J999O4054O5273L996o0370
783H041o8234j1309N5879O9447J8183m9188p0593k6973M1553P1460L4907l3625
795C9548p1351m2430K6510P1080M7962j9831o9063n2791J4189O6961N5522p027
807E9279o2284n8225j814N7217O3363J0492n2088o7356j8873M7900P0058K5466
819G3135m2759p0330l1341L6370O8626L6386k8677o6443m2142K0740O4111M8020
831F5696j3132o2987n4017O681O1292N7853L17n8054o1425p233N3668O3303J3973
$$ y = [-14461, -75230, -64943, 5305, 69273, 66815, 2044, -64414, -70339, -10779, 57900, 73019, 20059, -52466, -76856, -28465, 48063, 80015, 36628, -40678, -78150, -41566, 33729, 76691, 49007, -22742, -72193, -53928, 14957, 70409, 60573, -5916, -66911, -64912, -858, 64415, 68411, 8041, -60193, -71502, -15623, 53824, 72007, 22819, -47774, -74747, -33194, 38266, 73173, 39548, -31803, -74233, -47723, 23357, 71319, 51488, -17575, -70366, -56177, 10784, 66306, 59279, -3005, -61230, -63044, -5827, 57536, 68028, 15940, -51416, -70289, -22389, 47669, 73135, 30376, -39954, -71295, -34925, 33701, 70087, 41410, -25033, -67175, -46435, 17676, 65696, 52564, -10423, -64440, -57759, 3533, 61386, 61703, 3649, -57776, -65009, -11341, 51962, 65935]
844F5935m7195o4162k1403M0750O4346K8001l3058o5107l5321K8290O5593M0671
856F7340k3501o4844m4484J7639O2253M8388j0488n9072n2373K051N4782N6594
868E4285O247n0585o0304j3794M6600O2540J9445m2875o2495k4037L6607O1984
880C3618K9187l0038o1245l5523K3550O1011M1515j6785n9532m6856J0176N8287
892G365N1795m149n5350n3799k198N1219N5955P991m5326n6247j5165L9913N8090
905D0094K2113l5168o0083k7872L0781O0341L3189k6118o0105l8276K0435N7941
917A7272M1313j3346n4747m5586N120N0741M9936J606m8315n3506p451M5401N4644
930D3082J2557m1903n5816j7694L7202N6620K2838l1475n5871k8931K5019N6011
$$ y = [65935, 18740, -45422, -66825, -26075, 38271, 66272, 33214, -31893, -67214, -38924, 26669, 67340, 43839, -21005, -65489, -47850, 14403, 62791, 52303, -6769, -59142, -57091, -2309, 54285, 60532, 9947, -50357, -64151, -17551, 44989, 64434, 21559, -40936, -64973, -28366, 33618, 62805, 32767, -28478, -64001, -40451, 20560, 62075, 45290, -14242, -61098, -50922, 7365, 59160, 55011, -339, -54138, -56336, -5117, 50838, 58829, 13503, -42744, -57909, -17996, 40094, 62207, 27039, -33044, -60916, -30135, 30206, 63395, 37277, -22828, -61104, -40669, 17272, 58585, 45239, -9508, -55094, -49974, 767, 50703, 52309, 3994, -49512, -56963, -11562, 43082, 55639, 13736, -42080, -59774, -22572, 34048, 56886, 25411, -30460, -59391, -34372, 21639]
942B1639L5239j8195n5166m0553J3385N4192M3795p327n1424m6169K320M8534
954B70M8262L508m3861n0088r586L9682N2277J6473l5687n4418k2559L1538N5575
967C1386K7166k7011n5680l0751K0932N2796L4923j5019n0375l9116Q566M7622
979E439M3056l432m5953m6249k692M3944M8722P411m1203n0278j2337L6709N0714
992C3851J7596l0960n0549k3338K5491N0440K8996k0256n0082l3166J5466M9786
1004A3275L6568j1242m7759l8990P038M5655M0706o31m1738m3799n448L8347M6765
1017C8747J1437l4920m8983j6336L1519M9398K0429k7325m8891k4607K2820M7713
1029B1001K7826j7539m6341l2034J1906M5318L6114p220m4061l9696K248M2123
$$ y = [21639, 56878, 38683, -16483, -57036, -43651, 10541, 54336, 47009, -4415, -50584, -48264, 270, 48532, 52040, 8179, -41909, -51495, -11813, 40464, 56937, 21250, -33168, -55727, -24189, 31386, 58552, 31541, -24139, -54890, -33958, 18838, 53761, 38742, -11633, -50749, -42183, 5439, 48495, 45063, -890, -47139, -49831, -5887, 42835, 50246, 9043, -41235, -53572, -16863, 33851, 51447, 20487, -30062, -53400, -27909, 22531, 51527, 31271, -18811, -51977, -36511, 13275, 49843, 38601, -9158, -48148, -41110, 4545, 45251, 44620, 2882, -40917, -46365, -8018, 38747, 50184, 15264, -33719, -50055, -18536, 30862, 51291, 23966, -24925, -49532, -26712, 21001, 48827, 31288, -15053, -47087, -35181, 10137, 46251, 39031, -5030, -44726, -42478, -355]
1041c55M2498K278l9420m3905p337L5688M4635J1716l0612m4689j7174K6119M4862
1054B4304K2318k2455m4928k6396J8618M5488K9778j4978m4510l1717R792M2094
1066G408L4744m236l9209l7584j567L6247L9958O909l3176m2260j1090L0583M3110
1079B9837J4004k7265m2967j7794K3320M2641K1779j8789m2102k6326J4216M1501
1091A2055L0246r649m0823l3091M821L9291L6017j083l6925l6839k673L3033L7887
1104C2267P186k9375l8645j2065K6227M0587J6432k3334m1428k0520K0455M1080
1116A8867K3757j5952m0793k6108J1579L8684K8690o624l5949l1932K185L3857
1128B61L4107K022l2041l6031n880K9826L7094R309k7189l8202j2455K3587L7712
$$ y = [-355, 42143, 44421, 5001, -38904, -46241, -10553, 34082, 45798, 15186, -29503, -46677, -20558, 24304, 46622, 24167, -20761, -47157, -28539, 16949, 46727, 31749, -12761, -44478, -34686, 7408, 42152, 37916, -1293, -38877, -40444, -4197, 35761, 42670, 9494, -32766, -43856, -13273, 29837, 43841, 16576, -26391, -44185, -20865, 21776, 43555, 24766, -17336, -43662, -29446, 12055, 42301, 32652, -8171, -41262, -36441, 2850, 38867, 37784, 859, -35980, -38653, -5620, 32267, 39453, 10078, -28567, -40632, -14405, 26182, 42614, 19280, -22148, -42668, -22213, 18867, 42624, 26672, -14121, -40229, -28650, 10034, 38724, 32100, -3849, -35781, -33596, 261, 34368, 36390, 4349, -31682, -37562, -7736, 29358, 38667, 11478, -26724, -39179, -15592, 22120]
1141B2120J6825j9751l7637k0904J5167L7209K4707j1293l6683k7568P934L5716
1153E842K8988m662l3478l0727Q87L1332L2239L150k8461l3881p383K6207L5261
1166B5314J1810k2856l6931j5400K0922L6763J8371j7170l5819k0525J2999L4578
1178A2056K3386r428l2935k5566N082L1617K8960j557l0893l0683j824K8729L2235
1191B9179N262k6148l3569q442K2666L2942J2612j9670l3124j6364J6000L2975
1203A4319J9287j2863l2890k2118R953L2166K4229p421l0726k5814L361K9597
1215A080K7055N00k6489k9650m613K4679L0865Q411k2569l1279j0788J9749L2043
1228A8994J3722j7306l1502j5590J4676L0104J8875j0830k9823k1429P546K9309
$$ y = [22120, 38945, 19194, -18443, -39347, -24180, 13029, 37736, 26443, -10240, -37808, -29874, 5842, 34830, 30168, -3310, -34037, -33150, -1818, 30421, 33571, 5110, -28771, -36154, -9947, 25314, 37124, 14268, -22663, -38063, -17141, 19622, 37993, 20823, -14996, -35521, -22522, 12056, 35442, 26014, -6921, -32487, -27405, 4212, 33172, 31615, 722, -29961, -31785, -3056, 29179, 34441, 8293, -25276, -33718, -11052, 21890, 34502, 14832, -18292, -34656, -18656, 14319, 33606, 20743, -12147, -34265, -24312, 7854, 32083, 24662, -6064, -31878, -28517, 1080, 28135, 28635, 2146, -27504, -32117, -7438, 23427, 31838, 9269, -22010, -32798, -13049, 18994, 32716, 15410, -16092, -31682, -17006, 13098, 31973, 21143, -8680, -30109, -22563, 6746]
1240F746K4015m009k8665k6093R91K7095K7440J898k5207k7757n076K1963K8401
1253B1742Q084j9675k8650j1636J6366K9742J4418j4686k9669j6962J2320K9158
1265A0552J8714q770k8325k1454N960K6510K3082k077k4965k4387j354K3112K6318
1278B2916L598k0920k7056o687J9791K7266R130j7506k7411j1600J4911K7625
1290A4057J4636j2191k7032j7368R008K6501J9786o213k5536k1497L075K4951
1302B177K2477q64k2686k3489k011K0730K4024N280j8818k5084q200J6852K5838
1315A6226J1113j4946k6705j3176J2793K6191J5260j0198k5300j6577O867K4000
1327E548J8501l741k2635k0560J259K1656K2001J406k1007k2891l573J9084K3955
$$ y = [6746, 30761, 26752, -1913, -28006, -27015, 80, 27520, 29418, 4211, -23546, -28622, -6659, 21742, 29826, 10151, -18499, -30135, -13769, 15973, 30391, 15705, -13964, -30926, -18606, 10552, 29266, 20496, -7829, -29283, -23323, 3187, 26269, 24192, -773, -25160, -26514, -3402, 22916, 26514, 5594, -21462, -28149, -8358, 18908, 28038, 10532, -16879, -28479, -13568, 14057, 28693, 16502, -10530, -27898, -18890, 7611, 27397, 21184, -4352, -25849, -22774, 2177, 24654, 23790, 1104, -22385, -24396, -3666, 20358, 25638, 6820, -18264, -26464, -9612, 16226, 27339, 12393, -14312, -27488, -14695, 11496, 26756, 16558, -8742, -25319, -18452, 5548, 24049, 20308, -2327, -22887, -21628, 28, 22029, 23435, 2428, -20463, -24036, -4952, 19003]
1340A9003O017j7523k3811q321J4619K4073J0905j2257k4010j3267R298K3734
1352H460J5923p645k3447j7060N333K2749J8055l095k1130j9542M03J9859K0685
1365A9548K196j8377k1605n188J6847K2718P574j5261k3033r394J3036K2810J1692
1378B3563j1225k2434j2847Q608K1860J4771o267k0913j6786M025K0334J8256
1390B0945j222j9841j9274j350J8737K0211L310j6913k0357n708J4746K1050P537
1403B1871j2612k0804j0326J0940K1064J1713q456k1439j3569P320K0349J5009
1415B1060n128j9633j6336L052J7859J7475L07j7201j9125k168J6138J9641L753
1428A9694j4367j9551o406J3100J9979P771j1338j9806j0057R869J9274J1816
$$ y = [19003, 25020, 7497, -16314, -24635, -10016, 14057, 24962, 12705, -11305, -24572, -15274, 8460, 24383, 16738, -6709, -23769, -18436, 4313, 22368, 19273, -1857, -21399, -20996, -1137, 19548, 21744, 3367, -18238, -23426, -6579, 16139, 23713, 8452, -14581, -23975, -10939, 11871, 23563, 12338, -10096, -22943, -14335, 7525, 22296, 16029, -4884, -21670, -17645, 2689, 20945, 19723, -118, -19392, -20742, -2005, 18206, 21516, 4603, -15754, -21462, -6716, 14334, 21871, 9259, -11545, -21871, -10931, 10133, 21846, 13390, -8049, -21618, -14298, 6051, 21060, 15932, -3701, -20037, -16985, 874, 18349, 18656, 1455, -17670, -19838, -3700, 15941, 19694, 5327, -14224, -20630, -7530, 12449, 20220, 8882, -10924, -20981, -11112, 8162, 19978]
1440A9978p363j9522j3261N080J9031J5060k887j8381j6191J216J6934J7221Q10
1453A7725j5915j7240k439J3916J8073M831j2702j8167o743J1157J8877Q708r641
1466A0440j9155j0453Q086J8696J1825o305j7799j2850L508J7152J4053j608j6142
1479e52j5574k0J5021J6476J586j4326j7274l313J3374J6983N150j1524j7555
1492a1548p454J0203J7718Q676q086j7331j0588O176J7479J1972m670j6820j3217
1505a7490L397J6082J3765j273j4983j4307l95J4118J5082K370j2674j5909m452
1518a6669J1582J6794N774j0062j6939p299Q641J6643Q546o960j6268r713N282
1531a0648J5344J1581l790j4757j2629J564J4373J3764o14j3596j4449j614J3109
$$ y = [19978, 12615, -6907, -20168, -15088, 3943, 19003, 16116, -2265, -18456, -17240, -306, 16915, 17725, 1810, -15430, -17869, -3953, 14120, 18951, 6249, -11918, -18661, -7504, 11373, 20081, 10440, -8715, -19168, -11082, 7614, 19439, 13134, -4665, -17515, -14007, 3145, 17198, 15590, -552, -16126, -16146, -1125, 15351, 16937, 2611, -14663, -17976, -4602, 12381, 17531, 6007, -11548, -19002, -8799, 8919, 17595, 9509, -7822, -18410, -12234, 5245, 17217, 12547, -4273, -17490, -14093, 1989, 15754, 14481, -502, -14809, -15204, -1086, 13996, 16366, 3692, -12217, -16669, -5087, 11707, 17481, 7419, -9520, -16819, -8178, 8465, 17011, 10051, -6217, -15930, -10648, 4696, 16277, 12487, -2270, -14899, -13335, 1038, 14802, 14188, 592, -13857, -15471, -2362]
1544b362J4926K767j1686j5043m605J0094J5182O476r032j5366p610P208J5222
1557F171R504n948j5544r759M622J4676J1047k987j4029j1688J044J3153J3040
1570A3302R94j2622j3888k164J1407J4198L863j0447j4461m929Q945J4790O431
1583A5419q210j4362p519O021J4424R053n037j3899j0085L011J3819J1071j575
1596A2131j3199j2222L85J2186J2549J748j1366j3164k563R579J3665L925r027
1609D627j3273n786Q074J3782P055o713j3771q379N625J3677R051m210j3005r966
1623a3212K555J2358J1059j354j1438j1184q73J0976J2233J765j0358j2554k902
1636a2929R193J2672M468q537j2914n319O907J3264O789n818j3113q000M028J2827
$$ y = [-2362, 12564, 15331, 3645, -11398, -16003, -5909, 9273, 15749, 6717, -8649, -16259, -9051, 6171, 15675, 9727, -5817, -15576, -10954, 3722, 14769, 11782, -2247, -13935, -12891, 262, 13302, 14296, 1674, -12214, -14378, -2971, 11227, 15090, 4643, -9818, -14747, -5802, 8988, 15419, 7209, -7153, -14672, -8651, 5773, 14826, 9789, -4110, -14195, -11184, 2635, 13706, 12131, -1068, -13290, -12905, -719, 11830, 13578, 2212, -10952, -13515, -3936, 9729, 13654, 4627, -8646, -14432, -6358, 7424, 14479, 7766, -6005, -14384, -8759, 4918, 13969, 9759, -3246, -13212, -10657, 1701, 12760, 11406, -32, -11216, -12089, -1113, 11120, 12885, 2527, -10027, -12929, -3736, 8936, 13404, 4867, -8047, -13366, -6459, 6805, 13594, 7776, -5337, -13337, -9309, 3518]
1650C518R351k983j2315r878J408J1828J0361m54j0724j1040m42R646J1298K680
1664A2254r350j1737l538Q238J2138N123p448j2476n763N993J2218O948m556j1958
1678c914p987L634J1258Q718k006j1322r503J374J0363J0151K83r990j1025j013
1692a0979R201J1157K582q682j1548l882P521J1591N097o043j2026o094N380J1395
1706D670O862m175j1102q002L145J1163Q387j787j0701r129M76J0309R809N46
1720A0471r436j0077k465Q919J1050K853p786j1136l835O568J1451M891n631j1049
1734e212n791M558J0957O632l486j0280q138K462J0421Q775j560r677r629K05
1748i763R407R774P65q391j0204k014P615J0418L126o530j0854m495O364J0554
$$ y = [3518, 12869, 9886, -2429, -12307, -10899, 929, 11290, 10836, 112, -10928, -11370, -1724, 9574, 12254, 2904, -8833, -12371, -4133, 8005, 13128, 5680, -6796, -12559, -6566, 5652, 12600, 8044, -3914, -11901, -8267, 2991, 11709, 9703, -1619, -11122, -9748, 615, 10766, 11049, 1059, -9966, -10979, -1778, 9379, 11961, 3279, -8269, -12151, -4630, 6961, 12058, 6015, -6011, -12105, -6725, 4670, 11532, 7357, -3745, -11747, -8602, 2561, 10948, 9161, -1540, -10669, -10193, 116, 9925, 10471, 1035, -9042, -11507, -2588, 8462, 11315, 3529, -7607, -11442, -4874, 6577, 11468, 5837, -5212, -11003, -6445, 4512, 11144, 7658, -2622, -10760, -8298, 2123, 10898, 9338, -339, -9968, -9763, -356, 9418, 10183, 1792, -8412, -10426, -2811, 7607, 10733, 4203, -6651, -11146, -4782, 5772]
1762E772N162n539j0775o033M668J0465O693l262j0164p315J787R968Q394j094
1776H727r099q938o96R189R463J110q084j0278j508P299R777L395o677r955m059
1791a0334N526J0264N383m843j0156o310M103R987O971k788r881p694J781R524
1805A533Q038q25q763q203p67Q385Q627J371p599r332k200O881R597L523o703
1820C563r604m451N751R967M955m812r262o017L055R495O809k394r136p426J595
1835g912R048P832m48q866q306l96Q162R019J078p388r011k360O377R857L253
1850I939o079r361m276M798R788N256m344r166n866L155R210O518k591q820o825
1865h664J057Q677P668l01q216q258p82P438Q812J802p033q949k669O143R175
$$ y = [5772, 10934, 5395, -5380, -11413, -6745, 3720, 10413, 7151, -3013, -10328, -8541, 1427, 9821, 8727, -372, -9310, -10006, -817, 8646, 9756, 1672, -8606, -10114, -2815, 6962, 10357, 3680, -6275, -10334, -4808, 5456, 10839, 5996, -4160, -10470, -6367, 3620, 10591, 7803, -2078, -9772, -7991, 1533, 9571, 8746, -17, -8220, -8987, -602, 8025, 9396, 1797, -7535, -9735, -2854, 6743, 10266, 3563, -6041, -10492, -4741, 5226, 10181, 5369, -3893, -9910, -6855, 2640, 9449, 7055, -2081, -9507, -7912, 1136, 8968, 8520, -346, -8652, -9048, -886, 8133, 9211, 1823, -7188, -9548, -3171, 6686, 9939, 3860, -5501, -9777, -4979, 4809, 10065, 5721, -3445, -9311, -6156, 3054, 9572, 6981, -1839, -8664, -7607, 1070, 8738, 8437, 221, -8037, -8819, -1381, 7431, 9233, 2200, -6749, -9418, -3275, 5900]
1880E900L174m885r400m482M802R302M706l315r242n978L038Q937O735k315q441
1895a464p370J306Q096P591J38p764q359o01O995Q483J800o306q918k786O140
1910c019Q932L387n341r119l987M590Q707N077l689q961n536K345R107O517j776
1925G234q620p095P95Q134P210L12p432q057r26O818Q464J831o225q606k963N933
1941c193Q845L567n052r057l960M055Q892N032l419q661o009K775Q461O004j229
1956G051q053p214P35P645P721K7p181p902j270O878Q229K341o416q857k653N866
1972c053Q742L362m764q642m530L912Q642N075l014q685o043K305Q773O332j380
1987G032q097p090N65P595P800Q4p324p605j129O493Q319J910o143q288l151N642
$$ y = [5900, 9074, 4189, -5211, -9693, -4891, 4411, 9117, 5802, -3440, -9418, -6380, 2557, 9292, 6977, -1464, -8834, -7528, 568, 8159, 8297, 533, -7826, -8427, -1432, 7051, 8851, 2545, -6373, -9159, -3019, 5913, 9300, 3959, -5160, -9147, -4557, 4150, 9227, 5538, -3423, -8959, -6614, 2493, 9010, 7234, -1386, -8481, -7686, 448, 7658, 7970, 538, -7519, -8445, -1627, 6837, 8668, 2443, -6163, -9126, -3193, 5652, 9219, 4167, -4890, -8850, -4795, 4097, 9129, 5710, -2951, -8960, -6185, 2276, 8280, 7051, -1002, -8216, -7481, 164, 7885, 7912, 731, -7171, -8441, -1563, 6666, 9007, 2591, -6266, -8919, -3053, 5689, 9051, 4287, -4355, -8885, -4973, 3669, 8744, 5730, -2955, -8998, -6693, 2080, 8412, 7032, -1065, -8155, -7590, 5, 7805, 7889, 565, -7040, -8169, -1676, 6643, 8553, 2410, -5878, -9029, -3387]
2003c387Q304L837m222q705m394L594Q625N058l202p950n601J810Q124O521j176
2018G236p982p144M98P526P435N86p097p840j458O680P929K096n541q138l191
2033h405M936Q257L907m156q464m589L376Q386N294l238p872n843J926P818O614
2048G947j121p527p235L67O951P335J143o923p786j581O261P899K596n546q147
2063e367k995M396Q716L874m124q394m486L115Q576N300k573p951o267J646Q071
2078A537O483p78p650o725p4O900P160J255o624p687j792O014P710K566n167q272
2094e144l322M596Q482L676l651q242n030L078Q148N363j959p893o323J232P660
2109F71O634o92o827p214j45O898P324Q97o341p346k025O001P587K921n189q104
$$ y = [-3387, 4917, 8754, 4532, -4173, -8567, -4973, 3652, 8710, 5508, -2442, -8043, -6233, 1891, 8412, 7236, -746, -7890, -7392, 134, 7569, 8155, 1058, -6782, -8240, -1560, 6369, 8465, 2924, -5214, -8405, -3469, 4788, 8695, 4539, -3925, -8514, -5138, 3248, 8542, 5304, -2568, -8411, -6485, 1333, 7947, 6826, -701, -7936, -7569, -618, 6717, 7860, 937, -6849, -8430, -2169, 5730, 8326, 2780, -5367, -8362, -3966, 4750, 8624, 4500, -3894, -8380, -5265, 3311, 8611, 6038, -1913, -8180, -6534, 1537, 8020, 7242, -408, -7133, -7207, -307, 6853, 8108, 1484, -6203, -7995, -1981, 5729, 8295, 3128, -5144, -8466, -3870, 4612, 8288, 4637, -3605, -8635, -5557, 2591, 7954, 5995, -1898, -8221, -6989, 671, 7305, 6613, -214, -7428, -7573, -675, 6649, 7546, 1205, -6141, -8166, -2165, 5422, 8343, 3154, -4950]
2125d950l259M139Q249M617l708q492m716K721Q051N526k128p738n725J265P043
2140H95O772p84o672p274k62O648P244R39n827p735k068N731P808K858m833q442
2156e002l447M382P960M102l339p974m811K746P720N359k119p189o209J063P206
2171D48O547n5o931o830o65O304P390J717o229p406k014N210P726K720m400p848
2187d316l951M196Q032M150l150p750n053K354P657N748j787p161o497R96O911
2202C79O502J93o489p362o23O265P221J506n743p492k012M630P867K947m474p569
2218d254l713L611P681M585k932p425n593K353P396N790j118p058o231L58O759
2233B09O563N09o594o471j288N597P430J649n275p412k527M516P688L216l761
$$ y = [-4950, -8209, -4070, 4179, 8796, 5088, -3404, -8120, -5399, 2652, 8178, 6050, -1688, -7413, -6148, 895, 7667, 6883, 211, -7063, -7325, -677, 6567, 7506, 1679, -6056, -8124, -2393, 5415, 8273, 3440, -5002, -8449, -4067, 3893, 7995, 4656, -3318, -8129, -5383, 2337, 7696, 5577, -1612, -7821, -6758, 448, 6995, 6940, 9, -6821, -7486, -1182, 6208, 7925, 1696, -5710, -7724, -2514, 5212, 7932, 3532, -4316, -8267, -4071, 3961, 8111, 4961, -2789, -7842, -5488, 2169, 7917, 6130, -1031, -7528, -6532, 379, 6881, 7074, 585, -6777, -7400, -1135, 6086, 7592, 1849, -5643, -7655, -3025, 4842, 7789, 3315, -4254, -7967, -4356, 3325, 7910, 4978, -2447, -8040, -5687, 1709, 7499, 6381, -677, -6908, -6550, 209, 6772, 7281, 687, -5784, -7072, -1475, 5955, 7604, 2329, -5083, -7610, -3094, 4594, 7810, 4049]
2248D049p980l925L228P537M823k521p216n442J516P204N972p65o679o803K30
2263f772O520O567O60o161o917j189N331P211J956m707p371k820M212P456L695
2278G671l540p580m115K744P388M904k340o782n409J389O875N735o94o721o129
2293f604M0O318O452J024n720p130j580N300P149K299m799p197k977M102O939
2308C616L889l024p544m216K673O907M658j592p057n448J237O569O081o14o358
2323b23o118o66O139O735R95n165o836k381M665P395K623m193o989l589L524P322
2339C238L934k857p011m315K178O843M876j489o530n632J159O130N994J21o302
2354C37o361q36N758O701J613n392o654k049M321O842K935l571p235l783L607
$$ y = [4049, -3931, -7856, -4628, 2909, 7732, 5211, -2005, -7447, -5931, 1273, 7245, 6480, -199, -7002, -6772, -252, 6315, 6975, 814, -6103, -7292, -1961, 5250, 7206, 2499, -4872, -7692, -3480, 3976, 7671, 4131, -3449, -7564, -4820, 2568, 7472, 5132, -1650, -7059, -5670, 1205, 6940, 6246, -475, -6604, -6564, -246, 6206, 7230, 1510, -5620, -7200, -1900, 5249, 7548, 2749, -4448, -7425, -3323, 3616, 7505, 4481, -3063, -7279, -4606, 2301, 6959, 5367, -1690, -7138, -5901, 668, 6749, 6135, -223, -6341, -7007, -868, 5867, 6862, 1697, -5139, -7520, -2855, 4540, 7163, 2970, -4019, -7608, -4084, 3238, 7172, 4315, -2696, -7011, -4833, 2010, 6886, 5397, -1133, -6765, -5606, 524, 6518, 6639, 337, -6024, -6860, -1102, 5599, 7212, 1820, -4834, -6883, -2562, 4280, 7215, 3644, -3591, -7374, -3767]
2369c767O791M154k667p099m187J739O400N339j306o247n839Q57N627O002N35
2384F332n746o523q15N455O227J762m807o553k342M175O629L062l695o322l909
2399g070L048O463M422k051o555m839J413O312N389n65o352n660L43N371N822
2414E491Q18n272o318j190M842O279K139m190o441k870L653O781L111l223o769
2429c159l487K407O658M119j817o263n106J457N932N156j90o098n630j34N551
2444f04O208M72n166o052j670M998O031K318m252o068l092L995O064L400k543
2459D039o449m122K373O344M233j766n902m754N48O105N017P9n399n726n58M819
2475a119O206J208n008n710j847M240N888K896l563o384l464L101O343L549k456
$$ y = [-3767, 3024, 7178, 4511, -2588, -6775, -5036, 1364, 6703, 5397, -850, -6689, -5832, -205, 5797, 6332, 586, -5937, -6752, -1297, 4930, 6692, 1885, -4668, -7010, -2835, 3794, 6856, 3161, -3161, -7070, -4022, 2441, 6863, 4812, -1743, -6582, -5169, 1143, 6532, 5967, -385, -6045, -5702, -331, 5491, 6309, 1037, -5281, -6471, -1629, 4650, 6789, 2599, -3842, -6712, -3059, 3722, 6833, 3610, -3159, -6646, -4239, 2419, 6538, 4721, -1542, -6648, -5191, 741, 5897, 5707, -391, -6021, -6155, -604, 5604, 6076, 910, -5142, -6812, -1814, 4217, 6535, 2283, -3785, -6877, -2882, 3182, 6582, 4039, -2410, -6532, -4159, 2185, 6418, 4652, -1250, -6004, -5456, 649, 5666, 5745, 346, -5380, -5938, -1119, 5087, 6295, 1287, -4423, -6270, -2030, 3858, 6754, 3191, -3193, -6657, -3556, 2787, 6336, 3880]
2490C880o221l768J622O130M527j167o039n054O72N291N788R4n548n626n77M748
2506a248N923J508m343o142j910L714O001K587l157n938l491K611O438L689k026
2521D216o376l697R86O218M524r55n652m608O4N068N583M07m660n764j179M319
2537a506N762J729l596o280k183K756O664K739k963o007l502K375O097L948j831
2552D202n814m419R84N700M931n13n242n179j50M718N725Q37m837n425j466M184
2568a764N743J922l154o250k742L338N945L386k503o089l731J854N623M347j103
2583D822n766m386M56N211M706M30m866n589m70M531N222J620m300n980j454L494
2599b319O002K241l073n760l120K461N597L788j595n968l808J059N494M223l87
$$ y = [3880, -2341, -6109, -4487, 1643, 6170, 5003, -1036, -6090, -5418, -127, 5661, 5755, 207, -5419, -5996, -1248, 4675, 6183, 1840, -4302, -6212, -2498, 3503, 6090, 2933, -3005, -6496, -3885, 2553, 6242, 4216, -2160, -5857, -4871, 1347, 5871, 4916, -736, -5344, -5280, -212, 5371, 5778, 1118, -4646, -5825, -1506, 4256, 5985, 2389, -3891, -6074, -3318, 3346, 6085, 3122, -2885, -6387, -4012, 2085, 6033, 4202, -1612, -6031, -5047, 653, 5584, 5071, -171, -5350, -5500, -782, 4943, 5780, 943, -4482, -5948, -1764, 3979, 5901, 2747, -3503, -6245, -2907, 3038, 6424, 3921, -2168, -5899, -4045, 1578, 5925, 4822, -944, -5330, -4874, 337, 5043, 5473, 607, -4982, -5452, -921, 4301, 5921, 1621, -4359, -5813, -2319, 3683, 5924, 2851, -2909, -6029, -3568, 2029, 5817, 4222, -1746, -5554, -4495, 999, 5222, 4835]
2614D835n477m979M65N123M975M24m491n368r94M010N837J123l657n237k388L088
2630b711N803K872k665n655l455K347N630L778j736n098m481J012N170M056K68
2645E135n085n023l32M495N935K55m390n254j401L832N292K059l169n573k417
2660e641K505N519K902j899n504l605J845N426L706j133n244m153O62M767M406
2675D559K88m217n417m25M283N121J093l552n512j775L260N786K309k961n312
2690b472l193K509N189L694k060n306l756J606M931M074n68m688m820L10M329
2705b21M631N24m398m924o95L648N041J790l505n246k091L138M997K663k460n316
2721b424k966J811N240L617j402n012m258J313M770M286m11m626m547O4M090M617
$$ y = [4835, -642, -5621, -5156, -33, 4942, 5366, 875, -4493, -5487, -1477, 4360, 5483, 1826, -3411, -5799, -2711, 3092, 5964, 3299, -2356, -5811, -3464, 2166, 5944, 4208, -890, -5371, -4359, 811, 4867, 5135, 50, -4973, -5305, -810, 5125, 5380, 990, -4264, -5665, -1833, 3459, 5518, 2349, -3224, -5641, -3136, 2383, 5285, 3386, -2118, -5723, -3878, 1548, 5254, 4121, -1123, -5276, -4614, 153, 4559, 4847, 630, -4787, -5212, -929, 4192, 5285, 1733, -3779, -5554, -2294, 3492, 5801, 2840, -2472, -5665, -3156, 2033, 5727, 3667, -1639, -5395, -3789, 1142, 5216, 4648, -40, -4860, -4550, -221, 4410, 4934, 536, -4388, -5083, -1435, 3606, 5396, 1891, -3355, -5446, -2308, 2689, 5352, 2892, -2424, -5390, -3579, 1661, 5278, 3876, -1136, -5394, -4081, 689, 4975, 4564, -62, -4609, -4545, -455, 4162]
2737D162O64l643n074j419L664M743K080k819n083k369K473N062K897j949n310
2752a921l074J472N140L590j322m632m260N10M828M337J05m630m325q12L759N019
2768C784J367l685n042j589K725N182K480k980m768k682K090N073L249j671n104
2783a571l575J201M820M156q37m428m034k24M287M173N70l491m976r17L477M877
2799C508J488l234n038j780L000M852K522k135m893l467J912M971L235r87m887
2814i33l598Q60M120L705K45m464m046n19M106M158R95l537m657j379L175M851
2830C082J759k878m748k444K456M898K922k185m580l069J257M560L636j001m342
2845f77l807O24L964M132Q1l989m106o46L280M662J379l032m585k187L200M302
$$ y = [4162, 4826, 1183, -3891, -5310, -1646, 3097, 5177, 2358, -2725, -5094, -2621, 2441, 5338, 3389, -1921, -4995, -3523, 1617, 5207, 3885, -747, -5007, -4497, 331, 4668, 4773, 143, -4182, -4994, -1235, 3784, 5151, 1466, -3576, -5165, -2440, 2742, 5222, 2242, -2526, -5208, -3118, 1955, 5204, 3533, -1571, -5146, -3945, 875, 5031, 4194, -234, -4268, -4492, -205, 3968, 4538, 1047, -3929, -4846, -1369, 3508, 4996, 1762, -3276, -5056, -2056, 2796, 5318, 3183, -1710, -5177, -3265, 1706, 4941, 3954, -933, -4531, -3671, 449, 4154, 4399, -65, -4111, -4630, -524, 3634, 4629, 1092, -3565, -4944, -1769, 3082, 4841, 1963, -2785, -5229, -2773, 2125, 5047, 2862, -1718, -4787, -3530, 1030, 4666, 3665, -677, -4484, -3860, 104, 4236, 4317, 328, -3778, -4424, -1144, 3518, 4897, 1865, -2720, -4907, -1707, 2595]
2861B595K102k200m465k509J668M630K867j350m551l047P41M175L620l96m231
2876c51l740KL961L895P07l779m160j135L126M367J742k849m417j919K211M556
2892B217K360k282m348k502J565M345L193j126m346l197L20M028L924Nl975l784
2908c603o31L410M298J202l551m082j403K605M580J964k860m014k266J976M487
2923B112K496j682m341k894J385L942L317q21l770l778L81L545L797K90l924l612
2939c557q59L590L559J484l004m295q71K305L751K237k379m112k118J521M443
2954A695K853j631l959l122Q74M115L182o15l733l552K49L446L699N54l670l497
2970c112r22L238L698J440k958l948j526K062M189K201j919l989k420J154M137
$$ y = [2595, 4697, 2497, -1968, -4477, -2809, 1821, 4688, 3338, -1213, -4260, -3519, 656, 4276, 3880, -351, -4091, -4089, -128, 3767, 4474, 695, -3465, -4600, -1474, 2893, 4635, 1786, -2631, -4550, -2339, 2217, 4577, 2295, -2053, -4555, -2990, 1355, 4548, 3422, -924, -4121, -3801, 227, 4151, 4156, 181, -3603, -4234, -824, 3474, 4676, 1125, -2957, -4360, -1755, 2825, 4789, 1929, -2085, -4351, -2375, 2112, 4608, 2926, -1415, -4309, -2924, 1018, 4335, 3514, -256, -4034, -3653, -108, 3689, 3979, 55, -3557, -4416, -826, 2733, 4217, 1213, -3082, -3953, -1648, 2103, 4340, 1961, -2151, -4269, -2748, 1695, 4548, 2917, -1042, -4164, -3290, 825, 4007, 3392, -341, -3893, -3644, -198, 3501, 4055, 385, -3112, -4034, -796, 2902, 4342, 1384, -2564, -4090, -2028, 2161, 4362, 2443, -1546, -3966, -2812, 1325]
2985A325K988j273l797l153N65L613L195j81l505l373J99K897L543O84k914l800
3001b987j070K779L840J368k157m106j706K071L582K227j648l603k294O23M170
3016A089K717o43l501l025Q5L619K937J21l179l198m97K674M022L09k385l636
3032b491j297K331L594J947k247l745j933J670L845K015j373l518k796J134L782
3047I18K771r06l363l202P12L018L087K07k844l301o56K786L409Q25k323l442
3063b304j655K407L270J948j714l789j714J462L703J952j116l523k373P69L405
3078G28K400j43l052k986L7K733L387K00k918l079o12K554L487N26k122l203j150
3095c213J625L521J600j538l746j657J026L502K391j168l163k667P93K692K987
$$ y = [1325, 4313, 3040, -757, -3910, -3345, 268, 3463, 3282, -223, -3596, -3397, -500, 3043, 3727, 813, -2987, -4057, -1278, 2562, 3930, 1773, -2333, -4039, -1968, 1614, 3841, 2193, -1410, -3704, -3081, 1089, 3806, 3163, -338, -3363, -3278, 341, 3278, 3399, 220, -2978, -3475, -801, 3221, 3530, 1145, -2491, -3788, -1457, 2137, 4084, 1837, -1908, -3841, -2171, 1674, 3689, 2316, -1202, -3998, -2864, 918, 3689, 2783, -580, -3782, -3070, -52, 3035, 3242, 398, -2903, -3559, -773, 2636, 3461, 1138, -2304, -3959, -1552, 1718, 3666, 1952, -1837, -3551, -2089, 1614, 3566, 2450, -1073, -3446, -2677, 728, 3128, 2985, -67, -3053, -3016, -283, 3104, 3304, 386, -2693, -3305, -751, 2736, 3262, 1140, -2063, -3213, -1588, 1933, 3533, 1995, -1751, -3408, -2382, 1120, 3511, 2343, -820, -3487, -2694, -2, 2985]
3110B985k88k612l147J12K534L030M09k505k755r85K010L225J384k282l118j354
3126c357J827L185J566j087l261j923Q84K928K440r69k642k456K93K837K641l1
3142B875k681k547l38K234K769O63k078l043j002K205K801J248j515l505j043
3157b957J243L088J595j060l111k012R86L003J954n35k798k094K53K356K426L38
3173B675k409k596p01K365K912O24k003k948q47J714L044J159j393l266j140J326
3189a484K679J852q27l038j824P17K554J859J64k954k068j81K794K099M89k373
3205D58k617l49J917K308R63j696k725p58J250K473J391j331k603j064O72K476
3221G65J727q01k397k362J055K137K702m95k616j750n72K188K610K40j947k437
$$ y = [2985, 2697, 85, -3062, -2950, -416, 2614, 3023, 518, -2237, -3222, -1212, 2013, 3397, 1115, -2003, -3357, -1530, 1655, 3221, 2134, -1127, -3050, -2166, 762, 3202, 2233, -409, -2865, -2572, 265, 2906, 2875, 194, -2353, -2691, -457, 2312, 2975, 897, -2146, -3148, -943, 1858, 3106, 1591, -1914, -2957, -1714, 1374, 2969, 1909, -1202, -3214, -2228, 775, 2729, 2194, -604, -2698, -2445, -89, 2337, 2675, 266, -2330, -3031, -666, 2246, 2870, 867, -2081, -2928, -1214, 1830, 2989, 1596, -1670, -2810, -1484, 1195, 3047, 2220, -818, -2642, -1925, 629, 2488, 2652, -302, -2370, -2551, 243, 2342, 2831, 458, -2159, -2508, -591, 1717, 2680, 984, -1741, -2499, -1249, 1224, 2615, 1284, -1319, -2383, -1711, 765, 2492, 1691, -706, -3068, -2013, 124, 2826, 2331, -285, -2035, -2607, -419, 2191, 2431, 484, -1953]
3237a953l29J654K576O15j686k485r61J378K287J638j126k630j585R27K542J481
3253B343o32k171j845M48K145J893J11k266k026m40J854K499N70j838k460m54
3269b269J531K164Q04j201k219j539J406K396J087r25k298j480Q74K116J869n27
3285A789k230j577J34K007J893Q3k075j748j66J375K236N08j977j876o25J636
3301f13J962J007j565j826j327J084K297J142q76k104j399N41K081J509p5j850
3317a2j655l60J927J895l32j144j893o00J764K118M31j401k036n77J354J937P32
3334B148q42k499j096J035J750J308k71k012j438M91J757J610j57j844j446l67
3350a873J972J576L65j733j611m32J335K017Q3r44j894q52J190J867Q26r10j796
$$ y = [-1953, -2282, -628, 1948, 2563, 877, -1608, -2569, -1191, 1096, 2734, 1608, -1022, -2607, -1680, 862, 2343, 1711, -460, -2305, -1857, 288, 2181, 2292, 26, -2000, -2440, -586, 1913, 2483, 645, -1815, -2269, -738, 1426, 2230, 1029, -1190, -2729, -1323, 1073, 2160, 1235, -1063, -2543, -1669, 447, 2316, 1789, -441, -2018, -1884, 123, 2016, 2099, 24, -1724, -1890, -515, 1721, 2229, 252, -1624, -2249, -613, 1349, 2356, 791, -1035, -2362, -1278, 1019, 2161, 1285, -819, -2218, -1677, 404, 1913, 1838, -12, -1667, -2027, -100, 1795, 1463, 319, -1574, -2174, -410, 1708, 2139, 738, -1298, -1875, -521, 1416, 2148, 1306, -1193, -2289, -1254, 496, 1804, 1533, -479, -1917, -1426, 331, 1941, 1784, -60, -1506, -1873, 99, 1675, 2040, 307, -1304, -1736, -401, 1616, 1699, 755, -1139, -1991, -801, 1066, 1892, 982, -814]
3367h14j219J049J606J080j97j890j405J23J829J501Q4j732j711k3J686J299M17
3384A683j247j631o32J058J992M71q78j811q29P06J873J345j157j675j018M16
3400a334J531J303l57j266j837N63J269J601J2j495j064m30J470J310M37j443
3416B70j303n97J204J341Q06j092j325r47P30J877N44l62j706j045K22J816J155
3433A588k20j704r44j61J595J403M3j619j278k82J190J454L91j036j459n81J007
3450f13J400Q11q81j611p75M88J726Q41l99j226j223rJ606J116jj325j312o1J382
3469f6R74L79p75j527j32P17J529K91n92j686m70M62J501R36n12j913m01N39J153
3488D07Q18l09j237p57J67J094Q01L34j167j560K17R70R94Q34j390j403l71J085
$$ y = [-814, -2033, -984, 622, 1702, 1505, -385, -1790, -1667, 162, 1663, 1747, 15, -1696, -1719, -33, 1266, 1683, 436, -1195, -1827, -769, 1223, 1694, 816, -995, -1824, -1118, 755, 2100, 943, -732, -1750, -1334, 197, 1500, 1143, -123, -1960, -1397, -128, 1473, 1485, -10, -1074, -1504, -34, 1276, 1713, 270, -1033, -1630, -426, 915, 1721, 629, -696, -1643, -913, 964, 1508, 1146, -560, -1605, -1383, 433, 1588, 1368, -336, -1280, -1441, 154, 1557, 1600, -19, -1297, -1579, -389, 1065, 1456, 420, -1039, -1620, -613, 787, 1598, 717, -894, -1669, -1181, 545, 1386, 987, -239, -1462, -1471, 135, 1251, 1250, -75, -1387, -1448, -66, 908, 1287, 512, -1015, -1147, -430, 1099, 1390, 798, -888, -1358, -896, 605, 1541, 1029, -884, -1285, -746, 407, 1225, 916, -321, -1078, -911, 183, 984, 1318, 151, -1409, -1192, -222, 772, 1606, 216, -1187, -1558, -473]
3506d73J260N21q26j220o75O20J411M59n30j042r27M45J086J189j20j553q94J95
3524a074J342J043k26q43j507j08J137J099N16j051j281l8N51J246O55r41j141
3541f21l70M22R49J098q88o87r78K76R24R40J54j427q66J23R57J001J26j023j080
3560i70Q6O58J292K40r68r46n23Q37R96M07m26j303n08K65J384O17m78r50o65
3579i55J18J102Q07mq23j609J52J056J153J07j048q89j73N44J068L91p14q86m69
3598a072M91J182N66o47n84j267P83P52R73n35r35n21O9J026O48O1j017n51j84
3617g62M03J077L18r29r02j84Q19Q45N49p04r12o13M59R86O74n69j005n34K22
3636g62J142O99l63r69n61j67J132M53K82q77p08l19R59P85M30r13r32m80O20
$$ y = [-473, 787, 1308, 482, -738, -1413, -793, 618, 1077, 547, -495, -1422, -977, 109, 1298, 1178, -375, -1269, -1074, 268, 1311, 1085, 242, -1265, -1373, -236, 863, 1379, 328, -953, -991, -440, 806, 1461, 520, -621, -991, -569, 380, 1478, 590, -97, -1075, -799, 125, 1065, 1219, -208, -1074, -951, 6, 1007, 1133, 110, -970, -884, -226, 1066, 1306, 338, -608, -1131, -294, 702, 1109, 683, -620, -1128, -863, 521, 1138, 660, -290, -955, -837, 265, 1072, 1068, 245, -1364, -1212, -156, 997, 1104, 56, -833, -1006, -462, 606, 997, 283, -603, -1072, -581, 601, 1167, 520, -64, -1331, -548, 204, 1177, 642, -293, -814, -745, 281, 929, 990, -27, -578, -762, -359, 718, 1036, 107, -795, -979, -160, 685, 1234, 530, -382, -995, -536, 450, 1124, 555, -450, -984, -762, 380, 1079, 716, -253, -814, -981, 151, 604, 886, 9, -699, -1018, -59, 726, 1156, 243, -689, -1169, -549]
3655e49R97N72o65p57m96N84N18P22k9q77o79n1N64Q81M29j359m30j35N59J135
3675I34R6r57p62l53N42J320K67p49j111l23Q08M85Q57l74j128p1M8J022M78l69
3695F60j177k51M7O10J164j08p74r40P4P33P55K93j071o59m10O36J217J35n05
3714D29q94k64L42P27M78l41q20r7n1Q76K64J60q54r61M00P66N62L09q94j020
3734h83J07P37R23k6o82r33k41P97P56J10k30r75l01J67P70R90o42p53o34M23
3754e20J076L24O5j170l14Q9N72Q63q2q38r86L24M95Q46K21o30p90l69M21Q47
3774D44L40k57r59o37K25R89M75J07o90j073N20Q83K42M88j314q29P7R27R90k15
3794G33o52q66r9Q03P35K61n90q74l93P58P94M65n55r98l25K16R48L95k13p47
$$ y = [-549, 448, 1020, 355, -402, -898, -314, 204, 926, 897, 20, -659, -710, -146, 735, 1164, -195, -625, -760, -201, 934, 1030, 73, -689, -1042, -500, 820, 1087, 338, -773, -1096, -288, 197, 1054, 680, -448, -519, -471, 551, 1029, 660, -517, -768, -721, -111, 1053, 945, 171, -769, -695, 38, 793, 1086, 15, -644, -1054, -418, 799, 934, 429, -465, -729, -387, 340, 818, 477, -343, -440, -491, 385, 649, 809, -45, -1006, -606, 160, 722, 1031, 137, -883, -776, -39, 884, 858, 176, -757, -998, -201, 555, 665, 435, -540, -841, -674, 96, 1086, 444, -309, -943, -520, 556, 880, 945, -225, -539, -450, 122, 985, 903, 65, -921, -597, -102, 744, 965, 335, -455, -824, -403, 444, 784, 527, -432, -1069, -844, 145, 620, 727, 37, -1036, -516, 367, 609, 1097, -217, -1046, -969, -42, 948, 733, 81, -785, -884, -81, 654, 915, 325, -549, -942, -184, 610, 1075, 520, -478, -803, -587, 361, 756, 543, -204]
3814b04o96K84P57P35Lr68q04r4J191P35o5o04q02k18M40R39M54q35p87l02N85
3835b56Q00K86k58r11o69K92J002O31l41q38m33l2Q53P37Pj013p52m1Q57O74J30
3856G25n42n84l65N73J000J42k17j166l54O45P20M98n51r03m09N1P44Q43k26p81
3876a57o15J4R54O34J4n72r18k57N86J088N7n64p97m07P34N71P37p59q46n48P30
3897c21Q29O63k80j059p80K86O55R14N7r11q24O7O58R07K34q24r21l89J003N98
3917E62L59m43r93m44M28Q03N68m24r81m56K01R76Q40k16j100n19K5R16N84N9
3937G45j035o26j06P75J179l91l07n18l91N60N12P48p55q51n83M19J082P10m85
3956F82q70r22N03R29M98j17q00q30K9P52J019K37j119j042J87O15P87M65o22
$$ y = [-204, -900, -616, 141, 876, 879, -89, -893, -987, 204, 939, 874, 270, -532, -750, -310, 629, 1083, 248, -539, -841, -256, 544, 830, 572, -339, -1008, -716, 286, 917, 576, -262, -695, -727, 126, 863, 870, -143, -895, -936, -79, 595, 725, 183, -401, -766, -193, 807, 949, 732, -434, -788, -143, 577, 1075, 524, -379, -788, -737, 7, 850, 624, -157, -772, -758, 196, 830, 844, 272, -646, -903, -317, 771, 828, 264, -533, -940, -206, 365, 1102, 343, -503, -1051, -321, 508, 1171, 891, -168, -948, -662, -7, 907, 964, 53, -771, -704, -46, 861, 1095, 271, -650, -1039, -36, 562, 921, 478, -515, -959, -531, 272, 840, 416, -565, -1021, -820, 156, 996, 780, -320, -839, -814, 102, 686, 745, -290, -916, -1022, -247, 932, 541, 234, -284, -675, -115, 397, 1145, 390, -461, -1044, -625, 457, 1167, 682, -188, -1110, -607, 322, 820, 703, -97, -927, -898, -146, 873, 1110, -9, -1051, -864, -249, 538, 1003, 381]
3975C81j274k24R77O66N57n73r33o02K16J077Q06m71p96p75M2J316N80rj106p80
3995i25j34J036J153k19q44q91j22R37P21L69m85j075l64M92Q10K45k48j080l60
4014i84l00J390P92l55n70j173K86J002P96j99q73m82j57M22J289K77r99p95m34
4033a067Q26R00K68n39r41l75L42R93P02n60q33o67J14J252N60l50p48q42K59
4052g06P76J086l00p83q14J5O15Q43K71r18r88j32M22J385K70o56r73j82O1J143
4072D35O08m39p90p32J63J040O90k52r58n62l9N68J184j48k82j079n21N11J241
4091F38O07j068o84n09M50J165N08l39q25q48K95P35P32J68j192p20J11P68R22
4110I14l9p96q68k14P40J195J01o63p68n95N08P65O74o49j167k6O37P27N02k90
$$ y = [381, -893, -1117, -140, 526, 1083, 510, -423, -1025, -809, 268, 1074, 603, -193, -968, -926, 390, 970, 961, -145, -925, -1059, -23, 1130, 911, 67, -824, -946, -9, 712, 1081, 596, -479, -843, -351, 459, 704, 456, -624, -984, -1284, 106, 898, 543, -27, -1200, -914, 88, 884, 685, -188, -670, -827, -405, 884, 1161, 162, -633, -1067, -241, 659, 927, 388, -553, -928, -586, 407, 1109, 549, -284, -951, -837, 415, 975, 625, -123, -965, -706, 70, 1156, 856, 73, -741, -726, -111, 732, 1003, 85, -903, -1035, -613, 772, 1042, 386, -587, -769, -708, 435, 1043, 604, -186, -918, -755, 285, 975, 723, -235, -797, -836, -268, 916, 768, 486, -593, -1114, -603, 638, 1245, 177, -507, -1016, -566, 599, 1107, 768, -57, -905, -610, 125, 857, 1025, -167, -887, -776, -8, 914, 875, 79, -789, -1003, -263, 932, 1033, 370, -398, -993, -485, 280, 954, 305, -862, -888, -251, 476, 978, 688]
4130F88p99n77N5Q67P79k47r55o36k36J163Q01N9r02j015k1M89J201K35m92j070
4150f13n16O97R37L43k16j037n01K81J196K12o6r27q03J99J049L13M26j034j088
4169a148M82M32R21L79q62r77p1P25O54K57n09p61o51L80J362K08L9j477o26O70
4189e73Q90P52o7j070p28k92J091P38N7o03j119J66M84R41R3m34j115k25M65J246
4209F97J41k64j069o76O26P60O75m91p46m61J54R46M38J59p86o96j57P32Q60K78
4229A120p01j008n42R98O28N67q76n09m15M03P97N69j87j104r11N08R14P62l93
4248F20r87m21J30P00O20K24p61r00rQ13P09O7k13j153l22L10J444J78p33n08
4268a92n77J18O26J010m41n38j150O36N20P62K10r56p27K3M63R77K78q22q26k40
$$ y = [688, -111, -688, -633, 234, 1013, 766, -189, -825, -1061, 102, 903, 962, 60, -955, -976, -487, 714, 949, 457, -613, -1129, -432, 505, 848, 632, -405, -906, -625, 571, 783, 717, -210, -1013, -814, 235, 548, 974, -60, -1148, -666, -234, 687, 1066, 204, -773, -844, -119, 535, 792, 283, -478, -1129, -749, 613, 821, 860, -617, -1243, -573, 317, 1069, 1002, -68, -796, -1088, 3, 741, 798, 195, -924, -758, -274, 667, 760, 326, -789, -1014, -549, 697, 838, 574, -495, -1171, -545, 215, 890, 399, -347, -808, -654, 292, 730, 889, 103, -593, -750, -18, 842, 1120, 419, -589, -1131, -133, 495, 1062, 186, -323, -738, -335, 462, 1031, 844, -260, -1171, -663, 251, 1013, 620, -367, -788, -658, 42, 662, 886, 125, -775, -784, 29, 738, 805, 592, -561, -883, -573, 871, 1049, 316, -192, -769, -651, -25, 985, 544, 6, -1144, -508, 12, 774, 984, 28, -699, -676, -213, 764, 1042, 220, -606, -846]
4288h46M57Q15K86k67r75m58P73P57K15l62p64n07L51P76Q97o09q71j35k09P60
4308H4R54j45o85j166J08Q15P18Q8k63j292j03L65J107M48n29o70q71N64N83P07
4328H17k03m58j144P1R78P21J2r00n68l2N54R24N7l24j207k61Q65O14N10p13p26
4349d13n49O25O70N72n09p04l04J37J032J49J60j007o34j51J082M42O4m31o31
4368d00n65O05J051J63o10m48o63O07R36J15k98j118m36M24Q67M31r8o17p29k6
4388h09J242L83p1r60m30m00J094M59K61n94j153P4P63O19N73q46q49k07L18Q98
4408C65L94n8j141l04O1P74O97Ln21r88j82R15N68K96q50p86k11P51Q81J48o87
4429A25p80j22O54N04O80n54q01o54K22J035L59J45j111n28j66J054R02o4q71
$$ y = [-846, -389, 426, 712, 445, -530, -988, -215, 542, 757, 395, -369, -876, -525, 251, 1148, 539, -332, -467, -676, 84, 1038, 893, 208, -958, -850, -35, 683, 771, 508, -784, -887, -522, 585, 1033, 504, -166, -1037, -473, 110, 817, 614, 156, -988, -917, 61, 782, 794, -106, -674, -706, -152, 772, 829, 505, -702, -963, -98, 516, 1026, 313, -413, -962, -337, 333, 905, 396, -308, -612, -475, 557, 706, 866, -141, -775, -926, 156, 598, 662, 231, -400, -965, -360, 691, 854, 244, -204, -867, -260, 676, 791, 493, -625, -1061, -637, 230, 661, 563, -54, -783, -809, 433, 816, 745, -215, -645, -1045, 49, 508, 769, 175, -978, -904, -141, 478, 1051, 205, -644, -851, -533, 365, 759, 701, -440, -744, -683, 91, 788, 791, 270, -718, -900, 15, 583, 879, 29, -757, -968, -217, 664, 812, 125, -655, -777, -123, 381, 1061, 507, -294, -948, -726, 309, 668, 813, -298, -826, -992, 62, 964, 900, 29]
4448B9n23k58P38M89K09n77o08L2L27P28K76l79p12o80L87Q25N72n18o12m55Q7
4469f23Q36N97N6r43n33j77P91R64l8j006o48k44O32J098K63q06p92k80N43R14
4489F04P4m27p14m5Q1P49P02m37o78p66K77P55P99k16p82r13K7Q23O37K27m22
4510C55q05o39P14Q28O94p37p96q61Q83O53N85k88q04q59M48Q75P72l81p75l47
4530d85L2N12P40K88j016j001k62J033Q01L72n24q94n22K69J014P71m04j207n57
4549a040O55O45P22k32q84r37J82J054N52k8q51q53M38N64O09N06q73r89k29M00
4569e89J073K29m37p54m37L49J119N92n76r15p62N17P27R38lj285l54m56J149
4588A25R56k06q59l39o00P92P72M20o90q94m83N56J164J55l86r87p76O24Q16R10
$$ y = [29, -494, -752, -14, 475, 684, 107, -501, -469, -142, 586, 862, 483, -229, -909, -522, 303, 875, 357, -255, -710, -623, 213, 810, 866, -77, -610, -787, 4, 968, 930, -76, -724, -968, -336, 762, 1025, 219, -573, -853, -310, 604, 678, 251, -463, -508, -427, 322, 1024, 587, -91, -857, -580, 175, 974, 758, -24, -937, -910, -87, 550, 777, 355, -450, -1089, -375, 453, 1147, 410, -386, -1247, -364, 289, 874, 586, -218, -1077, -629, 246, 1018, 637, -138, -485, -453, 59, 799, 1087, 71, -930, -1192, -159, 642, 1014, 490, -404, -926, -657, 357, 1128, 724, -483, -1040, -385, 260, 982, 750, -134, -1071, -889, 165, 717, 689, -162, -1015, -577, -13, 596, 1102, 229, -760, -989, -589, 484, 713, 276, -478, -915, -566, 553, 1145, 569, -346, -1108, -591, 136, 1074, 1071, -214, -568, -1024, 125, 1081, 875, 16, -323, -923, -131, 641, 1061, 371, -523, -1006, -450, 714, 869, 483, -504, -1280, -656, 160, 1070]
4608A070o83p32n14j74J108R84k19o82j097m6O01R10M75p36j087l74R14O48M90
4627H56m10r79p17O95J066L60l99m57r44K10J092P99l33j096o72m8J194P71k11
4646G77o88j069j93P76J197J33p83j029j59Q43N70Q77p93j212l61K10J487M85
4664A068M9j324r49j2J413Q51l8j177r02M94L97J430l98p40j014j79O58J373m8
4683I52p54n95o73Q42Q04Q14j100n16r53O15R97J025m71j163p80J17J030O38Q9
4702I18j077p83j36N65J442no77j049k92O00J273O38j297p51n95P42J220O22p71
4721E87j005p53P71P97O46r9r73j281J57J176Q32mr22q48j20R59J230k53m33j443
4741i79k68Q83J259L24l43j238j050N85J396P73q13r03r31K44J087J019k20p14
$$ y = [1070, 387, -345, -859, -1033, 75, 1059, 840, 158, -939, -985, -384, 526, 1001, 265, -822, -1196, -282, 366, 856, 446, -533, -1250, -555, 511, 871, 472, 15, -929, -719, 373, 1172, 839, -257, -929, -977, 217, 988, 777, 89, -980, -1173, -397, 800, 933, 150, -879, -1038, -195, 375, 1252, 459, -753, -1114, -904, 583, 1068, 1117, -207, -1156, -1168, 245, 1096, 1058, -119, -1021, -527, -130, 1300, 902, 162, -852, -1031, -373, 1000, 952, 198, -397, -1070, -228, 576, 1390, 290, -226, -1179, -564, 433, 1458, 987, -176, -956, -839, 191, 829, 918, -159, -942, -1078, -513, 929, 924, 247, -802, -1094, -494, 779, 1417, 120, -631, -1226, -484, 736, 1358, 587, -418, -1171, -400, 397, 1043, 944, -29, -1310, -1153, 23, 855, 851, -71, -919, -1039, -80, 1150, 897, 464, -979, -1247, -364, 895, 1219, 876, -362, -1412, -827, 569, 1342, 529, -374, -1305, -1061, 26, 1045, 825, 111]
4759A11j176K52J075P18M12j321j045l1M19J324M75r68j022p40P17J046J186o73
4777G59j520m48L23J276O94j80j274p10k7J040J182q9j261o46m36J237J116J42
4795A178p94j284m08R41J123L92q17j380k31O17J262M00k57j263r03L12J380J087
4813A355k47j277j008Q5J245J096K30j525p56l16O97J330N22r56j362m52Q06J362
4831H29N71o17j455p25O31J249R09n64j365q30J77J385J064k77j034q33j74J100
4849D1R60L47j109j125q2M10J341M36p84j339k51M82J424M92m61j205j004M79
4867i48J628O40o14j027r31K0J153J090J52p46j695q3J378Q35N33j203r18o31
4885a367Q36J308Q48r84j378p31N83J617O71n52j229j149M79J257R28j80j012
$$ y = [111, -1065, -813, 262, 980, 1392, 71, -974, -1005, -586, 738, 1213, 245, -777, -1517, -800, 246, 1432, 759, -761, -1209, -886, 390, 1084, 904, -370, -1080, -1107, -67, 1115, 1026, -235, -881, -1317, -80, 1036, 1178, 384, -900, -1308, -367, 756, 1148, 331, -1049, -1280, -663, 599, 999, 742, -521, -1424, -1112, 268, 1355, 1108, -169, -1177, -1092, 153, 1249, 1479, -46, -802, -1118, -421, 909, 1431, 475, -887, -1339, -533, 829, 1400, 783, -672, -1397, -766, 483, 1392, 828, -537, -1367, -1190, 195, 1259, 982, -52, -885, -1059, 41, 1001, 1348, 239, -886, -968, -558, 783, 1219, 435, -904, -1155, -673, 751, 1243, 782, -423, -1427, -948, 680, 1320, 706, -321, -1252, -1232, -79, 1011, 1163, 417, -1278, -1361, 17, 852, 1385, 182, -736, -1367, -531, 777, 1625, 641, -737, -1468, -885, 732, 1403, 851, -378, -1527, -1048, 209, 1137, 957, -55]
4902e5j212m7J182J035N66j361j200j65R39J304L91j088j334j53O03J452M62m81
4920H38j428q29O02J343Q70m17j475p64N28J003J154K9j619j133K93Q16J196K15
4938A222j113j319k42J141J240L25m48j366o35N12J427O15p60j065j061O59J332
4955D64R81k48j502p27j14J422P54R5r91j379O4Q82J288K97j137q72p43P81J443
4974G58P28p98j539n49Q04J136P84n59j103j048L11J372R55j57j215r48l24J429
4992C7P64L64j147j336o4J167J272N25j193j497m38J099J291P74q35j282j104
5009a603N57J420R39m76j188q28J66J492Q19k7j491j064j39J469J068K92j122
5026B84j333k58P26J359M90p83j366o10P50J488R32q19j476p83J95J636Q47j42
$$ y = [-55, -1267, -1314, -132, 903, 1469, 108, -1092, -1257, -318, 986, 1377, 289, -1045, -1198, -595, 857, 1319, 838, -590, -1419, -817, 526, 1396, 979, -496, -1260, -732, 271, 1425, 1454, -165, -1298, -1005, -189, 1007, 1222, 109, -1210, -1452, -311, 929, 1254, 806, -560, -1195, -683, 744, 1359, 599, -466, -1527, -868, 464, 1445, 1197, -305, -1032, -1146, 276, 1030, 1125, 134, -1245, -1181, -299, 989, 1286, 149, -723, -1466, -685, 758, 1486, 688, -851, -1400, -596, 540, 1324, 765, -338, -1386, -1075, 297, 1252, 1095, -120, -1068, -1392, 37, 801, 1165, 18, -1318, -1382, -215, 1057, 1582, 389, -1108, -1546, -447, 844, 1618, 783, -499, -1603, -1046, 374, 1313, 837, -351, -1179, -1013, 479, 1298, 1271, -220, -1284, -1423, 46, 1114, 1406, 284, -1049, -1307, -581, 778, 1268, 485, -881, -1491, -741, 747, 1679, 860, -616, -1399, -1204, 432, 1279, 1137]
5044A137j236j048p6J494R47n8r58j458r7J123J356J36p54j336p19R19J417O87
5062A476p12j294q76O57J232R88l15j672n31J85R25J013j40j041j216QJ071J539
5080A297lq40j316j87Q40J354K33q49j224p71O96J553N16o51j272m95j1J832R07
5099A609p37j064j033K51J103J136O5j240j167j78Q82J700R9r06j282m40R08J480
5117A186L17q67j878P9Q8J669R21o58j169r90J5J281J505m87j222r23J97J139
5135B03J126J21j484j058j82O34J529P54j124j682k72Q95R86O49n59j189p70N19
5153i04J419J006l40j763r52L68J317J039o0q67j407OJ090R99L24r40j338o4N79
5172d88J415M81j136r52p12P16J479N62n24j159j116M89J030J130J05j691j075
$$ y = [1137, -99, -1147, -1223, 271, 1218, 1160, 202, -1256, -1353, -230, 1126, 1262, 508, -828, -1547, -628, 789, 1476, 764, -530, -1406, -749, 483, 1471, 1156, -516, -1047, -862, 63, 1076, 936, -105, -1321, -1313, -242, 1297, 1294, 454, -862, -1049, -209, 1145, 1378, 529, -695, -1466, -770, 783, 1299, 648, -624, -1119, -1130, 702, 1609, 872, -192, -1225, -974, 129, 1265, 1330, 90, -1077, -1255, -373, 1327, 1426, 520, -762, -1202, -294, 1186, 1503, 636, -1242, -1163, -1075, 594, 1515, 857, -312, -1302, -1287, -6, 1499, 1012, -210, -1133, -936, 203, 1329, 1450, -34, -1092, -1274, -640, 889, 1643, 519, -1163, -1435, -540, 446, 1095, 536, -653, -1423, -904, 515, 1521, 1181, -582, -1534, -1166, 151, 1190, 1130, 263, -1144, -1138, -48, 951, 1275, 335, -1003, -1067, -488, 927, 1408, 272, -680, -1392, -676, 803, 1365, 841, -318, -1434, -945, 85, 1215, 1320, -371, -1446]
5189a446M99J132J088j26j047j018k42Q45J376J24q02j358l69P33J436N78j106
5206B97q37o63J81J585O09j46j411r64L71J294J068l79j007j121mR58J477j8r73
5225C17j421l9J002J084L73j011j049p27Q43J394O39o19j197p03m0J711P28j70
5243A115j436p44J77J027J042K16j494j107J1Q24J324M00j332q26k38O19J365
5260I43L63q96j223n90P14J245J190o80j652p52M03J151R62k4j415r42n8J098
5278a63J403k65q67j199l19J253J108O81j263j101q32R59J475M94m86j521o83
5295a326M84J372R33n11j312j098L50J273J314k47j366j157Q3J200J214l5j062
5312A09j206l54R09J280N48o66j205p41P78J128P77l70j326q24J10J496J033p23
$$ y = [-1446, -947, 185, 1273, 1147, 100, -918, -1160, -315, 1061, 1185, 383, -975, -1344, -611, 825, 1403, 297, -540, -1203, -1022, 563, 1172, 1026, -385, -1349, -978, 316, 1384, 1005, -2, -1123, -1127, -169, 1308, 1290, 317, -1104, -1143, -141, 943, 1316, 305, -744, -1471, -628, 766, 1405, 786, -411, -1114, -1154, 557, 1285, 1115, -321, -1065, -888, 139, 1181, 1397, -97, -1204, -1193, -369, 955, 1355, 23, -803, -1041, -422, 943, 1306, 410, -813, -1403, -689, 556, 1746, 1066, -586, -1338, -935, 216, 1178, 1154, -261, -1203, -1261, -163, 1240, 975, 108, -1091, -1410, -157, 951, 1632, 369, -732, -1564, -605, 870, 1364, 878, -643, -1326, -842, 530, 1463, 952, -360, -1458, -1108, 165, 1479, 1232, -134, -1291, -1208, -8, 1206, 1171, 109, -1097, -1451, -542, 738, 1286, 620, -585, -1326, -548, 580, 1357, 987, -339, -1163, -1053, 443, 1476, 753]
5330G53q71j136N3J264J161N8j312j052J14P25J246L58j045j454r1R35J363L16
5348A385o97j494n86O93J392O64l81j763n75L70J215R84r8j421j098K96J363O90
5366I39L09r59j363j14P69J243N02p78j593j49P53J223M87n04j211o23J39J290
5384C60R44m47r19r89j35J239J252k47q26j329j00R07J319L6p75j060o01R99J099
5403G27O65j009j098p73R24J249M34k43j341p19N29J063R15j73j158j114M9J136
5421F3Q56L73j058j227m25J278J419K87j023j425m94J098J078M17o25j339l21
5438a068J20J352Q29m0j705p49L21J263R30l5j427r47J07J076J204j26j155p96
5456h46k49O74J413J9l37j449o25O76J193R96o68j347q44N18J565M11n46q85r33
$$ y = [753, -118, -1254, -1201, 63, 1224, 1282, -30, -1082, -968, -243, 1003, 1361, 316, -1138, -1229, -294, 1069, 1385, 688, -806, -1392, -699, 693, 1357, 976, -787, -1362, -992, 223, 1207, 1109, -312, -1410, -1114, 249, 939, 1248, 289, -1074, -1188, -419, 824, 1326, 548, -1045, -1194, -441, 782, 1269, 765, -446, -1069, -930, 360, 1304, 857, -62, -1051, -1186, 53, 1305, 1058, 232, -1097, -1197, -290, 1029, 1065, 290, -770, -1371, -372, 727, 1392, 383, -715, -1488, -564, 685, 1119, 876, -465, -1184, -655, 408, 1323, 1150, -8, -1122, -1073, 63, 919, 1292, 234, -993, -1418, -140, 1279, 1566, 543, -882, -1376, -278, 800, 1217, 592, -747, -1068, -948, 404, 1233, 1193, -512, -1261, -940, 323, 1253, 1218, -209, -1156, -1049, 27, 1231, 1105, -50, -846, -1095, -421, 992, 1011, 674, -775, -1400, -724, 469, 1465, 797, -550, -1394, -876, 689, 1100, 554, -331, -1264]
5475a264L26Q76J121L76j442j065l62R66J281M83q89j240l74N70J518N45o53j460
5493f87m89L24J439Q42q53j188p29N41J188Q87l18j279q51M3J189R46K71j157
5511A19j032r7Q84J248J13n72j518n50Q28J493N97r77j194o99L53J295R46j79
5529A058j406p34Q0J229J214l93j279p84o8J063R18J91q67j169l94J159J218L17
5547A353q33j189r39R53J239Q46q34j586l68L55J297J023k22j585p14N4J466Q28
5565A144J60j574n53j32N98J565K30j223j295k29J145R59N05q05r80q79L95J703
5583G34P59l62j842q00O44J077R67k45j146q69j21J333R06K52j033j337j51Q40
5601c94J184O85j134j229k81P21J264M11m46j605p81O04J453Q94k87j526r68L11
$$ y = [-1264, -938, -62, 1059, 1435, -7, -1072, -1434, -468, 813, 1296, 407, -833, -1207, -637, 881, 1426, 773, -687, -1176, -852, 587, 1429, 576, -612, -1341, -800, 388, 1275, 957, -322, -1173, -1130, 59, 1005, 1276, 119, -913, -1010, -126, 1122, 1235, 663, -855, -1405, -577, 916, 1513, 536, -658, -1357, -1004, 291, 1237, 1058, -348, -1082, -1002, 227, 1441, 1048, -231, -1015, -1083, -20, 898, 1089, 222, -947, -1341, -182, 1036, 1353, 520, -669, -1608, -655, 584, 1430, 596, -990, -1358, -1003, 294, 1317, 1095, -490, -1204, -1150, 316, 1144, 1304, -270, -823, -955, -357, 1208, 1438, 215, -1080, -1309, -164, 795, 1300, 495, -485, -1364, -969, 734, 1493, 1131, -711, -1511, -867, 210, 1177, 932, -214, -1083, -1204, 129, 1035, 1287, 254, -1083, -1234, -394, 790, 1475, 341, -888, -1169, -448, 816, 1227, 781, -824, -1605, -1001, 452, 1346, 1059, -467, -1435, -1124]
5619a124J381R61j41j331r08R6J156R48K14j218j013m34J099J093O41q76j548
5636a004n50Q08J285Q64r51r35p78L95J365P29k46j538n39o0J069J495l66j035
5654Hj280J77Q22J289J74j156q56n10P06J449M47q37j300m93N74J344P52p64j038
5673d92q87O22Q04J409l47j474p19n1J257J218l31j023j103J57J024J015K49r27
5691D01j471j71N04J515R12j038j402m62L58J478O36o75p94q43J43J192Q31j32
5709I82j423o82j72J216J032L77j142j252j21O72J495L89r84j328l17O92J327
5726G61N65m89j538m98N28J232Q12m50j058j022QJ365Q51J02j145j442K54J123
5744d1J027K11r17j153l27P70J417L15o61j650n41R42J187P50m94j399p20N25
$$ y = [-1124, 257, 1218, 1077, -254, -1162, -1066, 90, 1038, 1252, 34, -979, -1413, -314, 779, 1420, 544, -1004, -1554, -746, 539, 1403, 452, -483, -1261, -866, 499, 1228, 982, -556, -1095, -1155, -86, 1409, 1043, 8, -1272, -1095, -273, 1016, 1190, 34, -822, -1332, -626, 823, 1270, 433, -867, -1360, -786, 558, 1310, 546, -492, -1379, -757, 47, 1456, 1109, -365, -1084, -1135, 122, 1340, 1009, -14, -1117, -960, 64, 1079, 1328, 401, -1070, -1241, -737, 778, 1690, 652, -750, -1212, -854, 624, 1260, 585, -209, -1052, -909, 283, 1114, 982, -441, -1123, -1295, -79, 953, 1330, 188, -1064, -1185, -513, 982, 1371, 387, -941, -1258, -566, 761, 1326, 837, -701, -1199, -671, 561, 1373, 923, -135, -1157, -1149, 216, 1067, 1169, 24, -1418, -1164, -41, 986, 1197, 280, -873, -1200, -430, 987, 1302, 641, -1009, -1550, -608, 579, 1329, 835, -564, -1284, -759]
5762g59J170J000m80j171r78m8J457Q47o6j069r04l09J167J077K93r31j135p68
5780a607J443J354L73p53j641l85O34R49Q60O3j844p99M99J441O73l13j065j223
5798a341nJ685P64J26j152r96l85J131J219J4r90q78m80P83J341J80m54j059q54
5817a351P74J235N62n44j237o50L23J332P09k88j099r58J52J025J186K33j119
5834B85j297j89Q74J247L51p08j200o47O46J096P11n92j005p91L59J230O39j9
5852I90j107j190L69R33Q58K71r72j190J78P01R52J70r27j168j87P30J414L70
5870A195o91j452k18M65J308O75o95j038j036Q40J165R36n38j079r84J92Q75J087
5888A007P1r51q46n10J200J017K54j187q17n15Q76R00O51n53j465l92N57J489
$$ y = [-759, 411, 1411, 931, -240, -1218, -1266, 191, 1038, 972, -97, -1001, -1310, -143, 934, 1227, 296, -839, -1607, -164, 1190, 1563, 810, -831, -1216, -582, 367, 1227, 1290, -554, -1353, -854, 587, 1260, 947, -118, -1341, -1346, 339, 1103, 1229, 77, -919, -1304, -173, 1046, 1060, 70, -808, -1288, -505, 836, 1016, 562, -497, -1351, -577, 658, 1220, 676, -561, -1211, -888, 444, 1153, 865, -234, -1192, -1040, -15, 1171, 1404, 285, -1012, -1201, -327, 920, 1271, 563, -637, -1284, -638, 458, 1169, 577, -428, -1219, -860, 370, 1009, 990, -117, -1307, -938, -5, 853, 1124, 152, -1038, -860, -159, 793, 963, 36, -1132, -1319, -589, 825, 1195, 504, -948, -1166, -701, 607, 1282, 587, -451, -1487, -647, 518, 1454, 916, -163, -1147, -955, -80, 1007, 1078, 127, -719, -1229, -29, 988, 1242, 55, -762, -1277, -401, 499, 1150, 597, -868, -1260, -703, 786]
5906G86M35p13q73p27L05J436N10j59j216o92m1J072R54k42m38j419J14P65Q54
5925G11L22o69j462M6P70J230J73n79j063n84O16J049N12m59j031q19L74J084
5943B21J105l21j058p55k36R65P99L21j033q62l96Q92J395L39r21j082m81M82
5961f26J351K35k37j380l24K73J224N47n08j059l84j3J073R03k85n83r39l99J028
5980a03J226K91j155j103l01R46J240j04o07q08p24O76J148M62l58r45q41L80
5998f80R81Q86k64j275q46M08J090P80k43p13j142Q3Q28Q84N67j161r87k52P78
6017b78R22M80p86j016l60P00Q75L85j5j127j100N41J156P06l90j191p41M42R49
6036A52Q34k15p09o60k69M30J381K64r11j174m15O26J156N28l90j121n92M85J084
$$ y = [786, 1221, 508, -365, -1092, -787, 649, 1159, 1000, -216, -908, -949, 123, 1077, 835, 397, -1022, -908, -143, 711, 1033, 364, -1098, -1052, -282, 948, 1121, 542, -521, -1105, -489, 560, 1072, 613, -418, -1237, -863, 221, 1326, 1005, -53, -808, -1044, -79, 720, 1041, 8, -854, -1250, -358, 1037, 1376, 455, -627, -1108, -626, 725, 960, 723, -657, -981, -708, 516, 1063, 555, -504, -888, -901, 172, 1075, 790, 207, -732, -1131, -103, 1123, 1414, 259, -844, -1145, -199, 1041, 937, 330, -478, -1202, -526, 622, 1084, 726, -219, -1060, -680, 301, 1187, 923, -352, -1198, -790, 300, 1080, 837, 124, -1018, -935, -107, 777, 1344, 183, -804, -1056, -278, 644, 1124, 338, -678, -1038, -338, 537, 922, 907, -220, -1320, -779, 377, 1083, 693, -498, -1239, -797, 152, 986, 771, 62, -598, -867, -437, 944, 1208, 297, -877, -1292, -666, 490, 1018, 628, -493, -1085, -600, 484]
6055D84O72k65r11j188M54J071Q19j28j109q09JQ78J030J31q95j096k47M63J440
6074G95L57q51j031m36Q12R19Q39j081o64q66M92J330N61k88j061j061L77Q76
6092A9R54j24o95j348L29R79Q11J80q06r90j13O30Q14L72n30j076o08L00J372
6111D70P80q35q23o58L31J454J73k02q79p41K94Q81O03Kq67q35o9N77J169J49
6131I74p29j061k71R53P15P39q46r83p10O19J239L98m37j083p55N21J042Q80n69
6150F36p08j081M12Q15J016l04q23j106J34Q45P74M76p15r95k87N69J110L38k71
6169H35j422l29J14J186P68m99r50n69J42Q67J117k83q86j058K7J048O78J35j055
6188a34n44j87M85J059L41o40j169j99P63Q07N69n18r44r27O27Q50O86j87r96
$$ y = [484, 1156, 891, -20, -1208, -754, 317, 1136, 1008, -101, -910, -909, -31, 999, 1130, 235, -861, -1108, -645, 795, 1152, 301, -730, -1166, -354, 565, 1404, 323, -341, -1207, -715, 615, 1176, 888, -173, -1234, -857, 19, 973, 849, 154, -1194, -865, 114, 925, 1105, 299, -691, -804, -174, 640, 1012, 482, -594, -1202, -902, 470, 1250, 415, -408, -1066, -735, 719, 892, 690, -189, -930, -636, 245, 848, 850, -17, -852, -921, -344, 825, 974, 245, -816, -1087, -134, 581, 1320, 474, -509, -1219, -600, 639, 1037, 600, -483, -1238, -717, 325, 1205, 636, -72, -1153, -741, 74, 1090, 786, -37, -1143, -1009, -164, 610, 1086, 371, -624, -911, -342, 768, 1106, 835, -587, -916, -802, 384, 1152, 653, -297, -866, -724, 143, 1260, 977, 91, -967, -940, 108, 786, 921, -134, -678, -865, -380, 679, 1020, 380, -789, -988, -225, 582, 1151, 633, -311, -1238, -611, 239, 925, 738, -258]
6207b58p25J83O21J159j4r68q64q9O36J033M28q12j137l24J067P73K88q63o49
6226e15m22K94R60M77m4j052p69L44J046P25j27q80o70l10R39J045j22q55o28
6245e64k97O64Q33p8j94r53k73O27P98M27l17j295k89K20J009N57m46j068m21
6264a060J36J142Q87k77j059p92K45O25J140J70j018p79j80K70J167L21m92r84
6282e38n50O47Q93N92o10o55q11L48J129P55n37q07q26J72Q23J213k37q08j040
6301h47j33R75R33K01j116m56p10O51R34M48m73r68n65M36J141O81o00o96p34
6320h98K10P98R48m69r53m55R7N76P71M21r98q42j78P66O29K63m47j231j60P44
6340d08O13P19n04q13m92J90J376N06n17q82p39K45R18P28n1j013p98k9O28J274
$$ y = [-258, -983, -800, -179, 980, 966, -2, -866, -955, -319, 714, 1142, 330, -807, -1131, -64, 709, 997, 134, -515, -937, -643, 317, 794, 750, -302, -1071, -727, 319, 1044, 917, 37, -633, -943, -4, 1041, 919, 64, -564, -861, -197, 636, 558, 364, -589, -862, -235, 563, 990, 673, -622, -911, -691, 318, 875, 429, -639, -1060, -924, 218, 1105, 828, -231, -1023, -778, -153, 987, 1157, 139, -640, -820, -550, 617, 938, 446, -538, -1088, -441, 452, 1044, 434, -221, -1032, -684, 445, 1200, 663, -144, -970, -798, 25, 1238, 1001, 193, -847, -980, -5, 928, 1129, 13, -443, -1153, -502, 432, 880, 407, -561, -1126, -690, 451, 1132, 532, -164, -898, -688, 110, 1058, 589, -364, -819, -722, -146, 625, 1046, 48, -794, -972, -206, 423, 686, 239, -992, -1152, -408, 205, 924, 420, -393, -885, -695, 681, 1187, 670, -212, -951, -706, 212, 940, 889, -124, -922, -951, -323, 951]
6360I51M8q77r63j53P55R05M47q03p57r96R53Q44O17n62r05n19L79R30O90l66
6380F18p07q62j26J092Q19J24j001j122n0R90J145k3n19q58o01P38R87K62m88
6399D18j022m70O97Q24N94l47p95j107N85J003N24l56q32o15N7Q68Q91k3p85r94
6419h85K10N65J026K4o41q52l50O39R79L01o05j054l49L32J164M21l88p51q70
6438a084M91N13J003Qq07j237K86N42R99L73j259m29j72J45J160K02l5j469k23
6457i93N75R13N03l42r78r27O89J249L76l00q82j004L01R13Q05R9j115q16o8N57
6477d45J086K72n68j071l86O86J148J11m99j029J3L12P17N15l79q06p37M52Q91
6496B83O15k03q97q10L08P25Q52Kq05q38J18M38J082K61o22j227j89M42J164J32
$$ y = [951, 999, 122, -841, -994, -239, 666, 1113, 310, -447, -1443, -490, 354, 971, 409, -496, -1015, -636, 294, 984, 618, -89, -951, -1077, 15, 834, 958, -43, -1165, -1215, -225, 920, 897, 378, -480, -1081, -343, 644, 906, 418, -604, -1074, -377, 447, 1041, 694, -101, -1208, -623, 380, 904, 548, -284, -899, -842, 26, 917, 894, 109, -885, -675, -110, 916, 940, 299, -553, -903, -264, 715, 1016, 411, -643, -992, -660, 504, 925, 537, -214, -1084, -593, -80, 923, 931, 124, -1113, -827, -285, 714, 1087, -172, -601, -773, -628, 532, 734, 699, -770, -993, -418, 495, 998, 656, -322, -1249, -560, 689, 1065, 765, -117, -1121, -820, 93, 898, 997, -118, -934, -1002, -445, 641, 913, 345, -726, -1112, -426, 722, 833, 334, -695, -682, -370, 347, 862, 483, -323, -1060, -608, 283, 898, 695, -202, -1012, -704, 21, 873, 875, 70, -768, -650, -212, 870, 1131, 509, -718, -907, -465, 699, 831]
6516H31m13j099l92O38P64O21O9j606m81L76Q40Q87k74p58o92k16J297J82l5l39
6536B00p51k65L13J348K47r81p02k82J30J195L05k51j115l54L74Q34O82m0r43
6555e6j007L49R01P65J69r29q67j71Q15J048J99j005q09k87M33J198K96r01r17
6574g76k97M16Q41P20k25r88n46K14J060M66Q8j178p29J76R24J120q26m60q24
6593h24j46R48Q44N4o85r54L1J01J074O68n82j257j32L31P99O90n92n98n58K4
6613g64R27Q19m07o52o40k08R43R59l89o78m50l73P77Q07M75p64j033l65O14J011
6633F09O54r31q12m49M61R90N03l41r18m80j4J130L24l07o82o53K03O23P24M74
6653A108j048n93l46O62P08M11o29r96k44N01P88M82k49j383M9L65O87M27Jp56
$$ y = [831, 418, -681, -1073, -435, 329, 950, 1019, -587, -1068, -692, 148, 1035, 761, 3, -689, -905, 392, 574, 539, 200, -551, -816, -503, 845, 1092, 111, -591, -873, -743, 452, 757, 506, -609, -963, -589, 245, 927, 887, -56, -1063, -714, 187, 952, 1121, 192, -675, -846, -31, 1017, 1216, 211, -598, -885, -452, 746, 1042, 141, -776, -1073, -657, 184, 904, 679, -309, -855, -641, 419, 885, 973, -205, -934, -758, 166, 1286, 460, 0, -824, -970, -22, 822, 876, 191, -763, -732, -631, 443, 1111, 529, -728, -860, -529, 270, 960, 368, -230, -788, -764, 163, 982, 575, -77, -717, -925, 18, 977, 588, -90, -540, -913, -136, 671, 1146, 382, -651, -1016, -402, 609, 1263, 332, -480, -929, -468, 522, 1025, 684, -234, -714, -728, 402, 726, 419, -263, -916, -713, -90, 634, 1108, 60, -533, -879, -217, 491, 902, 273, -723, -967, -466, 322, 804, 555, -828, -779, -414, 273, 700, 701, -55]
6673e5q61j38J427M68l00n43q66M24J58J014L93p45j181ON79Q93L33n49q77l90
6693h10L17P53N40k20j021m17J7J066N11j40o34q86L06M17P30K29j114k94j70
6712h20O71Q38M7m89q33l73P87N60P30p75n77p06J59J197N85n78j023m05K76Q58
6732A29Q20j07j005q59J83P67M96M03q52q81kO83Q96k10j64o12o96M55J141M06
6752I91n94p37m71M13N02P62m58n28p15L59P95N99m13m06j062L21O86Q06k78l02
6772B70p63k57L60J126K91p84r68k78P40N71M17m71l94p63O02M77L64K41j079
6791b98o79N31M74Q30m55l57o74J65N56K81N93j064n98k26P23N19L83m23r81j41
6811h41O90N61N28m80o51o81K28R61M73Rr23o90L44N86N85K68j245k92k02O59
$$ y = [-55, -916, -1054, 373, 841, 541, -2, -868, -444, -286, 728, 1121, 376, -805, -799, -220, 673, 1006, 457, -420, -810, -493, 260, 800, 580, -441, -858, -841, 225, 736, 596, -38, -924, -618, -201, 529, 758, -356, -650, -820, -149, 689, 736, 247, -586, -959, -172, 388, 1118, 343, -234, -940, -781, 416, 1001, 423, -600, -1005, -729, 129, 949, 842, -163, -1022, -839, -72, 424, 827, -25, -906, -908, -225, 671, 461, 297, -315, -1011, -556, 585, 991, 397, -340, -811, -398, 104, 866, 408, -120, -835, -476, 319, 918, 505, 99, -963, -642, 44, 850, 572, 270, -493, -750, -390, 736, 1027, 243, -725, -1003, -263, 308, 725, 254, -140, -903, -301, 176, 540, 781, -298, -977, -446, 28, 858, 403, 46, -628, -463, 93, 374, 967, -97, -695, -921, -198, 321, 704, 281, -700, -841, -151, 410, 938, 458, -193, -874, -646, 315, 788, 797, -126, -816, -472, 114, 699, 967, -278, -570, -772, -113]
6831a13P68l3m67p42k33Q34M79M49m28j014n70N72J001L36k75q27n79M14M41P07
6851G20J22p63o78J16N60N85J39o56p33k06O37R48J1n14j163j19Q94P52k6l21
6871C05q10j40J53Q55K60l5p81n67J79P81O51k61o01o75nP05P70q8o54p51j09
6892h18Q55L27L68l64j004j85K88O97N08k40r57k60L13O99P22l14q95m98J41R60
6912C43K31o0j006j65P5M87M49K75k85j063k45P79K95O08m37p89l52N03P54K88
6932F85j38o20m54K25M49N09k23n18n94o3O53P54k74k76n58l48O89P36jn39m76
6953c82k05M08O97J15p7p02p72M69R74L64l25q78l24lO46O66r6p06n10J86M66
6974A1O11N5n35o30k92M44Q62M76o26p09o10M96M86P54p61k97m24K1R58K57k80
$$ y = [-113, 655, 622, 155, -587, -820, 14, 493, 942, 514, -500, -1070, -498, 503, 839, 564, -263, -842, -428, 13, 720, 842, 79, -599, -483, 77, 662, 801, 145, -588, -794, -157, 791, 802, 288, -875, -994, -100, 652, 626, 305, -505, -645, -492, 363, 623, 588, -193, -760, -581, 200, 851, 590, -11, -686, -691, 14, 784, 696, 42, -709, -818, 37, 364, 732, 368, -636, -821, -533, 164, 672, 432, -525, -785, -472, 227, 949, 635, -260, -758, -617, 343, 574, 514, -492, -657, -582, -95, 354, 629, 344, -719, -964, -185, 110, 718, 281, -508, -860, -357, 397, 685, 547, -73, -527, -302, 147, 656, 433, -85, -679, -742, -89, 665, 391, 115, -443, -791, -102, 634, 633, 94, -382, -587, -179, 518, 633, 556, -146, -918, -449, 525, 889, 564, -314, -638, -641, 5, 671, 575, -131, -641, -455, 11, 622, 677, 142, -488, -780, -336, 526, 1002, 376, -333, -943, -447, 39, 793, 32, -265, -689, -668, 290, 547, 267]
6995B67m81k60k10Q76M11j10m15r00N2P53P07O9m84n98o40O03Q42K0k83p52j55
7016f88L07N16N55p7r08l13N52M32K8j9l55l16k35N92N45n1n28q15J66M51O34
7037D73M53r64j82o02O24L63M89n21p60J2N7Q85N16j27p91l67q7P24K46J80q83
7058b62l80QN92P39j38o45l32o6J63O74L21m02o05m06K25Q30J52J0q75l06M13
7079b90M99M30k01n33n69L54M78L34j13l73p80M63K20P58j65m70n94M6M71L64
7099C29J56l42o23LN77j7L54N4o94k65L7M52N27P2o50n71L08J23O04P4l98n42
7121d32j35M08M36L93p29q6m34L93Q91j81k62o08q7J50O37L98j00p41l08J87M43
7142B33J41j64k73n07K37M61L68P9l84o76K7n6R98K96j66j059J16J28P25M2j80
$$ y = [267, -214, -474, -684, 192, 603, 493, 78, -822, -770, -17, 690, 759, 275, -323, -963, -360, 482, 502, 219, -533, -688, -381, 135, 690, 613, -295, -608, -56, 376, 404, 385, 30, -286, -521, 71, 616, 565, 37, -778, -612, -161, 473, 926, -38, -220, -822, -198, 165, 654, 133, -627, -615, -558, 327, 843, 716, -75, -442, -529, 195, 441, 621, -262, -642, -634, -42, 697, 559, -86, -418, -484, -321, 353, 674, 272, -333, -739, -514, 316, 468, 478, -397, -703, -290, 209, 639, 438, -95, -664, -310, 168, 502, 389, 16, -764, -301, -81, 677, 512, 42, -552, -506, -35, 329, 485, 143, -480, -477, 100, 83, 437, 491, -203, -468, -431, 21, 548, 620, -30, -601, -293, -170, 434, 508, 110, -432, -567, -159, 277, 670, -59, -145, -579, -186, 705, 524, 262, -346, -433, -283, 354, 752, 652, -89, -397, -210, 233, 374, 210, -63, -570, -333, 128, 496, 575, 191, -485, -458, -514, 484, 780, 614, -445, -329, -201, 524, 566, 386]
7163C86o93m23K69P99L84k76n23m43R6N68K33j34l18l44J38m3Q01J65n30o06J5
7184d79K04N28K05O2q60k72L93M40L81j99l60p35N68P2P81l59l40n59J82K55M73
7205C81j65k53k86j32L95L65J40m61m28j43J12P47J11j64o80m2J22N41L17l2m02
7226D3o07L73K26N00J46p25m89L69J50M36j23J68j048K64M94K89j11l38k74m73
7246g30N11M13L45l00m39k06m4P56J26j78m64k66J34K79N00J98n86o70M27R7M82
7267C85K31l94o43%j40R01P4m38l69l6M05K77P3r2l01l07j5K94N69j71n24k18
7289d39L02K46J57M75n88n95J19K47N19K19p73j93l19N57N56L0k11m52k53K12
7309a84K82O05l76m28l43l7O97K66l06m89k52J92J48M96K24n89k01k29M06M88
$$ y = [386, -307, -730, -461, 338, 722, 446, -77, -520, -424, 144, 377, 243, -75, -419, -281, -324, 477, 642, 112, -494, -479, -275, 253, 458, 520, -340, -612, -219, 221, 602, 403, 43, -692, -124, -52, 729, 370, 30, -529, -347, -92, 381, 216, -37, -323, -455, -60, 305, 445, -16, -444, -587, -475, 272, 383, 219, -461, -503, -381, 160, 477, 445, 43, -564, -191, 35, 535, 681, -44, -533, -164, -14, 422, 299, 467, -581, -317, 177, 466, 355, 17, -257, -730, -219, 194, 539, 239, -200, -406, -450, 306, 432, 254, -210, -476, -342, -63, 437, 635, 49, -621, -194, -97, 385, 616, 222, -421, -421, -561, 340, 414, -24, -393, -429, -24, 253, 326, 234, -67, -374, -389, -95, 474, 303, -221, -439, -137, 109, 266, 741, 153, -442, -323, -76, 443, 662, -111, -304, -623, -66, 490, 520, 309, -143, -396, -184, 98, 703, 327, -101, -444, -481, 216, 482, 176, -313, -565, -373, -225, 271, 495, -94, -295, -524, -118, 370]
7329C70L05m36o87l02N21M33Q7J44p64l26M35L86J34J15n47m03J92L82O12k47
7349D04k27o84K51L72L20q2j59o69J9K84L17L42m53j80k97J93L62L52o0p38l26
7370f59M55L81K18j75k38o14O2P78O6P3l99k25o2K34M76P9Rp43m02O34O54l8l67
7393A97l73k61Q3L10M48pn94m06L12L63K20J12l48m90J55L01L94P9l22m19l50
7414e96N25M13J64m30n02J31Q1O26O1k56l94k86Q0N51M72np69k87K53qL72J12
7436C08j88m19k22N63j40M57l9p15O4N40J38M32o08l98l39L87J89L59k1k73p41
7457f66N69L17J57j81j57l80j2N48K65k79j30m98j1L14N92k0l21o09J93J78L41
7478B10J04k12l05m15M41L58M57n25l05q7R3L05L37Q2m69o47K29K33N20j30l20
$$ y = [370, 675, 239, -448, -750, -229, 204, 291, 435, -329, -655, -220, 166, 300, 415, -132, -535, -343, 39, 651, 404, 177, -507, -256, 116, 436, 354, 195, -474, -455, -171, 146, 488, 35, -145, -442, -249, 113, 465, 405, -333, -659, -204, 177, 395, 220, -18, -632, -570, 208, 274, 347, -52, -277, -339, -105, 371, 450, 459, -284, -686, -52, 602, 564, 197, -176, -437, -354, -44, 404, 397, -197, -603, -291, 72, 292, 404, 56, -434, -279, 22, 416, 495, 173, -246, -596, -71, 342, 506, 76, -426, -295, -214, 412, 473, 217, -177, -463, -383, 168, 640, 635, -134, -421, -168, -176, 196, 308, 120, -299, -521, 42, -98, 359, 320, -395, -331, 209, 347, 779, 171, -227, -566, -179, 10, 369, 348, 75, -666, -97, 220, 377, 196, 39, -341, -353, 195, 460, 181, 51, -447, -458, -144, 448, 428, 107, -502, -309, -131, 210, 314, 102, -203, -618, -177, 181, 638, 113, -192, -279, -186, 119, 456, 538, 69, -578, -349, -116, 404, 274, -46]
7499d6l28j27J89M82L38p40K6j25L7M21M32l27l99m50O40R8Q9J57n52k08n5L95
7521e3N99m33m19p0J41J36M58j91j16l27r7J39N79N4n8l61k90M0M93J84k60l70
7543b22j83L18M18L54o65n7k42O9M2O14Ok37m45m0J44M13J32k49k98k56L19N69
7565E04l5l82m97J15k9M90P10m04n89n33M60N11K12l24l37j3o5K13M51J59p08
7586i1k03l06O02M09K85q86k22q8N1R26k8l67l02j77J15K92L84p9m29k89J58L65
7608A20J65R9n22j54j39N21K49J38m60n37J33L18M49j62R3p83J9J8M88J97l1j95
7630B4m47J41M90M42k45j44o43K25L37L76l27p7k72m55M30M15%j5k78k42QL59
7652A02L61k87m20j02QN25J81J34o11k34r5O44K64j70m27p2j90J68O94N0o16l42
$$ y = [-46, -374, -501, -312, 170, 508, -232, -206, -331, -294, 127, 559, 232, -167, -617, 23, 121, 210, 367, -185, -393, -448, -53, 546, 113, -306, -376, -235, -99, 359, 168, 52, -275, -372, -233, 346, 400, 342, -19, -309, -269, 224, 408, 148, -222, -405, -87, 331, 685, 20, -37, -279, -210, -168, 446, 452, 215, -230, -270, -126, 287, 419, 170, -128, -384, -65, 504, 469, 87, -410, -295, -324, 166, 876, 472, -117, -650, -190, 321, 533, 209, -128, -141, -206, 7, 458, 617, -91, -294, -600, 2, 411, 696, -190, -412, -500, -449, 477, 449, 82, -220, -397, -282, 10, 394, 315, -114, -403, -245, 120, 285, 384, -138, -292, -431, 90, 339, 477, 17, -520, -387, -69, 380, 218, 311, -472, -453, -435, 53, 250, 219, 24, -423, -282, 208, 650, 405, 261, -382, -157, 180, 556, 229, 152, -120, -575, -145, 270, 270, 255, -23, -265, -257, 102, 463, 176, -244, -346, -338, 187, 368, 502, -109, -343, -438, 206, 470, 300, -127, -199, -389, -221, 473, 523, -93, -435]
7674d35L9K09L65M09o44j50l61N05K49K00j35l88l6j35N41J11k44N7m17J32M85
7695C57J30j51l80k77L3J71K86L76l24n66J08J50M16j46L9l81r3K26L01QJ42o06
7717a81j35K1O04K18l20l70j56O3J59P93m66m03j59K0K09K73j9j4m71K6J46M86
7739C24n8q7l43k00J06M92J06m46J23m33j47M69L80k05k11l50m5N84L94k77k50
7760g4j05j22K30K82K37l26l46P5j68N42J48l10m32l12K70P07L8k95k82j14K08
7781a49K06K98j85n6m31l7L18K44K10n54lJJ28J54M64o09j80j6j6M62L31k34p03
7804c57n6n7O53j15J30l86q2J01K52J41J36m63l88K17M64K42l40k96j47n7L31
7825g7L07J09m61J28k09R8K71J11j60m13K0R1L34Q7j08o0j3k60N26m0Q3l49j27
$$ y = [-435, -396, -187, 178, 587, -57, -207, -568, -63, 186, 386, 251, -137, -173, -308, 233, 344, 100, 157, -260, -128, 357, 487, 336, -44, -321, -288, -117, 169, 545, 221, -345, -237, -87, 329, 183, 222, -159, -252, -26, 275, 283, 425, -181, -316, -295, 309, 527, 207, -163, -319, -256, -97, 696, 230, -173, -332, -312, -103, 170, 151, 137, -334, -308, -162, 324, 266, 179, -164, -364, -258, 234, 340, -106, 17, -416, -563, -94, 286, 81, -130, -480, -525, 59, 453, 176, -74, -179, -301, -71, 211, 448, 122, -224, -149, -317, 225, 373, 63, -369, -681, -411, 296, 334, 39, -243, -357, -149, 57, 355, 170, 114, -317, -354, -36, 208, 418, -136, -139, -138, -10, 144, 608, -1, -181, -197, -213, 249, 580, 346, -357, -413, -470, 183, 68, 198, -188, -270, -169, 83, 224, 360, -103, -491, -274, 190, 432, 92, -204, -351, -408, -77, 230, 339, -122, 6, -203, -105, 166, 277, 117, -296, -276, -185, 149, 236, 128, 68, 55, -205, 321, 281, 364, 15, -112]
7848a12l08N80L59k80j81l05jJ99K86J23l1o53l42M37M55k8j03k40q6M5L42L83
7870E39m03l19q7p6K76K72j13J69n48j86N16O0J20j24j94m4J6L25J86j99j60k74
7892b48k22Q84j70r1k18k60M94l13K18L64k89l91j94L66K03J03k58Kl90N10j17
7913a7N39m59l44m9M1J44M04r2l65L2m87Q36L10j75n02j96l4M80m5L6n4k50JJ12
7937a34Q1R2J5k17l98L13J97L23l20nk64K07K75k14L27m19k14K2O15L10m66j81
7959e5j85m0J84M23j52n6m02p4L74K28J79n29r5J18P5J35L89j94o42j28N76n5
7981G4K58j07q0k77l2K88K1K19l92k10K48L7o5R3o5k95Q5K65J47j91k58KK05r6
8005a26K99o6mk86K80l49J42L60j57j41l39K04K51J52n2j37l71J56J95J31r1O7
$$ y = [-112, -420, 160, 519, 239, 58, -247, -248, -49, 237, 360, 329, -324, -666, -229, 226, 198, 95, -145, -231, -186, 156, 539, 136, -183, -270, -346, -70, 202, 89, 258, -290, -476, 40, 100, 220, 96, -98, -142, -126, 199, 385, 186, 26, -248, -470, 414, 244, 153, -65, -325, 169, -144, 74, 438, 149, -242, -436, -70, 133, 236, -22, -20, -410, 100, -17, 522, 63, -281, -330, -289, -145, 259, 167, -198, -166, -653, 183, 493, 318, -184, -380, -414, 66, 21, 57, 3, -247, -246, -134, -53, 39, 54, -163, -561, -248, -51, 272, -48, -53, -317, -110, 165, -49, 278, -141, -355, -333, 282, 592, 126, -55, -240, -280, -96, 327, 175, 119, -283, -357, 17, 245, 424, -105, -200, -82, -7, 128, 517, 323, -319, -447, 129, 74, 332, 225, 145, -132, -164, 124, 145, 364, -28, -238, 10, 47, -18, 75, 10, -285, -200, 65, 212, 21, -237, -235, -30, -126, 173, 107, 103, -183, 97, -252, -110, 250, 93, -48, -387, -183, 68, 220, 168, 31, -340, -184, 11, 142, 51, 118]
8027A18j31j09j65N18J11j96k27q7K37L4J55k18L5j34o1J85o5J73m34q8K22J22
8049eM13l53L9j97j91M31J57q3k00Nk14J1L48j7q6j42q9M7K25J80j63r2j73j03
8073b52J72L42j73j96K2l3R6l1N1J17k60o2K93J59K53m10k83j66K67J85j3L6k20
8096a06R7k8J60P4r6K13j65m07K08J97j68P3O3l45j7L67K6n9j18o2K70q2Q2k23
8120d6j72L8L53j14O9k28J02j09j43M51n7J00j64r9j56j03M07K48l58N6j72K99
8142B02k87K42j25j03k15n4K13L01j3j11k33K42O8J38k64j31j18J3L09j70K1l49
8164d24L78j82K81q7J41K18l57k04J91P9K24J14m64K5J61l15J39QL4J05l39O30
8186C56K3n15R7j95o4
$$ y = [118, -13, -122, -287, 231, 342, 146, -81, -168, 69, 103, 258, 40, 75, -59, -120, 65, 0, 173, -261, -349, -127, -5, 408, 55, 94, -103, -294, 137, 294, 211, 11, 16, -198, -187, 161, 144, 58, -84, -173, -126, 99, 279, 116, 24, -149, -252, -80, 262, 89, -107, -85, -118, -22, -53, -2, 115, -145, -207, 86, 245, 498, 88, -195, -361, -94, 91, 78, 114, -106, -9, -37, 123, 197, 101, 314, 149, -258, -50, 147, -21, 52, 115, -230, -247, 120, 146, 87, -31, -93, 177, 95, 177, -46, -218, -180, 173, 59, 128, -100, 2, -107, -250, 201, 144, 244, 80, -19, -175, -278, 129, 377, 19, 75, -97, 202, -85, 157, 32, -71, -286, -340, -127, 174, 161, 50, -183, 59, 127, 265, 1, -130, -248, -235, 74, -96, -75, -424, -46, -228, 53, -34, 107, 325, -32, -236, -45, 34, 258, 372, -92, -67, 94, -221, -82, -74, -40, 65, -274, 356, 379, -136, -39, -234, -298]
8191b98
$$ Imaginary data points
##PAGE= N=2
##DATA TABLE= (X++(I..I)), XYDATA
0@%%%%%%jJ%Qj6J6k4L2l2M0m8N1o1P4q8J04j20J37j57J77k01K32k62K95l36L77
32A98m20M70n23N83o52P23q02Q92r86J093j212J339j484J648j830K039k279K554
50A351k881L274l753M357n144O218p782J0278j4902K6358j06527k09947J42428
63a56672K47145J49402r8332k21396j65478M3579K07050J98858r046k11220k20030
74b36140l616K12393K24878J9039j92423k19582m1614J67656K27976Q0528j40705
85I8390k37335j06688J29969K45302J23563j09533k30589j33948P8643K15638
95G3412J60089m1704k13745j89365K3147K20677J99696j8801k12359j94664j961
106a95578J79131J94205M2035j51771k19028q5584J40985K38829J01629j39382
$$ y = [0, 0, 0, 0, 0, 0, 0, -1, 0, 0, 8, -8, 8, -16, 16, -16, 24, -24, 27, -34, 40, -48, 56, -64, 73, -84, 93, -108, 124, -138, 157, -179, 198, -222, 248, -275, 308, -344, 379, -423, 469, -517, 576, -636, 703, -781, 867, -963, 1076, -1203, 1351, -1530, 1744, -2009, 2348, -2796, 3422, -4360, 5918, -8984, 17374, -89153, -299100, -156672, 90473, 239875, 141543, -79853, -245331, -201752, 5298, 204156, 195110, -16110, -236140, -239756, -27363, 197515, 216554, 24131, -195451, -237065, -69409, 158567, 239095, 98390, -138945, -245633, -115664, 129638, 253201, 143668, -86921, -220869, -142226, 73412, 233501, 191797, -21948, -211313, -188166, 32511, 232207, 213406, 1047, -193617, -195578, -16447, 177758, 219793, 68022, -151006, -236590, -95605, 143224, 244853, 105471]
116A05471k40014j07456J18369K22771J18953q6333k10087j44228N4051K08383
126C9880J70687l2312k10779j86760J9666K04813J92262J366j83112j97407l3393
137b15089J63497K13634O3173j52029k21497p6248J38318K13489Q8612j09269
147A06591k02177j13342P7510K04361J43555o0549k14044j59990N2739K10698
157D5352J61398l6801j90333j64673M706J65336J79999L1685j51162j99645n7470
168b11608J46579K10621O8288j37595k04455p7021J16427J94904R6824q7900j93769
179g8705j23240O6860K00300J43589n3146j97471j52592L2489J82412J63754l007
190A81243j69673j81247k1447J62746J91451L4159j53186j89585m8451J31204
$$ y = [105471, -134543, -241999, -123630, 99141, 218094, 131761, -78326, -222554, -168503, 39880, 210567, 178255, -32524, -219284, -199618, 5195, 197457, 198823, 15711, -181696, -215089, -51592, 162042, 225215, 73186, -148311, -224559, -86241, 127248, 215860, 106591, -95586, -208928, -131418, 72943, 216498, 155949, -58095, -218085, -165346, 45352, 206750, 169949, -20384, -185057, -180351, -15015, 164984, 196669, 45507, -154138, -211608, -65029, 145592, 213880, 76285, -128170, -205191, -88764, 106140, 202964, 115064, -78705, -201945, -135085, 65215, 208804, 155658, -41813, -194405, -161916, 20496, 184250, 181243, 11570, -169677, -191124, -28378, 163073, 197232, 44046, -145539, -193990, -62786]
200f2786J84224P0961j06252j88390r9126Q6905J97647J21242p6283k02671j32459
211b06988O4794J93534J35570m1895j72645j44651R209J55859J63553J8713j50594
222B4459j78984l2049J46889J81583M2192j31883j77327o0321J10272J79466Q3775
233A88072r1908j83826j01557P6518J81565J15269n6761j72758j29044L2468J64783
244B2821J45186j1388j59609j56946k940J54254J61939J5428j42232j61444l1658
255a66589J22317J63414N8302j01818j72873q4961R0067J83672J00048q2337j81840
266g2598j05350O5985J68133J13168m0265j55407j30279J5796J50004J44823k09
277A53801j46720j54143j3887J36866J57265L0418j23633j62567n0570J08114
$$ y = [-62786, 121438, 192399, 86147, -102243, -201369, -114464, 83183, 204425, 128142, -74529, -206988, -142194, 51340, 186910, 145015, -27630, -172281, -163072, -7213, 156340, 175053, 24459, -154525, -186574, -39685, 141898, 184090, 52207, -125120, -185441, -75169, 104297, 188072, 96164, -87662, -189219, -112701, 68864, 184133, 127372, -45386, -174430, -141962, 22821, 168007, 156619, -2990, -159936, -162876, -8622, 153317, 168745, 26513, -134931, -166589, -44272, 119142, 177444, 75626, -97247, -182208, -92141, 91531, 191579, 109242, -72598, -177948, -111963, 56170, 169338, 129073, -26334, -156613, -140817, 9187, 154010, 153801, 7081, -147062, -160949, -24083, 133182, 163600, 39967, -122600, -173170, -65056]
287f5056J66038O7737r3804j65952q2670P6448J61259R4894n6881j54448j09688
298a62123L7079J51964J25451k1247j51174j34559J2047J46503J37246J677j29320
309A3544j38183k3846J11687J47927N0690r8187j59151o6742R1443J62551P6179
320A67912p9608j56014q4690O2571J48500R6859m3572j44291j11252K5602J40979
331B2996J23756j0988j37112j33333n110J26668J39040K1632j15687j45890l9761
342a53789J03553J48697N2478r2982j46749o3680P5347J41364P8289n6694j41289
353e5455r5799M2617J44570J08998l3397j43241j13906K1883J32830J18325k709
364A24716j17365j24648j8058J05796J33939L7421r6610j39657m9616Q9420J41878
$$ y = [-65056, 100982, 168719, 74915, -91037, -173707, -97259, 64000, 158894, 102013, -52435, -162123, -125044, 26920, 152371, 131124, -20050, -154609, -142562, 3941, 141187, 142864, 13544, -124639, -148485, -36798, 111129, 161819, 63632, -95519, -162261, -70818, 91733, 167912, 88304, -67710, -152400, -89829, 58671, 155530, 111958, -32333, -143585, -117983, 22996, 146752, 135764, -1348, -134681, -139791, -13123, 125917, 147549, 31862, -114028, -153789, -50236, 98461, 150939, 57957, -88792, -152472, -77125, 64239, 142528, 85834, -55455, -151254, -108637, 35933, 144931, 111534, -31707, -145613, -123730, 9100, 127425, 124716, 7351, -117297, -135355, -29559, 104380, 141801, 45191, -94466, -144082, -54662, 87216]
375H7216N8840p7908j38250o8502O2957J34830Q2212m6117j33975r6015L2139
386a02573J30351J06403j6950j23378j15000r02J14506J23599J5433j07764j28968
397a05243k7501R9496J28585L6707q6472j27399n1264P0411J27986O8541n6910
408G6937j32070q3212M5932J33317R3445l6071j29073r8730K2882J18953J03386
419A15696m660j07205j10373j3438R8461J19412K7319r2791j24548l6620Q5577
430d3170J25490M7389p3363j25306o0760O0799J25143P2758m7626j22617q1993
441a23256L2695J16373R1881j6669j10790j02115K892J06778J09117P307j01654
452A2559j12766j6142R3022J12966K7900q1251j13993m2948O7529J17283N9481
$$ y = [87216, 146056, 68148, -70102, -138604, -75647, 59183, 141395, 95278, -38697, -134712, -102573, 27778, 134181, 117231, -6147, -121147, -122049, -7543, 116056, 131489, 23725, -105243, -132744, -33248, 95337, 132044, 45572, -81827, -133091, -62680, 65306, 133847, 76937, -55133, -138345, -92413, 40904, 134349, 98278, -30795, -129525, -106643, 12310, 115696, 111036, 3831, -106542, -119980, -21519, 97893, 125212, 32421, -92127, -128747, -43170, 82320, 129709, 56346, -68960, -129720, -68921, 56222, 128980, 81354, -41263, -123256, -90561, 25812, 117693, 101024, -9766, -111881, -108989, -2211, 106906, 114213, 12559, -100207, -116349, -23327, 89639, 117539, 36288, -77705, -120653, -53124, 64159, 123640]
463A23640n5733j21175p2295M7215J21809P8504l7490j15143q2853K4049J06486
474A7014Q9748q622r9576r8818m604R5360J05240J6281q9033j10389k7583Q0751
486c4231J13634L9806p1331j15574n0818O0885J13586N9668m7463j10420o9412
497a11670L4291J06046P9157k1851j03499q8615J0487J01453R6107k289r7884
508A733r9409o842Q9279J00059K0032p6227j03359l6230O5528J08268M9639n7177
520E5294j10977n8017M9596J08563O4663l9450j04255p0744K7873J00076P8668
531A01290j5371r5754q6251L216R0708R4074R195q4932r9197k0591P7925J02094
543G6406L1239o9310j03705l9833O0140J02383M7731m9178r8925n7755L6977R7256
$$ y = [123640, 67907, -53268, -125563, -78348, 43461, 121965, 84475, -30668, -113521, -89472, 17014, 106762, 98140, -1436, -100254, -104858, -9498, 95742, 112023, 22990, -87399, -114982, -34231, 79403, 119209, 47878, -67696, -118514, -57629, 55957, 115625, 68162, -42258, -111670, -77379, 28667, 107824, 85973, -17526, -106141, -95654, 5799, 101906, 99617, 1733, -97676, -104518, -15239, 84820, 104852, 28625, -74734, -110964, -45436, 62832, 112471, 55294, -55683, -113700, -64104, 44459, 109122, 69672, -34583, -105327, -77454, 22622, 101290, 85919, -9835, -96086, -92870, -2162, 91912, 101107, 16175, -83022, -103613, -25688, 76406, 107645, 38335, -65370, -105203, -45063, 57320, 105051, 55873, -43052, -100807, -63830, 33426]
555C3426O8459k5697r8672p8110J7426R7348Q3629r560r1819q6883k062Q2274
567a0241Q9952J5244p3333r3819k7757O4618R7619L7838n8177r9502m6355N1137
579e2776J00044N2990m2977r6819o0969L2110R4082O9453j9956r0532p6818Q622
591h3546Q6107Q3460L435p9925q8380j3677P4614R2398K2421o8606r2464k8815
603i2978O0213R0990L8906m9751r1142m9548L8845R2753N9908k9841r3429o8224
615i3298K1696R0299P2940j3402q5141p6609K521P6588P9554Q976o9867q4380
627g0123k0524O3531Q8360K9004n8781r1099l6903N1833R0999M5582m2926r0747
639d1794n3259L3319Q7999O1014k2279q3483o6967J1400P9189P4808k22p5902
$$ y = [33426, 101885, 76188, -22484, -100594, -83168, 14180, 97809, 88249, -3570, -90453, -92515, -10241, 79711, 94955, 21622, -72197, -99954, -35336, 62283, 100121, 41944, -57558, -103913, -52776, 47268, 100258, 57281, -39538, -100507, -68397, 25685, 95138, 75182, -15350, -92168, -83546, 2561, 86021, 89456, 9531, -78849, -92526, -17912, 74486, 96907, 28301, -64163, -92978, -32765, 58225, 97131, 47380, -43762, -93310, -54465, 38288, 98196, 68355, -25074, -93298, -71602, 18697, 91637, 78235, -6906, -83515, -80994, -4406, 75148, 84124, 14257, -70123, -90647, -27116, 61244, 90248, 31467, -59632, -96535, -44702, 46297, 91879, 48953, -41794, -95053, -61734, 26265, 87279, 65000, -18483, -85450, -74050, 5139, 79947, 79725, 3823]
651C823p9890o941P2471Q3137J4677o6438q3671k2312N8156Q4599L2583m8407
663D1787q5366m3694L9171Q6524N3082l1382q6811n9851K3770Q3508O3121j6101
675F7758p8064o7523N484P2478P1516M408o8417p6730j4158O2798Q0304K3422
687H3276n6562q3967l2269N0448Q5047L9393m2405q3678m5110L3598Q0304N2325
699H0400k2969p6519n9444J4109P4899O6265n384p2919p1069j694P0497P4524
711G0696Q872o4291p6413j7172N6340P6788K7403m7076p8665l7822L9730Q0188
723C8578M4877l4078p9735n0667K7058P7366N4870j9180p4613n9624R970P0771
735E593O4496r55o5671o9335r587O0804P4408J8226n5127p6888k5532M9518P6979
$$ y = [3823, -76067, -83008, -10537, 72600, 87277, 20839, -62832, -85144, -26988, 57611, 90194, 41787, -43579, -87273, -48102, 38422, 91504, 60122, -26689, -86540, -62770, 20738, 83859, 67758, -10306, -77829, -72345, 133, 71649, 76057, 7640, -69090, -83248, -20450, 59854, 83276, 26714, -57253, -89522, -39074, 45973, 85366, 42961, -40717, -85827, -52229, 28075, 80400, 57431, -19088, -78532, -64423, 10476, 76741, 71357, -1562, -72631, -74325, -3828, 70696, 79568, 15277, -61136, -78308, -21968, 54820, 82223, 35147, -43518, -81340, -41610, 38578, 83455, 49377, -30358, -81025, -53967, 23399, 78269, 59089, -15524, -75148, -65178, 5593, 70089, 69134, 3463, -65872, -75459, -14655, 59753, 77979, 22852, -54036, -79568, -30050, 46929]
748D6929L2225m2566p5686l7962L5007P4091M4082k5933p2189n1633J6998P1628
760A4991N9022r693p0621o4410L295O6971O6810M157o1001o8668j3126N3166P0291
773E1184K2057m6763p1650l0612M0463P3343L7177l5158p4101m2376K9119P2904
785B5587M7854k2167o9842n3142J3305O6373N8432l460o2174o2965n074N8191
797i082O6416J3364n3728o9280j9011M8936P0464K4522m3264o9337l0794L5820
809c4974O8337L8292k7380o8783m6124J9815O8326N2212j3146o6646n6628O354
821f0345O2621N9146M87n7504o0950q359N1950O2702J6046m5718o5829k3634M1356
834b8031O7553L0453l6260o8692l5659L0064O7781M1903k3427o5164m6334J5225
$$ y = [46929, 79154, 36588, -39098, -77060, -42053, 32038, 76120, 50187, -22002, -73635, -56637, 14991, 74013, 64320, -6301, -70711, -67416, -445, 66365, 70522, 9521, -59147, -72273, -19107, 51184, 73241, 26478, -45172, -75784, -35321, 38022, 75199, 40041, -34060, -76436, -47317, 25587, 73441, 51274, -18568, -71710, -58405, 7968, 66400, 62940, 766, -62199, -67273, -9082, 57334, 70698, 16970, -52310, -71321, -22385, 48079, 72601, 29337, -40000, -70794, -34974, 33363, 71655, 44275, -24508, -70632, -50817, 17509, 69721, 56575, -10071, -66699, -60345, 2276, 61422, 61909, 4405, -56545, -64904, -12954, 49748, 65794, 20076, -45753, -69387, -28031, 39522, 69975, 33715, -34977, -70636, -40572, 27209, 69112, 45685, -19479, -65813, -50588]
846e0588O1829N0783o987n7948n5129j078N5031N9434O822n2395o1575j2704M8208
859a6297O3129J8243m2694o3326k5462L6071O3493L2232k8249o3719l9171K1820
871d3930O2999M5423j6102o1605m8468J0607N8222N1037l930n4313n3405k964
883e6429N0221N6842J0278m5760n9629j7585M1398O2194K4240l6509o3252k9737
895f3728L1454O1678L4427k5299n9971l8469J7984N6875M3084j0647n5435m8322
907e6369M092N3292N2070J465n1004n5471p231M7300N6784J2759m2260n6814j9122
920f0509L4892N7508K6566k9294n7791l1992K4013N7934L7036j9366n6593m0295
932e7891J4293N4939M4147p848n1893m7200K090M7928N0434O174m3901n3390j3240
$$ y = [-50588, 11241, 62024, 55037, -2911, -58040, -59118, -4087, 55347, 62169, 9774, -51801, -64505, -16297, 46832, 65075, 22381, -40945, -66407, -30336, 33157, 65389, 37140, -26579, -65750, -43930, 19069, 64492, 48390, -13215, -61683, -51076, 7146, 58183, 54253, -60, -53465, -56429, -6208, 50634, 60912, 15152, -44477, -62062, -20664, 41530, 65770, 29261, -33991, -63728, -32274, 29404, 63831, 38532, -21439, -59908, -41924, 14951, 58035, 47388, -8047, -56369, -52277, 1015, 53085, 54550, 3546, -51925, -59156, -11856, 44928, 57687, 15427, -41387, -60509, -25617, 31891, 58457, 29163, -28628, -60620, -36607, 21327, 58363, 38997, -17596, -57891, -43598, 11341, 55488, 47640, -4253, -51453, -49363, -1435, 48999, 55173, 11272, -42118, -55358]
945e5358M0286N6322J8200l6305n6274k2979L1673N5379K6764k6175n4417l1852
957e4736K0294N2726L6686j4439n1964m1917P659N0869M5768k676m9223m8503
969d9456k096M4458M9528Q377l9856n0761j4540L4731N2036J9648k9821n2403
$$ y = [-55358, -15072, 41250, 59450, 23145, -33129, -56108, -24435, 30944, 57708, 31533, -22884, -54736, -34442, 18284, 54970, 40531, -11433, -53350, -45691, 5178, 50946, 48270, -953, -49456, -51552, -7094, 42434, 50811, 10955, -39806, -54346, -19615, 32421, 52069, 22248, -30155]
$$ [...]
8191C56
##END NTUPLES=NMR FID
##END=
