##TITLE=1H_AM A515 T
 CDCl3, 8 sc, 
 2.8.2019
##JCAMPDX= 6.0         $$ Bruker NMR JCAMP-DX V2.0
##DATA TYPE= NMR FID
##DATA CLASS= NTUPLES
##ORIGIN= UXNMR, Bruker Analytische Messtechnik GmbH
##OWNER= root
$$ XWIN-NMR		Version 3.5
$$ Fri Aug  2 15:29:30 2019 Russian Standard Time (UT+4h)  she@DPX200
##.OBSERVE FREQUENCY= 200.13155
##.OBSERVE NUCLEUS= ^1H
##.DELAY= (6, 6)
##.ACQUISITION MODE= SIMULTANEOUS
##.ACQUISITION SCHEME= undefined
##.AVERAGES= 8
##.DIGITISER RES= 18
##SPECTROMETER/DATA SYSTEM= spect
##.PULSE SEQUENCE= zg30
##.SOLVENT NAME= D2O
##.SHIFT REFERENCE= (INTERNAL, D2O, 0, 15.7039)
##AUDIT TRAIL= $$ (NUMBER, WHEN, WHO, WHERE, WHAT)
$$ ##TITLE= Audit trail, XWIN-NMR		Version 3.5
$$ ##JCAMPDX= 5.01
$$ ##ORIGIN= Bruker BioSpin GmbH
$$ ##OWNER= she
$$ F:/spectra/data/she/nmr/H-F/1/audita.txt
$$ ##AUDIT TRAIL=  $$ (NUMBER, WHEN, WHO, WHERE, WHAT)
(   1,<2019-08-02 15:28:17.46 +0400>,<she>,<DPX200>,
      <created by zg, POWCHK disabled, PULCHK disabled
       configuration hash MD5:
       00 E9 B6 7A A2 85 ED C7 34 08 36 98 17 FE 4E 26
       data hash MD5: 16K
       2D 74 FB 8E 08 EB DE 59 E0 BE 24 45 A2 20 C7 75>)
$$ ##END=
$$ 
$$ hash MD5
$$ 7D 6D AC CF B1 29 80 A7 7F 8C F3 77 9E 0A 17 03
##$RELAX= 
##$RELAX= 
##$RELAX= 
##$RELAX= 
##$RELAX= 
##$RELAX= 
$$ Bruker specific parameters
$$ --------------------------
##$DU= <F:/spectra>
##$EXPNO= 1
##$NAME= <H-F>
##$PROCNO= 1
##$TYPE= <nmr>
##$USER= <she>
##$AMP= (0..31)
100 100 100 100 100 100 100 100 100 100 100 100 100 100 100 100 100 100 
100 100 100 100 100 100 100 100 100 100 100 100 100 100 
##$AQSEQ= 0
##$AQ_mod= 1
##$AUNM= <au_zg>
##$AUTOPOS= <>
##$BF1= 200.13
##$BF2= 200.13
##$BF3= 200.13
##$BF4= 200.13
##$BF5= 200.13
##$BF6= 200.13
##$BF7= 200.13
##$BF8= 200.13
##$BYTORDA= 1
##$CFDGTYP= 0
##$CFRGTYP= 5
##$CHEMSTR= <none>
##$CNST= (0..31)
1 1 145 1 1 1 1 1 1 1 1 1 1 1 1 1 1 1 1 1 1 1 1 1 1 1 1 1 1 1 1 1 
##$CPDPRG= <>
##$CPDPRG1= <>
##$CPDPRG2= <>
##$CPDPRG3= <>
##$CPDPRG4= <mlev>
##$CPDPRG5= <mlev>
##$CPDPRG6= <mlev>
##$CPDPRG7= <mlev>
##$CPDPRG8= <mlev>
##$CPDPRGB= <>
##$CPDPRGT= <>
##$D= (0..31)
0 1.2 0 0 0 0 0 0 0 0 0 0.03 0 0 0 0 0 0 0 0 0 0 0 0 0 0 0 0 0 0 0 0 
##$DATE= 1564745296
##$DBL= (0..7)
120 120 120 120 120 120 120 120 
##$DBP= (0..7)
150 150 150 150 150 150 150 150 
##$DBP07= 0
##$DBPNAM0= <>
##$DBPNAM1= <>
##$DBPNAM2= <>
##$DBPNAM3= <>
##$DBPNAM4= <>
##$DBPNAM5= <>
##$DBPNAM6= <>
##$DBPNAM7= <>
##$DBPOAL= (0..7)
0.5 0.5 0.5 0.5 0.5 0.5 0.5 0.5 
##$DBPOFFS= (0..7)
0 0 0 0 0 0 0 0 
##$DE= 6
##$DECBNUC= <off>
##$DECIM= 24
##$DECNUC= <off>
##$DECSTAT= 4
##$DIGMOD= 1
##$DIGTYP= 9
##$DL= (0..7)
0 120 120 120 120 120 120 120 
##$DP= (0..7)
150 150 150 150 150 150 150 150 
##$DP07= 0
##$DPNAME0= <>
##$DPNAME1= <>
##$DPNAME2= <>
##$DPNAME3= <>
##$DPNAME4= <>
##$DPNAME5= <>
##$DPNAME6= <>
##$DPNAME7= <>
##$DPOAL= (0..7)
0.5 0.5 0.5 0.5 0.5 0.5 0.5 0.5 
##$DPOFFS= (0..7)
0 0 0 0 0 0 0 0 
##$DQDMODE= 0
##$DR= 18
##$DS= 0
##$DSLIST= <SSSSSSSSSSSSSSS>
##$DSPFIRM= 0
$$ [...]
##$SUBNAM2= <"">
##$SUBNAM3= <"">
##$SUBNAM4= <"">
##$SUBNAM5= <"">
##$SUBNAM6= <"">
##$SUBNAM7= <"">
##$SUBNAM8= <"">
##$SUBNAM9= <"">
##$SW= 24.9336996594482
##$SWIBOX= (0..15)
0 0 2 0 0 0 0 0 0 0 0 0 0 0 0 0 
##$SW_h= 4990.01996007984
##$TD= 16384
##$TD0= 1
##$TE= 0
##$TE2= 300
##$TE3= 300
##$TEG= 300
##$TL= (0..7)
0 120 120 120 120 120 120 120 
##$TP= (0..7)
150 150 150 150 150 150 150 150 
##$TP07= 0
##$TPNAME0= <>
##$TPNAME1= <>
##$TPNAME2= <>
##$TPNAME3= <>
##$TPNAME4= <>
##$TPNAME5= <>
##$TPNAME6= <>
##$TPNAME7= <>
##$TPOAL= (0..7)
0.5 0.5 0.5 0.5 0.5 0.5 0.5 0.5 
##$TPOFFS= (0..7)
0 0 0 0 0 0 0 0 
##$TUNHIN= 0
##$TUNHOUT= 0
##$TUNXOUT= 0
##$USERA1= <user>
##$USERA2= <user>
##$USERA3= <user>
##$USERA4= <user>
##$USERA5= <user>
##$V9= 5
##$VALIST= <valist>
##$VCLIST= <CCCCCCCCCCCCCCC>
##$VD= 0
##$VDLIST= <DDDDDDDDDDDDDDD>
##$VPLIST= <PPPPPPPPPPPPPPP>
##$VTLIST= <TTTTTTTTTTTTTTT>
##$WBST= 1024
##$WBSW= 4
##$XGAIN= (0..3)
0 0 0 0 
##$XL= 0
##$YL= 0
##$YMAX_a= 19657
##$YMIN_a= -17053
##$ZGOPTNS= <>
##$ZL1= 120
##$ZL2= 120
##$ZL3= 120
##$ZL4= 120
##$ABSF1= 10
##$ABSF2= 0
##$ABSG= 5
##$ABSL= 3
##$ALPHA= 0
##$AQORDER= 0
##$ASSFAC= 0
##$ASSFACI= 0
##$ASSFACX= 0
##$ASSWID= 0
##$AUNMP= <proc_1d>
##$AZFE= 0.1
##$AZFW= 0.1
##$BCFW= 1
##$BC_mod= 2
##$BYTORDP= 1
##$COROFFS= 0
##$CY= 11.3945322036743
##$DATMOD= 1
##$DC= 2
##$DFILT= <>
##$DTYPP= 0
##$F1P= 20.1720416913024
##$F2P= 0.152960286110954
##$FCOR= 0.5
##$FTSIZE= 0
##$FT_mod= 4
##$GAMMA= 1
##$GB= 0.15
##$INTBC= 1
##$INTSCL= 1
##$ISEN= 128
##$LB= 0.24
##$LEV0= 0
##$LPBIN= 0
##$MAXI= 10000
##$MC2= 0
##$MEAN= 0
##$ME_mod= 0
##$MI= 1.114404
##$NCOEF= 0
##$NC_proc= 0
##$NLEV= 6
##$NOISF1= 3.799351
##$NOISF2= 2.8
##$NSP= 1
##$NTH_PI= 0
##$NZP= 0
##$OFFSET= 15.70392
##$PC= 1
##$PHC0= -9131.836
##$PHC1= 14.20097
##$PH_mod= 1
##$PKNL= yes
##$PPARMOD= 0
##$PSCAL= 0
##$PSIGN= 0
##$REVERSE= no
##$SF= 200.130013532006
##$SI= 16384
##$SIGF1= 3
##$SIGF2= 2
##$SINO= 400
##$SIOLD= 16384
##$SREGLST= <1H.CDCl3>
##$SSB= 0
##$STSI= 0
##$STSR= 0
##$SW_p= 3612.71676300578
##$SYMM= 0
##$S_DEV= 0
##$TDeff= 0
##$TDoff= 0
##$TI= <>
##$TILT= no
##$TM1= 0
##$TM2= 0
##$TOPLEV= 0
##$USERP1= <user>
##$USERP2= <user>
##$USERP3= <user>
##$USERP4= <user>
##$USERP5= <user>
##$WDW= 1
##$XDIM= 8192
##$YMAX_p= 0
##$YMIN_p= 0
$$ End of Bruker specific parameters
$$ ---------------------------------
##NTUPLES= NMR FID
##VAR_NAME=  TIME,          FID/REAL,        FID/IMAG
##SYMBOL=    X,             R,               I
##VAR_TYPE=  INDEPENDENT,   DEPENDENT,       DEPENDENT
##VAR_FORM=  AFFN,          ASDF,            ASDF
##VAR_DIM=   8192,          8192,            8192
##UNITS=     SECONDS,       ARBITRARY UNITS, ARBITRARY UNITS
##FACTOR=    0.0002004,     1,               1
##FIRST=     0,             0,               0
##LAST=      1.6414764,     0,               0
##MIN=       0,             -17053,          0
##MAX=       1.6414764,     19657,           0
$$ Real data points
##PAGE= N=1
##DATA TABLE= (X++(R..R)), XYDATA
$$ [...]
994a395l36J036J698R11p70j991j362Q40K338J524r96k499j358J075K260J107
$$ -1395 -1731 -695 1003 1914 1144 -847 -2209 -1369 969 2493 1497 -1002 -2360 -1285 975 2082
1010B082q51j672j075J24J215J513N69j240k046q73J484K376P52j641k309n47
$$ 2082 1231 -441 -1516 -1392 -177 1336 1905 665 -1381 -2254 -770 1606 2358 717 -1592 -2139
1026b139J522J925N01j041j530q18M72J380J353qj572j878j08J905K007L9k002
$$ -2139 -617 1308 1809 768 -762 -1580 -1108 272 1625 1617 45 -1833 -1941 -36 1971 2010 8
1043Hj889Q1J771J624k3j284j384m06P15J417J067m45j816j486M98K171J554p52
$$ 8 -1881 -1800 -29 1595 1572 288 -1096 -1502 -787 630 1697 1252 -564 -2050 -1552 619 2173 1421
1061A421k158j331P25J775J134l40j325j216j45R72J482O92r22j852r48J094K128
$$ 1421 -737 -2068 -1343 432 1566 1226 -99 -1315 -1460 -488 994 1686 764 -1088 -2036 -942 1186
1078A186R01j247k032p48J195J700O64o96j350q78J39J200J380K74j327j787m11
$$ 1186 2087 840 -1192 -1940 -745 955 1619 923 -427 -1305 -1166 34 1414 1688 361 -1426 -1837
1095a837J563J940K94j694j752p9J410J364K24r08j259o73M27J385J168k77j661
$$ -1837 -274 1666 1960 266 -1486 -1565 -155 1209 1433 525 -734 -1407 -980 405 1573 1296 -365
1112c65j459K63J806J501l04j831j351L56J558J104j10j075j108l32O89J388Q56
$$ -365 -1824 -1561 245 1746 1442 -389 -1740 -1384 174 1278 1168 93 -1015 -1347 -658 730 1586
1129A586o40j765j047Q62J910R76r01j782q36Q14J415P67l38j110r87j05R77J344
$$ 1586 946 -819 -1866 -1004 906 1882 981 -801 -1637 -823 592 1359 1021 -89 -1076 -1181 -204 1140
1147A140M53j079j679n35J282J733L84j279j606l53J045J381M09o84j138p48K31
$$ 1140 1593 514 -1165 -1700 -418 1315 1699 420 -1186 -1539 -494 887 1296 612 -526 -1274 -1043
1164a043J110J222Rj400j502K5J600J532k05j546j229J75J188J042J37p71j086
$$ -1043 67 1289 1298 -102 -1604 -1579 21 1553 1348 -198 -1427 -1252 -64 978 1115 344 -742
1181g42n38N77J293R44m90j532j125N84J711J028o05j576q58N33J185Q18j63r43
$$ -742 -1280 -703 590 1534 1044 -488 -1613 -1029 682 1710 1105 -471 -1329 -796 389 1207 1044 101
1199A01r74k81Q31J240N38q42j573o71J032J612M94j062j432m47Q30J141N08l75
$$ 101 -873 -1154 -323 917 1455 613 -960 -1631 -599 1013 1507 445 -987 -1434 -604 537 1045 670
1217F70r57q94K4J055J180J82j243j377j05J325J351R2j260j235k6J041J030K96
$$ 670 -287 -1181 -1157 -102 1078 1260 17 -1360 -1465 -140 1211 1303 43 -1192 -1218 -177 853 1149
1235A149o43j001o25L50J183R97k51j430j155M14J480J028m08j369q94L16J042
$$ 1149 506 -495 -1120 -770 413 1410 1159 -271 -1426 -1012 468 1496 1088 -281 -1175 -859 183
1252A83Q02Np48r51m32O29J221O40p00j477o74P82J471O09p77j275n45N11J050
$$ 183 985 990 242 -709 -1141 -512 709 1349 649 -828 -1502 -720 751 1360 583 -692 -1237 -726 324
1271C24O65k17q77q68j04Q64J171L12j016j352k53J133J352J47j069j097j55P26
$$ 324 989 772 -105 -973 -1077 -213 958 1270 254 -1098 -1351 -218 1134 1281 212 -885 -1040 -314
1289c14R28M54m16r67p37K03J050J006j58j223j142K68J260J004k84j142q59J07
$$ -314 614 1068 652 -315 -1052 -849 201 1207 1049 -174 -1316 -1048 212 1216 932 -210 -1069 -962
1307i62Q80Q60J53o18r54m95N18J151P06m97j357p60O46J325O88o16j140n70M22
$$ -962 -82 778 931 313 -641 -1136 -618 533 1239 742 -615 -1375 -729 596 1284 668 -472 -1042 -620
1326f20Q82O52l6p50q79k64P93J181L41q96j283l18R33J159K93q49j016l16N97
$$ -620 262 914 878 128 -751 -1015 -222 959 1300 404 -879 -1197 -264 895 1188 339 -677 -993 -396
1345c96Q72M38k89q91p17P9R26R74Rj166j061Q5J149J002j46r73q30j0P01Q42
$$ -396 476 914 625 -266 -983 -904 22 996 1005 -161 -1222 -1137 12 1014 868 -105 -935 -945 -244 598
1365E98K52m32r10n47L81J050Q07m08j204p69N24J189O32m32r61n74J97Q06O76
$$ 598 850 418 -492 -1039 -658 392 1199 791 -413 -1182 -658 531 1163 731 -230 -804 -607 199 875
1384H75K3o56q88k72O07J102L85p47j202l93P91J100K77p10q89l27L86P53N44
$$ 875 898 242 -646 -918 -311 791 1176 429 -773 -1166 -375 725 1002 292 -597 -924 -538 215 759
1403G59j56q13p70PQ79R71Rr59r82J3R90R04K4q42p26j23N98P34L61l48q10n98
$$ 759 603 -210 -980 -973 -94 877 886 -73 -1055 -1042 -52 852 876 34 -692 -815 -217 517 878 530 -280 -878
1425h78L19J016O75l07j066p41L65J042O19l06q83n74Q8O59O44J72n63q57m03
$$ -878 -559 457 1132 825 -241 -982 -617 425 1044 738 -145 -719 -631 28 672 844 281 -576 -979
1444i79N75R94L71o24j061l73O19R84K84n19q18l75L17O91N53q8o83p36n8P95
$$ -979 -404 590 961 337 -724 -1097 -478 506 790 271 -547 -922 -605 86 639 551 -132 -868 -926 -131
1464a31R07J15q46r20m6Q64Q57M3o40o95j54N02O05L67k48p43n95K15Q97P00k64
$$ -131 776 891 45 -875 -921 -57 800 843 203 -492 -646 -144 461 828 580 -163 -758 -543 354 1054 790
1485G90r64o79K67Q93O05k42p33n70KN37O22K10n14p59l58M29R09M00n49r26m10
$$ 790 -174 -853 -586 307 912 670 -63 -633 -631 -94 528 738 224 -535 -893 -464 445 845 296 -630 -1040
1506a040N15Q93L36m22p34l56K39N84N46K5o08o76j13O82Q43J02p11p88n3O78
$$ -1040 -525 368 704 282 -452 -808 -569 15 561 586 -22 -698 -811 -129 714 816 105 -683 -736 -58
1526e8P50Q4n39o35j96L77O09L96j96p29n74J60P92O74k12q71n97J86P40N68j78
$$ -58 692 776 237 -398 -594 -217 392 788 592 -137 -711 -551 241 915 703 -168 -765 -579 161 729 551
1547E51n65n49l0M20N80K35l94p02l84L93Q59L66m77q43l27M43O94L62l18o04
$$ 551 -14 -563 -593 -173 407 642 248 -454 -838 -445 414 780 303 -540 -867 -424 270 632 314 -290
1567b90l63J37N10N82J1n44o66q8O19P30J19o31p18q7O09O39J34m52n89j79K68
$$ -290 -653 -516 -6 576 587 43 -623 -711 -92 638 757 126 -592 -679 -70 569 703 251 -338 -517 -249
1588b49N31M01j61o36m99Q8O92N86j45p45n46J68O39M51q6m95m80q4L80N34K49
$$ -249 282 683 522 -114 -613 -525 167 753 608 -137 -683 -515 124 575 489 -6 -486 -570 -190 344 593
1609E93l61o49l27L63P00L50l42p21l57L74O27L08k31m91l69Q0M62N01Q1m83o04
$$ 593 232 -417 -744 -381 319 669 327 -394 -751 -377 250 558 327 -164 -533 -453 9 510 591 108 -496
1630d96j41N39O66J31n88o25q6N28N29J36l42n08k63K42M97L63j36n43m99J09
$$ -496 -637 -98 568 699 111 -514 -600 -72 457 593 251 -257 -520 -278 219 582 446 -97 -596 -487
1650d87O12N17j41o08n15Q8N79M67p6m55m33n6L06N39J89k90n93k94K82O62K91
$$ -487 125 642 501 -107 -622 -534 45 512 436 -19 -452 -508 -202 337 526 236 -357 -651 -369 293 584
1671E84l21n81l01K79N48K98j87m32l57L8M55M30O0m32n72p1M50O02J28m99n47
$$ 584 263 -318 -619 -340 208 506 319 -113 -470 -432 23 453 513 81 -491 -562 -112 490 618 119 -428
1692d28j03L88N38J26k72m71k63J85M70L41p6n06m67Q4N53M57j02n26m62J08M61
$$ -428 -531 -143 395 521 249 -222 -485 -300 170 511 435 -71 -538 -454 99 556 454 -72 -534 -426 35
1713C5L59Ml62l90j05K53M67K36k83m89l30K66N94K78k72n40k88K60M73K86j54
$$ 35 394 398 36 -354 -459 -206 261 497 214 -275 -605 -339 255 533 261 -279 -567 -307 166 452 298
1734B98l91l20qL79M39J04l69n15j25M14M95J51m17m89r4L36M22J45k37l94k29
$$ 298 -93 -413 -421 -42 397 501 132 -383 -508 -94 401 552 135 -354 -448 -112 310 455 218 -176 -405
1755d05J05M19L68q1m63m21R9M42M41p4m61m18K8L85L68L6k62m25p9K05M28K12
$$ -405 -300 119 487 406 -57 -478 -379 63 504 430 -31 -449 -421 -36 332 368 106 -319 -398 -193 235 447
1777D47k02m69l20K83M86K52k29m62k66J71M51K44o8l60l10k3L09L98R6l35m45
$$ 447 245 -224 -544 -261 225 477 248 -214 -480 -309 142 386 318 -42 -352 -375 -66 332 428 93 -352
1798c52r8L10N08J07l31m30j49K81L85J68j79l52k54J21L38L68o7l90m15M4M17
$$ -352 -450 -140 368 475 144 -286 -435 -154 231 399 220 -132 -386 -265 73 441 374 -16 -431 -387 30
1819C0L88rm32l23j8L28L86J2k61l35j54J79M06K54j86m76k28J65M63K48j50m43
$$ 30 418 409 -23 -346 -364 -36 350 362 101 -234 -388 -209 197 451 265 -211 -439 -274 189 437 287 -156
1841a56k60J24L84K20j6k90l15o8L09L77J12l04m57j18L26M36J13k75m07j41K37
$$ -156 -416 -292 92 312 296 6 -309 -377 -68 309 421 117 -340 -458 -132 304 417 142 -265 -406 -169
1862a69L47J86j32l27k53M7L44L18Nl80l68J1L87L59k5l28l56l7K97L61L7k31
$$ -169 178 364 232 -95 -348 -301 43 361 366 -14 -382 -371 16 375 350 22 -334 -371 -74 287 324 93
1884I3l19j21J42L59K64j70m04k56J14M17K73j50l78k00P3L09K55j9k21l29r6
$$ 93 -226 -347 -205 154 418 248 -156 -412 -298 119 392 242 -136 -336 -263 46 301 282 61 -268 -364
1905c64K50M09J02k66m21j32K81L97J75k83l64j41J95L50J40o6l09k99O6L19L13
$$ -364 -114 295 397 131 -290 -422 -141 256 431 148 -216 -357 -162 188 328 262 -47 -346 -280 39 352
1926C52m1l05l58mL43L90k7l54l14l5K85K96R6j77l19k09J55L50K73j36l99k28
$$ 352 311 6 -352 -356 -13 377 350 -4 -318 -353 -68 228 324 147 -172 -381 -226 124 397 261 -138 -366
1948c66J16L83K46r2l80k50Q8K75K81k1k33k60j57K39M08J47k72m01j26K41L71
$$ -366 -250 133 379 287 -93 -343 -255 20 301 280 47 -213 -370 -131 277 424 152 -249 -375 -134 237
1969B37J31k34l01j76J55L05K25j02l01k60rL34K98M4l46l53l1L64L27K6k92k73
$$ 237 368 134 -167 -343 -188 117 342 240 -61 -321 -330 4 302 346 0 -353 -384 -20 307 333 41 -232
1991b32j11K51L08J24j71l53j59J43L16K33p6l75k80J27L76K58j04l08l01L1L12
$$ -232 -343 -92 216 340 169 -184 -343 -200 116 349 273 -102 -382 -255 121 379 275 -33 -334 -303 9
2012IK62N0k36l41p9J98L63J43j91l66k26K53L61J50k07l38j46J13L04K42r9k60
$$ 9 271 321 85 -256 -335 -137 226 369 178 -188 -414 -161 200 350 143 -195 -341 -228 76 318 219 -41
2034d1l14%L15L43K4k78l52o8L17L43P0k89l22q0K09L20J43j56k93k30J23L58
$$ -41 -355 -355 -40 303 327 49 -303 -371 -54 289 359 70 -252 -332 -123 197 340 184 -109 -339 -216 142
2056A42K57r3l98k74J17L38K55m1l22k31qK23K98M8k13l20r8J62L86J48k00m17
$$ 142 399 306 -92 -366 -249 89 344 303 -19 -250 -258 -35 263 311 98 -222 -320 -158 228 376 176 -241
2078b41j80K61L80J43j77l37k04J05K94K58k1l00k85l5K89L67L9k95l64o3L06
$$ -241 -421 -160 220 363 186 -151 -355 -250 44 302 281 -19 -304 -339 -50 317 356 61 -303 -366 -60
2099f0L39N8k56k80j00J55L03J71j35l21k17J02L50K67p8l79k84O9L64K78m5k80
$$ -60 279 337 81 -199 -299 -144 159 330 195 -126 -343 -241 109 376 298 -81 -365 -296 68 346 301 21
2121B1l14MK32L02O8j80l22j63J99L44J91j99l77k03J73L88K01j82k90k32O5L21
$$ 21 -293 -289 -57 245 313 133 -189 -352 -153 191 382 183 -194 -397 -224 164 365 183 -107 -339 -274 47
2143D7K65j4l06k80n1L18L33N8k78l79p0K94L47O6k44l32q9J39L23K01j09l09
$$ 47 312 298 -8 -288 -339 -21 312 370 92 -287 -357 -63 284 350 106 -226 -315 -176 147 348 239 -70
2165g0l14J02L63K99r9l24l04K9L65K44m2k54k83k6K34L01R3j96l46j48K08L49
$$ -70 -384 -282 81 380 281 -43 -347 -318 47 291 249 -5 -288 -314 -80 221 314 118 -228 -376 -168 181
2187A81K02j75l60k13J56L43K27j17l27k32N4K84K81K9k87l19n9K90L61N7k51
$$ 181 383 208 -152 -365 -209 134 361 244 -83 -315 -261 23 304 333 46 -273 -332 -42 319 376 125
2208A25l66r2K47L17J19k20l12j64J40L22K15p3l58k36M9L33K70nl87k31nK81
$$ 125 -241 -333 -86 231 350 130 -182 -346 -206 116 331 258 -100 -336 -287 46 316 311 -76 -307 -312 -31
2230c1L34j8k73k65p6K10K87J63j86l33j71J63L54K26j86l42k24J29L36K27q4
$$ -31 303 285 12 -253 -329 -119 168 331 145 -188 -359 -196 158 384 198 -144 -368 -239 97 324 240
2251B40k76k59O5K49K53P1k81l34n3K77L45O7k73l35j17K41L25J34j68l23j44
$$ 240 -36 -295 -230 19 272 343 62 -272 -325 -48 297 364 91 -244 -361 -120 205 339 171 -152 -296
2272b96J17K59K07p8k91k60L9L29K93j3l42l10J9L37K87J3k51k89p2J98K88J28
$$ -296 -179 80 287 209 -82 -342 -303 26 319 306 -36 -346 -327 10 297 310 59 -230 -302 -104 184 312
2294C12j73l10j73J53L38K05j19l49k16J31L27K08q6k68k31oK56K84J2j92l64
$$ 312 139 -171 -344 -191 147 352 233 -116 -332 -201 126 334 248 -20 -251 -257 -1 283 295 103 -261
2315b61n4K26L58J05k31l41j46K14L00J38j42k87j82Q7K89K15o8k72k51K6K75
$$ -261 -315 -89 269 374 143 -198 -344 -130 170 308 166 -121 -303 -216 73 288 220 -52 -303 -277 -2
2336bK86j1k94k70k8K59K84N7k42k76p8J84L46J08j64l09j95J35L64J65o5l42
$$ -2 284 273 -21 -291 -319 -60 224 281 39 -237 -315 -131 215 323 159 -150 -345 -210 154 319 254 -88
2358h8k32R8L17K09m1l11k00J5K07K75P4k56k97q1K18L23R9j90l41j17K02K80
$$ -88 -320 -222 95 304 263 -48 -248 -233 -26 249 323 67 -230 -311 -93 230 329 139 -202 -319 -117 163
2380A63J41j41k82j56L8K92K09%l08k51j2L09K85l3k55k79l3K46K47N9j51k47
$$ 163 304 163 -119 -275 -237 55 264 264 -44 -295 -307 2 287 254 -1 -280 -313 -67 180 239 88 -159
2402a59j28J36K83J66j07l28k01R9L53J87q6k94k22N9K85K64kk82k11q4K45K49
$$ -159 -287 -151 132 298 191 -137 -338 -239 114 301 215 -79 -301 -242 43 307 305 23 -188 -272 -27 222
2424B22N9j64l30q5K06K77J28j55l31j14J43K74J34p0l08j39jK82K32l2k69k61
$$ 222 281 117 -213 -298 -92 185 313 158 -173 -287 -144 130 264 194 -114 -253 -254 28 260 228 -41 -302
2446c02qK65K69K4k31k76m6K61K30R0j88k40j21J00L09J58j14k67k21J03K80K35
$$ -302 -310 -45 224 248 17 -259 -305 -44 186 276 88 -152 -273 -173 136 294 180 -87 -308 -205 75 310
2468C10p0k77k05K9K29K47J2k54k03p0K05K48R4j68l05j10J83K87J22j33k95j76
$$ 310 240 -37 -242 -213 16 263 275 21 -182 -252 -47 201 295 127 -178 -288 -105 182 304 171 -124 -300
2490c00J36K40J86o9k34k12oK43K61J6k65k27o9K43K38Q7k34k60o6K19K23J07
$$ -300 -164 76 262 193 -41 -253 -259 -16 245 261 -4 -231 -300 -57 181 268 34 -226 -292 -73 150 257
2512B57j36k52j59R4K93J80r7k40k08M4K78K32o5k26k32jK17K38O6k23k41p8J72
$$ 257 121 -131 -290 -196 97 277 180 -60 -268 -224 54 286 221 -5 -237 -238 -21 217 283 60 -181 -259 -87
2535h7L04O0j53k48j62J41L01J33r9k76j90Q0K44K08j2k30k47j2K49K05J6j82
$$ -87 217 277 124 -124 -286 -145 156 289 190 -86 -276 -196 48 256 244 14 -233 -245 4 209 225 43
2557D3k69o2K54K16M2j39k57j07J48K38J46r6k84j63J01K24J83l9k44j75J9K26
$$ 43 -226 -288 -34 182 224 85 -172 -279 -131 107 253 157 -127 -290 -189 35 218 179 -65 -240 -221 5
2579EK24K3k55k06l3K09K46N2j91j85j72J66K83J11j24k78j22R1K56J42m3k41
$$ 5 229 252 -3 -209 -242 -33 213 265 74 -111 -283 -117 166 277 153 -125 -247 -156 100 242 199 -42
2601d2j94J9K74J82Ok35k04q4K38K27O8j73k63q6J69K53J06j55k61j18J05K84
$$ -42 -236 -217 57 239 245 10 -194 -278 -40 187 255 82 -181 -267 -98 155 261 106 -155 -273 -168 116
2623A16J47r9k56j30OK62J81pk43j91lK26K16L0k01k57m8J75K15P5j10k67p6J27
$$ 116 263 164 -92 -222 -216 46 227 220 -23 -214 -217 9 225 255 54 -203 -251 -76 139 214 104 -163 -239 -112
2647a12K26J55o5k95j58P3K57J63l8k20j81K0J90K14k2j96j99o0J54K72R5k01
$$ -112 114 269 204 -91 -249 -176 81 244 206 -14 -195 -175 15 229 207 11 -188 -248 -94 178 273 72
2669G2k53p9J73K20J13q7k62j60J06K46J53p4k15j98M4J71K60k3k03k41OK05K07
$$ 72 -181 -260 -87 133 246 159 -103 -263 -157 89 242 168 -47 -245 -201 -30 230 207 4 -237 -231 -26 181
2692A81N2j97j95j22K03K04J08j12k26j06O3K27J76q5k56j26KK37K26l9k00k26
$$ 181 233 36 -159 -281 -78 126 234 122 -104 -210 -147 80 256 171 -85 -211 -209 28 254 215 15 -211
2714b11k3K29K10Kj47k27o8J58K29O9r8k43j51J21K43J57j04k16j82P8K10J63
$$ -211 -234 -5 205 207 60 -167 -235 -77 152 221 123 -120 -271 -150 93 250 146 -70 -252 -174 36 199
2736A99k2k17j93pK30J99M6k47k01l4J79K38N6j39k34j10J76J78J58j28j98j54
$$ 199 177 -40 -233 -240 -10 189 235 -12 -213 -247 -68 170 226 87 -147 -257 -81 97 255 127 -71 -225
2758b25O4K48J56n2k38j76JK74J99l7j78k11m1J90J77J15j74k32q6J29K28J33
$$ -225 -161 87 243 191 -47 -223 -222 52 251 214 36 -175 -216 -26 151 266 92 -140 -226 -97 131 264
2780B64j29k33j61J03K78J11q6j85k05O6J98J68lk20j86k6J85K29R9k20k31p0
$$ 264 135 -98 -259 -156 122 233 147 -38 -243 -177 21 189 186 -34 -220 -246 -61 168 267 47 -184 -254
2802b54J37K56N9j23j82j49J23K23J40p6k32j38M3K18K17o3k20j91pK30J80L7
$$ -254 -117 139 198 75 -107 -256 -133 90 230 154 -78 -216 -173 45 262 199 -21 -212 -219 11 191 228
2824B28j64k54k1J50K43P6j62k43j05J40K41J27p6k69j85J24K39J57r0k15j51
$$ 228 64 -190 -211 -61 182 258 96 -147 -252 -112 129 256 180 -89 -274 -150 89 246 156 -59 -210
2845b10lK13J95j0j61k34l4J81K22Q2j76k04j19J31K41J40j40k40j17R6K02J60
$$ -210 -213 0 195 185 24 -210 -244 -63 159 241 65 -139 -258 -127 114 254 114 -126 -243 -147 55 215
2867B15o1j99j76J6K33J97mk03k31QJ76K44K0j75k22m7J22K13J57j32k65j38J19
$$ 215 154 -45 -221 -205 28 225 221 18 -213 -205 -29 215 235 60 -162 -209 -87 126 283 151 -114 -252 -133
2890a33K38J62j44j78j54M2K19J65j5k17j82KK03J87L6j81k37m7J73K00R9j62
$$ -133 105 267 123 -55 -209 -167 52 217 202 -15 -197 -195 8 195 231 50 -187 -234 -61 139 238 76
2912G6k41j27J95J96J45j07k23j45M7K71J18j2k18j55l1K09K16l8j79k01oJ87
$$ 76 -165 -292 -97 99 244 137 -86 -231 -184 87 205 193 -25 -180 -211 -2 214 176 -3 -204 -210 -23
2934b3K12L3j52k68l6J67K15J08j10k38j22N1K48J61p4k12j94Q6J97J95m2k27
$$ -23 189 222 70 -198 -234 -67 148 256 146 -92 -214 -163 85 246 172 -40 -234 -148 49 244 202 -25
2956b5j75m7K22K03M9j74j97o6J35K26O3j02k41j38J26K03J62j10k16j15J6K24
$$ -25 -200 -247 -25 178 227 53 -144 -210 -75 151 214 112 -129 -267 -141 62 224 114 -102 -217 -201 23
2978B3K08m6k29j77J4J87K25Jj61k08o4J75J94O4j25k11j22J52K12R8l8k45j45
$$ 23 231 185 -44 -221 -207 -20 205 206 45 -163 -227 -52 142 206 81 -130 -252 -100 112 210 172 -73 -218
3001b18P6J89J56j2k25j53K1J68J89j1j55k27K1J40J82R0j62j89j43J93K17Q3
$$ -218 -142 47 203 191 -34 -187 -166 2 191 180 25 -202 -181 -41 141 231 69 -120 -263 -70 147 230
3023B30j45k14j31J20K37R4o1k09j40J2K27J85j3k23j68k1J91J96K4j45j89j20
$$ 230 85 -129 -260 -140 97 191 130 -79 -219 -207 20 205 192 -31 -199 -220 -29 167 191 46 -143 -263
3045b63J81K11P3j01k25j08J14K32J08o6k33j39P1K01J37k9j67j89%K06J65J3
$$ -263 -82 129 202 101 -124 -232 -118 114 222 156 -77 -216 -145 56 193 164 -3 -192 -192 14 179 192
3067A92j79j92rJ42K03N5j33k21p9J19K06J20r9k21j13P0J89J52o1j82j40JJ89
$$ 192 13 -179 -188 -46 157 212 79 -142 -221 -102 104 224 125 -96 -209 -139 50 202 141 -41 -181 -180 9
3090IJ63J7j79j97l7J90J75O4j36k17m0Q9K37O7j06k05j07Q2J77J62p9k17j17
$$ 9 172 189 10 -187 -224 -34 141 205 69 -148 -188 -99 138 205 99 -106 -213 -131 46 208 129 -88 -205
3113b05M5J86K07n8j78j90K2J59J49O8j51j85p1J10K59P9j58k11j02J27K09R9
$$ -205 -160 26 233 175 -3 -193 -171 -12 137 205 54 -131 -202 -92 167 246 88 -123 -225 -98 111 210
3135B10q9j94j36N8J89J56o4j33j74J1J68J62qj44j68m0J29K20O7j85j66o4J04
$$ 210 121 -73 -209 -151 38 194 130 -3 -177 -166 2 164 156 12 -156 -196 -67 153 220 35 -131 -195 -91
3158i1J75J24j19j71j00L7J64J61l7j84j46K1J77J48Mj41j99qJ41K08Pj20j78
$$ -91 84 208 89 -82 -182 -145 19 180 143 -41 -187 -166 11 159 163 22 -177 -185 -44 164 171 51 -127
3181a27n6R7J76R1q0k00j04P0K07J30o9j79j30L6J81J20J8j71j89l3J86J77L9
$$ -127 -183 -86 90 181 101 -99 -203 -133 74 204 135 -44 -174 -138 43 163 181 10 -179 -212 -26 151 190
3204A90j56j86p0J66J84J18j46k24r8R6K23J27q9j97j47Q6J67J30k9j81j69L1
$$ 190 34 -152 -222 -56 128 246 100 -124 -222 -126 97 224 135 -62 -209 -123 44 174 145 -36 -205 -174
3226a74J79J45J2j32j98m7J42K00O1j49j74o0R7J74J21p4k10r4L0K01J45o8j48
$$ -174 5 150 162 30 -168 -215 -73 127 188 39 -135 -195 -98 76 197 123 -87 -181 -151 50 195 127 -21
3249b1j39PJ38J69K8j61j74PJ27J47N6j08j87o2R2K02O1r9j86q7P9J78J29o5j99
$$ -21 -160 -153 -15 154 182 21 -153 -146 -19 128 184 76 -111 -173 -81 121 182 83 -103 -190 -111 67 196 131 -68
3274f8j28N7J38J72j4j58j54k2J43J69M5j54j95n8J56J77O1j11j69q6P2J70J41
$$ -68 -196 -139 -1 171 157 -1 -155 -177 -34 135 180 26 -169 -227 -71 106 167 56 -113 -199 -127 43 184
3297A84n3j66j63L4J76J63k2j91j13j9J69J52J1j30j83LJ04J64P6r1k17q2J42
$$ 184 131 -35 -198 -164 12 175 153 -38 -151 -170 -1 151 162 32 -151 -148 -44 120 196 105 -112 -194 -52
3320e2J27Q9m7j37j44L1J91J12o9j16j27k3J46J96k3j56j67lP3J83J03j23j92
$$ -52 75 164 117 -20 -164 -133 58 170 101 -15 -142 -165 -19 177 154 -2 -169 -172 -99 84 187 64 -128
3343a28n9R5J55J14q0j54j23N1J62J29k3j64j44KJ69J32K8j16j73KQ4J95N1j39
$$ -128 -187 -92 63 177 97 -57 -180 -129 33 162 139 -25 -169 -167 2 134 162 46 -127 -125 -41 154 205 66
3367F6j63o8P8J64J08r8j58q8N0J96Q4Jk15j06K4J53J51n2j40j29lJ19J35Q0j25
$$ 66 -97 -165 -87 77 185 87 -71 -159 -109 87 171 172 -43 -149 -125 28 179 127 -13 -142 -145 -26 109 189 64
3392F4j86p8J09J84L8o1j72r7P3J71Q4j5j76j37K4J95J42l4j17j50m6J71J78J4
$$ 64 -122 -200 -91 93 131 70 -102 -199 -126 45 129 114 -62 -199 -175 20 162 128 11 -139 -185 -14 164 178
3416A78j39j35l8J07J72M7j03j77r6J04J66J05q6j61j19P9J37J57j3j68j40j1
$$ 178 39 -96 -134 -27 145 192 89 -88 -184 -80 86 191 105 -56 -175 -96 41 198 185 17 -123 -134
3438a34J41J26M2j26j90k4J12J85M8j29j63j09J13J64J17p8j78r4K9J92J11l4
$$ -134 7 133 175 49 -141 -165 -53 132 180 51 -112 -221 -108 56 173 95 -83 -177 -148 44 155 121
3460A21j47j53J8J77J59k9j66j26k5J26J62L8j01j52q5R2J61J25q2j82r4O7J64
$$ 121 -26 -179 -161 16 175 146 -20 -146 -171 -45 117 155 54 -98 -183 -91 70 195 113 -69 -163 -96 68
3483F8J10j0j84j46J4J76J57l2j29j74J9R1J59O7j36j58r9J57J28R1r9j55j15
$$ 68 178 168 -16 -162 -148 28 185 153 24 -150 -131 -40 119 186 50 -108 -207 -50 78 169 70 -85 -200
3506b00R8J54J10o0j42j68L9J76J35Mj37j84j0J45J95J4j76j23m1R0J78R2j21
$$ -200 -102 52 162 102 -40 -208 -169 7 142 146 9 -175 -185 -40 155 169 -7 -130 -171 -81 97 189 68
3529F8j44j11P0K06Q7q1j26j20K0J62J37K0j67j30l5J60J50jj18j69k5R9J52O9
$$ 68 -76 -187 -117 89 176 95 -31 -151 -131 31 168 188 21 -109 -144 16 166 165 47 -122 -147 -48 104 173
3553A73j19j68p5P8J82J13m6j78j28K3J96J13l2j60j41k3J85J49nj45j61j3J34
$$ 173 54 -114 -189 -111 71 184 138 -40 -168 -145 51 164 132 -28 -169 -192 -7 142 137 -8 -169 -182 -48
3576d8J78M6j06j90p7J22J75Q5j14j34j30Q0J76J38o4j81j26K6J89J18m3j06j46
$$ -48 130 176 70 -120 -197 -75 100 185 71 -63 -193 -113 63 201 137 -44 -170 -144 45 163 120 14 -132
3599a32m0J33J69O3j50j67m6J18J64O1q4j77r5P8J51J39o9j85q1J5J59J29j3j44
$$ -132 -172 -39 130 193 43 -124 -170 -52 112 173 89 -88 -183 -105 46 185 116 -69 -150 -135 24 153 140 -4
3623dj62JJ32J49Lr9j42m5J07J54P4j02j98m9J16J44J05p5j82q9N9J48J09%j74
$$ -4 -166 -165 -33 116 119 20 -122 -167 -60 94 168 66 -132 -181 -65 79 184 109 -73 -162 -103 45 154 154 -20
3648b0j14j6J56J56L1j91j12o9J55J67K3r8j65o7R3J55R6q8j70r7O0J59J49n2
$$ -20 -134 -150 6 162 193 2 -110 -179 -24 143 166 68 -97 -164 -71 84 180 92 -78 -175 -115 44 193 141
3672A41j52j49L8J21J36K5j44j61k3J42J55J0r6j62m1Q1J69O4p1j55j48J33J30
$$ 141 -11 -160 -122 -1 135 160 16 -145 -168 -26 129 139 43 -119 -160 -79 90 154 83 -72 -220 -87 43
3695D3J36m2j97r4M2J15J53j7j49j44J0J08J82L2j45j45n9J10J71Q1q9j76r1R0
$$ 43 179 137 -60 -154 -112 3 156 139 -10 -154 -144 -36 146 178 33 -112 -171 -61 110 191 102 -74 -165 -75
3719g5J41J31n3j91j37M6J46J63k6j51j37kJ34J68Nj53j23n9J37J37P1j14j80
$$ -75 66 197 144 -47 -184 -138 8 171 145 -6 -143 -145 -11 157 162 9 -114 -173 -36 101 172 58 -122
3742a22m0R0J53Q0o1j49r3%J93J02k6j85j07J0J36J27M0j26j36n4J21J77L4j10
$$ -122 -162 -72 81 161 100 -49 -142 -142 51 153 127 -58 -165 -155 -19 108 148 22 -114 -168 -47 130 164 54
3766E4j54p2R6J81P9p6j73j00O3J30J47n0j60j06M3J21J39j6j13j42n5J40J49
$$ 54 -100 -172 -76 105 184 108 -65 -165 -102 28 175 125 -35 -141 -98 23 162 146 33 -109 -164 -24 125
3789A25N0j61j11m6M7K00M2p8j62m7M5J31J31p2j80q5N9J25J39k0j25j47j1J39
$$ 125 175 14 -97 -143 -96 104 146 68 -94 -141 -96 35 166 94 -86 -171 -112 13 152 132 7 -140 -151 -12
3813a2J15M9j10j52m8Q3J73K9p0j45o5R2J21P8l2j45r3J5J62J25o4j11j27L0Q8
$$ -12 103 152 42 -110 -158 -75 98 127 57 -88 -153 -61 60 138 106 -39 -132 -117 45 170 106 -5 -132 -102 -14
3838a4J56J8j32j37j1P2J69N7j55r0p0M8J67O0p3j30q7K6J56J10l9j35j15JJ39
$$ -14 142 160 28 -109 -120 -48 121 178 23 -67 -137 -89 78 138 65 -65 -152 -126 30 140 101 -34 -149 -148 -9
3863iJ16K5j13j32j4R0J02M0q4j32k4N8J26P6m8j67m0L3J50J07n8j41r8L7J63
$$ -9 107 132 19 -113 -127 -37 65 105 21 -111 -135 -77 49 125 77 -90 -130 -97 53 160 102 -39 -137 -100 63
3888F3R5%j02j74kJ12J39K1j04j42m8J19R8O8q4j57m3O2J67N9l7j60q3M3J10J11
$$ 63 158 158 56 -118 -120 -8 131 152 48 -94 -142 -23 75 143 59 -98 -141 -79 88 147 110 -50 -133 -90 20 131
3914A31m6r3j13kQ7J11K1r7j16oN7J26O6o8j45o8P9J17J32j00j24o7L9J49K4k5
$$ 131 85 -8 -121 -123 -36 75 96 -1 -117 -123 -66 60 126 58 -87 -155 -76 41 173 73 -51 -118 -79 70 94 69
3940F9j07p4j1J05J13Qq8j12j2P5J47J6q9r9n6O0J30M1k7j12r3K2J62M2j5j00
$$ 69 -38 -112 -123 -18 95 103 15 -97 -109 -34 113 129 40 -59 -115 -55 75 116 89 -23 -116 -94 68 110 95 -5
3966ej41M9J00R1L1j13j31k7J10J18Rk8j36m0L1J58L9q2r4l5J7Q3J05l9j20n1
$$ -5 -146 -97 3 94 125 12 -119 -146 -36 82 91 63 -73 -113 -82 76 115 33 -61 -96 -79 4 109 70 -50 -101
3992a01lJ37O8%q2j04j4P6J23Lq5r6m7J17P4O1n2j36m5M9J25O8n2r4o6qJ22N5
$$ -101 -104 33 101 101 19 -85 -99 -23 100 103 18 -78 -125 -8 66 127 75 -61 -106 -57 68 136 84 -10 -76 -84 38 93
4020I3k0j04m8l5J20O5J3n5j15k9R4R0N6p4r8m5J8J20N3J2j63j6%J02Q8l1j11
$$ 93 73 -31 -79 -114 6 71 84 29 -86 -115 -21 69 125 51 -47 -92 -74 46 99 111 -52 -68 -68 34 122 91 -20
4047b0o7jQ1Q7L1q9r3n6P2J36J0p9p5lL8J09K4j1j30n9K5J24P8l8j08o9j7J18
$$ -20 -87 -88 -7 80 111 22 -71 -127 -55 81 91 12 -63 -66 -28 81 105 94 -36 -95 -70 54 132 94 -14 -83 -100 18
4075A8Q4Po3j27k1P7O6M8l9j23k2L0J13K5j9j03m6M8R1M9j2j15r7M3R3Q8Rq7j06
$$ 18 102 109 46 -81 -102 -25 41 89 50 -73 -95 -65 48 73 54 -49 -95 -47 44 93 81 -34 -131 -88 5 93 102 15 -91
4104i1lO4R4M4q6q4n4P8R5M9m8j17l3M3P5N9Nj30n2N2O0R0pj00j00L7P1M3R2j26
$$ -91 -94 -30 64 108 22 -62 -116 -38 57 106 58 -59 -92 -49 26 85 90 -40 -92 -40 20 110 103 3 -97 -60 11 54 146 20
4134B0q4j5L7J01M4o0r1k4J4R0N4j9r5j00P5O9Q0k4r2n9j9Q1J00j0o4q0k1N0J01
$$ 20 -64 -79 -42 59 103 43 -48 -72 -58 32 86 67 -28 -128 -53 16 96 72 -20 -79 -98 -17 83 73 9 -71 -92 -42 59
4163E9L1m8j15n2Q2P6N2l1j17m2J7J01O8nr4p4J7R2N3J1q2k1n0M8R3O0r0r0n0
$$ 59 90 42 -73 -125 -43 33 85 54 -63 -105 -88 13 81 76 -18 -92 -75 17 70 81 -1 -22 -72 -24 69 129 39 -51 -101
4192a01N4J06L6rj23k8NR3M7J8j17p1mR9M4K1p9p7J2K8Q9M9o2o9o6P5N2K7pj03
$$ -101 -47 59 95 86 -37 -65 -60 33 80 98 -19 -90 -94 5 49 70 -9 -86 -74 -46 43 92 30 -39 -105 -30 22 49 42 -61
4222f1m3L4J02O3l2j01m9JN3J37m5o5q2jQ2P6K6q2o7k6N8N8P7r2k9p1L9Q6N8j9
$$ -61 -104 -70 32 95 63 -38 -87 -86 -33 104 59 -6 -88 -89 -7 69 95 13 -54 -80 -22 36 113 21 -8 -79 -40 46 104 85
4252H5j13l2K7N9O2Pj03q1J8O0Q1J2l4j21PM7O6K2rr8l3M3O4P4p4q7j7J9O2O3
$$ 85 -28 -60 -33 26 88 95 -8 -89 -71 -11 70 82 48 -73 -66 -19 47 69 60 -38 -71 -28 36 110 36 -51 -68 -49 13 76
4282G6qp4n9j1P4O7J3j00n5l2R5P3J9q1m3n1P2M1O6l2j05j1j1Q7M8j1o5p7M7M7
$$ 76 68 -6 -65 -76 -2 65 78 -22 -77 -109 -14 59 78 -3 -46 -97 -25 16 82 50 -55 -66 -77 10 58 47 -18 -95 -48 -1
4312aR0j7n4n4j2M1L4N1j2q9l7M0P6L0m1o3q6O2L5O5k8m2o9K8P7O5n5m2o3J0L7
$$ -1 89 72 18 -36 -48 -7 27 78 66 -23 -60 -20 56 86 45 -18 -104 -42 -7 58 30 -12 -81 -53 24 89 34 -8 -71 -61 -24
4343b4N9rk0n0k3M1N4K0k3p0n0N4P3L9k1q1l2J5P3L5j4n6o2rR3M2L1q0n6j7P1
$$ -24 35 26 6 -44 -67 -26 28 48 25 -45 -95 -41 32 71 50 -31 -63 -48 25 60 46 -10 -72 -81 12 54 85 5 -51 -68 3
4374CL7L8m7o9n7O2Q0L4n3n8m8L5O7L9jq1n5lQ7J2J7n3p5RO3N0M8p4p6j2P8M5
$$ 3 40 78 31 -38 -95 -33 47 81 28 -30 -78 -43 24 63 62 -19 -74 -77 10 22 39 -14 -89 -80 -17 33 81 7 -69 -81 -3 42
4406D2K5m7o3o3N5R8Oj4o3m4M6J2O4j2o0m1lP4N6K2r3k7k5M8O9Rl2j07j2M8O8
$$ 42 67 20 -43 -106 -51 47 53 39 -24 -68 -22 -10 54 42 -18 -59 -62 12 68 90 -3 -30 -55 -7 62 71 39 -68 -80 -32 36
4437C6K5qp1n8M4N4L3Mr1j9%Q5K0m0k4o0pO6O5mm6p9%M6P0lj1o0k2nR9K3m8n9
$$ 36 61 53 -18 -76 -32 22 55 59 -32 -51 -51 34 54 14 -10 -70 -77 -11 54 50 4 -75 -75 -29 41 38 27 -33 -55 -60 39 62 14 -45
4471d5k7J8P0O6l2o4n7PR6L4om8q2M8jO1M0l6r6QM1O4Mj9n9l2PP4J3l4k7k3nM2
$$ -45 -72 -54 16 82 50 -14 -71 -64 32 66 60 12 -70 -22 -23 38 78 42 -54 -46 -5 59 63 44 -15 -47 -40 34 47 13 -14 -37 -42 0
4505@P0l1p3k8L5pQ1K1n6o5j5P0M8ol4o9j9J5R1K0m4m3k7J9K2J07m1o4l1K0M1
$$ 0 70 39 -34 -62 -27 -34 47 68 12 -53 -68 2 50 44 10 -59 -78 -63 28 48 4 -39 -66 -47 -25 82 41 -23 -54 -34 7
4536GN7Po2m4l4N6N2K4m3o4j4N6K9N5n0o2J1KL6N4m8pp4J7K6O5Jp7l4k2P1N1K
$$ 7 64 71 9 -35 -69 -13 39 63 20 -44 -58 -2 27 82 32 -30 -19 -17 19 73 25 18 -56 -39 -13 52 53 -24 -58 -80 -9 42 44
4569D4m9l1j5M0M3mj2o6k1K7M4M1j6n2n2M5P1MJp1n7L9Q7kPk7o1lN7N9k3k4l2
$$ 44 -5 -36 -51 -11 32 28 16 -50 -71 -44 0 41 25 -27 -79 -34 37 41 42 -29 -86 -47 40 38 45 18 -43 -46 11 70 47 23 -9
4602ik8M0N1J3n2m8lnL9L1J0j7p4M6J8K7Pnj10L4M9MK7p6%j5QP7l4j1m0m1L6O3
$$ -9 -37 3 54 67 15 -33 -36 -41 -2 29 39 22 -52 -6 12 39 46 41 -69 -35 14 18 45 -31 -31 -46 -38 39 5 -6 -46 -87 -51 12
4636A2N1j4n8m4J7PJ02n1m0l6RN6L0j5Pj06P5k4N4L5n6l1nKO2M0l6n8l5M5J8P2
$$ 12 63 49 -9 -53 -36 -29 73 22 -18 -54 -45 11 41 26 33 -73 2 -22 32 67 11 -20 -25 -23 39 79 43 -15 -50 -5 13 85
4668H5n5n1j1mO1KM0o1m5K4K7L6k3Qm2j2j4M2K1l5l8oM4K9Qpm3j7j3O5NK7n6O
$$ 85 30 -21 -32 -36 25 27 67 6 -39 -15 12 48 25 33 -9 -21 -35 7 28 -7 -45 -51 -7 22 30 23 -20 -37 -50 15 20 47 -9 -3
4702cl4L0N5ql3m3MK1K4K5rn8j1O3K3j6k2ql2L0QM5l2j7j8k0O8Rlk1l1j5L5L4
$$ -3 -37 -7 48 40 7 -36 -32 -11 13 38 29 -29 -40 23 46 30 8 0 -32 -2 6 51 19 2 -16 -36 32 41 38 17 -14 -29 6 40
4736D0pm8l5J9M2OK6n7k2k0qQ2omm2mqM3OJ5l3l6J8J8N3J3l4m3k5M4M3L4m7m6
$$ 40 33 -15 -50 -31 11 17 43 -14 -36 -56 -64 18 12 8 -34 -38 -46 -3 3 18 -15 -51 -33 -15 38 51 17 -26 -51 -7 36 70 23 -23
4770b3l0M3M7OQo1K2j9M0J7j3l9m2K1M6J9Mk0l7l3K5P0j3m5l5J0J8N2ml0m7j9
$$ -23 -53 -10 37 43 51 -10 12 -7 33 50 37 -2 -44 -23 23 42 46 26 -11 -44 -19 51 38 -7 -42 -32 -14 38 34 4 -43 -62
4802f2L7L8N6m9l7l8J8N0K1Ql5n6%P7J4j4m3k0J0K8J7K1k2p7J3L6M8J8j9m4n9
$$ -62 -25 13 69 20 -17 -55 -37 13 34 42 7 -49 -49 28 42 28 -15 -35 -25 3 20 41 19 -58 -45 -9 39 57 38 -6 -65
4833f5M1P2nkl6m8J5L0N5l2l8j1J3K1ON0o8j3k9L9K4L5jr8L0LJ8L4J6o6l7K1O
$$ -65 -24 48 43 41 5 -43 -28 2 57 25 -13 -24 -11 10 16 66 -2 -15 -44 -5 19 54 53 -45 -15 -12 6 40 56 -10 -47 -26 -20
4866b0O9j1n5k3rL7O6n6Lj0n7N4L0K7k4m1pJ4L8L6l8j8m2L8MM3j6n0k5J2L7L4
$$ -20 49 38 -17 -40 -49 -12 54 -2 1 -9 -66 -12 18 45 21 -20 -27 -13 25 61 23 5 -37 1 5 48 32 -18 -43 -31 6 40
4898D0jk1m3m0M8M2L7k4l3n4N7LL7l2k1k1rM7J8kj3l9j8M7K7Jm1k6j7K8K8J4o
$$ 40 39 18 -25 -65 -17 25 62 38 5 -49 8 11 48 16 -5 -26 -35 12 30 28 15 -24 -42 5 32 33 -8 -34 -51 -23 5 19 13
4931A3p3K4NJ6O2q7L5k2K2M3k0j4k4l0K9J9P7l0n6j7K6J5RLk4k8j2L5K5K1l3n6
$$ 13 -60 -36 -31 -15 47 -40 -5 -27 -5 38 18 4 -20 -50 -21 -2 75 45 -11 -28 -2 13 22 25 1 -27 -39 -4 21 42 9 -47
4963d7Qj3P3M0m3k9k4OL7Qm3K4m7J9K5K4Rj0o8K2j6Q0K5o5k8lK1OM1J4o1m3N0
$$ -47 -39 -52 21 61 18 -11 -35 -29 8 16 -27 -3 -50 -31 -6 18 27 17 -51 -29 -45 35 60 -5 -33 -36 -15 -9 32 46 -15 -58 -8
4996hJ5L5Qm8n7K4M6J0J9m8k5JOM4kl4MK0mLM7k6k8o2J6P9NLm2m9J5J2M4L1p8
$$ -8 7 42 50 2 -55 -31 15 25 44 -4 -29 -28 -22 22 20 -14 -10 10 6 9 56 30 2 -60 -44 35 40 43 1 -48 -33 -21 23 54 -24
5031b4k2k1N4LN0j3p4J6L3J9jQm0j0KJL7J6p4j5K2M5nJ0Jo4k8O4N8l5Jp9K8K6
$$ -24 -46 -67 -13 -10 40 27 -47 -31 2 21 20 28 -12 -22 -20 -19 18 34 -40 -55 -33 12 7 17 18 -46 -74 -10 48 13 14 -65 -37 -11
5065a1K9K9l8pn1k3Q1L5J2p6j4PM4N2k6n0k6j7Q5kJ4l5k4k7L6QM6l3o1%L3L0J4
$$ -11 18 47 9 2 -49 -72 9 44 56 -20 -34 -27 17 69 43 -7 -33 -50 35 33 47 12 -12 -39 -3 5 51 18 -43 -43 -10 20 34
5098C4on4m4O3K5KK0n3k5j3L5L7Ll6n2J7K5M3L3o7k4l4O4K6K4k3k2o9M5N0NJn0
$$ 34 28 -26 -70 -7 18 20 40 -13 -38 -51 -16 21 24 -12 -64 -47 -22 21 54 -13 -37 -71 -7 19 43 20 -2 -71 -26 24 29 30 -20
5131b0J5l6L5N6j4m6l5J4M6K8k1kn1PJ4N7Ml3m8m1N5K4K5Po4l2N3PJ3kn5j4j5
$$ -20 -5 -41 -6 50 36 -10 -45 -31 15 43 22 20 -31 -24 -10 47 51 18 -30 -71 -16 8 33 40 -24 -56 -3 4 17 15 -40 -54 -69
5164f9L6Q1Mm3o4k9Q7K8K3o8jn1L7M4L8m0m2j1oO5L8n1l0kmK7L4Nl6j0m0P7L4
$$ -69 -33 48 52 9 -55 -84 3 31 54 -14 -15 -66 -29 15 53 13 -29 -40 -46 19 57 6 -24 -26 -30 -3 31 36 0 -10 -50 27 61
5197F1j4np2l2P2L3j7J1m0l8K0L3K8k2l4l6lP1K5k0m1l8K8K8J8%j2m5m2N2M4K5
$$ 61 47 42 -30 -62 10 43 26 37 -3 -41 -21 12 40 18 -16 -52 -55 16 41 21 -20 -58 -30 -2 16 16 4 -41 -83 -31 13 38
5229C8l1o6oM2J8N4l8l5l9MR5rK8o6n1L7J6O4j9Kl5l2PO5mk0j5l7J5M3J8k7l2
$$ 38 7 -59 -65 -23 -5 49 11 -24 -63 -59 36 27 55 -11 -62 -25 -9 55 36 38 3 -29 -22 43 39 19 4 -33 -18 25 43 16 -16
5262a6j7JN9L5l1o7j8M8J8K4K4p1l0k0M5M2kk5m7RL0J4L2j2n1j7j1P4Pl2j3l6
$$ -16 -33 -32 27 62 31 -36 -54 -6 12 36 60 -11 -41 -61 -16 26 24 -1 -48 -39 -9 5 37 25 -26 -43 -54 20 27 -5 -18 -54
5294e4L4J8L8Ln4l7J3L7L9j1j7o2RL1L9L5o5j1j9J7O8pj6k5l5mR2Nj9j3o5L0K
$$ -54 -20 -2 36 39 -15 -52 -39 -2 37 26 9 -53 -44 -13 26 61 -4 -15 -34 -17 51 44 28 3 -32 -36 56 61 42 29 -36 -6 -4
5327dL8K8n5k2l9M8M5Mn9k1J7NM5j8Pn4m1M0O1Kkk5p1J8L0N4j1j8l0OL7K6Km0
$$ -4 34 62 7 -15 -54 -6 39 43 -16 -37 -20 -15 30 12 19 -35 -76 -36 25 27 25 0 -71 -53 -23 31 20 2 -28 -22 15 41 43 3
5361Cm2J1K5K3%j6k7l3K0O9j3L6o1j7L5MK6Qm8k5PM1K0j7on5k6N6L6J7k3n7m2
$$ 3 -39 -28 -3 20 20 4 -23 -56 -36 33 20 56 -5 -22 13 17 43 51 3 -22 -15 26 46 29 23 -32 -58 -2 34 51 28 -29 -71
5394g1M3K7K3j3n4k2O1L2j0j4Jn8L7K5l4M2j6m2qN0J9j3mk4pJ9L6Kk1l7j7K0L2
$$ -71 -28 -1 22 9 -45 -67 -6 26 16 2 3 -55 -18 7 -27 15 -1 -43 -51 -1 18 5 1 -23 -30 -11 25 27 6 -31 -48 -28 4
5427DM9j6l5m8%O6K3on3j4J0PO9Lo4j5%jK7L4k8k5m8L3M8L3k3m9j6k9O1N9j5o4
$$ 4 53 37 2 -46 -46 20 43 37 -16 -30 -20 -13 56 59 -5 -20 -20 -21 6 40 12 -13 -61 -28 20 53 30 -19 -35 -64 -3 56 41 -23
5461b3k0j4L5M0Lj6m3KQO3l0j1J1m5L3L4Lk7j9krM5O0l3n0j4K1K7K9j0k3m1l0
$$ -23 -43 -57 -22 18 21 5 -38 -36 -28 35 5 -6 5 -40 -7 27 30 3 -16 -18 -27 18 78 45 -5 -19 2 29 58 48 25 -16 -46
5494d6L4N4k3Nm2k5K9K6J7j0k8k0J3K3L6k7Jl4lJ7O2k8op3LN3Qj3K7p7PNL4jj7
$$ -46 -12 42 19 24 -18 -43 -14 12 29 19 -9 -29 -16 7 43 16 17 -17 -20 -3 59 31 25 -48 -45 8 16 3 30 -47 -40 -35 -1 -2 -19
5529a9m0K4L2M5j1k3m4K0PLL7j5Lm4j3M5K0Nk5k9K6jJ0J7k4j8j4PO7k4oj8n6L7
$$ -19 -59 -35 -3 42 31 8 -36 -16 -9 -6 31 16 19 -25 -38 7 27 32 7 -22 4 3 13 30 6 -12 -26 -19 48 24 18 0 -56 -19
5563a9N2rrl2m4QM8N2n7L1n7rN5J5J8o2pjk5K7L3j9k3k2K3L6j1L2n8J4mM8J1l6
$$ -19 33 24 15 -17 -61 -53 -5 47 -10 21 -36 -45 10 25 43 -19 -26 -27 -52 -25 8 -11 -34 -56 -33 3 -8 24 -34 -20 -24 24 35 -1
5597aL1n9PJK2J9nl8OJ6K5%k2k2jJ6M8Pnn0J0j4L8k5K8n2m6N8L7j2j4ln0J8J3
$$ -1 30 -29 -22 -21 1 20 15 -23 -17 -1 24 24 2 -20 -21 -5 43 50 45 -5 5 -9 29 4 32 -20 -66 -8 29 17 3 0 -50 -32 -19
5632a9N8l2Pp0L9KL2J4j6n0j1jN5J9k5k1k4JJ9N0k8J0n4K3J9N6kl2l3jL5Rk5J5
$$ -19 39 7 14 -56 -17 -15 17 31 15 -35 -46 -47 8 27 2 -19 -43 -42 -23 27 -1 9 -45 -22 -3 53 51 19 -14 -15 20 29 4 19
5666A9k5j9K1J5K5k2k2j4KJ7M1j5l6J5o2N0K3KNm3j2P1j2Kk2l2j4M1mJ9k4J6p
$$ 19 -6 -25 -4 11 36 14 -8 -22 -20 -3 38 23 -13 2 -60 -10 13 15 20 -23 -35 36 24 26 4 -28 -42 -1 -5 14 -10 6 -1
5699an9M8QPLk0j3QL9Kjm3k4N8mJ9nml9QjL7J5k9m4O8j2j1K6j5l3J0J8kJ8m7J8
$$ -1 -60 -12 -4 3 6 -14 -27 -19 20 22 21 -22 -46 12 8 27 22 18 -21 -13 -14 23 38 9 -35 33 21 10 36 21 -12 -2 16 14 32 -15 3
5736Cm2P3j9J7j7n4J8OL7pMn0rL2LK0qk0kl2L9j0L1j7n0L3j8N5J0k8k6qN1J1l
$$ 3 -39 34 15 32 15 -39 -21 -15 22 15 19 -31 -40 -8 -5 15 7 -13 -15 -47 -8 -18 13 -4 -54 -21 -39 16 26 -2 -28 -36 15 26 23
5771B3J3l5m3K7M0PJ9m3k4kM7j6L4l4l8P%K6K2j9k6k1M3J0J0Mn6K3K0%N6o0j5
$$ 23 36 1 -42 -15 25 32 51 8 -16 -18 29 13 47 13 -25 -18 -18 8 30 11 -15 -36 7 17 27 31 -25 -2 18 18 74 14 -1
5804ak9J7L5ol8j2OlJ5N4rk7j9m1M5J5k3L4l5k2L2POkMk3JM9k0Lj5l1J2L0J6J4
$$ -1 -30 -13 22 16 -22 -34 -28 -31 -16 38 29 2 -17 -58 -13 2 -21 13 -22 -44 -12 -5 1 -1 3 -20 -19 30 10 13 -2 -33 -21 9 25 39
5840C9j3l9j7QM9Mk3n6K7NL5%J4l8k6N1J4j0j9rk2QJ5QJ4k6k5L9l1K2J5m8M2m5
$$ 39 26 -13 -30 -22 27 31 8 -48 -21 -16 19 19 33 -5 -31 20 34 24 5 -4 -26 -18 -3 5 19 -7 -32 7 -24 -2 13 -35 7 -38
5874c8J6K6POl9k2MM4M1m9k5J3j7L9lKJ4n3JJ8OM7j5k2j3j3M0M9n2j7kJM3Jl3
$$ -38 -22 4 11 17 -22 -44 -40 4 45 -4 -29 -16 -33 6 3 5 19 -34 -33 -15 -9 38 23 1 -12 -25 15 64 12 -5 -7 -6 37 38 5
5909EJ8l4K1LK6Nm4j7J6j5K0J8j1l7K6k5L0K6m1l7K1QPL0m7J4j7J7j0N1n0jNr
$$ 5 23 -11 10 13 39 44 0 -17 -1 -16 4 22 11 -26 0 -25 5 31 -10 -47 -26 -18 -11 19 -28 -14 -31 -14 -24 27 -23 -24 -19 -28
5943b8K9K8rNk3m0M8lK3l8k4NK3K3J3j7pj5j6jL4J6k6rkRRj6Olk1jL3L0l1np2
$$ -28 1 29 20 25 2 -38 10 7 30 -8 -32 -27 -4 19 32 15 8 -7 -23 -24 10 26 0 -9 -11 -2 7 -9 -3 -6 -27 -28 5 35 4 -1 -73
5980g3N4M8Mn6K5k7JJ3RL2n1OLrM4Nn4J3%pML0mk5m1M6J6J2Kj3l3L2J0Nl6Ql5
$$ -73 -19 29 33 -23 2 -25 -24 -11 -2 30 -21 -15 -12 -21 23 28 -26 -13 -13 -20 -16 14 10 -15 -56 -10 6 18 20 7 -26 6 16 21 -15 -7 -42
6017d2L4L5l0L1k6k4RJ3K5j8j7rrK2J7J4k0j4LL1Nnk1l7Oj8O2nj9%p%K5J1k1j4
$$ -42 -8 27 -3 28 2 -22 -13 0 25 7 -10 -19 -28 -6 11 25 5 -9 -6 25 30 25 4 -33 -27 -45 17 12 -7 -7 -14 -14 11 22 1 -13
6053a3Rj6J2K2l5K1n1K2M2l7M1ko0J5J6N6l9j3J8j5j4J1L3rj8NpM1K0m8qj4nL8
$$ -13 -4 -20 -8 14 -21 0 -51 -29 13 -24 17 15 -45 -30 -14 42 3 -10 8 -7 -21 -10 23 14 -4 1 -6 35 55 7 -1 -15 -20 18
6087A8J9%m0j1lK2%N2j7n3Kj6K6K8m2K1m9K8K6Lnk9J2%k0N0m7K1k0o%K7MMk9j3
$$ 18 37 37 -3 -14 -17 5 5 57 40 -13 -11 -27 -1 27 -15 6 -43 -15 11 14 9 -20 -8 -8 -28 22 -25 -4 -24 -30 -30 -3 1 5 -24 -37
6123c7L3K0Lmnj5l5M4K0j6jj9J4oKK5k4j9PL3K4j6km4Mj7M2L7n3j0K3qL5j0l7
$$ -37 -4 16 19 15 10 -5 -40 4 24 8 7 -12 2 -4 -2 23 -1 -20 -13 20 44 28 26 -18 -14 -31 11 48 -5 -15 8 0 35 25 -12
6158a2NJj6J3K8j4J2m1lJ6L4l2K4m4j2N0J8j9k9mk9O2J4l2jK1nk4J4K4l2Rk5P
$$ -12 -7 -6 -22 -9 19 5 17 -24 -27 -11 23 -9 15 -29 -41 9 27 8 -21 -25 -54 8 22 -10 -11 10 5 -19 -5 19 -13 -4 -29 -22
6192b2L6J6J6n6K2J3j7Rl2N5l9Nml5L7K6k1kj4j1K2%k4NJ5J9mRJn1L2r%j7nQJ9
$$ -22 14 30 46 -10 12 25 8 17 -15 40 1 6 2 -33 4 30 9 7 -7 -18 4 4 -20 -15 0 19 15 24 25 -26 6 -3 -3 -20 -25 -17 2
6229Bj1j2K4J2J0n9J8L3j5l0PkL2l5L6rmkpK9J1Pk4k2J0J0lqjN7n9K6j7K4k2J0
$$ 2 -9 -21 3 15 25 -34 -16 17 2 -28 -21 -23 9 -26 10 1 -3 -5 -12 17 28 35 11 -11 -1 9 6 -2 -3 54 -5 21 4 28 6 16
6265A6KnlML0l6jk1L8j5j0k3J5k6K9j3Olj0oK0RPk9K7J5Jj8j7M1j4j0j5LnKK9
$$ 16 18 13 10 14 44 8 7 -14 24 9 -1 -24 -9 -35 -6 -19 -13 -16 -26 -32 -12 -3 4 -25 2 17 18 0 -17 24 10 0 -15 -12 -17 -15 14
6302A4j8j5nKO5o2J6N%mJ1J6l7kJ4K6Mj3%k6J5J0J1k8oM1n2K4ppK9m7K7mK7l6
$$ 14 -4 -19 -24 -22 43 -19 -3 2 2 -2 9 25 -12 -14 0 26 30 17 17 -9 6 16 27 -1 -7 34 -18 6 -1 -8 21 -26 1 -3 24 -12
6338a2J3l9L2lL8j9p2N8Mj2K4J3m8J4K9k8L3m8J3J6j6pRJ2m6N1mJ9j0Ojj8mOK2
$$ -12 1 -38 -6 -9 29 10 -62 -4 0 -12 12 25 -23 -9 20 -8 25 -23 -10 6 -10 -17 -8 4 -42 9 5 24 14 20 19 1 -3 3 25
6373B5Kj1j5jK8j8j6J4rL4k2K5k1jojj0L1Ko2QM1j2K%kQj4J7j6J5j7j0k2M9pl9
$$ 25 27 16 1 0 28 10 -6 8 -1 33 11 36 15 14 8 7 -3 28 30 -32 -24 17 5 7 7 5 13 -1 16 0 15 -2 -12 -34 15 8 -31
6410c1KPL9K0l7Qk8J7J6j8L2l6J1J5l1mM6J7m0Qj2J7mOMpl2L5Kj3%lqK7J7m9J6
$$ -31 -29 -22 17 37 0 8 -20 -3 13 -5 27 -9 2 17 -14 -18 28 45 5 13 1 18 14 20 24 17 -15 20 22 9 9 6 -2 25 42 -7 9
6447INQj3K3m3M1k4qK3k6J7j2K1l6J9lqpJ7J6Mpm0%j7N1jQJ4l7j4J7oK4m2LM5
$$ 9 14 22 9 32 -11 30 6 -2 21 -5 12 0 21 -15 4 1 -7 -14 3 19 23 16 -24 -24 -41 10 9 17 31 -6 -20 -3 -9 15 -27 -24 21
6484B1l7QK4k0J5nqJ9rj7JL4K1k8pRJ7m5mjJ5MJ1j6Kj6L1j3k9J2RK2qJJ3m0QN
$$ 21 -16 -8 16 -4 11 6 -2 17 8 -9 -8 26 47 19 12 21 38 -7 -11 -12 3 7 18 2 4 -12 19 6 -23 -11 -2 20 12 13 26 -14 -6 -1
6522aKl4J6oNK5qQl7Q%L1k0MKRll3N5j8j4kK6rK1k0jJ7j4J2l2NJ9j2j6J3nJ4j7
$$ -1 1 -33 -17 -23 -18 7 -1 7 -30 -22 -22 9 -11 -7 -5 4 1 -32 23 5 -9 -11 15 6 27 7 6 23 9 21 -11 -6 13 1 -15 -2 -7 7 -10
6561a0oJ5MOk2K4Oj4J3J7l9K0lk1jkML3j6mLk6K3j3QjJ3Jjk3JKJ7m3L0J0Mrj1
$$ -10 -16 -1 3 9 -13 11 17 3 16 33 -6 14 11 -10 -11 -13 -9 24 8 4 7 -19 4 -9 -1 -2 11 12 11 -12 -11 -9 8 -35 -5 5 9 0 -11
6600a1J6NKJ4pk1PpJ3J8j4PrNjnJ5l1OjNJ0j0LJ0l9J5K0k7J1J5mk3L4rk3k2KK8
$$ -11 5 10 12 26 19 -2 5 -2 11 29 15 22 13 18 17 12 27 -4 2 1 6 16 6 9 19 -20 -5 15 -12 -1 14 10 -13 21 12 -11 -33 -31 -3
6639cj2J9k7pqmL5K0Kl1J7j7K3j6M0j5j3l6K5K3loj0l2N3qj7NJ7%RlRK2m8Jk7
$$ -3 -15 4 -23 -30 -38 -42 -7 13 15 -16 1 -16 7 -9 31 16 3 -33 -8 15 12 6 -4 -36 17 9 -8 -3 14 14 23 20 29 51 3 4 -23
6676b3K2J0L1j4k3PjL5k6kj7j5K6j6L3j8j7j1K1j5J8Nm8L2QpK3m8L2l8L9rLJ3
$$ -23 -1 9 40 26 3 10 9 44 18 16 -1 -16 10 -6 27 9 -8 -19 2 -13 5 10 -38 -6 2 -5 18 -30 2 -36 3 -6 -3 10
6710A0j8j3%K6k9N9m3L7k4NjJ0ok5J5l1N0Mlk2OKL4l8L2l8j3pK2M3k8J1l6J7j0
$$ 10 -8 -21 -21 5 -24 35 -8 29 5 10 9 19 13 -12 3 -28 22 26 23 1 7 9 43 5 37 -1 -14 -21 1 44 16 27 -9 8 -2
6745bJ4Qnk3L8n3OL9k7j8J5oJ1J6k6J9k1mMPL3Mj4j7j1kL3omnj4pK9kjk8kK9K
$$ -2 12 20 15 -8 30 -23 -17 22 -5 -23 -8 -14 -3 13 -13 6 -15 -19 -15 -8 25 29 15 -2 -13 -15 18 12 8 3 -11 -18 11 9 8 -20 -22 7 9
6784IMnmKK8qRj0k5j3MJ1L1ok8k5J1M3j3K8jn0j7L4RNll5l2K2L2J6j1opk1M0M
$$ 9 13 8 4 6 34 26 35 25 0 -13 -9 2 33 27 -1 -26 -15 28 15 43 42 -8 -25 9 18 23 20 -15 -47 -25 7 23 12 6 -1 -22 18 22
6822B2l5LJ0m4O1j2J7l7k4K7K6l8M2k4Ojj5N5k9kkqJ7JK8k1qk4RM0l4J6l1L8j9
$$ 22 -13 -10 0 -44 17 5 22 -15 -39 -12 14 -24 18 -6 0 -1 -16 39 10 8 6 -2 15 16 44 23 15 -9 0 40 6 22 -9 29 10
6857A0J3k3L2l1k3J4K7pL8rm7k2L5J5J6k9k2k7K3LL6m9K2oNK6m3O9m8kJ3l6J7
$$ 10 23 0 32 1 -22 -8 19 12 50 41 -6 -28 7 22 38 9 -13 -40 -17 -14 22 -27 -5 -11 -6 20 -23 46 -2 -4 9 -27 -10
6890a0J9k5j4L7j9J6Ok1Rk4K9l4P3pm3J0K1l4N1j6mj6j2K8LMj1prJ5J6lk0k2O
$$ -10 9 -16 -30 7 -12 4 10 -11 -2 -26 3 -31 42 35 -8 2 23 -11 40 24 20 4 -8 20 23 27 16 9 0 15 31 28 8 -14 -8
6925hK5PPk4ljKmJ5j4j2pj7K6lnL5m1j3K4K0K2Mk4l5J4K0K1k4j8j9L1J0MRJ7q3
$$ -8 17 24 31 7 4 3 5 1 16 2 -10 -17 -34 -8 -11 -16 19 -22 -35 -11 9 31 35 11 -24 -10 10 31 7 -11 -30 1 11 15 24 41 -42
6962d2L8JK6K1n3Mk4L2K0J8k2j3kJ6j9J2K1k5k4JM2l5o%k0K6LJ8J0m4k6K2K3O
$$ -42 -4 -3 23 44 -9 -5 -29 3 23 41 19 6 4 20 1 13 34 9 -15 -14 28 -7 -13 -13 -33 -7 -4 14 24 -20 -46 -24 -1 5
6996EJ7k9k8K9KK8Kll5jlj3O1k3k4LNJ2L6l3k8Qk6N1J5l8NLl9L5L5k8Qpm0M4J9
$$ 5 22 -7 -35 -6 -4 24 26 23 -12 -13 -16 -29 32 9 -15 -12 -7 5 41 8 -20 -12 -38 13 28 -10 -5 -2 -41 -6 29 1 9 2 -38 6 25
7033B5K2j6j4n9K8L9jj2k0Nj1L2L0j3k9j5j8K3K3mkk7ooK3Q%j0k5J3K7j2J7l1
$$ 25 47 31 17 -42 -14 25 24 12 -8 -3 -14 18 48 35 6 -9 -27 -4 19 15 13 -14 -20 -26 -3 5 5 -5 -30 -17 10 -2 15 -16
7067a6k4M4pkL0j3k7K8K0j0Lk9llK2J4j4qj3qL2J8J9j9l6KqJ3J7J4k3m1oK2K6
$$ -16 -40 4 -3 -5 25 12 -15 13 33 23 26 -3 -6 -9 13 27 13 5 -8 -16 16 34 53 34 -2 0 -8 5 22 36 13 -28 -34 -12 14
7102A4K3j2l4KL3k4L5k5m9J9J7J5knl8PqL2K9l0l7K2j7PM1nm2J2j0kO3J0k1m1
$$ 14 37 25 -9 -7 26 2 37 12 -37 -18 -1 14 12 7 -31 -24 -32 0 29 -1 -38 -16 -33 -26 15 10 -32 -20 -30 -32 31 41 20 -21
7136b1nRJ7K1j5k3K8j9J2M0k5j9k5J0L2J7k2mlpJ3L7k0l3j5%J8J5j1%l9L0k0M2
$$ -21 -26 -17 0 21 6 -17 11 -8 4 44 19 0 -25 -15 17 34 12 8 5 -2 11 48 28 -5 -20 -20 -2 13 2 2 -37 -7 -27 15
7170A5J3k4lk2K4j7L4Qm1j6QrL9j3lk7J6J3L5mj1k5lKJ8J6J1m1Jj2LL6mJ2m2K4
$$ 15 28 4 1 -21 3 -14 20 28 -13 -29 -21 -30 9 -4 -7 -34 -18 -5 30 26 15 -10 -13 -11 7 23 34 -7 -6 -18 -15 21 17 29 -13 11
7206A1LNlkk2j1kO0Kl2Pk7j5K4K3%m2lK1jM7j4p4K6oOJ9J5j3kl1K6K3k2K0l1j6
$$ 11 14 19 16 14 -8 -19 -21 39 41 9 16 -11 -26 -2 21 21 -21 -24 -3 -4 43 29 -45 -19 -25 -19 0 15 2 0 -31 -5 18 -4 16 -15 -31
7243c1LL0NJ2k6k0J3L8jk4rl9O7Jjj8K7l1J2J2K1J0k3l9M1m5M5K1k1l3j1lL0m
$$ -31 -28 2 7 19 -7 -27 -14 24 23 -1 -10 -49 18 19 18 0 27 -4 8 20 41 51 28 -11 30 -15 30 51 30 -3 -14 -17 13 9
7277ILmj3k6K3J4J4j8l8K6pJ7M1n7k1J3j6L5K1j8J6j7l5M1npKj0PQ%L5m9QJj1
$$ 9 12 8 -5 -31 -8 6 20 2 -36 -10 -17 0 41 -16 -37 -24 -40 -5 16 -2 14 -3 -38 3 -2 -9 -7 -17 -10 -2 -2 33 -16 -8 -7 -18
7313a8L9Pk3k4PL5j0M3j3o1KjL9J3K0o0ojM3L2m6k6loj1O4On0k1K4j7J7M1l5j4
$$ -18 21 28 5 -19 -12 23 13 56 43 -18 -16 -17 22 35 55 -5 -11 -12 31 63 17 -9 -12 -18 -29 35 41 -9 -30 -6 -23 -6 35 0 -14
7348a4k0jM2J9m3Pj8j4M5K9j3m6J0qK4K9k6nj6j7L6mK0L3n8k6K9M2k8K9m8JK1
$$ -14 -34 -35 7 26 -17 -10 -28 -42 3 32 19 -27 -17 -25 -1 28 2 -3 -19 -36 0 -4 16 49 -9 -35 -6 36 8 37 -11 -10 11
7381A1K3j4Jk0oj8L0K9l5Ol7K4j2L9j8J2j4m1N9j4mK0l8j2k3P3Kj8Qn9K8QK4p
$$ 11 34 20 21 1 -5 -23 7 36 1 7 -30 -6 -18 21 3 15 1 -40 19 5 1 21 -17 -29 -52 21 23 5 13 -46 -18 -10 14 7
7415Gj9oJj5L4L1j5m8mL4nK7pl8L0mK1Mj6lj3RjL6Ok5k2k0K3O7o0K6l8j5K5L2
$$ 7 -12 -18 -17 -32 2 33 18 -30 -34 0 -5 22 15 -23 7 3 24 28 12 9 -4 5 4 40 46 21 -1 -21 2 69 9 35 -3 -18 7 39
7451C9oK3o4l4K0K0N9o7J9n5L3K9j7kRj1m4M6J5jMm1k0L3K9K0l2lk0MN3jl1j2
$$ 39 33 56 -8 -42 -22 -2 57 -10 9 -46 -13 16 -1 -3 6 -5 -49 -3 12 11 15 -26 -46 -13 16 36 4 1 -19 -15 38 37 6 -6
7485f%k5L0L0Nml1l2K0J9J6On6K5j3K8L6m4j8K2j1K1K0on5J6LK1rK0j1l9M5l8
$$ -6 -6 -31 -1 29 34 30 -1 -33 -13 6 22 28 -28 -3 -16 12 48 4 -14 8 -3 18 38 32 -23 -7 -4 17 8 28 17 -22 23 -15
7519a5j2M5rm4lK3L6lnj7m1K3K5M2m2m7KL1J0J0J0l5k0NJ3N8No4%%NK2rL0r2O8
$$ -15 -27 18 9 -35 -38 -15 21 18 13 -4 -45 -22 3 45 3 -44 -42 -11 -1 9 19 -16 -36 -31 -18 40 45 -19 -19 -19 -14 8 -1 29 -63 5
7555Ej9J9J6k1J1rl7L8N4n1J6k1k6M4K8J5n2l0qJ8L7qj6kk6M5j1OJ0p4PL4K3k6
$$ 5 -14 5 21 0 11 2 -35 3 57 6 22 1 -25 19 47 62 10 -20 -28 -10 27 19 3 1 -25 20 9 15 25 -49 -42 -8 15 -11
7589a1K4n5J6j0K7L4mk4l9L4qM1l0M0m5j3lK3L9n0Mj9QK4J6J4k5l6rN8L3mk9k7
$$ -11 13 -42 -26 -36 -9 25 21 -3 -42 -8 -16 25 -5 35 -10 -23 -26 -3 36 -14 -10 -29 -21 3 19 33 8 -28 -37 21 54 50 21 -6
7623fj0OQL4j1no3J7M4K4mn1rj6N6J6mj8o3J7M6QJ8m7m2mM5K0M7m3k7j5J9K9k2
$$ -6 -16 -10 -2 32 21 16 -47 -30 14 38 34 -17 -26 -42 14 30 26 8 -55 -38 8 16 34 -13 -55 -59 -14 6 53 10 -17 -32 -13 16 -6
7658fl0J9k9jL0K7Jk6K2o0N9M4k2k0m1L6KnM8l0k4o3N3K2M5j7p0K1RL3L8l8nl8
$$ -6 -36 -17 -46 -47 -17 10 11 -15 7 -53 6 50 28 8 -33 3 5 0 48 18 -6 -69 -16 6 51 34 -36 -15 -6 27 65 27 22 -16
7692a6MJ1M9l3jn0K2RM5l0j9%k9J7K7N3o5k6J3OJ9J4pj5k8M0JJ8k1qok1nM8K0
$$ -16 -12 -1 48 15 14 -36 -14 -5 40 10 -9 -9 -38 -21 6 59 -6 -32 -19 -13 6 20 13 -2 -30 10 11 29 8 0 -6 -27 -32 16 36
7727C6ln4RN6qK1m5rk2L1K5N0r1J4k3kM5L0k9l8j4j5M9K1l3J1rl2K7L9j8J1k8
$$ 36 33 -21 -12 44 36 57 12 3 -19 12 37 87 -4 10 -13 -15 30 60 31 -7 -21 -36 13 34 1 12 3 -29 -2 37 19 30 2
7760Bl9L9J2K6p2oJ3J5J1j5L9Qp7M3JN6m7oRn0M9NNql1NJ3L3kk8k1k1RL9LJ4j0
$$ 2 -37 2 14 40 -32 -38 -25 -10 1 -14 25 33 -44 -1 0 56 9 3 12 -38 11 16 21 13 -18 -13 0 33 31 3 -18 -39 -30 9 12 26 16
7797A6m8nP4ll1j0K0j8pN1%m0%k2K6J3Jk2j5PNJN7m0k3j5nJ1K3K9m5j6K0OK0m
$$ 16 -32 -37 37 34 3 -7 13 -5 -12 39 39 -1 -1 -23 3 16 17 -5 -20 -13 -8 -7 50 10 -13 -28 -33 -22 1 30 -15 -31 -11 -5 15 11
7833A1j8J1k4OK9K4j9m6j2L3J9J2j1j4k8K8K8J1%j7k8L1Q%kPm3mlL6J4k1l4J8
$$ 11 -7 4 -20 -14 15 39 20 -26 -38 -5 14 26 15 1 -27 1 29 40 40 23 -5 26 34 34 32 39 -4 -8 -11 25 39 18 -16 2
7867BKJ0M5m3l2j3PJ4J9J0j9k7j4N5kJnm2J1PQL3k0j5k3K6PKnj2J3k2K6kj6K4
$$ 2 4 14 59 16 -16 -29 -22 -8 11 21 2 -25 -39 16 14 15 10 -32 -21 -14 -6 27 7 -8 -31 -5 2 4 -1 -13 0 -22 4 2 -14 10
7903A0l1JJ6M3j8j6%l0J8K5kK7l9l3M3JNLl3%JK1J0J5n5pjK4RoKk3k5K7N7k8n
$$ 10 -21 -20 -4 39 21 5 5 -25 -7 18 16 43 4 -29 14 15 20 23 -10 -10 -9 12 22 37 -18 -25 -26 -2 7 1 3 -20 -45 -18 39 11 6
7940Fl3j9K4L9K6m8l0MK8K6j5Lm8J0LK3L0j8K1n7K4%J6J0k9m2L9RKL9l0j3j9q
$$ 6 -27 -46 -22 17 43 -5 -35 -31 -3 23 8 11 -37 -27 -24 -1 29 11 32 -25 -1 -1 15 25 -4 -46 -7 2 4 43 13 0 -19 -27
7974b7O0J0l1J2m2L5Omkk8k8M4j1L7oj0k4j0J8K6pKn3K2k2L0j1Krk3K0J0M3j8
$$ -27 33 43 12 24 -18 17 23 19 17 -11 -39 5 -6 31 25 15 -9 -19 -1 25 18 20 -33 -11 -33 -3 -14 -12 -21 -44 -24 -14 29 11
8008A1rl5J4J0K9j8k1L2l4L8K1l5j5Lj0j4M7L3k0l7qJ6J7k%K0n8K9j6L9j9K5n8
$$ 11 2 -33 -19 -9 20 2 -19 13 -21 17 38 3 -12 -9 -19 -33 14 47 27 -10 -18 -2 15 13 13 33 -25 4 -12 27 8 33 -25
8041b5ML6J7j6J4k8k3J6L0k5ll0M5rLO8o5k1k4J8K7Ml0rj5KJ0M7j2pm2j4K8K7
$$ -25 -21 15 32 16 30 2 -21 -5 25 0 -3 -33 12 3 6 74 9 -12 -36 -18 9 13 -17 -26 -41 -39 -29 18 6 -1 -43 -57 -29 -2
8075bK9rl1rL0Nj7KK1l2J4PlK2Kl0nL7l6N9o4Qj1KL1%ok3L7n7N0K1l1m6JL3K5
$$ -2 27 18 -13 -22 8 13 -4 -2 19 -13 1 8 5 27 29 -1 -6 31 -5 54 -10 -2 -13 -11 20 20 14 -9 28 -29 21 42 11 -35 -34 -1 24
8112B4Jk3J5m6K0J6j7L4l3%J2PK1l4L7m9j3NK0M7m7qnQJ7j3J6Ol3J5K0K5k9Pl
$$ 24 25 2 17 -29 -9 7 -10 24 -9 -9 3 10 31 -3 34 -15 -28 -23 -3 44 -3 -11 -16 -8 9 -4 12 18 -15 0 20 45 16 23 20
8147B0m7L3J7K8k4j8KQLPk1j7J6j6%L3m2K2l9J1K1RJ5l6j1J7J5K2rn2J3J3j7K5
$$ 20 -27 6 23 51 27 9 11 19 22 29 8 -9 7 -9 -9 24 -18 4 -35 -24 -3 6 21 -15 -26 -9 6 28 19 -33 -20 -7 -24 1
8181AK2l3OLj4oL3Km2k
$$ 1 23 -10 -4 -1 -15 -21 12 14 -28 -30
8191c0
$$ Imaginary data points
##PAGE= N=2
##DATA TABLE= (X++(I..I)), XYDATA
0@%%%%%%%%%%%%%%%%%%Qj6J6j6J6j6J6j9K7l2L2l5M3m8N1n9O6p4Q3r2J03j13J25
$$ 0 0 0 0 0 0 0 0 0 0 0 0 0 0 0 0 0 0 0 8 -8 8 -8 8 -8 8 -11 16 -16 16 -19 24 -24 27 -32 34 -40 43 -49 54 -59 66
41F6j40J56j72J89k08K32k59K88l23L64m12M71n43O36p63R37j206J681k756J0032
$$ 66 -74 82 -90 99 -109 123 -136 152 -171 193 -219 252 -291 345 -418 519 -687 994 -1762 8270
61H270j968j6690L407J0375Q806k623o740p962l304K170Q377O016k802j1555q919
$$ 8270 6302 -10388 -6981 3394 12200 9577 2837 -5125 -8429 -6259 2118 8134 5332 -6223 -15142
76a5142K221J2100Q823l314j2906q835L661J1980P586k807q830n872P15O108P492
$$ -15142 -12921 -821 8002 4688 -8218 -17053 -13392 -1412 6174 3367 -5463 -11335 -10620 -4512 2980
91B980M404l170r582o793N468J4037P800p344j3408m000Q869J0731K647m958o509
$$ 2980 7384 4214 -5368 -12161 -6693 7344 15144 7800 -5608 -9608 -739 9992 12639 7681 1172
106A172m270P6N905Q457K318q366j1542k488R198J0885J186r718j1058k133Q124
$$ 1172 -3098 -3022 2883 11340 13658 5292 -6250 -8738 460 11345 12531 2813 -8245 -10378 -2254
121b254R269J056p374p923k532L121O128N538j53q267r926J1J1737J0968k218
$$ -2254 7015 8071 697 -7226 -9758 -6637 -509 5029 4876 -3391 -13317 -13306 -1569 9399 7181
136G181j2427q267L997J0281O090j579n516n125j849L615Q087O009l298j0409
$$ 7181 -5246 -13513 -9516 765 6855 5276 -240 -5365 -7214 -3599 4488 10497 7199 -3210
150c210o449N305J1776N852n689j0692m881M851R060M588l398p443n122M33N038
$$ -3210 -9659 -4354 7422 13274 7585 -3107 -7988 -3137 5923 10511 7113 -330 -5452 -5019 19
165A9O283K521n086r784m966O608J1680L196r249j0851q76P945P062O86l939n268
$$ 19 6302 8823 3737 -6047 -11013 -4405 7275 10471 1222 -9629 -10505 -2560 4502 5188 1249 -4019
181d019m038N18O626P632M00q442q849N08R684R031p30r105p651J157P914O642
$$ -4019 -8057 -7539 -913 6719 7119 -1323 -10172 -9664 20 9051 8321 -784 -8435 -7278 636 7278
197G278N8n290n707k080L083O566N096j835q634p321K469J0668P262m361j0879
$$ 7278 7336 2046 -3661 -5741 -2658 3908 9004 7169 -1465 -8786 -6317 4351 11613 7252 -3627
212c627n357M609P782L288k066m546m596k166L330P627M231n121r844l842O477
$$ -3627 -8984 -4375 3407 6695 4629 83 -4513 -6679 -3349 4278 8509 3388 -6456 -10298 -3821
227c821R568K754o213q316k486M968P198K932l059n726l841O10M997O289J804
$$ -3821 5747 8501 2288 -6028 -8514 -3546 3652 6584 3525 -2201 -6042 -5432 -435 5854 7658
242G658n848q664j900P878R273K78q413p388P89O440N099M33l356m704l481R51
$$ 7658 1810 -6854 -8754 -876 8397 8675 262 -7126 -6337 103 5202 5635 2279 -2425 -5906 -4955
258d955O265O278r93q570p203K175R201O109k842p918m953J855N984M700p9m386
$$ -4955 1310 7588 6595 -1975 -9178 -7003 2198 8307 5465 -2453 -7406 -5551 433 5133 5054 668
274F68n137j706L287O220L955k805q034n133M024R555M496n288q450k516M436
$$ 668 -4469 -6175 -2888 3332 7287 4482 -3552 -8685 -4661 4894 9390 4102 -4348 -6864 -2428
289b428N673K321j266l662m460j714M057P097K457n749q269j803O488P623Q71
$$ -2428 3245 5566 4300 638 -3822 -5536 -1479 5618 8075 2326 -5943 -7746 -1258 6365 7236
304G236o137o504r41M397N189J839k383m844l786M95N244N750K07o389o950Q3
$$ 7236 1099 -5405 -6346 -1949 3240 5079 2696 -2148 -5934 -5439 -195 5555 5762 -627 -7577 -7494
320g494P505O835j108p263n207J547N326L784L59k438m168l283J421O511N390
$$ -7494 11 6846 5738 -1525 -6732 -5185 141 3925 4284 1846 -2322 -5605 -4184 2327 7717
335G717k272q116m997L526P898L942l253o336l441J939M923L622k51l832m529
$$ 7717 5445 -2671 -7668 -4142 3756 7698 4445 -1891 -5332 -3393 1530 5152 4901 1069 -3460
350c460j620L182N938L011l843p598l289M855P781K134n205o424j398L535M389
$$ -3460 -5080 -1898 4040 7051 3208 -4390 -7679 -2824 4957 7091 1886 -4538 -5936 -2401 1988
365A988J983r26l561m240j060M371O397J348n971p008j95O651N991n21n386m541
$$ 1988 3971 3045 -516 -4756 -5816 -1445 4952 6300 329 -6679 -6874 -223 5768 5247 -139 -4680
381d680q7L531M284J836j943m634l413J119N429M911p67o366n569J335P044M943
$$ -4680 -4767 -1236 3048 4884 2941 -1693 -5106 -3987 1442 6353 5586 -780 -6349 -5014 2030 6973
397F973k186o211l473J607L962K942N62k157m454l092K154O298L905l335p316
$$ 6973 4787 -1424 -4897 -3290 672 3614 4176 2019 -2435 -5527 -3373 2925 6830 3495 -3821
412c821l403L846O706K501l423n289k271J818L939L012k4l379m429j302L740N843
$$ -3821 -7224 -3378 3328 5829 2406 -2883 -5154 -3336 603 3615 3591 212 -4217 -5519 -1779 4064
428D064J847m454o398j583N083O239J016m647m958o44L018L666J909o26l416m163
$$ 4064 5911 1457 -4941 -6524 -1441 4798 5814 1167 -3791 -4435 -1417 2249 4158 3532 116 -4047
444d047o15M890N816M4o229n608J094O038M236j170m594l549o4K917L700J555
$$ -4047 -4662 228 6044 6088 -141 -5749 -4655 1383 5619 4449 -145 -3694 -3758 -841 2859 4414
460D414j964m503l186J437N413M125j810o356m188K385O209L262k543m937k459
$$ 4414 2450 -2053 -5239 -3802 1611 5736 3926 -2430 -6618 -4233 1976 5238 2695 -2242 -4701
475d701J283L275K891P27k363m342k343K825O050K842l841o561j883M399N577
$$ -4701 -3418 -143 2748 3475 1112 -3230 -5573 -2748 3302 6144 2303 -4258 -6141 -1742 3835
490C835J256l249m020j580J488L417L000rl604m252n76M170N129P15m769n482
$$ 3835 5091 1842 -2178 -3758 -2270 1147 4147 4138 534 -3718 -4294 -124 5005 5720 951 -4531
506d531m14M969M912j13m251l830l80K331L078J973p24l889m035L87N179M698
$$ -4531 -4945 24 4936 4823 572 -3258 -3638 -1307 1771 3744 3020 -869 -4904 -4517 662 5360
522E360j233n934m173J849N327L178j526l935k746J74K601L373J612k030m480
$$ 5360 4127 -1807 -5980 -4131 1196 4374 2848 -1087 -3833 -3659 -1058 2315 3927 1897 -2583
537b583k683K303N534L070k745n698k610L014N200K136k418m066j946J205K908
$$ -2583 -5266 -2963 2571 5641 2896 -2802 -5412 -2398 2802 4938 2520 -1546 -3492 -2287 621
552F21K682O22k593m322j794L457N649J457m544n523n94M236M241L88k830l381
$$ 621 3303 3925 1332 -2990 -4784 -1327 4322 5779 1235 -4288 -4882 -646 3595 3983 1153 -2228
568b228j417J244L238K746l57l812l884J15M448M501l61m945m329P92M739L637
$$ -2228 -3645 -2401 837 3583 3226 -586 -4470 -4355 93 4594 4233 -712 -5041 -4249 490 4127
584D127o65l486k959l33K096L141J994j171m079l264J308N204L610k063n557k855
$$ 4127 3462 -24 -2983 -3316 -1220 1921 3915 2744 -1335 -4599 -3291 1913 5523 3460 -2097 -4952
600d952K482M594J971j717l155k235j6K331L344J314k534m562j886K987N056J771
$$ -4952 -2470 2124 4095 2378 -777 -3012 -3028 -697 2647 3961 1427 -3135 -5021 -2034 3022 4793
616D793l305m946j491L191M305J183k358l281j431R55K665K802M11l056m115o64
$$ 4793 1488 -3458 -4949 -1758 2547 3730 1372 -1909 -3340 -2385 280 3082 3493 437 -3678 -4342
632d342M129M782K15m562m208L75L999L304m7k553k813j111J244L124K475p89
$$ -4342 -213 4569 4784 222 -3986 -3611 388 3692 3645 1092 -1721 -2832 -1588 1536 4011 3222
648C222m021l442R64M622L341j509m697l018J394L948K526r13l074k529k57J965
$$ 3222 -799 -4241 -3277 1345 4686 3177 -1520 -4538 -3144 804 3330 2417 -657 -3186 -3443 -1478
664a478L018J684j670m059k534K149N071K341k801m712j440K780L666J323j423
$$ -1478 1540 3224 1554 -2505 -5039 -2890 2181 4522 1721 -2991 -4431 -1651 2015 3338 1915
679A915k548j935J18K617L206P85k823m081r09L451M401O54l584m028m24L081
$$ 1915 -633 -2568 -2450 167 3373 4158 1335 -2746 -3655 -204 4197 4851 1267 -2761 -3185 -104
695a04L190M66k089k778j442P68K719K495l20l545l578K14M086L707r11m400l148
$$ -104 3086 3552 1463 -1315 -2757 -1989 730 3225 2905 -640 -4218 -4004 82 3789 2878 -1522 -4670
712d670J057L467K375m39k114k352r43J367L259K239j378l950k356J962M438K300
$$ -4670 -3613 -146 2229 1790 -324 -2676 -3619 -2252 1007 3246 1868 -2082 -4438 -2476 1962 4262
728D262j963l905j852J885L476J854j027k440k086j08K095K933J191k242l992
$$ 4262 2299 -1606 -3458 -1573 1903 3757 2730 290 -1796 -1904 191 3124 4315 2073 -1919
743a919j479K827M197R31l216l828o66K470K760O50j520k484j767K11K510K774
$$ -1919 -3398 -571 3626 4557 1341 -2487 -3153 -683 2077 2727 1207 -1277 -3044 -2833 -323 2451
759B451R6l362l542O4L675L425m27l502k846L75K758K539L30j746k324j052J215
$$ 2451 2547 -815 -4357 -4293 -618 2807 2380 -1122 -3968 -3593 -835 1704 2034 288 -2036 -3088 -1873
776a873K902K212p42l388k634J271M176K613j558l773j867J477K827J669l92j838
$$ -1873 1029 3241 2499 -889 -3523 -2252 1924 4537 2979 -794 -2661 -1184 1643 3312 2920 1082
792A082k265q40J618L042J376k044l763j588K304L653J091k554l408j045J809
$$ 1082 -1183 -2023 -405 2637 4013 1969 -1794 -3382 -1078 2575 3666 1112 -2296 -3341 -1532
807a532K577J068j025k273j926M3K219K721M81k685l334l40L051L390J68l025
$$ -1532 1045 2113 1088 -1185 -3111 -3068 -849 1872 2353 -332 -3666 -4006 -955 2435 2603 -422
823d22k736K05K394K204N12j159j985j451O17K824K472n49l297k605J005L549
$$ -422 -3158 -2953 -559 1645 2157 998 -987 -2438 -1821 1003 3475 2926 -371 -2976 -1971 1578
839A578K336j064l003k018O90K313J812m1j693k127r68J220K673J546j532l437
$$ 1578 3914 2850 -153 -2171 -1481 832 2644 2603 910 -1217 -2185 -965 1708 3254 1722 -1715
855a715j814J841L418J340k044l050j088J377K247J214m71j783j955m55J923K808
$$ -1715 -3529 -1688 1730 3070 1026 -2024 -3112 -1735 512 1726 1255 -528 -2483 -2938 -1015 1793
871A793Q15k324l132m94K691L000K82k345k372l01J789K103Q99q82k024j535L84
$$ 1793 2608 284 -2848 -3342 -651 2349 2631 286 -2086 -2387 -598 1505 2404 1522 -502 -2037 -1653
888a653K373K228j58k739k640L74L028K380o92k670j940M36J830J607K93j196
$$ -1653 720 2948 2790 51 -2589 -2215 813 3193 2501 -169 -2109 -1673 157 1764 2057 861
904H61k032j283R16K625J712j189l126j760J394L018J454j385k514j221Q25J891
$$ 861 -1171 -2454 -1538 1087 2799 1610 -1516 -3276 -1882 1136 2590 1205 -1309 -2530 -1705 186
920A86J408o4j478j930n98J601K571R21j827k806q41K078K843O00j896k286m89
$$ 186 1594 1530 52 -1878 -2476 -875 1696 2617 790 -2016 -2857 -779 2064 2664 768 -1518 -2007
937b007J301J792R73m40j642j766j10K012K415R2k503k472K02K446K085k49k089
$$ -2007 -706 1086 2059 1619 -23 -1789 -1899 113 2528 2620 117 -2355 -2153 293 2378 2129 40
954D0j834o7J472J672O17r04j935j320O16K282J807p23k684j853R41K650J524
$$ 40 -1794 -1861 -389 1283 1900 996 -939 -2259 -1643 639 2446 1723 -961 -2814 -1873 777 2301
971B301r12k139j288M56J587J361K59j153j839q67J194K423J161j484k645j007
$$ 2301 1389 -750 -2038 -1582 5 1366 1625 472 -1367 -2234 -1040 1383 2544 1060 -1585 -2592
987b592J700K437P48j399j883q06P43J555J178r0j510j709l03J728K124L66j960
$$ -2592 -892 1545 2293 894 -989 -1795 -1052 503 1681 1591 81 -1628 -1931 -203 1921 2287 327
1004C27k307k22K032K131J5j732j668k34J044J470Q58m87j642j526K80K096J820
$$ 327 -1980 -2202 -170 1961 1976 244 -1424 -1658 -614 856 1714 1227 -415 -1941 -1661 435 2255
1021B255m53k298j747N74K222J459n39j769j279J26J219J431M71r30j762j034
$$ 2255 1802 -496 -2243 -1669 553 2012 1473 -296 -1575 -1449 -230 1201 1672 742 -1020 -2054
1037b054R03K206J225j099k340j116J159K126R39r63j728q82M70J302J111J49
$$ -2054 -1151 1055 2280 1181 -1159 -2275 -1116 1010 1949 986 -742 -1624 -1154 148 1259 1408
1053A408j137j666n74J414K129N35j642k178l26J632J817L13j209j498n28P17
$$ 1408 271 -1395 -1969 -555 1574 2109 467 -1711 -2037 -405 1412 1725 516 -982 -1510 -793
1069g93J349R78k03j458j470J2J794J706j42j879j737L24J765J485k20j464j229
$$ -793 556 1534 1331 -127 -1597 -1585 209 1915 1773 -106 -1843 -1519 246 1731 1511 47 -1182
1086a182j81R49J265P11o17j581j197N82J919J330p75k081j151Q50J833R16o30
$$ -1182 -1363 -414 851 1562 945 -636 -1833 -1251 668 1998 1223 -858 -2009 -1159 674 1590 960
1103I60j383r59J64J046J254L98j071j636o44J156J917O89j230j945n77J233J702
$$ 960 -423 -1382 -1218 -172 1082 1480 409 -1227 -1871 -715 1202 1891 661 -1284 -1861 -628 1074
1120A074N53r32j356o16M46J107J036O6j287j451j90J522J700O7j625j644M0J450
$$ 1074 1627 695 -661 -1277 -831 276 1312 1378 91 -1360 -1550 -28 1672 1739 114 -1530 -1490 -40
1138d0J385M9j108j146l94O34J179Q20l32j472j245L57J734J296n08j765j157
$$ -40 1345 1394 286 -860 -1254 -620 559 1379 1047 -425 -1670 -1313 421 1717 1209 -556 -1713
1155a713N32J530R90l06j220r77m8Q89J140N55p11j506q69Q41J805Q72j028j696
$$ -1713 -1181 349 1339 1033 -187 -1164 -1212 -323 817 1372 661 -845 -1714 -873 932 1804 776 -920
1173i20o40R32J439N95n80j163p52J64J011J125J74j117j426l08J236J586K86
$$ -920 -1560 -628 811 1406 826 -337 -1089 -925 86 1211 1385 268 -1158 -1466 -230 1356 1642
1190A642j367j510j71J126J246K62q13j115m84M16J072Q48j64j277j202J34J482
$$ 1642 275 -1235 -1406 -280 966 1228 415 -700 -1184 -768 304 1152 988 -289 -1491 -1357 125
1207A25J288k30j553j179L19J351R52q8r03r30k72O18J158O79n51j399q21O26
$$ 125 1413 1183 -370 -1549 -1230 121 1073 985 82 -848 -1120 -502 656 1335 784 -615 -1436 -810
1225h10J528Q93p38j489p54O91J258P15l92j055p45m7Q71J074L30q78j393m99
$$ -810 718 1611 873 -616 -1370 -679 579 1294 902 -153 -898 -945 -74 1000 1330 452 -941 -1440
1243a440J019J520L92j127j388l00R53J125L42o08r93n90K50R91R11K0j175j226
$$ -1440 -421 1099 1491 364 -1024 -1324 -371 754 1096 488 -505 -1095 -845 146 1057 1077 -98 -1324
1261a324J7J330J267r6j311j123J25J064R83R7p58r28l68M82J012P48l35j302
$$ -1324 -1307 23 1290 1194 -117 -1240 -1115 -51 932 1029 271 -657 -1025 -543 469 1217 882 -420
1279d20r33M41J437R40n78j354p91M94J052P23k14p94q27k20P02J081M61p63j298
$$ -420 -1353 -912 525 1465 887 -467 -1258 -764 288 1011 797 3 -824 -1044 -342 739 1200 437 -861
1298h61n28Q54J343N09q97j230l99P08J055M47l84q94o84J13R31R64J00j001j221
$$ -861 -1389 -535 808 1317 420 -810 -1209 -501 554 1001 617 -277 -961 -848 83 1047 1147 146 -1075
1317a075r3J158J176P1j120j028m5R17Q52J68n73q67n17L35J011P77k87j216r47
$$ -1075 -1168 -10 1166 1237 117 -911 -956 -39 813 981 408 -459 -976 -641 370 1147 860 -356 -1303
1336a303L62J258Q46l66j211p70K64R63P41k7p31p86k37N21J035N05n81j195n70
$$ -1303 -941 317 1163 797 -414 -1184 -920 43 784 757 26 -760 -997 -476 559 1064 483 -712 -1282
1355a282O94J282N64p66j115m43O07Q83N46k42p52p04o3P97R48K23r08j109j93
$$ -1282 -588 694 1258 492 -623 -1066 -459 424 970 728 -24 -728 -791 6 954 1177 269 -840 -1033
1374a033J016J053Q9r32r33j31O65Q24K61m56q44n47K42R01P65j39j113q86J57
$$ -1033 -17 1036 1125 193 -740 -871 -206 618 879 423 -421 -968 -726 175 940 801 -312 -1198 -1041
1393a041J185Q49k83j041p07J89P89P08M2n11p61l84N19R68N79n16j119n91O04
$$ -1041 144 993 710 -331 -1038 -849 -60 648 690 179 -582 -966 -447 521 1100 584 -535 -1126 -522
1412e22J181N09n71r68m72L92Q14N38j44o67p17r5O43Q87K55q08r99k58Q27R77
$$ -522 659 1168 597 -371 -843 -451 363 901 757 90 -627 -722 -79 808 1063 255 -744 -1002 -175 802
1432H02J98q25r14j93N92P24L42l40p23n95J29Q59P86r5r97q46J57J005P75j53
$$ 802 1000 175 -739 -932 -340 384 726 386 -337 -932 -803 56 842 747 -250 -1096 -939 66 841 688
1452F88q33o96O5P23O26J72m50p51l61M09R14N53l89j038n36M41J018M99m34q90
$$ 688 -145 -841 -776 -53 573 745 295 -456 -817 -408 506 1059 670 -368 -904 -463 555 1054 620 -270
1472b70m33K94O53N13l4o37o58j84N68Q72K51p03r67k70P24R00J82o55p82k14
$$ -270 -703 -409 244 757 723 86 -572 -756 -188 684 935 232 -735 -1005 -281 619 801 146 -636 -850
1492h50M10O94L25j81o92n64J29P19P42p3p79p65P7Q58P31p4p67o04L4N56O08
$$ -850 -440 254 579 398 -294 -858 -729 -10 732 659 -120 -885 -808 50 781 707 -60 -664 -630 -74 534
1513E34J79l27o89m11L34Q25N06l33q81n30L52Q55M80l59p28m55J99N89M55L9
$$ 534 713 386 -303 -714 -380 445 951 618 -263 -793 -441 414 894 535 -193 -648 -449 140 595 634
1533F34n09o84j82M97P86K74n85q76k53O06P93K30n26o96k70L53O00L62j34n79
$$ 634 125 -559 -741 -244 542 816 231 -645 -898 -292 501 731 205 -491 -761 -408 192 554 420 -159
1553a59n36N0O69O81l1p39p01P7P62O41p7o00n34o5M29O02J94l02o20l84K64P29
$$ -159 -695 -645 24 705 674 -65 -766 -689 73 714 637 37 -497 -562 -133 469 663 361 -259 -643 -379 350
1575C50M83k79q06n00K86P74M23k49o47m34J01N04M65Q2m28o45j95M29P34K70
$$ 350 833 554 -252 -752 -466 308 731 482 -165 -599 -498 6 471 553 125 -520 -715 -286 448 718
1595G18m98p78k14M50P17K44m34n90k38K72N35L50q3n30n23K3N79O24L4o50o29
$$ 718 220 -558 -772 -322 395 639 205 -385 -623 -351 184 534 451 -79 -602 -579 0 624 658 8 -621
1616f21QO44N65km94m86j04L36N51J96k38n81l70K27O35M49k17p49m14K57O14
$$ -621 -613 31 596 594 100 -386 -490 -154 397 593 355 -226 -596 -369 266 715 498 -251 -665 -408 206
1637B06M15k09n33l94J9M46M51J13m16n58j92L97O37K23l85p15j83M52N85J95
$$ 206 621 412 -121 -515 -496 -50 401 514 98 -460 -652 -255 382 605 220 -495 -678 -226 359 554
1657E54l12n54k35J84N00L73r9m25n27J3N40N21N1n15o30L3N54M74L4m09m54j40
$$ 554 242 -312 -547 -363 137 510 411 -14 -541 -528 12 533 584 69 -561 -528 26 500 534 125 -329 -469
1679d69L16M60K34j95n28l49J64O06L95k10o04l92J47N67L97j90m54l37j1L50
$$ -469 -153 307 541 346 -182 -531 -367 239 634 424 -180 -572 -425 142 539 349 -105 -442 -453 -103
1699a03L97J47l18n38j45L41N41K37l67n89k42M02N22K12k61m59k53J29M15L83
$$ -103 294 441 123 -415 -560 -219 322 559 192 -397 -639 -237 285 497 236 -223 -476 -347 68 451
1719D51l0m15m68oM79N10Om82n05k6M66M73j3k95l93j70K63L97K65j90m57l34
$$ 451 421 6 -462 -468 11 521 527 45 -460 -486 -20 453 440 145 -248 -418 -155 242 507 317 -140 -474
1741d74R6N53L98j79n29l59J21M98L24j08l93l25l4L22M04R5k97m60j91K93N10
$$ -474 -378 175 573 394 -135 -494 -373 125 449 341 -52 -377 -411 -89 315 410 113 -347 -538 -245 265
1762B65K42l14n34k09L48M37J99k09l91k58J10L59L68m3l69m08k6M02M78K6m30
$$ 265 507 193 -341 -550 -202 235 434 225 -166 -424 -314 45 413 370 1 -407 -433 -31 447 473 43
1783D3m29k8L62M33L6k58l87j58J90L80K25j03m52l07J18M86L38j75m15l41J20
$$ 43 -386 -414 -52 381 417 159 -228 -386 -196 184 409 306 -146 -453 -335 151 489 314 -101 -442 -322
1804c22L95L14n5l11l69pK49L81J36k45m64j71K24M71K46k82m36k02J97M48J64
$$ -322 73 387 332 21 -348 -355 -106 275 411 166 -298 -469 -245 226 472 190 -246 -448 -251 197 361
1825C61j66l24k32K9L34L32K1l32m23pL45M42M4l63l83q4L26L91P7k46l28j70
$$ 361 195 -129 -361 -332 2 334 355 23 -400 -407 -62 380 424 61 -322 -406 -80 311 388 142 -186 -356
1847c56J55L45K80r6m45k82P6M48L17o9m47l04R0L07L23%l15l31n0J96L47J74
$$ -356 -201 144 424 328 -117 -399 -323 125 442 373 -74 -378 -288 19 342 342 27 -304 -354 -158 189 363
1869C63k04m11k25K49M43K08k39m52j30J82L35K37j33k81k65RL24K85O5l27l54
$$ 363 159 -252 -477 -228 215 423 184 -268 -398 -216 119 356 223 -58 -323 -314 10 295 360 33 -321
1890c21q4L39L96N3l11l46q8K82L30J35k61k66j75J12L53K63j21l70l45J19M20
$$ -321 -405 -66 330 383 72 -274 -362 -80 250 385 124 -142 -317 -205 148 411 290 -80 -425 -306 114
1911A14K92p8m12k74O3K92L10nk52k79j39J74M08J39k08l63j90J83M14K03k13
$$ 114 406 328 -84 -358 -295 -3 307 302 50 -229 -368 -194 214 353 145 -218 -408 -225 189 392 179
1932A79m20k01J94L28K59j05l12k42nK83L29R1k96l94o1L04L84N1k38m09l8K14
$$ 179 -241 -442 -248 80 339 234 -78 -320 -325 -42 287 378 82 -312 -373 -69 315 366 128 -281 -319 -105
1954a05L46J28j68l47j83J18L20K43r0l38l15O3M12L04r7l13k81j5K89L02Lk06
$$ -105 241 369 201 -146 -329 -211 109 352 262 -76 -391 -328 84 388 291 -22 -303 -318 -29 273 276 70
1976G0l10q0J66L22K06j84l85j96J59M10K19k04l86j90J71K75K40j9k87k94qK61
$$ 70 -240 -320 -154 168 374 190 -195 -391 -232 178 397 193 -193 -383 -212 63 303 284 -3 -297 -305 -44
1998d4L02Q6k75l46r6K93L24J32k61l70q8K23L09J47j20l42k05O5L43K99p2l44
$$ -44 258 344 69 -277 -373 -80 244 376 115 -255 -343 -120 189 336 216 -126 -331 -266 77 376 304 -40
2020d0l20O4L35L24k8l32k98J3K72K36J05k29l23j21J94L34K08j76m04j86J47
$$ -40 -360 -296 39 363 335 3 -295 -282 -10 226 331 102 -221 -342 -148 186 394 218 -186 -372 -225
2041b25M02K18j45l99k18J43L02K22k9k84k89k1K59L53L9k47l80p6K29M23J04
$$ -225 177 395 250 -149 -367 -224 78 300 271 -13 -302 -323 -64 289 328 81 -299 -375 -146 277 381
2062C81k61l55j42J95L15K09j52k93k29M0L41K58Jl35l42Q4K92L31Jl11l23k5
$$ 381 120 -235 -377 -182 133 342 190 -103 -332 -292 49 307 308 -27 -369 -285 7 338 339 28 -295 -320
2084c20K92K76J08k18l31j62J99L33K17j26m09k16J41L66K36j20l83k14O8L22
$$ -320 -28 248 356 138 -193 -355 -156 177 394 268 -141 -357 -216 150 386 266 -117 -331 -263 59
2104E9K37mk70l24l7K18L88P6k19l92j37K26L97J32k12l30j56J57L09J97q3l05
$$ 59 296 292 22 -302 -339 -121 267 343 124 -268 -405 -179 218 350 138 -192 -348 -191 118 315 232 -73
2126g3k38J1L21L12k0l28l12PL21L45L0l35l07l8K71K67J07j59l30j68J55L33
$$ -73 -311 -300 21 333 313 -15 -327 -320 1 346 376 41 -266 -304 -33 234 341 182 -148 -316 -161 172
2148A72K20j35l89k37J14L96K30j04l65k08M8K59K81kk71k86p2K18L83R7k49l85
$$ 172 392 257 -132 -369 -255 141 371 267 -98 -306 -258 1 282 280 9 -277 -349 -131 252 349 100 -285
2170b85j17K46L63J22j78l32j44J39K95K08j04k49k63j2L30L19K2l64l18qL06
$$ -285 -402 -156 207 329 151 -181 -325 -186 109 317 213 -36 -299 -311 19 338 360 -4 -322 -330 -24
2191b4L27L4k60l05p5K19L07J26j56l39k13J51L66J91j06l56k45J00L46K68j17
$$ -24 303 337 77 -228 -303 -84 223 349 193 -146 -359 -208 158 349 243 -113 -358 -258 88 356 239
2212B39k74k93L2K48K76L5j98l42j08K68L32J32k20l94j41K52L57J29j70l16k09
$$ 239 -35 -328 -296 -48 228 263 65 -277 -385 -117 215 347 127 -267 -408 -156 201 330 160 -156 -365
2233c65J27L43K19n8l25k34j3K98L47mk70l62RK67L15O5k52l10q0J84K78J68j46
$$ -365 -238 105 324 266 -59 -293 -306 -8 339 335 65 -297 -288 -21 294 359 107 -203 -283 -99 179 347 201
2256B01l06k31J23L29K32j16l44k15N9L57J89k5k84k29l0K36K88L1j80l12j41
$$ 201 -105 -336 -213 116 348 232 -112 -327 -268 89 278 253 -31 -260 -290 -54 234 265 85 -227 -368
2277c68K47L40J49k25l42j60J80L56J56j60l07k08J20K84K41p7k50k69J2K77L12
$$ -368 -121 219 368 143 -199 -359 -179 177 333 173 -134 -342 -222 62 303 226 -24 -293 -281 -4 308
2298C08L1l07k93q1L02L06O0k25l18q3J77K81J72j32l34j72Q4L28K73r5l54k43
$$ 308 339 32 -261 -342 -40 266 326 101 -217 -300 -123 158 330 198 -136 -308 -224 104 377 282 -72 -315
2320c15M1L30K64m1k74k77j2K45K43J01k18k96j21J90L21J58j89l21j74J80L04
$$ -315 -274 56 320 279 5 -272 -284 -39 204 305 87 -209 -330 -140 181 339 150 -171 -345 -165 139
2341A39J65j14k96j65M0K89K27k9k89k40j5K48K97N8k67l18l9K27L07J01k03k99
$$ 139 304 190 -106 -271 -231 58 285 256 -33 -273 -288 -40 257 315 48 -270 -309 -82 225 326 123 -176
2363a76j14J38K84J80j14k95k20R8L15K25o6k87k55L6K90K65m2k51k49o3K34K76
$$ -176 -290 -152 132 312 198 -97 -317 -219 96 321 255 -32 -287 -251 39 304 262 11 -238 -301 -67 209
2385B09P3j71l51q6J78K86J75j42l37j79J47L21K02j15k88j86M0K45K57l5k45
$$ 209 282 111 -240 -326 -148 138 313 171 -166 -345 -198 123 325 210 -78 -264 -224 21 278 243 -2
2406bk47n4K84K75N3k24l32n7K10L19P1j40l15j02Q5K78K03j24k34k40N2K92K48
$$ -2 -249 -303 -19 256 309 85 -247 -304 -94 225 296 156 -159 -261 -176 102 305 181 -53 -293 -241 51 299
2429B99m4k72k54M1K43K54j5j90k66o1J77K61J39j83k39j93J37L14J56j27k66
$$ 299 255 -17 -271 -230 13 267 252 62 -204 -265 -88 173 312 129 -110 -303 -166 148 304 177 -89
2450h9k17J11L02J83q8k54k02L8K17K25O0k62k46p0K24L05M8j68l17r5K02K47
$$ -89 -306 -195 107 290 202 -52 -254 -216 1 226 286 24 -222 -292 -68 237 285 117 -200 -295 -93 154
2472A54J20j36k54j36O6K87J80l5l06k12L7K58K51k6k33k70m0K80K20P6k41k38
$$ 154 274 138 -116 -252 -186 101 281 246 -60 -272 -235 23 274 248 15 -255 -295 -15 205 281 40 -198
2494a98q6J70K49J83j58l06j43J00K97J55q0k72j91R0K35J93%k58k19qK18K54
$$ -198 -284 -114 135 318 160 -146 -289 -189 108 263 183 -89 -280 -190 45 238 238 -20 -239 -247 -29 225
2516B25M0j94k71p5J76K69J12j75k69r2J31K53J41j03k72j60O7K41K10mk74k23
$$ 225 265 71 -200 -275 -99 170 282 107 -162 -254 -123 130 271 168 -104 -264 -197 44 254 250 -24 -247
2538b47L9J94K82J2k47k50m4K14K48N2j57k47o1R7L00R0j17k57j86R7K80K06j09
$$ -247 -208 -14 268 280 33 -217 -261 -47 201 253 96 -151 -212 -115 185 275 158 -99 -285 -188 92 298 189
2561A89k45k11O5K47K00m0j83k16l0J75K65N2j62k48j46J88K50J13j36k75j26
$$ 189 -56 -267 -202 45 245 205 22 -194 -224 -49 216 268 106 -142 -288 -100 150 263 127 -148 -274
2582b74J35K31J90r6k46j98M1K42K11n1j95k44j5K31K51K9k24k22o0J90K53Q0
$$ -274 -139 92 282 186 -60 -258 -217 25 236 185 -10 -254 -269 -38 213 242 18 -204 -264 -74 179 259
2604B59j37k45j52J41K45J45p4k51j95P1K66J81l2k29j72k7K20J93L4k13k23l2
$$ 259 122 -123 -275 -134 111 256 182 -69 -264 -193 73 254 222 -7 -179 -206 14 207 241 28 -195 -227
2626b27J62K43R0j71k37j12J50K52J51j56k53j31O3K45J79l0k48k08%K45J95M0
$$ -227 -65 178 268 97 -140 -252 -102 150 301 145 -108 -239 -176 69 248 218 -30 -238 -238 7 202 242
2648B42j97k40m5J82K58N9j91j96r0J21K66P2j03k49j59J23J86J79j6k39k20Q1
$$ 242 45 -195 -240 -58 200 259 68 -128 -218 -97 169 241 138 -111 -270 -147 39 218 202 -37 -257 -176
2670a76J99K00j5k09j90j8J83K07N2j56k29r2J73K16J15j20k75j25J36K14J70
$$ -176 23 223 208 -1 -191 -209 -26 181 233 77 -152 -244 -71 145 260 140 -135 -260 -124 90 260
2691B60p7k44j81P7J86K27l1k35j69j7J98J98L8k09k06l8J69K42O5j50k57j01
$$ 260 183 -61 -242 -165 21 248 217 -18 -187 -204 -6 192 230 21 -185 -223 -54 188 253 103 -154 -255
2713b55R2K62J43q1k52j40P5K18J97m5k29k21K4J97K46J5k36k17oJ79K18N5j50
$$ -255 -163 99 242 161 -91 -231 -156 62 259 214 -15 -236 -212 -15 231 246 10 -207 -213 -34 184 239 89
2736H9k31j02J44K41J35j21k16j89R6K37J79p7k22j64JK62J68j2k11k18J3J46
$$ 89 -142 -244 -100 141 276 155 -61 -250 -154 83 262 185 -37 -201 -200 62 230 218 7 -211 -198 -52
2758e2K35N5j62k37j02J58K16J27j40k35j09P5K76J13o5k02k15O4K28J95k9j83
$$ -52 183 238 76 -161 -263 -105 111 238 98 -137 -246 -171 105 218 153 -49 -264 -200 28 223 194 11
2780A1k14n2K20K21K5j69k10o4J73K26P7j48k10j18Q8K61J41p2k45j57M4K34K01
$$ 11 -203 -255 -35 186 211 42 -168 -232 -59 167 244 96 -114 -232 -144 117 258 186 -59 -216 -172 62 263
2803B63o9k39j68L6J99J78J3j61k26q0J83K30Q9j54k01j54J50K27J17j36k07j18
$$ 263 194 -45 -213 -177 22 200 213 52 -174 -254 -71 159 248 94 -107 -261 -111 116 233 97 -110 -228
2825b28Q0J91J61l6k11k11K9K33J88K7k17k33NK13K08L5j66k29q5J55K24J00j03
$$ -228 -148 43 204 168 -43 -254 -225 8 196 223 6 -227 -222 -9 199 234 68 -161 -246 -91 133 233 130
2848A30k37j19Q0K32J57l9k49j88O5K05K21m6k13k09oJ87K03M4j65j96j01J36
$$ 130 -107 -226 -146 86 243 204 -45 -233 -168 37 258 212 -1 -210 -216 -29 174 218 53 -143 -244 -108
2870a08K35R1j12k37j03J00K45J18q2k13j73K6K48J75m5k10j94L7J56K09N5k10
$$ -108 127 218 106 -131 -234 -134 111 229 147 -66 -239 -213 35 210 165 -45 -239 -202 -46 163 218 8
2892Hk26j0J73J92P0j15k41r5J41K14J29j03k24j41O5K46J39j8k36j91K5K31J89
$$ 8 -218 -228 -55 137 207 92 -149 -244 -103 111 240 137 -87 -228 -163 83 222 204 -32 -223 -198 33 222
2915B22J2k23j77k2J63K03N1j41k52q6J40K55J15j31k23j46J03K05J76j11k10
$$ 222 234 11 -166 -188 -25 178 229 88 -164 -250 -110 145 260 129 -94 -240 -137 68 244 133 -77
2936g7j76O1K11J76k5j83j87oJ65K19K9j70k23n9J60K19P9j11k28q8O5K51J31
$$ -77 -253 -192 19 195 170 -13 -200 -206 -41 178 207 37 -186 -245 -85 134 213 102 -126 -214 -149 102 233
2959B33r1k01j68P1K04J82k5j93k36M3K14J87Jj71k13n0J82K05P9j88j90q5J16
$$ 233 142 -59 -227 -156 48 230 205 12 -224 -181 33 220 221 50 -163 -213 -31 174 253 65 -125 -210 -94
2982i4K10J23j26j97j46P6K49J19n0k05k14N5K10J95k8j57k04k5J64K17J6j36
$$ -94 116 239 113 -84 -230 -154 95 214 164 -41 -255 -200 10 205 177 20 -184 -209 -45 172 188 52
3004E2j89j00J51K13Q5j08k40q3P3K05J40m1k25j65M2J80K15j0k11k19N6J90J77
$$ 52 -137 -237 -86 127 212 104 -136 -219 -146 59 199 158 -67 -232 -190 -10 205 195 -16 -235 -179 11 188
3027A88O3k07j89o3J27K12J04j41k00p7M2K55J21p2k32j34O7J90J64n5j86j75
$$ 188 251 44 -145 -208 -81 131 235 94 -106 -183 -141 114 235 163 -69 -203 -136 54 218 163 -23 -198
3049a98L1J74J60K8j58k14l5J33K49M4j29k39q5J19K44R4r3k11j46J14J98J25
$$ -198 -167 7 167 195 37 -177 -212 -79 170 214 85 -154 -239 -120 124 218 125 -86 -232 -118 80 205
3071B05m2j77k13N7J98J93j0k02j67n5K09J95K7j56k15l2J12K24J05j57k06j03
$$ 205 163 -14 -227 -170 28 221 211 9 -158 -213 -4 191 218 62 -153 -185 -73 151 256 99 -107 -210
3093b10Q7K04J46p3k09j45K7K09J63o1j31j80mJ53J76N0j47k17p4J49K26M8j06
$$ -210 -123 81 227 154 -55 -200 -173 36 199 138 7 -173 -177 -24 152 202 55 -162 -236 -87 139 187 81
3116H1k02j18J11K08J27q4j93j29K8K07J60j5j97j81PJ89K06j1j93j54k7J33K13
$$ 81 -121 -239 -128 80 207 123 -70 -199 -171 36 196 181 -16 -197 -190 -1 205 194 1 -153 -180 -47 166
3139A66N9j18k20m5Q9J83J20j29j56j34M0K16J80o6k30j56N2J84J48J3j70k20
$$ 166 225 107 -113 -158 -69 114 234 105 -51 -185 -145 71 251 185 -45 -201 -149 35 183 196 26 -194
3161a94nJ80J53K7j40j81n3Q0K31J06j24j91j01J19J77Q1o6j61j47N4K18J15j3
$$ -194 -199 -19 134 161 21 -160 -213 -133 98 204 80 -111 -212 -93 84 165 99 -62 -209 -155 63 178 165
3184A65j75j84J4J90J37O5j94j73l5J16J96Q6j25j94n2P6J40J40o2j86j40N6K15
$$ 165 -10 -194 -180 10 147 212 18 -155 -190 -74 122 208 83 -111 -163 -87 53 193 131 -55 -195 -139 76
3207G6J29n9j79j82M1J97J42oj39j73k0J10J60Q4j11j83j02J19J64J11r2j78j02
$$ 76 205 146 -33 -215 -174 23 165 159 20 -153 -173 -63 97 181 70 -113 -215 -96 68 179 87 -91 -193
3230a93M2J76J45m7j46j27j3J33K02J4j79j80l1J86J59M1r9k26l2J11J94Q0j34
$$ -193 -151 25 170 123 -23 -150 -163 -30 172 186 7 -173 -204 -18 141 182 83 -143 -175 -64 130 210 76
3253G6j39j30R9J53J58p7j53j61M1J77J53l8j39k09%J61J70M7j58j71n2J09J93
$$ 76 -63 -193 -94 59 217 140 -13 -174 -133 44 197 159 20 -189 -189 -28 142 189 31 -140 -192 -83 110
3276A10N5j01j87j04J35J75J07q1j83j37N7K05J13j7j89j48K3J76J46J2j57j77
$$ 110 165 64 -123 -227 -92 83 190 109 -74 -211 -154 51 164 147 -42 -190 -167 9 155 167 10 -167
3298a67m8J68J50O9o7k36n8Q8K07Q8p9j69r5M0J88J15oj80j55j6J67J48K1j18
$$ -167 -215 -47 103 172 105 -131 -189 -101 106 194 115 -54 -149 -109 79 194 188 8 -147 -163 4 152 173 55
3322E5j98m0J51J65P4j46j52q4Q9J63J19j13j35j28K7K01J33k7k12j26K8J54J66
$$ 55 -143 -183 -32 133 207 61 -91 -175 -86 77 196 83 -52 -180 -153 48 181 154 -58 -184 -156 -2 164
3345A64j2j57j17l6J22J79K7j13k05k0J05J86Q1j20j63p9P3J70Q5l4j51j92M8
$$ 164 152 -5 -122 -158 -36 143 170 57 -148 -168 -63 123 204 84 -79 -158 -85 85 170 136 -15 -207 -159
3368a59J73J61J7j59k07K8J35J48L5j22j80n7J26J50P3n1j94j09O9J95J21n8j71
$$ -159 14 175 192 33 -174 -146 -11 137 172 50 -130 -187 -61 89 162 111 -83 -192 -123 72 193 135 -36
3391c6j48L7J72J17Pj94j17j7J64J73j6j08j83KJ05J22R0j16j49q7P7K07P9p3
$$ -36 -184 -147 25 142 149 -45 -162 -179 -15 158 142 34 -149 -147 -42 80 170 54 -95 -182 -105 102 181 108
3415A08j62j22L6J84J34l3j66j29rJ59J36Rj13j40o1J35J62L8j13j71o7Q2K17
$$ 108 -54 -176 -140 44 178 145 -21 -150 -159 0 136 145 32 -108 -169 -34 128 166 53 -118 -185 -103 114
3438A14O7o1k08q7L7J77J25l0j41j56QJ83J05Kj03j81JJ03J40O7j29j40r0R9K32
$$ 114 181 120 -88 -175 -138 39 164 134 -7 -163 -155 28 133 135 32 -149 -148 -45 95 162 33 -107 -197 -98 134
3463A34L6p4j84j11Q3J85J03l3j82j34O1R7J94Mj85j68lJ65J56J4r5j90m2J21
$$ 134 170 96 -88 -199 -116 69 172 139 -43 -177 -116 -19 175 179 -6 -174 -177 -12 144 158 63 -127 -169 -48
3487d8J51R4j38j64p1N5J71J25l7j88j19L9J55J47k1j36j68RJ27J97j0j24k08
$$ -48 103 197 59 -105 -176 -121 50 175 138 -50 -169 -130 25 172 151 15 -153 -144 -17 180 170 46 -162
3510a62j8J22J98N2j25j60r6J11J60J15q9j60j24N3J29J30K7j58j76JJ68J46Q
$$ -162 -180 -58 140 192 67 -93 -189 -78 82 197 108 -52 -176 -123 6 136 163 5 -171 -170 -2 144 152
3533A52j46j40m7J29J93op7j84l4O4J68J03n7k04j10R1J42J35l0j72j36MJ77J56
$$ 152 6 -134 -181 -52 141 135 58 -126 -160 -96 72 175 118 -86 -196 -105 37 172 142 -30 -166 -162 15 171
3557A71j2j52j41QR4J54M8q7j99n3R2J77J20r5j78j21P6J54J35n4j67j16qJ62
$$ 171 159 7 -134 -126 -32 122 170 83 -116 -169 -77 100 220 125 -53 -174 -98 56 191 137 -30 -146 -154 8
3581HJ25%j19j40l5J11K03J1j22j88n5J23J65O3n3j92q4P2J61J27r8j43j14O1
$$ 8 133 133 14 -126 -161 -50 153 164 42 -146 -201 -78 87 150 97 -95 -179 -107 54 181 83 -60 -174 -113
3605a13J57J10L3k08j42J3J23J60O4j43j90k8J26J77M6r6j64r0P9J84O6o5j41
$$ -113 44 154 187 -21 -163 -150 -27 133 197 54 -136 -164 -38 139 185 89 -75 -165 -86 98 164 99 -42
3628d2j38M4J82J22qj78j48J0J56J42K5j42j63m3J32J97L4j13j77p1R0J89J02
$$ -42 -180 -136 46 168 160 -18 -166 -156 0 142 167 25 -138 -181 -49 148 182 69 -108 -179 -89 100 202
3651B02r2k22n6N3J94J13o6j51j27QJ21J59mj24j54k9J52J80L4j25j79p2J01J95
$$ 202 110 -112 -168 -115 79 192 126 -25 -152 -144 -23 136 132 8 -146 -175 -23 157 191 66 -113 -185 -84 111
3675A11P4o8k02r6R7J91O6l8j73j12j3J94J60l6j69j19j1J20J57M8j72j36m6Q8
$$ 111 185 117 -85 -181 -84 107 173 135 -38 -150 -163 31 191 155 -14 -133 -144 -24 133 181 9 -127 -173 -85
3699h5J97O6r0k14m0L6K02J12r1j33j51P2J42J42l1j42j33J9J40J40M1j56j88
$$ -85 112 178 88 -126 -166 -130 72 184 93 -40 -191 -119 23 165 134 -8 -141 -122 18 158 199 43 -145
3722a45l5J20J86O9j32j59j00J26J77O8o2j96p7N3J51J48m0j71j23K5J48J16M
$$ -145 -180 -60 126 195 63 -96 -196 -70 107 175 113 -83 -160 -107 44 192 152 -19 -142 -117 31 147 151
3745A51r8j75o1J55J58M9j10j53j03J06J70P1o2j88p1M2J75P7jj34j83N1J22J40
$$ 151 53 -122 -183 -28 130 179 69 -84 -187 -81 89 160 98 -90 -161 -119 56 133 132 -2 -185 -134 -12 128
3769A28J3j38j52mJ08J66L4j29j43p1J40J54M6j08j43p0J04J53R7q6j42j02L4
$$ 128 141 3 -149 -153 -45 121 155 26 -117 -188 -48 106 152 44 -99 -169 -65 88 185 99 -43 -145 -111
3792a11J44J12k1j22j49k4J54J48L8j14j80l0J22J54N2j00j64q1J13J49O9l0j88
$$ -111 33 145 124 2 -147 -171 -17 131 169 55 -125 -155 -33 121 173 73 -91 -172 -59 90 159 129 -59
3815e9r8M1J35J41j7j82q3k1J31J09M9j26j75LJ03J61L7j06j36n0M4J63R8j04
$$ -59 -157 -116 19 160 143 -39 -122 -143 -12 97 146 20 -155 -152 -49 112 149 43 -93 -143 -99 64 162 58
3839E8j28o4MJ80J09o2j23j01%J48J30qj56j09pJ02J47po5j41o8P0J67Q1q9j33
$$ 58 -70 -134 -130 50 159 97 -26 -127 -127 21 151 143 -13 -122 -129 -27 120 113 48 -93 -161 -91 76 157 68 -65
3865f5p2L5J77Q4p1r6j35J9J37J11Pj16j43pJ27J05K1q7j28l2P7J47M8r0j28j20
$$ -65 -137 -102 75 159 88 -8 -143 -124 13 124 131 15 -128 -135 -8 97 118 31 -97 -129 -52 95 143 53 -75 -195
3891a95J01J13J19l2j62r0N6J29O8k1j12j23M8R5J08M7r1j45k5R7J23M1q7j34
$$ -195 -94 19 138 106 -56 -146 -90 39 107 86 -26 -149 -101 -6 102 149 58 -87 -112 -15 108 149 62 -72
3915g2m9N7J30P3n6j01p5J1J52O0l8j13j05L4J05J18j5j26j10kP5J66K2r1j26
$$ -72 -121 -64 66 139 83 -18 -93 -82 70 130 92 -21 -126 -92 13 131 116 -10 -120 -122 -47 119 141 50 -76
3940g6l5P0Q1Q1n3j39o5O8R0J41p8j21q5K4J01R3mp8j37OP3J41L2r4j28m5O7J28
$$ -76 -111 -41 40 121 68 -71 -136 -68 22 163 85 -36 -121 -97 4 97 93 15 -122 -116 -43 98 130 36 -92 -137 -70 58
3968E8Q3m8j41o7L6J30P0k1j21p5J9J21O7J8j42p5j8P0J45K0j02j00l7Q4R5L7
$$ 58 141 93 -48 -115 -79 51 121 100 -21 -96 -77 44 111 129 -13 -88 -106 -36 109 129 27 -73 -110 -26 69 106
3994A06j7j64l4QJ51Q6n8j03r7K9J33R7j4j34j16J2R4Q9K9m0j70M1O0P5Q5j15
$$ 106 89 -75 -109 -101 50 136 78 -25 -122 -93 40 137 123 -11 -127 -115 -21 68 97 57 -113 -72 -12 63 148 33
4020C3p7q3R1R8O8n1j10q4O4J19L7J9j30n9k9J23Q4L4j40q9j0Q0J09Kn2j29k4
$$ 33 -44 -127 -36 62 130 79 -31 -115 -51 68 105 124 -6 -65 -94 29 113 147 7 -82 -92 -12 97 99 47 -82 -106
4047a06O7J13K4k6j29n4L6J04P8j2j24p7J4R3Q0M0j36q8J8O4J10lq2q5k0P5Q3
$$ -106 -39 74 98 72 -57 -111 -75 29 107 95 -29 -106 -92 1 81 121 -15 -103 -85 -21 89 86 4 -81 -101 -26 57
4074E7O2p0o8o9K3Q1J25n0j07o0k1J33N5qp8p8l4J02P4M1p3j01o6Q5J02L3k2j14
$$ 57 119 49 -19 -88 -65 16 141 91 -16 -76 -97 36 91 83 5 -73 -107 -5 69 110 37 -64 -130 -45 57 90 68 -46
4102d6l1jQ1J09j8j18p3K5R5P1np4q0jP5N8J2n9j04j9Q9P6J4l4q0n4L3O9Q7k5
$$ -46 -77 -78 3 112 94 -24 -97 -72 23 94 89 15 -65 -66 9 67 79 20 -84 -103 -14 62 76 42 -38 -92 -59 10 97 72
4132G2j02o8J4J31L0K7j23l7l4O2J11K8p8q6m1O6R8K5m3q9l6L9N5P7l2r9m5M2
$$ 72 -30 -98 -84 47 77 104 -19 -56 -90 -28 83 111 33 -53 -94 -28 70 95 52 -37 -73 -34 21 98 66 -33 -78 -36
4160c6M6P6op5j01N2M7R0K3j12o5k7P6O7J4k7r5m9M5R6O9o8p7m3k3J10P5m1q9
$$ -36 10 86 80 5 -96 -44 3 93 116 4 -61 -88 -12 55 69 42 -53 -102 -57 39 108 40 -37 -80 -103 7 82 41 -48
4189d8n2K2J21Qmm3q3K2L3J07L4q8o3l3L4J15J6p2o3m3K2R8J6J9r7p5N8O2K8K1
$$ -48 -100 -78 43 51 47 4 -79 -57 -24 83 117 29 -34 -67 -33 82 98 26 -37 -80 -58 40 56 75 -22 -97 -39 23 51 72
4219G2p8o9M0K1Q5J6r0p7k8P3Q4K5l7q3l1LJ14M3k5r5n5L1O8R7k7p2p4mO1R4l
$$ 72 -6 -75 -35 -14 71 87 -3 -80 -108 -35 49 74 37 -46 -77 -74 40 83 58 -37 -92 -61 7 104 77 5 -69 -73 -12 82 79
4250G9o8p8oN0R5L9o8r9o2Q5M6R0o9o6m1RJ01O1k1p5m7m1J36M4op8p0rM3Q7L5
$$ 79 11 -67 -73 -23 72 111 43 -56 -118 -33 13 103 34 -32 -73 -64 37 98 77 2 -45 -86 50 94 88 10 -60 -69 -26 61 96
4281I6p6o8n9N2R9K5n7o1l5K6R3L9k4o2q5O3M4O0l1m7p9J5O9N0K4l9r6qN9O2k
$$ 96 20 -48 -107 -55 44 69 12 -49 -84 -58 35 74 50 -12 -97 -34 10 70 39 -8 -87 -72 -3 47 71 32 -64 -72 -13 49 47
4312D7j1r0l0O8O8K2j5n7n6MO6L0K3p8o6qQ2Q3j3o0p1qN6P1L8p3j04LK3J06M7
$$ 47 36 -54 -84 -16 52 74 59 2 -54 -50 16 46 69 -9 -75 -83 -1 82 69 9 -62 -70 -14 57 95 22 -82 -79 -56 50 97
4343I7n8p7l8MQ0P9k1j02n0J1O9O2Jo5l8m6N8Q7K2l8j04k2N2Q9J3or4l5QJ09O1
$$ 97 39 -38 -76 -72 8 87 66 -36 -86 -75 -6 56 57 -8 -46 -92 -34 53 75 37 -67 -89 -37 52 65 59 -35 -70 -62 47 108
4374A08m3r1k8j1O3N4mm7n4lL9R0K1o4r1J1J5R8M1j15j6m6M7O9K0j1o6p2J8J08
$$ 108 65 -26 -54 -65 -2 52 48 1 -53 -56 -17 73 94 30 -61 -50 -35 63 104 -11 -27 -73 -26 43 63 52 -14 -86 -68 40
4404D0J0lo7n9M0L3N4J4o7p5LO5P3L5r4o8rN2K4N3j4n6n6L6O9L8k1o6m4J3P4L2
$$ 40 50 47 -20 -79 -39 -6 48 62 -5 -80 -77 -12 61 96 2 -66 -75 -23 1 54 40 -16 -72 -36 33 71 50 -16 -60 -47 27 59
4436E9pm8k5n3Q9N0J0m6o8j3J6O1M0k2n9m4K8N4O5o7m6n6K4P2L1K2p4q2M0N9M8
$$ 59 52 4 -21 -74 15 65 75 29 -39 -52 -36 25 65 43 -16 -60 -32 22 87 20 -26 -82 -58 14 45 67 -7 -89 -49 10 58
4467E8j4%j09j1N6O7nl8p4k2N2Q4Ll5l7n5M6P4K5j6o2l6KM5P7Op6q5J5P2M5K2
$$ 58 44 44 -65 -76 -20 47 42 4 -70 -92 -40 44 47 12 -25 -80 -34 40 65 49 -13 -49 -47 -2 75 81 5 -80 -65 7 52 74
4499G4l7j12J5M3P3J6k0p8l0O3J2K6Lp8%k1O2O5o0j3m1qN8K4K3p3m1qM9M9J1k2
$$ 74 37 -75 -60 -17 56 72 52 -26 -56 7 19 45 48 -30 -30 -51 11 76 16 3 -38 -46 12 36 59 -14 -55 -63 -14 35 46 24
4531B4p2rJ1Q9%%r4j7K3N5L2ll5p8L8NR1j5m7j9l5R0K5K3q5k0MQP7J2n3n3k2K0
$$ 24 -48 -57 -46 43 43 43 -51 -68 -45 10 42 39 4 -74 -36 -31 60 45 -2 -21 -56 34 59 82 -3 -23 -19 -11 66 78 25 -28 -50 -30
4565c0O4K9k3n4l2RP6K2jl0r6J1N7N8l2l7k0MM6oM6m9n7l6L8P3K6l0o0l4M1M5
$$ -30 34 63 40 -14 -46 -37 39 61 60 30 -66 -55 2 60 28 -9 -29 -25 21 15 61 12 -45 -81 -43 30 56 26 -34 -68 -27 18
4597A8J7Oq0qJ1L9K4Pn4kl4O3M5j3j8o6OM2O1qj2r7kK4N7K2j6m2n7M8L4ML7l3
$$ 18 35 41 -39 -47 -36 3 27 34 -20 -22 -56 7 52 39 21 -45 -39 3 64 56 44 -53 -55 -31 26 48 32 -10 -67 -19 15 19 56 23
4631B3o4kJ8R2m5j2m1j5L1O0Mj7p6k0O7J9OJ0q4J7LM3L7j1m7n1J1P7K3j9p6j4
$$ 23 -41 -43 -25 67 22 10 -31 -46 -15 45 49 32 -44 -64 3 22 28 38 -46 -29 -26 17 54 43 -4 -55 -44 33 56 37 -39 -53
4663e3JM7L2j3mk2n8N0N3K3m6m0J1mO3J4k0n0l3L5L3N2l1p3j9J0J5Q5jl3n6l5
$$ -53 -52 -5 27 14 10 -12 -70 -20 33 56 10 -30 -19 -23 40 54 34 -16 -49 -14 19 71 40 -33 -52 -42 -27 58 57 24 -32 -67
4695f7O6L1K7m8o7K3LQ0k2j0n0NJ8J4J5kj0m9J4M7J8K2n3k2l3M2L4K0n7j9mL0
$$ -67 -1 30 57 9 -58 -35 -32 48 26 16 -34 -29 -11 3 18 16 6 -43 -29 18 36 58 5 -17 -50 -8 26 46 -11 -30 -34 -4
4727dM1Om3k7L7rN0Mk8n5LpQ7k9K1o2k3KK5O3J6m3n5J5K7L3K3p1l4k1LP4L7n1
$$ -4 37 43 0 -27 10 1 51 55 27 -28 -25 -32 55 26 47 -15 -38 -36 -11 52 68 25 -30 -15 12 45 68 -3 -37 -58 -55 19 56 5
4761En5j8L0L6Kj1J3n0mO7J1J4m4n7oL9L7jj5l6PJ6L2L7k9k5l8J5O0Mk9l5rJ4
$$ 5 -50 -68 -38 -2 0 -11 2 -48 -52 15 26 40 -4 -61 -67 -28 9 8 -7 -43 -36 -20 12 49 20 -5 -43 -28 32 36 7 -28 -37 -23
4795b3L7K8j9ol9j3K9K2K8l1n6j1N5L7j2lm2J2L4JJ2j3m8l3kL6N0m5j8rj5M5O
$$ -23 14 42 23 17 -22 -35 -6 16 44 13 -43 -54 1 38 26 23 -19 -7 27 28 40 27 -21 -54 -56 -20 30 -15 -33 -42 -57 -12 -6
4828fM9m9ko1L3M3OPo9J7K4L0J7mp1k1L4P3j1m0jj7qJ2M6qk5qj9K2P9l2m0k7q
$$ -6 43 -6 -8 -69 -36 7 13 20 -49 -32 -8 22 39 35 -36 -57 -23 50 39 -1 -2 -19 -27 -15 31 23 -2 -10 -29 -7 72 40 0 -27 -35
4863c5MN5L0m1k9kOL3M3m2qk5j6K0M4Rq1l1NM9K5M0p9l4j5N2N2kj5p0L6j9O1K1
$$ -35 -31 24 54 13 -16 -18 -12 21 64 22 14 -11 -27 -7 37 46 -35 -66 -61 -12 13 53 -26 -60 -75 -23 29 27 12 -58 -22 -41 20 41
4897D1l3k8k7L0oP5m3n7NJN8NJ7m0l5JL0M7l0rm2ML3K0M4l7n2k5L3L8J5mn8j6
$$ 41 8 -20 -47 -17 -23 52 9 -48 -43 -42 16 21 38 -2 -37 -36 -6 41 11 2 -40 -36 -3 17 61 24 -28 -53 -20 18 33 29 -29 -45
4931d5MO6K0jn3Ll0N7oJ9l0m5OL3L4kj7l6LnK7K7J1k4o5L2J2jL0o4%KJ8L7Nl9
$$ -45 -41 25 45 44 -9 -6 -36 21 15 34 4 -41 -35 -2 32 30 13 -23 -20 -25 2 29 40 16 -49 -17 -5 -6 24 -40 -40 -38 -20 17 22 -17
4967a7j5K5K8J2J2l7lm2M1J3K9k5q4RL0K1M0km4l5J1%P5j9m7Jk6M1qN0j0o0Pn
$$ -17 -32 -7 21 33 45 8 5 -37 4 17 46 21 -63 -54 -24 -3 37 35 -9 -44 -33 -33 42 23 -24 -23 -49 -8 -16 34 24 -36 -29 -34
5001c4M9K8m3m4J4kM3J1K4o0m1N0nL9M1j07k4M7J2K2K2op4j2N5M0l3M0m4j9jN3
$$ -34 15 43 0 -44 -30 -32 11 22 46 -14 -55 -5 -10 29 70 -37 -61 -14 -2 20 42 36 -38 -50 5 45 12 52 8 -11 -12 41
5033D1L4mo4j8j8N0J2Mm8k0LL4K1Pk6k4k0j2P5L2m6m6pK8K8L6l4n1MnJP4k2n4
$$ 41 75 71 7 -11 -29 21 33 37 -11 -31 -28 6 27 34 8 -16 -36 -48 27 59 13 -33 -40 -12 16 52 18 -33 -29 -34 -33 41 19 -35
5067c5k5QL8Q3k4m5l0k5M4M6J6n7j4k1L3L4J1pm5m0N4K9J0Rn3k2NP7l2N3m4o7
$$ -35 -60 -52 -14 69 45 0 -30 -55 -11 35 51 -6 -20 -41 -8 26 37 30 -15 -55 -1 28 38 47 -6 -28 -23 54 22 75 31 -36
5099c6mM7K3L8o0k4j6PN2pJ5n0j1LO0Lj5k5m9J3MP6n1nl1mN2K7Kl8ppk4J11p2
$$ -36 -40 7 30 68 8 -16 -32 -25 27 20 35 -15 -26 -23 37 40 25 0 -49 -36 -32 44 -7 -12 -43 -47 5 32 34 -4 -11 -18 -42 69 -3
5134cNrl2K7K9M6o1k8kjO3K0j2l7l7kO7j3K7k6l9J6J1J8jOo5j2L8K3QRn2k9L7
$$ -3 2 -7 -39 -12 17 63 2 -26 -28 -29 34 54 42 5 -32 -34 33 20 47 21 -18 -2 9 27 26 32 -33 -45 -7 16 24 33 -19 -48 -11
5169a1N1j1L0q3j4RM9Ojm0l0J5K7M6%p2j8l9O6R8l0j9n2l8M5K8K0k6%l4RM4jK1
$$ -11 40 29 59 -24 -38 -29 20 26 25 -15 -45 -30 -3 43 43 -29 -47 -86 -20 78 48 29 -23 -61 -16 12 32 6 6 -28 -19 25 24 45
5203D5n9n9K6M5K9K9j8p0J8J2L8J0m1j1k0J2M2L3l4m9j4K5K3J7K0l6k2l1N6J8
$$ 45 -14 -73 -47 -2 27 56 38 -32 -14 -2 36 46 5 -6 -26 -14 28 61 27 -22 -36 -11 12 29 49 13 -9 -40 16 34
5233C4jj8n1J7OO1J3l4k8l2J3M2J6j8m2n1L3R0onn1m8J7N8M9j6l6m1kK7L8K7l8
$$ 34 33 15 -36 -19 -13 48 61 27 -1 -33 -20 22 38 20 -22 -73 -40 50 44 39 -12 -60 -43 15 64 48 12 -29 -31 -4 34 61 23
5266B3l5rj2O1K9k2n3m4N4J8N6j5n2k7rN7K3jm0l4MM0K8k8om0J4K3jM1Jo9plL6
$$ 23 -12 -21 -33 28 57 35 -18 -62 -8 10 66 51 -1 -28 -37 20 43 42 2 -32 -28 12 40 12 6 -34 -20 3 2 43 44 -25 -32 -35 1
5301AO1m5m5oLK9K5ok5j1kP0l8Rk0o2K3L5M9K6p5J%mN6Kn1k4rmP5Ok3j5k5j2L8
$$ 1 62 17 -28 -34 -31 -2 23 17 -8 -19 -21 49 11 20 0 -62 -39 -4 45 71 -4 -3 -3 -7 49 51 0 -24 -33 -37 38 44 21 6 -19 -31 7
5338GL7j1j8l7JJ6L4jnp5J9ON1MMo6lK1L2J5Ln8k5%O2N2l8l3l1LK3J3M8l5l3K0
$$ 7 44 33 15 -22 -21 -5 29 28 23 -52 -33 -27 24 28 32 -34 -37 -16 16 31 34 -24 -49 -49 13 65 27 -6 -37 -34 -11 2 50 15 -18 2
5374Bj5N9J6l5k6l7jP6qk5J4l6mL6K7Nn5k8mM6L9ol7k3j6J7N8J1j1o2k6M2M6R
$$ 2 -13 46 62 27 1 -36 -37 39 31 6 20 -16 -20 16 43 48 -7 -35 -39 7 46 40 3 -20 -36 -19 39 50 39 -23 -49 -7 39 48
5408D8nq5k5L8M2L4j8m2m3J7M0M4n6Ll3%OO7rl1j2j2K4L2K7m6m3MK8L3%j2k3m5
$$ 48 43 -42 -67 -29 13 47 29 -13 -56 -39 1 45 -11 -8 -41 -41 -35 32 23 -8 -20 -32 -8 24 51 5 -38 -34 -6 27 27 15 -8 -53
5442e3K3N1K2j5k4%j4%M1Nn0jk1L0L3Pnk7m8J7L7L4l8k7k7K6QN7Lq0k3N6J9J4
$$ -53 -30 21 43 28 4 4 -10 -10 31 36 -14 -15 -36 -6 27 34 29 2 -46 -29 8 42 4 -23 -50 -24 -16 41 44 -36 -59 -3 16 30
5476C0Ok4l0m6N1M5qj8k6n2O9L0J1l4j9j6J9L4K3l1j7l2J7QK3J6m2j2rO5K9k6
$$ 30 36 12 -18 -64 -13 32 24 6 -20 -72 -3 27 38 4 -15 -31 -12 22 45 14 -3 -35 -18 -10 13 29 -13 -25 -34 31 60 34
5508C4k0k4J0LN4j0m2k8j0M0j3L6Qo9RJ5rM7ll8mj2L3Lnpk9MK0J6Pml0j9M1J9
$$ 34 14 -10 0 3 57 47 5 -23 -33 7 -6 30 38 -31 -22 -7 -16 31 28 -10 -14 -26 7 10 5 -2 -31 -27 -7 9 16 12 -18 -37 4 23
5544B3Orl4oMM8J4l0l7l5K1L4K3kk3m3J9M7J8k4k6J1k1K4K7Rk9k2mK2K7K4mm7
$$ 23 29 20 -14 -20 -16 32 46 16 -21 -56 -35 -1 22 20 -3 -46 -27 20 38 14 -12 -1 -22 2 29 38 9 -13 -17 5 32 56 52 5
5578EPk7J8N0j7n8J0j6J8J8K7n7mKJ8M0j4k9k8K9jK5J1Nj9k5j1K3OJ8k8m1K5J3
$$ 5 12 -15 3 53 36 -22 -12 -28 -10 8 35 -22 -26 -24 -6 34 20 -9 -37 -8 -9 16 27 32 13 -12 -23 0 6 24 -4 -45 -20 -7
5612gN6m6k0l7RM3M4j2l0ml6ON6Qk0rk7L8nM9k2l6Ll1L1M1k5Jk7k8K4N2Rn0pj7
$$ -7 49 3 -17 -54 -45 -2 42 30 0 -4 -40 -34 22 30 10 1 -26 12 7 56 34 -2 1 -30 1 42 17 18 -9 -37 -13 39 48 -2 -9 -26
5648b6J7K3k1J2k6kk0O1Nk5Lkm4RK1K0j0l4L1k2P1lj9o2K9JM6Kl3k0pj6Q6nj9
$$ -26 -9 14 -7 5 -21 -23 -43 18 23 -2 1 -1 -45 -36 -15 5 -5 -39 -8 -30 41 38 19 -43 -14 -13 33 35 2 -18 -25 -41 45 40 21
5683B1k0nj6L5Pj2j5j0j3M2L6l9K3o6K0k8N1K0l2RlpK7J2K3n5l1J0QN5j7n8mJ9
$$ 21 1 -4 -20 15 22 10 -5 -15 -28 14 50 11 34 -32 -12 -40 11 31 -1 8 5 -2 25 37 60 5 -26 -16 -8 47 30 -28 -32 -13
5717a3%L2J1m3jk6L1K6lJ3k9k1%N5%k6k2j0j1L8K8k8Rk5RK1J4J2l7k8M1%J7J4
$$ -13 -13 19 30 -13 -14 -40 -9 17 14 27 -2 -23 -23 32 32 6 -16 -26 -37 1 29 1 10 -15 -6 15 29 41 4 -24 17 17 34 48
5751D8l5n1J0PK1QJ3j4k6NK1L4m3jl3j2L6M4jm0Kl5K7K6OJ0l5rL1nK3k6j8m1J5
$$ 48 13 -38 -28 -21 0 8 21 7 -19 -14 7 41 -2 -3 -36 -48 -12 32 31 -9 -7 -42 -15 11 17 27 -8 -17 14 9 32 6 -12 -53 -38
5786c8L5N1n7Lk7J1M2J4j8j6Mm3M2pM2l9l8K7L6JrJ9k2k2jP5k8nm2k6LM0QJ2m2
$$ -38 -3 48 -9 -6 -33 -22 20 34 16 0 4 -39 3 -4 38 -1 -39 -12 24 25 16 35 13 -9 -10 65 37 32 -10 -36 -33 7 15 27 -15
5821a5Mk5L6J6K6l8k4MlK0rJ1k3KJ1L8qk9k2LpM6Nj4j5j4K8J3lJ0j7l6J9j0N9
$$ -15 -11 -36 0 16 42 4 -20 -16 -19 1 -8 3 -20 -18 -7 31 23 -6 -28 -25 -32 14 19 5 -10 -24 4 17 14 24 7 -29 -10 -20 39
5856C9k4%l7%K6K0qlpnj3K0L0l8j3l6K3N1%Lm1j7M0j3J3pkk4qK0J7Kln0L5K7j4
$$ 39 15 15 -22 -22 4 24 16 13 6 1 -12 8 38 0 -13 -49 -26 25 25 28 -13 -30 10 -3 10 3 1 -23 -31 -11 6 8 5 -45 -10 17 3
5893CJ7l8%ooM2npJ9k1j9QRj1j0LQJ4M3l7L6l1l3K0L5Ol3j4RlK8Nj4j4pj6N6k4
$$ 3 20 -18 -18 -24 -30 12 7 0 19 -2 -21 -13 -4 -15 -25 -22 -14 0 43 6 42 11 -22 -2 33 39 6 -8 1 -2 26 31 17 3 -4 -20 36 12
5931A2K1m0l8RRN4j3Pn9J9M2KL1m7nk3LL3Pk2k2J6k5nM5lJ1l7LL5J0k2Ln9L2M
$$ 12 33 -7 -45 -36 -27 27 14 21 -38 -19 23 25 56 9 4 -19 -16 17 24 2 -20 -4 -29 -34 11 8 19 -18 -15 20 30 8 11 -48 -16 -12
5967a2M1Ql0j0rJ1J7K2m2oJ7K3k1L9m2J4p2J7M7NJ0j0m0J6K5KlNk9roM0j5J7o2
$$ -12 29 37 7 -3 -12 -1 16 38 -4 -10 7 30 9 48 6 20 -52 -35 12 17 27 17 -23 -7 18 20 17 22 -7 -16 -22 18 3 20 -42
6002d2N5j7RLoRm2K5LJ4N1n6m5J8LL6k2j0J5k1J0L3lk2Nk4J8J9L3qn8lJ4J1M2
$$ -42 13 -4 5 8 2 11 -31 -6 -3 11 62 6 -39 -21 -18 18 -4 -14 1 -20 -10 23 20 -2 3 -21 -3 16 49 41 -17 -20 -6 5 47
6037D7l9OJ6l6PK8k4Mj3j8K3K3Pj1m0L6j1jjrLn5K6L4K5j1l4j7J0K6Mm0L1j7J6
$$ 47 8 14 30 -6 1 29 5 9 -4 -22 1 24 31 20 -20 16 5 4 3 -6 -3 -58 -32 2 27 16 -18 -35 -25 1 5 -35 -4 -21 -5
6072ej5M5k0Ok9J9RPK4j4l6oJ7j4L2j7LmJ0rJ7pj9j5J1pN4l5jQkJ0j5K3k1L4p0
$$ -5 -20 25 5 11 -18 1 10 17 41 27 -9 -15 2 -12 20 3 6 2 12 3 20 13 -6 -21 -10 -17 37 2 1 9 7 17 2 25 4 38 -32
6109c2M6j1L2Km5qJ7k0J4joj4K9j3JL3j0n7K9%N5j1k5Jj6k1M6Pn1K5m8N7Qj0m
$$ -32 14 3 35 37 -8 -16 1 -19 -5 -6 -12 -26 3 -10 -9 24 14 -43 -14 -14 41 30 5 6 -10 -31 15 22 -29 -4 -52 5 13 3 -1
6144aJ2m1ML5oN5k5l4k8K4K1K3k3mk7QJ7Pj7Ql3K7NJ3qk5RJ7k3L5j4j2%k9L7%
$$ -1 11 -30 -26 9 3 58 33 -1 -29 -5 16 39 16 12 -15 -7 10 17 0 8 -25 2 7 20 12 -13 -4 13 -10 25 11 -1 -1 -30 7 7
6180Gopj5J2J9l1J9Mlj3l0M3J4qm2J5lK8J3l6M9n3K5K3j2Q%l3J4JK3krJ6nj5l5
$$ 7 1 -6 -21 -9 10 -21 -2 2 -1 -14 -44 -1 13 5 -37 -22 -25 3 16 -20 29 -24 1 24 12 20 20 -13 1 2 25 23 14 30 25 10 -25
6217b5M0k8L7jm6K4L1J%l7rJ0KlJ3nl7L5J7j1l7K0PJ1MMk1K0k2klK1rRj8lMj3
$$ -25 15 -13 24 23 -23 1 32 33 33 -4 -13 -3 -1 -4 9 4 -33 2 19 8 -29 -9 -2 9 13 17 -4 16 -6 -8 -11 10 1 10 -8 -11 -7 -20
6255b0L0m1J6oK6K1k1J1j9K4j5Oj5J1J%J5J2k8Nnj2K7jNj6nK8k0okKMk9kM3l1
$$ -20 10 -31 -15 -21 5 26 5 16 -3 21 6 12 -3 8 9 9 24 36 8 13 8 -4 23 22 27 11 6 34 14 8 6 8 12 -17 -19 24 -7
6292grJ0K9k5NlOj8j5L7k6K0Mj4M9j6l9Pj1J8J2k1k0M5m6K1K6k5qJ3Rk0qL5pK
$$ -7 -16 -6 23 -2 3 0 6 -12 -27 10 -16 4 8 -6 43 27 -12 -5 -16 2 14 -7 -27 18 -28 -7 19 -6 -14 -1 8 -12 -20 15 8 10
6328A0jK1l1J3j4J8J7k3J0k6OjK0lj5lM8k9k2K3j3j9L0j8j6%J7j6J6%m2K6NQl2
$$ 10 9 30 -1 12 -2 16 33 10 20 -6 0 -1 19 16 1 -2 46 17 -5 18 5 -14 16 -2 -18 -18 -1 -17 -1 -1 -43 -17 -12 -4 -36
6363c6J8k6K5J4ljJ4L0l9MrK8k7J0pJ4j1j2QQnPNoJ2l7L9qk1M5j5lkLJ3n4K1n
$$ -36 -18 -44 -19 -5 -8 -9 5 35 -4 0 -9 19 -8 2 -5 9 -2 -14 -6 2 -3 4 9 3 15 -22 17 9 -12 33 18 15 13 16 29 -25 -4 -9
6401iL9l2J3K2k8j8J9mL3j4k8K2j2j5K4mj8j2oJ5j1kK0Oj2NjJ8J2l7J0Ok1J6k0
$$ -9 30 -2 11 33 5 -13 6 2 35 21 -7 15 3 -12 12 8 -10 -22 -28 -13 -24 -26 -6 0 -12 -7 -8 10 22 -15 -5 1 -20 -4 -24
6436b4K5r%oM0k2J4k7K2Nj1j4J1K2m7K4pJj7J0K5PJ6n9J6K7j9K2l0Rj8L3ok0p
$$ -24 1 -8 -8 -14 26 4 18 -9 13 18 7 -7 4 26 -21 3 -4 -3 -20 -10 15 22 38 -21 -5 22 3 25 -5 4 -14 19 13 -7 -14
$$ [...]
8190hj6
8191b4
##END NTUPLES=NMR FID
##END=
