##TITLE=1H_AM A514
 CDCl3, 8 sc, 
 1.8.2019
##JCAMPDX= 6.0         $$ Bruker NMR JCAMP-DX V2.0
##DATA TYPE= NMR FID
##DATA CLASS= NTUPLES
##ORIGIN= UXNMR, Bruker Analytische Messtechnik GmbH
##OWNER= root
$$ XWIN-NMR		Version 3.5
$$ Thu Aug  1 15:33:51 2019 Russian Standard Time (UT+4h)  she@DPX200
##.OBSERVE FREQUENCY= 200.13155
##.OBSERVE NUCLEUS= ^1H
##.DELAY= (6, 6)
##.ACQUISITION MODE= SIMULTANEOUS
##.ACQUISITION SCHEME= undefined
##.AVERAGES= 8
##.DIGITISER RES= 18
##SPECTROMETER/DATA SYSTEM= spect
##.PULSE SEQUENCE= zg30
##.SOLVENT NAME= DMSO
##.SHIFT REFERENCE= (INTERNAL, DMSO, 0, 15.7039)
##AUDIT TRAIL= $$ (NUMBER, WHEN, WHO, WHERE, WHAT)
$$ ##TITLE= Audit trail, XWIN-NMR		Version 3.5
$$ ##JCAMPDX= 5.01
$$ ##ORIGIN= Bruker BioSpin GmbH
$$ ##OWNER= she
$$ F:/spectra/data/she/nmr/H-F/1/audita.txt
$$ ##AUDIT TRAIL=  $$ (NUMBER, WHEN, WHO, WHERE, WHAT)
(   1,<2019-08-01 15:32:54.21 +0400>,<she>,<DPX200>,
      <created by zg, POWCHK disabled, PULCHK disabled
       configuration hash MD5:
       00 E9 B6 7A A2 85 ED C7 34 08 36 98 17 FE 4E 26
       data hash MD5: 16K
       88 4D 5F 13 41 2A F3 34 E7 5A 00 91 ED F9 A1 89>)
$$ ##END=
$$ 
$$ hash MD5
$$ D0 9C 6A AD 0F 43 80 32 24 B7 B6 B0 98 C3 66 BA
##$RELAX= 
##$RELAX= 
##$RELAX= 
##$RELAX= 
##$RELAX= 
##$RELAX= 
$$ Bruker specific parameters
$$ --------------------------
##$DU= <F:/spectra>
##$EXPNO= 1
##$NAME= <H-F>
##$PROCNO= 1
##$TYPE= <nmr>
##$USER= <she>
##$AMP= (0..31)
100 100 100 100 100 100 100 100 100 100 100 100 100 100 100 100 100 100 
100 100 100 100 100 100 100 100 100 100 100 100 100 100 
##$AQSEQ= 0
##$AQ_mod= 1
##$AUNM= <au_zg>
##$AUTOPOS= <>
##$BF1= 200.13
##$BF2= 200.13
##$BF3= 200.13
##$BF4= 200.13
##$BF5= 200.13
##$BF6= 200.13
##$BF7= 200.13
##$BF8= 200.13
##$BYTORDA= 1
##$CFDGTYP= 0
##$CFRGTYP= 5
##$CHEMSTR= <none>
##$CNST= (0..31)
1 1 145 1 1 1 1 1 1 1 1 1 1 1 1 1 1 1 1 1 1 1 1 1 1 1 1 1 1 1 1 1 
##$CPDPRG= <>
##$CPDPRG1= <>
##$CPDPRG2= <>
##$CPDPRG3= <>
##$CPDPRG4= <mlev>
##$CPDPRG5= <mlev>
##$CPDPRG6= <mlev>
##$CPDPRG7= <mlev>
##$CPDPRG8= <mlev>
##$CPDPRGB= <>
##$CPDPRGT= <>
##$D= (0..31)
0 1.2 0 0 0 0 0 0 0 0 0 0.03 0 0 0 0 0 0 0 0 0 0 0 0 0 0 0 0 0 0 0 0 
##$DATE= 1564659173
##$DBL= (0..7)
120 120 120 120 120 120 120 120 
##$DBP= (0..7)
150 150 150 150 150 150 150 150 
##$DBP07= 0
##$DBPNAM0= <>
##$DBPNAM1= <>
##$DBPNAM2= <>
##$DBPNAM3= <>
##$DBPNAM4= <>
##$DBPNAM5= <>
##$DBPNAM6= <>
##$DBPNAM7= <>
##$DBPOAL= (0..7)
0.5 0.5 0.5 0.5 0.5 0.5 0.5 0.5 
##$DBPOFFS= (0..7)
0 0 0 0 0 0 0 0 
##$DE= 6
##$DECBNUC= <off>
##$DECIM= 24
##$DECNUC= <off>
##$DECSTAT= 4
##$DIGMOD= 1
##$DIGTYP= 9
##$DL= (0..7)
0 120 120 120 120 120 120 120 
##$DP= (0..7)
150 150 150 150 150 150 150 150 
##$DP07= 0
##$DPNAME0= <>
##$DPNAME1= <>
##$DPNAME2= <>
##$DPNAME3= <>
##$DPNAME4= <>
##$DPNAME5= <>
##$DPNAME6= <>
##$DPNAME7= <>
##$DPOAL= (0..7)
0.5 0.5 0.5 0.5 0.5 0.5 0.5 0.5 
##$DPOFFS= (0..7)
0 0 0 0 0 0 0 0 
##$DQDMODE= 0
##$DR= 18
##$DS= 0
##$DSLIST= <SSSSSSSSSSSSSSS>
##$DSPFIRM= 0
$$ [...]
##$SUBNAM2= <"">
##$SUBNAM3= <"">
##$SUBNAM4= <"">
##$SUBNAM5= <"">
##$SUBNAM6= <"">
##$SUBNAM7= <"">
##$SUBNAM8= <"">
##$SUBNAM9= <"">
##$SW= 24.9336996594482
##$SWIBOX= (0..15)
0 0 2 0 0 0 0 0 0 0 0 0 0 0 0 0 
##$SW_h= 4990.01996007984
##$TD= 16384
##$TD0= 1
##$TE= 0
##$TE2= 300
##$TE3= 300
##$TEG= 300
##$TL= (0..7)
0 120 120 120 120 120 120 120 
##$TP= (0..7)
150 150 150 150 150 150 150 150 
##$TP07= 0
##$TPNAME0= <>
##$TPNAME1= <>
##$TPNAME2= <>
##$TPNAME3= <>
##$TPNAME4= <>
##$TPNAME5= <>
##$TPNAME6= <>
##$TPNAME7= <>
##$TPOAL= (0..7)
0.5 0.5 0.5 0.5 0.5 0.5 0.5 0.5 
##$TPOFFS= (0..7)
0 0 0 0 0 0 0 0 
##$TUNHIN= 0
##$TUNHOUT= 0
##$TUNXOUT= 0
##$USERA1= <user>
##$USERA2= <user>
##$USERA3= <user>
##$USERA4= <user>
##$USERA5= <user>
##$V9= 5
##$VALIST= <valist>
##$VCLIST= <CCCCCCCCCCCCCCC>
##$VD= 0
##$VDLIST= <DDDDDDDDDDDDDDD>
##$VPLIST= <PPPPPPPPPPPPPPP>
##$VTLIST= <TTTTTTTTTTTTTTT>
##$WBST= 1024
##$WBSW= 4
##$XGAIN= (0..3)
0 0 0 0 
##$XL= 0
##$YL= 0
##$YMAX_a= 162090
##$YMIN_a= -176379
##$ZGOPTNS= <>
##$ZL1= 120
##$ZL2= 120
##$ZL3= 120
##$ZL4= 120
##$ABSF1= 10
##$ABSF2= 0
##$ABSG= 5
##$ABSL= 3
##$ALPHA= 0
##$AQORDER= 0
##$ASSFAC= 0
##$ASSFACI= 0
##$ASSFACX= 0
##$ASSWID= 0
##$AUNMP= <proc_1d>
##$AZFE= 0.1
##$AZFW= 0.1
##$BCFW= 1
##$BC_mod= 2
##$BYTORDP= 1
##$COROFFS= 0
##$CY= 11.3945322036743
##$DATMOD= 1
##$DC= 2
##$DFILT= <>
##$DTYPP= 0
##$F1P= 20.1537800932815
##$F2P= 0.134698688090026
##$FCOR= 0.5
##$FTSIZE= 0
##$FT_mod= 4
##$GAMMA= 1
##$GB= 0.15
##$INTBC= 1
##$INTSCL= 1
##$ISEN= 128
##$LB= 0.24
##$LEV0= 0
##$LPBIN= 0
##$MAXI= 10000
##$MC2= 0
##$MEAN= 0
##$ME_mod= 0
##$MI= 1.114404
##$NCOEF= 0
##$NC_proc= 0
##$NLEV= 6
##$NOISF1= 3.799351
##$NOISF2= 2.8
##$NSP= 1
##$NTH_PI= 0
##$NZP= 0
##$OFFSET= 15.70392
##$PC= 1
##$PHC0= -8863.04
##$PHC1= 16.20097
##$PH_mod= 1
##$PKNL= yes
##$PPARMOD= 0
##$PSCAL= 0
##$PSIGN= 0
##$REVERSE= no
##$SF= 200.130013532006
##$SI= 16384
##$SIGF1= 3
##$SIGF2= 2
##$SINO= 400
##$SIOLD= 16384
##$SREGLST= <1H.CDCl3>
##$SSB= 0
##$STSI= 0
##$STSR= 0
##$SW_p= 3612.71676300578
##$SYMM= 0
##$S_DEV= 0
##$TDeff= 0
##$TDoff= 0
##$TI= <>
##$TILT= no
##$TM1= 0
##$TM2= 0
##$TOPLEV= 0
##$USERP1= <user>
##$USERP2= <user>
##$USERP3= <user>
##$USERP4= <user>
##$USERP5= <user>
##$WDW= 1
##$XDIM= 8192
##$YMAX_p= 0
##$YMIN_p= 0
$$ End of Bruker specific parameters
$$ ---------------------------------
##NTUPLES= NMR FID
##VAR_NAME=  TIME,          FID/REAL,        FID/IMAG
##SYMBOL=    X,             R,               I
##VAR_TYPE=  INDEPENDENT,   DEPENDENT,       DEPENDENT
##VAR_FORM=  AFFN,          ASDF,            ASDF
##VAR_DIM=   8192,          8192,            8192
##UNITS=     SECONDS,       ARBITRARY UNITS, ARBITRARY UNITS
##FACTOR=    0.0002004,     1,               1
##FIRST=     0,             0,               0
##LAST=      1.6414764,     0,               0
##MIN=       0,             -176379,         0
##MAX=       1.6414764,     162090,          0
$$ Real data points
##PAGE= N=1
##DATA TABLE= (X++(R..R)), XYDATA
$$ plain form
0 0 0 0 0 0 0 0 0 -7 8 -8 8 -9 16 -16 24 -24 32 -39 44 -50 60 -71 81 -93 108 -125 141 -161 182 -204 232
31 232 -261 293 -328 365 -408 453 -503 558 -620 685 -758 839 -930 1029 -1145 1270 -1416
48 -1416 1581 -1775 2002 -2273 2608 -3027 3574 -4322 5408 -7149 10382 -18509 85482 106048
62 106048 -11560 64765 151828 162090 72416 35409 65793 119459 106332 57409 27066 64015
74 64015 103624 82734 8347 -11886 49003 106176 61620 -33317 -59128 18273 84615 45840
86 45840 -53407 -83509 -16409 45025 8873 -72518 -87201 -25335 7362 -44453 -104624 -82739
98 -82739 -15706 -11468 -86797 -139152 -96617 -18890 -13978 -89502 -149276 -120331 -43537 -18574 -78295
111 -78295 -143405 -124773 -49801 -27188 -87761 -136053 -96664 -31946 -42705 -109978 -125964 -59256
$$ packed form
0@%%%%%%%pJ5j6J6j7K5l2M0m8N6p1Q3r4J10j31J52j74K01k33K66l02L43l86M36
31B32m93N54o21O93p73Q61r56J061j178J305j443J597j769J959k174K415k686
48a416K997l356L777m275M881n635O601p896R730j2557J7531k8891J03991K0566
62A06048j17608P6325Q7063J0262q9674l7007L0384N3666j3127m8923l0343L6949
74F4015L9609k0890p4387k0233O0889N7173m4556r4937k5811P7401O6342l8775
86D5840r9247l0102O7100O1434l6152q1391j4683O1866L2697n1815o0171K1885
98h2739O7033M238p5329n2355M2535P7727M912p5524n9774K8945P6794K4963n9721
111g8295o5110J8632P4972K2613o0573m8292L9389O4718j0759o7273j5986O6708
$$ plain form
123 -59256 -2296 -36540 -115209 -124951 -43588 24538 -10177 -95785 -109757 -31545 31668 3264
135 3264 -62170 -67474 -10835 28835 6525 -35760 -30153 23163 52344 12814 -39131 -16904 64646
148 64646 94137 24089 -44415 -6489 90955 112322 35007 -24844 14218 91469 101863 44876
160 44876 7617 37982 86152 83358 37490 16793 55666 100621 80976 15325 -4741 56067
172 56067 114286 82983 -501 -23414 41753 102236 73917 -3359 -28001 24316 73309 47337
184 47337 -15269 -24368 27348 52709 5149 -47198 -25567 36699 42789 -22846 -72861 -41399
196 -41399 26139 38090 -24275 -82893 -64295 4409 29528 -22892 -80161 -64005 -3915 8217
208 8217 -42536 -76976 -40926 9682 -4859 -66544 -82923 -24581 28584 -88 -73389 -88074
$$ packed form
123e9256N6960l4244p8669r742Q1363O8126l4715q5608j3972P8212O3213k8404
135C264o5434n304N6639L9670k2310m2285N607N3316K9181l9530n1945K2227Q1550
148F4646K9491p0048o8504L7926R7444K1367p7315n9851L9062P7251J0394n6987
160D4876l7259L0365M8170k794m5868k0697L8873M4955j9645o5651k0066O0808
172E6067N8219l1303q3484k2913O5167O0483k8319p7276k4642N2317M8993k5972
184D7337o2606r099N1716K5361m7560n2347K1631O2266O090o5635n0015L1462
196d1399O7538J1951o2365n8618J8598O8704K5119n2420n7269J6156O0090J2132
208H217n0753l4440L6050N0608j4541o1685j6379N8342N3165k8672p3301j4685
$$ plain form
220 -88074 -21107 37566 10718 -60987 -77662 -20207 30070 10715 -41924 -50168 -5790 25611
232 25611 2104 -37884 -30938 19168 42140 -146 -49663 -28255 43845 67207 5814 -53837
244 -53837 -25099 52855 71905 13970 -34421 -8667 47494 57450 15524 -13663 11108 51976
256 51976 49158 5766 -13762 25580 70144 51734 -9491 -26556 29031 81981 58241 -10749
268 -10749 -31889 19777 72511 55228 -4581 -24374 18089 57444 34937 -14150 -15406 31320
280 31320 51723 8978 -35625 -16020 41080 51274 -3466 -50745 -29061 31200 47935 -1389
292 -1389 -53082 -41084 15196 36386 -6449 -51546 -36621 11007 17977 -27379 -53731 -20668
304 -20668 21394 5753 -49002 -63879 -14730 32633 10715 -52178 -70862 -19645 31448 14867
$$ packed form
220h8074O6967N8673k6848p1705j6675N7455N0277j9355n2639q244M4378L1401
232B5611k3507l9988O946N0106K2972m2286m9517K1408P2100K3362o1393n9651
244e3837K8738P7954J9050n7935m8391K5754N6161R956m1926k9187K4771M0868
256E1976k818m3392j9528L9342M4564j8410o1225j7065N5587N2950k3740o8990
268a0749k1140N1666N2734j7283n9809j9793M2463L9355k2507m9087j256M6726
280C1320K0403m2745m4603J9605N7100J0194n4740m7279K1684O0261J6735m9324
292a389n1693J1998N6280K1190m2835m5097J4925M7628O970m5356k6352L3063
304b0668M2062j5641n4755j4877M9149M7363k1918o2893j8684N1217N1093j6581
$$ plain form
316 14867 -42228 -60362 -17944 22073 7426 -34587 -41525 -4888 20360 -2189 -38525 -30823
328 -30823 14617 34634 -4379 -50403 -33298 28463 50497 997 -50312 -32041 28399 48021
340 48021 5627 -35323 -20138 24076 34011 645 -24049 -3615 31866 27693 -13799 -31557
352 -31557 4740 47286 32612 -22924 -42135 2681 51072 36533 -19465 -41252 -1875 41990
364 41990 31973 -15115 -31223 3384 35525 16344 -23458 -21189 20800 38460 2011 -36935
376 -36935 -20336 31034 45464 2918 -40199 -26863 25323 46991 11150 -32803 -26636 19430
388 19430 39225 6587 -27701 -13073 25999 28578 -9501 -29355 759 37978 25531 -21533
400 -21533 -37539 1746 44005 30960 -20918 -42555 -4663 38760 30095 -16062 -34422 -3797
$$ packed form
316A4867n7095j8134M2418M0017j4647m2013o938L6637K5248k2549l6336P702
328c0823M5440K0017l9013m6024J7105O1761K2034m9500n1309J8271O0440J9622
340D8021m2394m0950J5185M4214R935l3366k4694K0434L5481m173m1492j7758
352c1557L6297M2546j4674n5536j9211M4816M8391j4539n5998k1787L9377M3865
364D1990j0017m7088j6108L4607L2141j9181l9802K269M1989J7660l6449l8946
376c6935J6599N1370J4430m2546m3117J3336N2186K1668l5841m3953O167M6066
388A9430J9795l2638l4288J4628L9072K579l8079j9854L0114L7219j2447m7064
400b1533j6006L9285M2259j3045n1878k1637L7892M3423q665m6157j8360L0625
$$ plain form
412 -3797 28044 16431 -18165 -23507 6710 26464 3878 -29878 -24527 17285 36032 1327 -41799
425 -41799 -31830 20096 41923 3313 -41412 -31600 15746 33465 1822 -31615 -21534 13293
437 13293 20947 -7356 -28852 -9476 22505 18436 -20135 -37546 -4955 34206 24153 -24286
449 -24286 -44682 -9089 33958 26775 -18469 -39990 -10774 25586 19089 -17733 -29937 -1125
461 -1125 23738 5709 -27309 -23917 12720 29086 -1657 -36736 -25876 18434 36038 3274
473 3274 -35980 -29983 12971 35917 9386 -27969 -24615 12187 28037 2708 -22661 -8869 22833
486 22833 23220 -9717 -25403 1297 34790 27242 -13131 -30858 -96 39303 34306 -8845 -30118
499 -30118 -2036 35195 30447 -5372 -20504 3650 28715 18380 -10349 -13665 13415 29979
$$ packed form
412c797L1841j1613l4596n342L0217J9754k2586l3756N351M1812J8747l4705m3126
425d1799R969N1926K1827l8610m4725R812M7346J7719l1643l3437J0081L4827
437A3293P654k8303k1496J9376L1981m069l8571j7411L2591L9161j0053m8439
449b4286k0396L5593M3047p183m5244k1521K9216L6360o497l6822j2204K8812
461a125K4863j8029l3018L392L6637J6366l0743l5079J0860M4310J7604l2764
473C274l9254N997M2954K2946k6531l7355L354L6802J5850k5329k5369J3792L1702
486B2833L87l2937j5686K6700L3493p548m0373j7727L0762L9399m997m3151k1273
499c0118K8082L7231m748l5819j5132K4154K5065j0335k8729l316K7080J6564
$$ plain form
511 29979 9284 -22711 -18794 18842 38181 8393 -32149 -27854 15332 37361 8031 -31017
523 -31017 -26878 9241 24543 353 -26294 -18830 8901 13809 -11770 -30607 -13248 16781 13657
536 13657 -21514 -40554 -13489 23345 18503 -22634 -43759 -16876 20178 18551 -17154 -36174
548 -36174 -14372 14938 10592 -17696 -26023 -1413 18170 2244 -25557 -22404 10824 27577 2675
561 2675 -29949 -24590 13086 33439 10362 -24744 -24185 10845 31872 12143 -17821 -15151 13719
574 13719 25954 4063 -15482 -2775 23820 23909 -5069 -20760 1211 32979 29819 -6454 -27063
587 -27063 -2938 33566 33352 -2766 -23699 -3119 27789 25521 -2732 -14556 4318 24423 14789
600 14789 -9936 -12923 12516 28797 10550 -20070 -19361 14449 34806 11309 -25262 -24934 10632
$$ packed form
511B9979k0695l1995L917L7636J9339k9788m0542M295M3186K2029k9330l9048
523c1017M139L6119J5302k4190k6647P464K7731M908k5579j8837J7359L0029l124
536A3657l5171j9040K7065L6834m842m1137k1125K6883L7054j627l5705j9020
548c6174K1802K9310m346k8288q327K4610J9583j5926k7801L153L3228J6753k4902
561B675l2624N359L7676K0353k3077l5106N59L5030K1027j9729k9964K670K8870
574A3719J2235k1891j9545J2707K6595Q9k8978j5691K1971L1768l160l6273k0609
587b7063K4125L6504k14l6118k0933K0580L0908k268k8253j1824J8874K0105r634
600A4789k4725k987K5439J6281j8247l0620P09L3810K0357k3497l6571L28L5566
$$ plain form
613 10632 31201 9831 -22146 -21212 6266 19162 1246 -19933 -13706 8585 12168 -10767 -27493
626 -27493 -11842 16008 15019 -17138 -37123 -15657 17847 17759 -16256 -37228 -18330 12877 13365
639 13365 -13784 -30005 -13806 9699 5773 -17033 -23163 -2066 14933 1413 -24038 -22666 7482
652 7482 25134 5549 -25069 -23719 8614 30137 13179 -17220 -18924 9193 27900 13712 -9636
665 -9636 -6859 17023 25874 7143 -8906 3689 28416 29364 3069 -13434 5033 35263 35759
678 35759 4655 -15666 2569 34262 36121 6496 -11723 3764 27973 26447 3806 -6009 9576
691 9576 25180 15636 -7331 -10059 12742 28798 12291 -17830 -20335 8932 29216 10557 -21885
704 -21885 -25033 2569 20166 4282 -20867 -21872 -1216 8261 -6313 -23390 -18674 906 4598
$$ packed form
613A0632K0569k1370l1977R34K7478J2896j7916k1179O227K2291L583k2935j6726
626b7493J5651K7850r89l2157j9985K1466L3504q8l4015k0972J8898L1207M88
639A3365k7149j6221J6199K3505l926k2806o130K1097J6999j3520k5451J372L0148
652G482J7652j9585l0618J350L2333K1523j6958l0399j704K8117J8707j4188k3348
665i636K777K3882Q851j8731j6049J2595K4727R48k6295j6503J8467L0230M96
678C5759l1104k0321J8235L1693J859k9625j8219J5487K4209j526k2641r815J5585
691I576J5604r544k2967k728K2801J6056j6507l0121k505K9267K0284j8659l2442
704b1885l148K7602J7597j5884k5149j005K0656R477j4574j7077M716J9580L692
$$ plain form
717 4598 -16294 -33478 -20527 5699 7083 -21408 -41164 -24663 5148 7372 -20008 -39054 -26227
730 -26227 -1262 1375 -19369 -32314 -19909 -2098 -5357 -25259 -30270 -10841 5390 -6373 -30886
743 -30886 -31590 -5238 12744 -1884 -29478 -31589 -4814 15507 3587 -21576 -24585 -2349 13691
756 13691 2743 -15671 -12376 7804 15119 -1049 -15385 -3909 19923 22849 -593 -16707 -1642
769 -1642 26872 31009 5931 -13255 210 27141 31542 10398 -4021 7700 27087 26729 8889
782 8889 2177 15874 30846 23391 3304 25 20857 37480 24663 -2483 -6180 18857 38129
795 38129 24321 -2192 -6569 13926 29221 17965 -1058 -2794 12523 20579 8240 -7552 -2941
808 -2941 15357 18566 -1151 -18193 -7729 16500 18872 -5670 -24802 -13300 11064 14827 -6913
$$ packed form
717D598k0892j7184J2951K6226J384k8491j9756J6501K9811K224k7380j9046J2827
730b6227K4965K637k0744j2945J2405J7811l259j9902n011J9429J6231j1763k4513
743c0886p04K6352J7982j4628k7594k111K6775K0321j1920k5163l009K2236J6040
756A3691j0948j8414L295K0180P315j6168j4336J1476K3832K926k3442j6114J5065
769a642K8514M137k5078j9186J3465K6931M401k1144j4419J1721J9387l58j7840
782H889o712J3697J4972p455k0087l279K0832J6623j2817k7146l697K5037J9272
795C8129j3808k6513m377K0495J5295j1256j9023j736J5317Q056j2339j5792M611
808b941J8298L209j9717j7042J0464K4229K372k4542j9132J1502K4364L763k1740
$$ plain form
821 -6913 -23466 -14820 4766 7361 -9779 -21199 -11077 4035 258 -17817 -22780 -5033 9996
834 9996 -894 -24286 -27291 -4523 13520 2120 -22737 -27201 -6752 10513 2306 -17779 -21890
847 -21890 -4620 7858 -1351 -17379 -14675 2697 8815 -6108 -20383 -11178 10130 14061 -5941
860 -5941 -22546 -12118 12287 17737 -2302 -19453 -10683 10724 15878 -223 -12392 -4147 11348
873 11348 11173 -3310 -9257 3323 17281 11372 -8008 -12590 6531 23527 14563 -8951 -14161
886 -14161 6180 23404 14927 -5911 -10824 5408 18457 11602 -3533 -5245 8373 15618 4914
899 4914 -8662 -3879 13908 18311 898 -15793 -6856 15332 20048 168 -16829 -9322 10947
912 10947 16140 72 -14217 -8725 7048 9504 -4499 -13830 -4713 8983 5189 -12196 -17439
$$ packed form
821f913j6553Q646J9586K595j7140j1420J0122J5112l777j8075m963J7747J5029
834I996j0890k3392l005K2768J8043j1400k4857m464K0449J7265q207k0085m111
847b1890J7270J2478r209j6028K704J7372O118j4923j4275R205K1308L931k0002
860e941j6605J0428K4405N450k0039j7151Q770K1407N154j6101j2169Q245J5495
873A1348j75j4483n947J2580J3958n909j9380m582J9121J6996q964k3514n210
886a4161K0341J7224q477k0838m913J6232J3049o855j5135j712J3618P245j0704
899D914j3576M783J7787M403j7413j6691Q937K2188M716j9880j6997P507K0269
912A0947N193j6068j4289N492J5773K456j4003r331R117J3696l794j7385n243
$$ plain form
925 -17439 -1672 12976 4373 -16178 -21074 -2950 13488 5948 -14580 -20420 -5178 9931 4826
938 4826 -11348 -15285 -1979 7627 -164 -13094 -10678 4903 10255 -3485 -16916 -9933 9465
951 9465 14903 -2120 -17655 -10795 9632 15937 940 -13829 -8491 7858 12672 371 -9359
964 -9359 -3144 9630 9005 -4295 -9848 1834 14680 9077 -8417 -13364 2631 18257 11921 -8541
978 -8541 -14599 766 15962 11019 -5708 -10611 1232 11656 6249 -6039 -7224 5359 11844
991 11844 2175 -10966 -6607 10305 15081 218 -14783 -8111 11000 16484 1735 -12990 -8314
1004 -8314 8189 13959 2351 -9313 -5072 7973 9993 -1919 -9465 -297 12058 8449 -7059
1017 -7059 -11985 1819 15109 9410 -8356 -13986 -262 13974 10021 -6445 -12824 -1310 10841
$$ packed form
925a7439J5767J4648q603k0551m896J8124J6438p540k0528n840J5242J5109n105
938D826j6174l937J3306R606p791j2930K416J5581N352j3740j3431O983J9398
951I465N438j7023j5535O860K0427O305j4997j4769N338J6349M814j2301r730
964i359O215J2774o25j3300n553J1682J2846n603j7494m947J5995J5626o336k0462
978h541o058J5365J5196m943j6727m903J1843J0424n407j2288j185J2583O485
991A1844r669j3141M359J6912M776j4863j5001O672J9111N484j4749j4725M676
1004h314J6503N770j1608j1664M241J3045K020j1912p546R168J2355l609j5508
1017g059m926J3804J3290n699j7766n630J3724J4236l953j6466o379J1514J2151
$$ plain form
1030 10841 6945 -5713 -9475 1276 8966 1654 -9362 -7134 6029 10871 -1210 -13730 -8748
1043 -8748 7755 13506 150 -14102 -10455 5766 12515 1209 -11252 -8048 4994 8536 -1397
1056 -1397 -9641 -3285 7785 6334 -5880 -10911 -573 11877 7414 -8184 -13692 -1024 13001
1069 13001 9003 -7556 -13617 -2405 10321 7290 -5722 -9849 -515 8164 2685 -7503 -7462 3583
1083 3583 8978 -545 -12433 -8330 6527 11582 -881 -14090 -10169 5513 11215 371 -12080
1096 -12080 -9409 3484 8616 -428 -9637 -5624 4920 6099 -4403 -10236 -1587 9045 5981 -7536
1110 -7536 -11869 -151 12030 8220 -6189 -11947 -1714 10715 9045 -3492 -9259 -515 9226
1123 9226 6537 -4335 -5589 3970 9748 2416 -6980 -4228 7625 12233 1726 -9683 -6404 7714
$$ packed form
1030A0841l896j2658l762J0751P690p312j1016K228J3163M842j2081j2520M982
1043h748J6503N751j3356j4252L647J6221O749j1306j2461L204J3042L542r933
1056a397q244O356J1070j451j2214n031J0338J2450m463j5598n508J2668J4025
1069A3001l998j6559o061J1212J2726l031j3012m127R334Q679n479j0188M1J1045
1083C583N395r523j1888M103J4857N055j2463j3209L921J5682N702j0844j2451
1096a2080K671J2893N132r044r209M013J0544J179j0502n833Q649J0632l064j3517
1110g536m333J1718J2181l810j4409n758J0233J2429j670j2537n767Q744R741
1123I226k689j0872j254R559N778p332r396K752J1853M608j0507j1409L279J4118
$$ plain form
1137 7714 13629 3167 -9135 -7252 5870 11525 2370 -7520 -4734 5390 7779 -1174 -7333 -1024
1151 -1024 8034 6022 -5339 -9754 -189 10604 7370 -6429 -11901 -1546 10313 7630 -5113
1164 -5113 -10698 -1789 8162 5839 -4237 -7779 585 7410 2547 -6488 -5718 4458 9079 534 -9813
1179 -9813 -6568 6340 11213 1266 -10070 -7728 4888 10407 2164 -7847 -6078 3944 7678 296
1193 296 -6571 -2784 5920 5549 -3543 -8138 -380 8825 6161 -5749 -10303 -1465 9551 6954 -4954
1208 -4954 -10455 -2537 7765 6268 -3408 -7981 -921 6402 3165 -5023 -5467 2798 7386 657 -7975
1223 -7975 -5849 5492 9632 1111 -9173 -6805 4864 10344 2031 -7912 -6415 3967 8249 940
1237 940 -6107 -3230 4565 5638 -2027 -6235 -666 7008 5390 -4616 -8779 -598 9013 6816 -4893
$$ packed form
1137G714N915j0462j2302J883J3122N655r155r890K786J0124K389q953o159O309
1151a024R058k012j1361m415R565J0793l234j3799n472J0355J1859k683j2743
1164e113n585Q909R951k323j0076l542Q364O825m863r035P70J0176M621q545j0347
1179i813L245J2908M873r947j1336K342J2616N519q243j0011J769J0022L734p382
1193B96o867L787Q704l71r092m595P758R205k664j1910m554Q838J1016k597j1908
1208d954n501P918J0302j497r676m573P060P323l237q188m44Q265M588o729q632
1223g975K126J1341M140q521j0284K368J1669N480q313r943J497J0382M282p309
1237I40p047K877P795J073p665m208N569P674j618j0006m163Q181R611k197j1709
$$ plain form
1252 -4893 -9952 -2244 7746 6186 -3722 -8408 -1935 5500 3272 -4444 -6045 227 5071 475 -6825
1267 -6825 -5840 3281 7312 -189 -8607 -6789 3774 8715 890 -8587 -6867 2795 7547 952 -6315
1282 -6315 -5235 2923 5073 -321 -5517 -1686 5612 4938 -3383 -7031 -21 8019 6118 -3838 -8094
1297 -8094 -799 8072 7001 -2912 -7300 -1080 7070 5255 -2618 -5124 507 5713 2127 -4613 -4108
1312 -4108 3164 6330 301 -7086 -5263 3975 8074 867 -7955 -6907 2622 7449 1003 -6631 -5480
1327 -5480 2192 5066 -652 -5478 -2906 3203 3405 -2846 -6714 -1374 5549 4271 -4407 -8416 -1544
1342 -1544 6791 5032 -3960 -7933 -2168 5631 4519 -2689 -5916 -716 4257 2227 -3522 -3998 1500
1357 1500 4852 739 -5687 -4082 3732 7151 868 -6970 -5415 3529 7309 1489 -5927 -4670 2844
$$ packed form
1252d893n059P708R990j560r908m686O473P435k228p716j601O272M844m596p300
1267f825R85R121M031p501q418J818J0563M941p825r477J720R662M752o595p267
1282f315J080Q158K150n394n196L831P298o74q321l648P010Q040j901r956m256
1297h094P295Q871j071r913m388O220Q150j815p873k506N631N206l586o740N05
1312d108P272L166o029p387J823R238M099p207q822J048R529M827o446p634J151
1327e480P672K874n718m826K572O109K02o251l868N340O923j278q678m009O872
1342a544Q335j759q992l973N765P799j112p208l227N200M973k030n749m76N498
1357A500L352m113o426J605P814L419o283p838J555Q944L780n820p416J257P514
$$ plain form
1372 2844 6163 1334 -4537 -2537 3439 4686 -520 -4434 -479 5870 4796 -2300 -5489 321 7952
1387 7952 6203 -2412 -5958 -74 7497 6539 -997 -4292 294 6220 4544 -1043 -2473 2362 5923
1402 5923 2875 -2856 -2251 4447 7316 1665 -4842 -3025 4478 8124 2335 -4969 -3809 3296 6908
1417 6908 2162 -4056 -2784 2593 4272 165 -4126 -1459 3368 3110 -2785 -5566 -1216 4537 3690
1432 3690 -4031 -7614 -2034 4611 3565 -3720 -6937 -2751 3172 2105 -3395 -5504 -1254 2294 380
1447 380 -4471 -4696 547 3623 -802 -6090 -5032 1812 4880 -477 -6835 -5459 1743 4840 410
1462 410 -5602 -4570 1207 3425 -280 -4474 -2326 2392 2454 -2198 -4876 -1126 4387 3069 -3263 -6259
1478 -6259 -779 5082 3898 -3029 -5932 -1327 4383 3525 -2012 -4129 -603 3485 2237 -2216 -2859
$$ packed form
1372B844L319m829n871K000N976J247n206l914L955O349j074p096l189N810P631
1387G952j749q615l546N884P571r58p536l295M586N926j676n587j430M835L561
1402E923l048n731O05O698K869n651o507J817P503L646n789p304J160P105L612
1417F908m746o218J272N377J679m107m291K667M827k58n895k781M350N753q47
1432C690p721l583N580O645j046p285l217M186N923j067n500k109M250L548j914
1447C80m851k25N243L076m425n288J058O844L068n357o358J376P202L097m430
1462D10o012J032N777K218l705m194K148M718O2m652k678L750N513j318o332k996
1478f259N480N861j184o927k903M605N710q58n537k117L526M088j248m453o43
$$ plain form
1493 -2859 1064 4018 656 -3790 -2497 2990 5210 736 -4308 -3328 3293 5931 1526 -4054 -3011
1508 -3011 2412 5053 1118 -2915 -1636 2808 3782 -10 -2906 -24 4087 3461 -1960 -3936 -10
1523 -10 5344 3976 -2210 -4991 -329 4803 3377 -1982 -4184 -621 3262 2617 -1647 -3028 81 2761
1539 2761 530 -3626 -2667 1791 3757 -378 -5018 -3430 2161 4735 341 -4668 -3642 1874 4172
1554 4172 494 -3692 -2738 1404 3202 -282 -2843 -1037 2503 2293 -1464 -3409 172 4545 3015
1569 3015 -2262 -4333 201 4666 3866 -1445 -3463 -64 4219 3302 -948 -2542 515 3248 2024
1584 2024 -1662 -1607 2055 3780 730 -2966 -2047 2790 4864 572 -3688 -2648 2219 4242 1053 -3330
1600 -3330 -2511 1338 3465 252 -2562 -1270 1876 2247 -1245 -3099 -430 2957 2094 -2251 -3928 -112
$$ packed form
1493b859L923K954l362m446J293N487K220m474n044R80O621K638m405n580J043
1508c011N423K641l935m033J279M444R74l792k896K882M111o26n421j976L926
1523a0N354j368o186k781M662N132j426n359k202L563L883o45m264j381L109K680
1539B761k231m156R59M458J966m135m640J588N591K574m394n009J026N516K298
1554D172l678m186R54M142J798l484k561J806L540k10l757j945L581M373j530
1569C015n277k071M534M465q00n311k018L399M283r17m250j594L057K733j224
1584B024l686N5L662J725l050l696R19M837K074m292m260J040M867K023l189m383
1600c330Q19L849K127l213k814J292L146L71l492j854K669L387q63m345j677L816
$$ plain form
1616 -112 3758 2450 -2322 -4180 -886 2997 2463 -1646 -3336 -280 2562 1498 -1837 -2590 690 2594
1632 2594 221 -3312 -2305 1683 3349 -223 -3822 -2493 1483 3567 308 -3851 -2754 1096 2713
1647 2713 85 -2679 -2186 1155 1921 -992 -3024 -827 1906 1392 -2239 -3639 -408 2960 2113 -2335
1663 -2335 -4341 -530 3125 2235 -1538 -3396 -512 2191 1639 -1335 -2267 484 2225 478 -2032 -1616
1679 -1616 1770 2639 -75 -3035 -1663 2202 3604 396 -2999 -1745 1747 3164 839 -2399 -1555
1694 -1555 1770 2457 -39 -2063 -455 2145 1532 -1312 -2455 217 2475 1602 -2026 -3413 -8 2841
1710 2841 1782 -1821 -3319 -457 2503 1477 -1605 -2432 -108 1794 850 -1984 -1830 828 2082 2
1726 2 -2670 -1393 1937 3128 246 -2979 -1769 2038 2895 437 -2369 -1712 1447 2679 510 -1802
$$ packed form
1616a12L870j308m772j858L294L883n34m109j690L056K842j064l335p53L280J904
1632B594k373l533J007L988J666l572l599J329L976K084l259m159J097L850J617
1647B713k628k764M93L341P66k913k032K197K733n14l631j400L231L368q47m448
1663b335k006L811L655q90l773j858K884K703n52k974r32K751J741j747k510M16
1679a616L386Q69k714k960J372L865J402l208l395J254L492J417k325l238Q44
1694a555L325O87k496k024J608K600o13k844j143K672K258q73l628j387L405K849
1710B841j059l603j498K862K960j026l082q27K324J902r44k834J54K658J254k080
1726Bk672J277L330J191k882l225J210L807Q57k458k806O57L159J232k169k312
$$ plain form
1742 -1802 -448 1834 1760 -430 -1820 492 2568 1461 -1599 -2061 497 3271 2080 -1528 -2525 264
1758 264 2815 1987 -896 -2085 250 2151 1202 -1222 -1373 1161 1938 197 -1853 -995 2114 2805 -120
1775 -120 -2609 -1298 2386 2525 180 -2102 -1422 1791 2540 329 -2017 -543 1452 1787 -500 -1568
1791 -1568 48 2086 1161 -1472 -2021 265 2203 1093 -1831 -2425 509 2594 1276 -1591 -2455 -237
1807 -237 1754 1039 -1305 -2015 251 1490 -98 -1775 -1231 894 1268 -693 -2640 -1412 1218 1936
1823 1936 -899 -3038 -1935 1147 1691 -478 -2481 -1501 740 998 -790 -1850 -559 973 743 -1537
1839 -1537 -2113 308 1632 519 -2281 -2274 218 2303 1291 -1967 -2292 177 2131 966 -1253 -1701
1855 -1701 335 1773 408 -1358 -1111 1235 1869 -319 -1764 -471 1762 1829 -600 -2327 -1035 1770
$$ packed form
1742a802J354K282p4k190j390K312K076j107l060m62K558K774j191l608r97K789
1758B64K551q28k883j189K335J901r49k424j51K534P77j741k050Q58L109O91k925
1775a20k489J311L684J39k345k282O80L213P49k211k346J474J995L35k287j068
1791a568J616K038r25k633n49K286J938j110k924n94K934K085j318k867q64K218
1807b37J991p15k344p10K266J239j588j677N44K125L74j961j947J228K630P18
1823A936k835k139J103L082N44k169k003R80K241K58j788j060J291J532k30k280
1839a537n76K421J324j113k800PK492K085j012l258l25K469J954j165k219m48
1855a701K036J438j365j766K47K346O34k188j445J293K233O7k429j727J292K805
$$ plain form
1871 1770 2121 -61 -1874 -997 1442 1699 13 -1421 -327 1516 728 -769 -1371 334 1981 635
1887 635 -1528 -1537 754 2282 796 -1547 -1792 476 2361 1127 -1255 -1532 880 1869 901 -1131 -938
1904 -938 748 1147 136 -1314 -382 1416 1730 -348 -1735 -377 2260 2159 -291 -2156 -522 1626
1920 1626 1641 -307 -1720 -436 1310 1100 -840 -1555 31 1233 432 -1528 -1526 633 2053 548 -1874
1937 -1874 -1690 772 2105 737 -1617 -1832 199 1669 416 -1528 -1072 648 1437 16 -1432 -710
1953 -710 1111 1340 -719 -1961 -795 1876 1669 -594 -1862 -614 1685 1698 -390 -1841 -620 1622
1969 1622 1412 -616 -1773 -139 1422 514 -1040 -1037 614 1782 332 -1908 -1472 737 2038 221
1985 221 -2014 -1889 616 1883 706 -1222 -1562 559 1226 44 -1332 -769 1042 984 -875 -1772 -597
$$ packed form
1871A770L51k182j813Q77K439K57j686j434J094J843p88j497o02J705J647j346
1887F35k163rK291J528j486k343k45K268J885j234k382k77K412R89r68k032J93
1904i38J686L99j011j450R32J798L14k078j387J358K637j01k450j865J634K148
1920A626J5j948j413J284J746k10j940p15J586J202q01j960KK159J420j505k422
1937a874J84K462J333j368k354k15K031J470j253j944M56J720P89j421j448P22
1953g10J821K29k059j242J166K671k07k263j268J248K299J3k088j451J221K242
1969A622k10k028j157J634J561r08j554LJ651J168j450k240M36K209J301j817
1985B21k235J25K505J267j177j928l40K121O67j182j376N63J811n8j859q97J175
$$ plain form
2002 -597 1719 1265 -656 -1844 -614 1590 1529 -578 -1899 -397 1574 1522 -675 -1300 15 1425 593
2019 593 -953 -968 748 1632 509 -1237 -1316 650 2167 595 -1977 -1644 699 1786 446 -1750 -1393
2036 -1393 517 1485 316 -1488 -981 794 1049 -780 -1585 -456 1298 834 -1299 -2186 -527 1542
2052 1542 1420 -793 -2403 -855 1426 1052 -880 -1675 -589 1066 741 -1107 -1399 29 1142 154
2068 154 -1350 -1109 608 1956 -3 -1830 -1717 925 2101 55 -1566 -1543 625 2087 240 -1016
2084 -1016 -962 1063 1315 -81 -1413 -326 1345 1479 -719 -1755 9 2183 1843 -836 -1746 -63
2100 -63 2003 1314 -533 -1791 -125 1555 1274 -661 -1146 288 1601 958 -915 -684 1031 2198 434
2117 434 -1289 -943 1161 2348 655 -1444 -1224 1220 2200 711 -1364 -1238 1063 1691 217 -1075
$$ packed form
2002e97K316m54j921j188J230K204o1k107j321J502J971n2k197o25J315J410q32
2019E93j546j5J716Q84j123j746p9J966J517j572k572L33K343J087j340k196L57
2036a393J910R68j169j804N07J775K55j829q05J129J754m64k133q87J659K069
2052A542j22k213j610J548K281l74j932p95J086J655l25j848k92J428J113r88
2068A54j504K41J717J348j959j827J13K642J176k046j621K3K168J462j847j256
2084a016N4K025K52j396j332J087J671J34k198j036J764K174l40k679r10J683
2100f3K066o89j847j258J666J680k81j935m85J434J313o43j873K31J715J167j764
2117D34j723L46K104J187j693k099K20K444R80j489k075J26K301O28j474j292
$$ plain form
2133 -1075 -299 1204 1367 -334 -1276 144 1790 1310 -770 -2099 -387 1995 1322 -823 -2057 -392
2149 -392 1390 1099 -912 -1954 -334 1180 448 -991 -1255 213 1030 -231 -1938 -1684 874 1618 67
2166 67 -2434 -1545 639 1404 -170 -1974 -1717 523 1304 -140 -1480 -1006 768 886 -835 -1857 -518
2183 -518 1247 927 -1235 -1997 -227 1836 1155 -1084 -2066 -702 1597 1190 -1111 -1973 -245 1243 586
2200 586 -971 -1288 198 1058 -64 -1607 -1084 865 1887 -135 -2183 -1285 951 1880 -234 -2072
2216 -2072 -1443 815 1483 252 -1512 -1099 936 1231 -90 -1237 -80 1231 1068 -1030 -1446 563
2232 563 2111 1225 -1123 -1593 152 2527 1607 -486 -1108 100 1658 1375 -480 -760 439 1775 981
2249 981 -675 -902 1149 2043 415 -1494 -946 1586 2323 232 -1920 -1060 1383 2114 377 -1579 -1020
$$ packed form
2133a075P76J503J63j701r42J420J646m80k080j329J712K382o73k145j234J665
2149c92J782k91k011j042J620J514p32j439k64J468Q17j261j707K54K558P44j551
2166F7k501Q89K184P65j574j804K57K240P81j444j340M74J774J18j721j022J339
2183e18J765l20k162p62J770K063o81k239r82J364K299m07k301q62J728J488o57
2200E86j557l17J486Q60j122j543N23J949J022k022k048Q98K236R29k114j838
2216b072O29K258O68j231j764M13K035K95j321j147J157J311j63k098m16K009
2232E63J548q86k348m70J745K375r20k093o22J208J558k83j855k80J199J336p94
2249I81j656k27K051Q94j628j909N48K532P37k091k152Q60K443P31j737j956N59
$$ plain form
2266 -1020 1004 1921 90 -1369 -393 1229 1187 -912 -1551 3 1847 1292 -1156 -2057 139 1933 1135
2283 1135 -1216 -2102 -214 1756 1112 -934 -1461 -167 1111 565 -987 -954 383 1633 -107 -1972
2299 -1972 -1013 1176 1725 -143 -2295 -1683 1126 1782 -68 -1744 -1361 349 1380 -237 -1843 -1177
2315 -1177 769 573 -848 -1824 -501 1169 675 -1357 -2074 -331 1677 861 -1519 -2325 -385 1768
2331 1768 1209 -1093 -1909 -449 1103 863 -880 -1203 469 1236 288 -1412 -897 1384 2073 -45 -1761
2348 -1761 -745 1499 2428 310 -1586 -1029 1133 2216 497 -1024 -647 1000 1808 245 -779 327
2364 327 1901 1571 -530 -1540 345 2166 1196 -912 -1863 93 2133 1526 -929 -1848 -149 1888
2380 1888 1039 -743 -1315 84 1217 459 -1216 -1045 760 1485 -381 -2032 -1385 1231 2093 -120 -2244
$$ packed form
2266a020K024R17j831j459R76J622m2k099o39J554J844n55k448r01K196J794p98
2283A135k351q86J888J970o44k046n27J294J278n46j552L3J337J250j740j865
2299a972R59K189N49j868k152O12K809O56j850j676L83J710J031j617j606O66
2315a177J946j96j421r76J323J670m94k032p17J743K008q16k380q06J940K153
2331A768n59k302q16J460J552k40j743l23J672P67r48j700N15K281O89k118j716
2348a761J016K244R29k118j896N57K162J083j719j521L77J647Q08j563j024J106
2364C27J574l30k101j010J885J821r70k108r51J956K040o07k455r19J699K037
2380A888q49j782n72J399J133p58j675J71J805P25j866j651O47K616Q62k213k124
$$ plain form
2397 -2244 -1551 519 2000 140 -1873 -1456 521 1347 -216 -1511 -903 816 616 -1231 -1649 -220
2413 -220 1518 936 -1626 -2368 -195 1890 1177 -1480 -2229 -438 1614 1092 -1283 -1964 -52 1342 756
2430 756 -1210 -1475 658 1269 26 -2118 -1247 1230 2215 114 -1999 -1210 1448 1945 528 -1813 -1024
2447 -1024 1244 2080 479 -1231 -482 1331 1479 -15 -761 484 1810 1424 -278 -1031 565 2616
2463 2616 1745 -664 -1352 378 2553 2011 -449 -1533 182 1938 1217 -389 -695 572 1778 784
2479 784 -1428 -879 1171 1769 -81 -1798 -1143 1383 2057 66 -2299 -1680 765 1608 -184 -2189 -1547
2496 -1547 525 1009 -503 -1492 -1067 764 291 -1445 -1917 -520 1392 716 -1632 -2608 -447 1700 748
2513 748 -1235 -2574 -656 1077 812 -1131 -1889 -387 1081 231 -1873 -1286 629 1265 -43 -1852
$$ packed form
2397b244O93K070J481j860k013M17J977Q26j563j295O08J719k00j847m18J429
2413b20J738n82k562p42K173K085p13k657p49J791K052n22k375o81J912J394n86
2430G56j966k65K133O11j243k144Q71K477R85k101k113P89K658M97j417k341P89
2447a024K268Q36j601j710P49J813J48j494p46J245J326l86j702p53J596K051
2463B616q71k409o88J730K175n42k460j084J715J756p21j606l06J267J206r94
2479G84k212N49K050N98j850j717O55K526O74j991k365O19K445Q43j792k005O42
2496a547K072M84j512r89M25J831m73j736m72J397J912o76k348r76K161K147r52
2513G48j983j339J918J733k65j943p58J502J468q50k104N87J915O36j308j809
$$ plain form
2529 -1852 -1368 878 2076 -190 -1925 -1570 989 1543 244 -1787 -1435 726 1357 -63 -1424 -547
2545 -547 1070 953 -280 -1270 63 1834 1364 -908 -1858 347 2271 1555 -883 -1687 220 2201 1651
2562 1651 -614 -1210 85 1517 1371 -589 -1044 720 1853 400 -1091 -514 1162 2333 453 -1736
2578 -1736 -797 1587 2356 352 -1473 -1465 1073 2082 626 -1395 -885 1195 1168 -157 -1252 -262 1519
2595 1519 898 -1059 -1930 -103 2005 901 -1297 -2377 -672 1623 1262 -1186 -2393 -605 1240 771
2611 771 -1329 -1507 63 806 -13 -1729 -1314 398 1523 -355 -1746 -1405 1013 1884 -150 -2111 -1444
2628 -1444 906 1813 250 -1691 -1269 611 1217 -141 -1160 -283 1025 1096 -945 -1867 221 1717 1079
2645 1079 -1152 -2024 51 2146 1365 -938 -2225 -338 1594 886 -770 -1505 -160 1465 664 -1067
$$ packed form
2529a852M84K246J198k266j735L55K559N54j299k031L52K161O31j420j361Q77
2545e47J617j17j233r90J333J771m70k272r50K205J924p16k438q04J907J981n50
2562A651k265n96J295J432j46j960m55J764J133j453j491N77J676J171j880k189
2578a736R39K384P69k004j825QK538J009j456k021N10K080k7j325j095R90J781
2595A519o21j957q71J827K108j104k198j080J705K295l61k448j207J788J845m69
2611G71k100j78J570P43q19j716M15J712J125j878j391L41K418Q71k034j961O67
2628a444K350R07j563j941M22J880O06j358j019Q77J308P1k041r22K088J496o38
2645A079k231q72K075K095p81k303j287J887J932p08j656p35J345J625q01j731
$$ plain form
2661 -1067 -979 641 1444 -91 -1648 -1027 1057 1917 465 -1685 -1079 1049 2183 753 -1431 -1154 926
2678 926 1955 132 -1272 -501 1124 1205 -583 -1131 -17 1801 1358 -903 -1580 305 1993 1610 -706
2695 -706 -1916 -286 2170 1933 -455 -1602 152 1619 1150 -910 -952 569 1170 485 -1418 -1083 961
2712 961 1766 327 -2109 -1463 1123 2121 19 -1881 -1269 838 1739 324 -1710 -1373 414 1177 -472
2729 -472 -1407 -621 767 835 -1181 -1919 -241 1564 928 -1195 -2491 -445 1301 1421 -993 -2059 -445
2746 -445 1012 893 -883 -1640 -107 1210 256 -1302 -1261 421 1422 -187 -1926 -1633 675 1877 -68
2763 -68 -2083 -1518 564 1432 187 -1537 -1571 366 1151 -296 -1518 -912 771 613 -705 -1659 -121
2780 -121 1482 937 -1157 -1966 -507 1928 1399 -909 -1965 -331 1241 1168 -445 -1423 35 1388 1014
$$ packed form
2661a067Q8J620Q03j535j557O21K084Q60j452k150O06K128J134j430k184K77K080
2678I26J029j823j404P71J625Q1j788n48J114J818m43k261o77J885J688l83k316
2695g06j210J630K456k37k388j147J754J467m69k060m2J521O01o85j903L35K044
2712I61Q05j439k436O46K586R98k102j900O12K107R01j415k034L37J787P63j649
2729d72r35P86J388O8k016p38J678J805o36k123j296K046J746J20k414j066J614
2746d45J457j19j776p57J533J317r54j558M1J682J001j609j739K93K308J202j945
2763f8k015N65K082Q68j245j724l4J937P85j447j222O06J683j58j318r54J538
2780a21J603n45k094q09J459K435n29k308j056J634J572p3j613r78J458J353l74
$$ plain form
2797 1014 -696 -688 631 1714 412 -1223 -926 1343 2269 561 -1488 -908 1400 2299 738 -1248 -1040
2814 -1040 1018 1768 363 -915 -377 852 954 -70 -1110 -119 1430 1020 -690 -1541 -4 1673
2830 1673 1419 -858 -1853 -493 1560 1383 -487 -1593 -282 1142 813 -509 -1237 11 1096 444
2846 444 -1070 -1135 992 1547 141 -1279 -1048 651 1601 400 -1465 -1137 937 1465 376 -749 -818
2863 -818 753 1248 441 -1009 -296 1132 1205 -515 -1140 -48 1667 1124 -504 -1449 -168 1812 1415
2880 1415 -475 -1408 -288 1607 1289 -586 -1116 227 1344 595 -586 -1066 570 1330 187 -1226
2896 -1226 -975 680 1842 444 -1478 -1242 723 1611 289 -1251 -1085 386 1074 108 -959 -452 504
2913 504 628 -661 -1650 -550 971 828 -736 -1735 -505 1063 1104 -892 -1881 -801 669 845 -657
$$ packed form
2797A014j710QJ319J083j302j635K97K269R26j708k049N80K308Q99j561j986K08
2814a040K058P50j405j278N38J229J02j024j040R91J549m10j710q51J537J677
2830A673k54k277r95J360K053j77j870j106J311J424l29j322p28J248J085o52
2846D44j514o5K127N55j406j420K31J699R50j201j865L28K074N28j089j125o9
2863h18J571M95q07j450P13J428P3j720o25J092J715n43j628r45J281J980l97
2880A415j890r33J120J895l18j875n30J343J117p49j181m80J636P60j143j413
2896a226K51J655J162j398j922K36J965Q88j322j540J66J471O88r66j067N07R56
2913E04J24j289r89J100J521j43j564r99J230J568M1j996r89J080J470J76j502
$$ plain form
2930 -657 -1601 -837 561 267 -1169 -1390 -302 705 -195 -1693 -1786 432 1159 -322 -2273 -1818 -15
2947 -15 1049 -57 -1788 -1306 -113 1375 0 -1188 -992 575 983 -351 -1163 -268 1194 1168 -508
2964 -508 -1186 13 1611 1160 -450 -1383 -70 1652 1766 -76 -1040 -115 1538 1344 256 -218 650
2981 650 1161 898 -486 -167 1071 1988 869 -657 -651 1090 2169 812 -800 -707 968 1800 838 -601
2999 -601 -679 873 1273 198 -382 -274 1078 948 -271 -1134 -230 1464 1400 -934 -1243 -474 1171 688
3017 688 -711 -1392 -442 708 771 -417 -1044 -234 705 99 -972 -1116 67 690 -188 -1443 -1160 201
3035 201 966 -207 -1910 -1672 -67 911 -65 -1412 -1353 -101 549 -87 -1269 -971 264 639 -591 -1556
3053 -1556 -267 556 269 -865 -1391 -523 1236 819 -506 -1291 -468 833 761 -346 -1477 -113 813
$$ packed form
2930f57r44P64J398k94j436k21J088J007r00j498r3K218P27j481j951M55J803
2947a5J064j106j731M82J193J488j375j188J96J567M08j334q12Q95J462k6j676
2964e08o78J199J598m51j610r33J313J722J14j842r64R25J653j94j088m74Q68
2981F50N11k63j384L19J238R17j119j526OJ741J079j357j612R3J675Q32r62j439
2999f01p8J552M00j075n80J08J352j30j219q63R04J694o4k334l09P69J645m83
3017F88j399o81R50J150O3j188o27Q10R39o06j071j44J183O23q78j255K83J361
3035B01P65j173j703K38J605R78r76j347N9J252O50o36j182K98J235L75j230r65
3053a556J289Q23k87j134n26Q68J759m17j325p85Q23J301p2j107j131J364R26
$$ plain form
3070 813 759 -474 -357 447 1093 250 -671 -430 864 1350 485 -628 -730 713 1621 915 -857 -570 797
3089 797 1424 853 -575 -341 739 929 544 -714 -24 1020 924 -290 -573 -243 1010 1065 -624 -1417
3107 -1417 -397 924 929 -370 -1130 -321 551 509 -602 -1067 -331 758 216 -863 -1212 342 934 -145
3125 -145 -1340 -1091 398 889 -236 -1350 -1006 242 871 5 -1054 -900 158 862 195 -660 -436 64
3143 64 402 -270 -1151 -272 857 636 -601 -1290 -394 1049 825 -477 -1099 -388 591 740 -114 -850 212
3162 212 702 711 -417 -521 477 1256 405 -627 -569 704 1329 343 -732 -710 432 1316 674 -378 -627
3181 -627 468 1358 743 -737 -49 448 742 -60 -392 154 1056 667 -373 -441 -96 1129 850 -338 -1195
3200 -1195 -458 944 941 -108 -1201 -204 673 402 -414 -599 -213 821 141 -677 -846 229 589 -114 -1175
$$ packed form
3070H13n4j233J17Q04O46q43r21K41J294M86q65j113j02J443R08p06j772K87J367
3089G97O27n71j428K34J080J90l85j258O90J044r6j214k83L30J253N5j689p93
3107a417J020J321Nj299p60Q09Q72m2j111m65P36J089n42j079l49J554N92j079
3125a45j195K49J489M91j125j114L44J248O29q66j059J54J058P04o67q55K24N00
3143F4L38o72q81Q79J129k21j237o89Q96J443k24j302o22P11R79J49q54p36J062
3162B12M90Rj128j04R98P79q51j032N8J273O25r86j075K2J142Q84o42j052k49
3181f27J095Q90o15j480O88M97K94q02l32N46R02l89j040o8L45J225k79j188q57
3200a195P37J402lj049j093R97Q77k71q16j85L86J034o80q18j69J075L60p03j061
$$ plain form
3219 -1175 -1203 179 664 9 -1209 -1302 -89 564 206 -984 -936 -121 438 -279 -1119 -394 273 149 -563
3238 -563 -1161 -160 809 477 -814 -1080 -206 829 646 -581 -1133 -472 757 820 -294 -798 99 570
3256 570 225 -550 -563 606 1204 283 -788 -774 590 1157 407 -555 -822 374 1227 632 -665 -344 444
3275 444 980 4 -404 -112 434 428 -27 -647 31 1024 651 -331 -742 42 752 779 -5 -905 -260 934 1005
3296 1005 -16 -534 -150 534 501 -685 -315 137 748 312 -699 -426 503 987 205 -657 -710 498 882
3315 882 334 -987 -693 259 514 -66 -699 -338 352 635 -219 -450 -380 561 468 -551 -940 -219 824 708
3335 708 -668 -1230 -163 449 451 -153 -1156 -238 716 703 -352 -819 80 522 49 -590 -541 66 781 108
3355 108 -826 -689 301 1087 351 -713 -1060 451 737 514 -530 -727 251 480 -74 -655 -315 190 370
$$ packed form
3219a175k8J382M85o55j218r3J213O53l58j190M8Q15N59p17q40P25O67j24p12
3238e63n98J001R69l32j291k66Q74J035j83j227n52O61J229O3j114n04Q97M71
3256E70l45p75j3J169N98r21j071J4J364N67p50r62k67J196Q53n95j297L21P88
3275D44N36r76m08K92N46om55o20O78R93l73r82m11P84P10K7p84r00O45J194P1
3296A005j021n18L84O84l3j186L70M52O11m36j011K73R29M84p82q62n3J208L84
3315H82n48j321K94R52K55n80o33L61O90K83q54k31P0R41r3j019l89P21J043j16
3335G08j376n62J067O12Ko04j003R18R54j3j055m67Q99M42m73o39M9O07P15o73
3355A08r34J37R90P86p36j064l47J511K86k23j044j97R78K29n54n81L40N05J80
$$ plain form
3374 370 -341 -973 -547 625 462 -350 -1027 -22 654 519 -354 -1156 -649 631 567 -253 -592 -220 698
3393 698 181 -596 -490 159 652 19 -905 -445 201 849 382 -520 -455 696 942 505 -544 -621 705 853
3413 853 53 -154 -232 550 496 -39 -438 69 860 669 -286 -602 195 804 963 20 -371 -295 825 976 361
3434 361 -656 281 1047 479 -194 -181 434 694 227 -295 -394 145 894 380 -718 -464 290 569 31 -887
3454 -887 -505 359 948 157 -626 -267 115 593 -193 -591 -270 430 241 -331 -828 -423 503 529 -201 -774
3474 -774 -440 300 570 -270 -691 -541 233 401 -361 -801 -289 316 0 -520 -717 91 583 282 -808 -873
3494 -873 254 294 412 -485 -864 364 578 327 -550 -613 -41 254 -132 -599 -126 431 195 -310 -866 108
3514 108 418 720 -207 -761 -56 490 640 -51 -602 -130 725 767 89 -97 74 517 83 38 -294 484 791
$$ packed form
3374C70p11o32M26J172j63q12o77J005O76j35q73q02N07J280o4q20l39L72R18
3393F98n17p77J06O49M93o33r24M60O46O48m67r02O5J151K46m37j049p7J326J48
3413H53q00k07p8P82n4n35l99N07P91j91r55l16P97O09J59r43l91P6J120J51o15
3434C61j017R37P66n68o73J3O15K60m67n22r9N39P49n14j098K54P54K79n38r18
3454h87L82Q64N89p91p83L59L82M78p86l98L21P00j89n72m97M05R26K6p30n73
3474g74L34P40K70q40m21J50P74J68p62m40N12O05l16n20j97Q08M92l01j090o5
3494h73J127M0J18q97l79J228K14k51q77o3N72K95l86m67M73N57k36n05n56R74
3514A08L10L02r27n54P05N46J50o91n51M72Q55M2o78j86J71M43m34m5l32P78L07
$$ plain form
3535 791 374 -406 -453 275 638 264 -607 -245 -52 594 171 -437 -574 150 465 -146 -546 -340 61 281
3555 281 -101 -583 -168 290 432 -696 -773 162 765 282 -227 -845 -471 182 338 -196 -965 -133 432 419
3575 419 -405 -505 -25 215 -45 -348 -194 488 413 116 -670 -333 337 679 193 -277 -556 -38 334 118
3595 118 -314 -230 415 365 148 -751 162 419 343 -379 -491 18 530 752 46 -477 36 659 284 321 -389
3616 -389 -147 535 461 97 -500 140 254 168 -191 -408 429 576 456 -449 -8 167 773 431 -508 -164 298
3637 298 644 263 -259 -81 223 414 -141 -449 -104 392 634 -377 -408 11 389 613 -315 -693 -359 585
3657 585 323 -67 -494 -296 149 546 -153 -553 -343 232 129 -497 -498 31 226 -356 -733 -730 82 232 -88
3678 -88 -725 -682 304 364 244 -583 -554 -96 25 18 -649 -265 144 136 -287 -367 -117 333 533 -139 -398 -208 606
$$ packed form
3535G91m17p80m7P28L63l74q71L62J93O46m23o08j37P24L15o11m00K06M01K20
3555B81l82m82M15M58J42j128p7R35O03m83n09o18L74O53J56n34p69Q32N65j3
3575D19q24j00M80K40k60l03J54O82p5k97p86L37O70L42m86m70k79N18L72k16
3595A18m32Q4O45n0k17q99R13K57p6p22j12N09N12K22p06n23N13O23l75L7p10
3616c89K42O82p4l64n97O40J14q6l59k17Q37J47j20r05M41J75O06l42r39L44M62
3637B98L46l81n22J78L04J91n55l08L45M96K42j011l1M19L78K24r28l78L34R44
3657E85k62l90m27J98M45L97o99m00K10N75j03o26jN29J95n82l77LQ12J50l20
3678h8o37M3R86O0j20q27K9M58J21po67L84M09qm23q0K50M50K00o72k59J90Q14
$$ plain form
3701 606 800 -82 -630 -71 602 776 -38 -360 163 536 421 -52 -220 3 761 -136 -269 -281 357 337 108
3722 108 -662 -445 176 692 192 -431 -548 291 612 162 -333 -413 96 505 -3 -214 -189 213 160 -274 -528
3743 -528 32 412 349 -98 -368 -116 175 251 -272 -380 100 478 255 19 -191 196 285 125 -211 -213 124 399
3765 399 396 -242 -521 172 382 196 -551 -595 -54 377 -34 -500 -406 374 228 77 -161 -107 168 183 -511 -439
3787 -439 -146 393 132 -272 -1021 -80 659 378 -364 -607 -76 235 437 -142 -492 188 634 156 -340 -305
3807 -305 241 403 40 -577 -140 233 612 -121 -450 -527 255 506 271 -635 -291 131 143 94 -277 -69 198
3828 198 389 74 -428 -136 420 244 -432 -621 76 277 301 -373 -349 -55 400 436 -8 -306 -93 139 279
3849 279 -389 -633 64 248 -180 -268 -327 256 532 108 -390 -371 517 586 -17 -430 -281 401 191 698 -421
$$ packed form
3701F06J94q82n48N59O73J74q14l22N23L73j15m73j68K23P58q97j33j2O38k0k29
3722A08p70K17O21N16n00o23j17Q39L21m50m95q0N09M09n08k11K5M02n3m34k54
3743e28N60L80o3m47k70K52K91P6n23j08M80L78k23k36k10L87Q9j60l36kL37K75
3765C99lo38k79O93K10j86p47m4N41M31m11m66R4P80j46j51k38N4K75J5o94P2
3787d39K93N39k61m04p49R41P39k81p42k43N31L11K02n79l50O80M46m78m96L5
3807c05N46J62l63o17M37L73L79p33l29p7P82K51k35r06L44M22J2m9l71K08K67
3828A98J91l15n02K92N56j76o76j89O97K01K4o74K4K94M55L6m44k98K13K32J40
3849B79o68k44O97J84m28q8n9N83K76m24m98J9Q88O9o03m13J49O82k10N07j119
$$ plain form
3870 -421 -295 278 222 -14 -282 327 268 206 -348 -94 36 472 244 -223 -683 74 380 243 117 -359 135
3891 135 577 551 -194 -483 192 288 151 -208 -206 -18 524 -113 -542 -87 120 519 -117 -419 -281 45 516
3912 516 23 -418 -358 586 -16 -86 43 -158 125 -22 -258 -722 143 553 342 -414 -705 86 402 199 -262
3933 -262 -469 -186 369 395 -100 -432 -235 293 -5 -184 -411 137 107 83 -595 103 117 230 -136 -91 -189 72
3955 72 493 129 -255 -364 136 290 29 -606 -243 100 141 -255 -307 277 461 198 -218 -499 57 504 -28
3976 -28 -134 -369 46 527 552 -197 -208 -104 227 352 -294 1 300 517 112 -401 -73 61 286 60 -387
3997 -387 -265 138 467 -61 -407 -230 306 363 34 -412 -141 111 172 168 -541 116 315 -196 -200 -438 -130 132
4019 132 241 -442 -219 96 361 228 -303 -67 -63 533 300 -154 -363 120 268 -90 -52 -5 2 432 117 -253
$$ packed form
3870d21J26N73n6k36k68O09n9o2n54K54J30M36k28m67m60P57L06j37j26m76M94
3891A35M42k6p45k89O75R6j37l59KJ88N42o37m29M55K07L99o36l02J38L26M71
3912E16m93m41O0R44o02p0J29k01K83j47k36m64Q65M10k11p56k91P91L16k03m61
3933b62k07K83N55K6m95l32J97N28k98j79k27N48l0k4o78O98J4J13l66M5r8K61
3955G2M21l64l84j09N00J54k61o35L63L43M1l96n2N84J84k63m16k81N56M47n32
3976b8j06k35M15M81K5p49j1J04L31J25o46K95K99K17m05n13L28J34K25k26m47
3997c87J22M03L29n28l46J77N36N7l29m46K71K52O1mp09O57J99n11mk38L08K62
4019A32J09o83K23L15K65j33n31K36MN96k33m54k09M83J48l58L8M7PM30l15l70
$$ plain form
4041 -253 -152 286 433 116 -742 -279 -125 336 277 -503 -38 279 68 -218 -394 -107 391 196 314 6
4061 6 -151 242 286 -234 -311 77 320 225 -139 -322 -240 474 152 -374 -348 -271 187 12 -203 -245 214 529 66
4084 66 -162 6 13 404 -35 -381 -252 292 550 74 -553 -132 172 202 -191 -493 -247 246 47 -114 -244
4105 -244 -209 348 152 -302 -380 103 -26 483 -133 -170 -35 251 71 -201 -474 -130 386 -75 -84 14 9 75 102
4128 102 -27 34 544 142 -123 -110 -21 470 243 20 -313 -98 274 515 -83 -325 -444 327 676 117 -114
4149 -114 95 157 300 -140 -221 283 215 186 -19 -317 -64 525 443 -149 -262 212 15 203 -167 -51 214 -2
4171 -2 -267 -119 -20 202 -149 -150 -176 -139 51 358 142 -334 -59 213 25 183 -342 -170 26 260 -165 -202 180
4194 180 163 135 108 -225 107 293 158 -479 -310 46 492 44 -210 -403 -305 437 61 -304 -308 215 25 -68
$$ packed form
4041b53J01M38J47l17q58M63J54M61n9p80M65L17k11k86j76K87M98j95J18l08
4061Fj57L93M4n20p7L88K43r5l64j83Q2P14l22n26K6P7M58j75k15m2M59L15m63
4084F6k28J68PL91m39l46J29N44K58m76o27M21L04L0l93l02K46M93j99j61j30
4105b44L5N57j96m54p8M83j29N09o16l7J35K86j80k72k73L44N16m61rR8nO6K7
4128A02j29O1N10m02k65J3Q9M91k27k23l33K15L72K41n98k42j19P71L49n59k31
4149a14K09O2J43m40q1N04o8k9k05k98K53N89q2n92j13M74j97J88l70J16K65k16
4171bk65J48R9K22l51jk6L7J90L07k16m76K75K72j88J58n25J72J96K34m25l7L82
4194A80j7k8k7l33L32J86j35o37J69L56M46m48k54j93R8P42l76l65mN23j90r3
$$ plain form
4216 -68 -79 -113 -132 -30 84 -248 -49 -107 164 23 -243 -131 164 258 129 -312 -138 -147 313 -61 -365 -34 175
4239 175 114 -313 -223 151 446 153 -67 156 279 152 281 -25 -347 190 234 324 -121 -430 150 114 355 -24
4261 -24 -210 117 59 213 -335 95 373 353 53 -492 -116 221 -75 -77 -199 -314 172 537 -228 -312 -101 255
4283 255 126 -173 -276 -228 373 180 -204 -187 54 48 -120 -270 -589 26 283 -116 -239 -371 10 1 245 -17
4305 -17 -398 99 483 52 -73 -207 21 341 13 -455 -4 372 -20 -24 -221 -56 -55 -1 101 -118 -60 242
4327 242 200 -41 -30 -72 216 20 -237 188 44 305 2 -62 -53 -105 473 253 -118 36 89 254 266 63 -54
4350 -54 163 68 1 -16 -63 143 57 15 -268 57 135 275 46 -139 -103 490 -8 -35 -310 381 246 254 -161 -179
4374 -179 154 47 178 -324 146 7 277 -123 -151 -317 -42 317 165 -297 22 160 270 -116 -67 -68 137
$$ packed form
4216f8j1l4j9J02J14l32J99n8K71j41k66J12K95R4j29m41J74rM60l74l04L31K09
4239A75o1m27R0L74K95k93k20K23J23j27J29l06l22N37M4R0m45l09N80l6K41l79
4261b4j86L27n8J54n48M30K78k0l00n45L76L37k96kj22j15M86L65p65q4K11L56
4283B55j29k99j03M8O01j93l84J7K41oj68j50l19O15K57l99j23j32L81rK44k62
4305a7l81M97L84m31j25j34K28L20l28m68M51L76l92mj97J65JN4J02k19N8L02
4327B42m2k41J1m2K88j96k57M25j44K61l03o4Rn2N78k20l71J54N3J65J2k03j17
4350e4K17r5o7j7m7K06q6m2k83L25P8J40k29j85L6N93m98k7k75O91j35Qm15j8
4374a79L33j07J31n02M70j39K70m00k8j66K75L59j52m62L19J38J10l86M9jK05
$$ plain form
4395 137 -132 -262 -102 -145 35 108 -110 -347 -341 106 101 -364 -409 200 358 181 -88 57 26 271 90 10 -112
4418 -112 -111 20 -28 168 -272 -146 383 4 -100 83 -78 481 -123 -202 -238 135 245 -88 -13 -120 208 300
4440 300 35 -301 -176 -163 148 111 -282 -108 -37 294 -74 117 -222 482 71 -69 -205 32 133 435 21
4461 21 -316 -228 -53 14 18 225 77 104 115 -62 -256 391 16 -102 -280 -150 370 337 257 -164 -61 104 219
4484 219 199 -242 291 233 366 -209 -15 110 181 202 9 -269 -304 112 151 -7 -158 46 196 72 -52 -223
4506 -223 -68 98 72 -176 -432 -176 140 142 -227 -225 66 50 -117 -95 -208 157 252 6 -326 -152 218 -21 -151
4529 -151 -586 -106 -175 487 114 -265 -76 -101 -67 105 -322 109 152 246 -120 -71 26 304 56 -65 -356 -96
4551 -96 109 131 -119 -135 -35 284 109 -54 -454 -209 -24 -162 220 -157 -108 150 -213 -310 -257 -234 258 -30
$$ packed form
4395A37k69j30J60m3J80P3k18k37OM47nm65m5O09J58j77k69J45l1K45j81q0j22
4418a12JJ31m8J96m40J26N29l79j04J83j61N59o04p9l6L73J10l33P5j07L28R2
4440C00k65l36J25J3L11l7l93J74P1L31l68J91l39P04m11j40j36K37J01L02m14
4461B1l37Q8J75O7MK07j48K7J1j77j94O47l75j18j78J30N20l3q0m21J03J65J15
4484B19k0m41N33n8J33n75J94J25P1K1j93k78l5M16L9j58j51K04J50j24j24j71
4506b23J55J66k6k48k56K56L16Kl69KK91j6j67K2j13L65R5k46l32J74L70k39j30
4529a51m35M80o9O62l73l79J89k5L4J72m27M31M3R4l66M9R7K78k48j21k91K60
4551i6K05K2k50j6J00L19j75j63m00K45J85j38L82l77M9K58l63r7N3K3M92k88
$$ plain form
4573 -30 -42 -7 529 64 178 -257 76 80 308 120 -148 92 308 202 -40 -7 96 294 -214 -124 -100 45 -10
4596 -10 111 64 -44 119 514 92 358 -93 334 337 68 -104 -100 244 -22 107 -48 -113 -97 319 176 -151 3
4619 3 -4 -133 89 -285 28 -45 35 245 -286 -62 140 50 -253 -64 -75 103 277 -117 8 -166 130 154 45
4642 45 -252 -146 517 36 -55 -325 2 76 162 46 28 72 13 2 -182 -100 30 121 55 -223 64 319 51 -139
4666 -139 -221 -480 -3 181 -22 -174 -148 -55 -88 -13 -8 309 72 292 127 -189 66 2 -147 -69 -195 -116 44
4689 44 183 -93 -358 139 218 217 -213 223 142 1 -18 -128 -155 -5 58 64 -47 49 410 282 90 -88 152 206
4713 206 153 265 -149 66 -166 156 56 -167 36 380 242 44 228 -304 -112 -87 -68 -159 -75 209 294 -21
4735 -21 -227 112 160 133 -98 -3 -100 7 10 31 -251 129 44 51 -278 -75 119 90 -96 -220 -346 5 230 176
$$ packed form
4573c0j2L5N36m65J14m35L33MK28j88k68K40K16j06k42L3J03J98n08R0K4J45n5
4596a0J21m7j08J63L95m22K66m51M27Lk69j72ML44k66J29j55o5J6M16j43l27J54
4619Cpj29K22l74L13p3Q0K10n31K24K02r0l03J89j1J78J74l94J25j74K96K4j09
4642D5k97J06O63m81r1k70L27P4Q6j16j8M4n9j1j84Q2J30R1o6k78K87K55k68j90
4666a39q2k59M77J84k03j52K6R3l3P5NL17k37K20j65l16K55o4j49P8j26P9J60
4689D4J39k76k65M97P9jm30M36q1j41j9j10k7J50O3Oj11R6L61j28j92j78K40N4
4713B06n3J12m14K15k32L22j00k23K03L44j38j98J84n32J92K5J9r1Q4K84Q5l15
4735b1k06L39M8k7k31R5r7J07LK1k82L80q5Pl29K03J94k9j86j24j26L51K25n4
$$ plain form
4759 176 -338 -136 -165 -134 202 -117 -97 -108 96 -313 170 -15 198 -9 4 -79 64 196 311 -191 -225 -29
4781 -29 228 110 -117 -151 48 344 -104 49 -85 -2 266 -148 -279 88 60 229 -77 -19 -149 -70 462 31
4803 31 -18 3 380 333 -10 -5 -89 -35 -57 -129 51 -92 51 158 114 -129 156 212 78 -377 -320 129 50 287 -64
4828 -64 -273 -1 259 159 198 -139 84 29 25 -15 -21 150 290 258 30 57 413 305 134 -322 -1 300 334 -182
4852 -182 6 133 264 254 -117 -16 -386 216 142 -48 -279 -213 85 418 -160 -299 -62 -17 201 -195 -277 48
4874 48 305 -51 108 -188 294 207 -4 -228 -233 89 363 -264 -78 100 133 186 18 -442 10 334 41 -184
4896 -184 -6 195 -76 278 -405 -168 -52 215 52 39 -354 12 75 251 -169 -140 183 401 301 -130 -303
4917 -303 34 239 116 -56 -172 -102 100 315 -92 -217 -19 373 -167 -72 -330 60 268 -213 -264 305 248
$$ packed form
4759A76n14K02k9L1L36l19K0j1K04m09M83j85K13k07J3q3J43J32J15n02l4J96
4781b9K57j18k27l4J99K96m48J53j34Q3K68m14j31L67k8J69l06N8j30P9N32m31
4803C1m9K1L77m7l43Nq4N4k2p2J80j43J43J07m4k43K85N6j34m55N7M49p9K37l51
4828f4k09K72K60j00L9l37K23n5mm0oJ71J40l2k28K7L56j08j71m56L21L01L4n16
4852a82J88J27J31j0l71J01l70O02p4j90k31O6K98L33n78j39K37M5K18l96q2L25
4874D8K57l56J59k96M82q7k11k24nL22K74o27J86J78L3N3j68m60M52L24k93k25
4896a84J78K01k71L54o83K37J16K67j63j3l93L66O3J76m20K9L23K18j00m31j73
4917c03L37K05j23j72j16P0K02K15m07j25J98L92n40R5k58L90K08m81n1N69n7
$$ plain form
4938 248 135 205 -278 -282 101 313 -173 -33 -118 230 67 43 28 -8 132 46 -155 -212 -336 192 259 -157 -151 6
4962 6 12 -53 -143 -414 34 169 -98 130 -305 52 -22 29 -85 -66 125 306 284 121 -57 130 303 -66 -382
4985 -382 2 74 286 194 -260 -177 170 261 -308 -174 49 141 511 -199 -332 -102 -161 102 -139 -222 -111 428
5007 428 81 -166 -51 -20 -118 35 60 -230 -9 86 104 -147 -364 -266 297 -116 -134 -88 -148 89 229 -256 -429
5030 -429 14 110 261 -268 67 -3 184 59 -180 -245 271 48 121 -152 -42 168 135 105 -36 54 113 285 -81
5053 -81 -172 -107 268 278 43 -68 -468 256 149 48 -198 -94 247 -33 -54 -169 13 294 72 -142 -156 60
5075 60 -38 -159 -188 -191 191 352 7 -50 -31 19 254 166 60 43 269 254 105 48 -322 305 388 -87 -100 407 382
5100 382 -14 -215 -350 70 61 58 -118 -31 -238 270 271 -161 -113 123 198 75 -294 -450 211 228 -109 -362 -67
$$ packed form
4938B48j13P0m83mL83K12m86J40q5L48j63k4j5l6J40q6k01n7j24N28O7m16OJ57
4962FOo5r0k71M48J35k67K28m35L57p4N1j14J9J91J81k2j63j78J87J73l69l16
4985c82L84P2K12r2m54Q3L47R1n69J34K23R2L70p10j33K30n9K63k41q3J11N39
5007D28l47k47J15L1r8J53K5k90K21R5J8k51k17R8N63m13j8M6o0K37J40m85j73
5030d29M43R6J51n29L35p0J87j25k39o5N16k23P3k73J10K10l3l0j41R0N9J72l66
5053h1r1O5L75J0k35j11m00P24j07j01k46J04L41k80k1j15J82K81k22k14j4K16
5075F0r8j21k9lL82J61l45n7J9N0K35q8j06j7K26j5j49n7l70O27Q3m75j3N07k5
5100C82l96k01j35M20rlj76Q7k07N08Jm32M8K36P5j23l69j56O61J7l37k53K95
$$ plain form
5123 -67 61 297 -195 -6 -91 364 56 142 -142 66 126 88 -27 51 -77 119 386 -141 -138 -111 364 234 -17
5146 -17 -239 -233 206 222 131 7 -90 -51 -46 -132 -161 203 144 11 -223 -27 -256 463 -37 -441 1 301 328 74
5170 74 -214 -151 -24 203 279 -122 164 -60 77 -171 171 -86 416 76 -91 -92 224 165 70 -241 -174 -111 -8
5193 -8 254 -227 -204 329 259 212 301 19 212 277 -22 -98 -154 154 177 -3 -6 -418 317 1 -123 -269 -34 22
5217 22 -38 -154 -308 -143 253 245 41 -178 156 245 -147 -216 -315 -69 79 393 -442 -249 -256 366 387 -68 142
5240 142 -210 216 575 221 -230 126 121 13 -118 129 54 225 -133 48 -139 351 151 -39 -321 -238 104
5261 104 300 340 -306 -211 134 119 82 6 -177 198 222 8 -53 -126 84 153 147 -324 -206 101 70 -282 -164 117
5285 117 86 423 8 -366 -184 214 -53 -157 -189 347 61 155 -246 -118 283 197 336 -381 -194 -154 248 217
$$ packed form
5123f7J28K36m92J89q5M55l08Q6k84K08O0l8j15P8j28J96K67n27LK7M75j30k51
5146a7k22OM39J6r1j24r7L9Nq6k9L64n9j33k34J96k29P19n00m04M42L00K7k54
5170G4k88O3J27K27P6m01K86k24J37k48L42k57N02l40j67jL16n9r5l11O7O3J03
5193hK62m81K3N33p0m7Q9k82J93O5k99p6n6L08K3j80lm12P35l16j24j46K35N6
5217B2o0j16j54J65L96qk04k19L34Q9l92o9r9K46J48L14q35J93pO22K1m55K10
5240A42l52M26L59l54m51L56nj08j31K47p5J71l58J81j87M90k00j90k82Q3L42
5261A04J96M0o46R5L45j5l7p6j83L75K4k14o1p3K10O9om71J18L07l1l52J18K81
5285A17l1L37m15l74J82L98k67j04l2N36k86R4m01J28M01q6J39p17J87M0M02l1
$$ plain form
5307 217 -150 -32 412 415 204 -248 -95 447 48 74 -472 -163 130 241 35 -246 -138 56 166 -12 -165
5328 -165 -74 256 104 -162 -310 -111 447 435 -109 169 -224 -64 -85 -128 -6 -38 384 -106 -277 -234 -137 106
5350 106 318 -74 -129 81 414 21 -255 -562 119 168 283 -232 -19 18 332 202 -148 -220 366 155 44
5371 44 -246 -75 80 192 117 -464 -9 46 129 159 69 -111 -10 108 -89 -284 50 349 29 -230 -387 294
5393 294 277 -68 -324 -208 -157 253 416 -189 -211 -180 18 -64 -166 -284 -54 11 -14 -111 41 182 -62 -199 -427
5416 -427 -185 533 271 21 -565 -165 88 457 -272 -160 -318 120 156 -212 -368 -132 306 -100 -152 -200 122
5437 122 515 -1 143 -85 80 328 219 -359 -248 -15 313 50 -148 -103 -158 128 -74 26 -258 -84 -101
5458 -101 74 -353 -55 251 451 248 -500 -265 -19 246 -106 -60 -134 111 521 -91 -467 -332 45 231 -202
$$ packed form
5307B17l67J18M44Lk11m52J53N42l99K6n46L09K93J11k06k81J08J94J10j78j53
5328a65R1L30j52k66j48J99N58j2n44K78l93J60k1m3J22l2M22m90j71M3R7K43
5350A06K12l92n5K10L33l93k76l07O81M9J15n15K13L7L14j30l50p2N86k11j11
5371D4k90J71J55J12p5n81M55N5Q3L0r0j80J01J18j97j95L34K99l20k59j57O81
5393B94j7l45k56J16N1M10J63o05k2L1J98q2j02j18K30O5k5r7J52J41k44j37k28
5416d27K42P18k62k50n86M00K53L69p29J12j58M38L6l68j56K36M38m06n2m8L22
5437A22L93n16J44k28J65K48j09n78J11K33L28k63j98M5n5K86k02J00k84J74j7
5458a01J75m27K98L06K00k03p48K35K46K65l52M6p4K45M10o12l76J35L77J86m33
$$ plain form
5479 -202 -217 -139 372 247 -4 -87 189 331 193 -45 -296 156 241 449 -31 -119 -53 -30 112 21 -16 153 20
5502 20 -320 -98 -146 174 48 -206 101 -196 165 175 -202 -477 -176 45 60 373 -110 77 -130 370 -173
5523 -173 -176 -80 -46 -223 102 -221 175 95 114 7 -242 274 225 395 -276 126 -167 381 226 -462 -61 -207
5545 -207 2 107 -136 -163 137 277 14 -486 50 200 281 191 -159 -276 207 -82 77 -261 -83 -101 263
5566 263 -120 -116 192 96 195 60 -156 26 470 108 -204 -107 -209 140 137 81 -182 31 6 277 -70 -150 50
5589 50 148 4 47 -172 92 71 -75 -55 126 130 394 -81 -248 12 307 344 78 -178 -205 338 385 88 -339
5612 -339 -12 138 24 -316 -3 78 305 36 -211 -292 -77 289 38 -222 -138 -35 123 107 -209 -48 92
5633 92 220 -46 -209 -565 -74 179 -73 39 -189 313 114 -91 -230 -124 -30 203 149 -324 -220 87 352
$$ packed form
5479b02j5P8N11j25k51q3K76J42j38k38k51M52Q5K08m80q8O6K3J42r1l7J69j33
5502B0l40K22m8L20j26k54L07k97L61J0l77k75L01K21J5L13m83J87k07N00n43
5523a73lR6L4j77L25l23L96q0J9j07k49N16m9J70o71M02k93N48j55o88M01j46
5545b07K09J05k43k7L00J40k63n00N36J50Q1r0l50j17M83k89J59l38J78j8L64
5566B63l83ML08r6R9j35k16J82M44l62l12R7j02L49ln6k63K13k5K71l47q0K00
5589E0R8j44M3k19K64k1j46K0J81MK64m75j67K60K95L7k66k56k7N43M7k97m27
5612c39L27J50j14l40L13Q1K27k69k47q1K15L66k51k60Q4J03J58j6l16J61J40
5633I2J28k66j63l56M91K53k52J12k28N02j99k05j39J06R4K33n4m73J04L07K65
$$ plain form
5654 352 -98 42 -64 203 273 -137 -145 -62 115 413 -145 -230 -58 94 515 -121 141 31 139 347 -240 -99
5676 -99 -3 462 212 -75 -42 85 -4 -42 -266 -113 5 36 99 -273 -315 29 213 76 -20 -181 185 186 175 124
5700 124 -88 294 300 -124 -9 -247 -50 -177 -103 -417 58 275 266 -383 -320 -13 82 159 -79 -283 -225 398 -112
5723 -112 -21 -67 -16 335 223 97 -108 109 335 231 -315 -77 -35 111 -215 -309 -361 42 -53 111 -419 -205
5745 -205 46 228 -83 38 -109 -27 46 43 -310 30 337 53 30 -285 -59 147 318 42 -74 -168 130 455
5767 455 79 -367 111 208 -301 -122 -75 -45 415 -69 -116 214 134 352 308 -87 -113 42 45 -227 -336 -46 -28
5790 -28 -91 234 -65 -119 218 447 179 -164 -4 90 276 -74 -193 -139 188 370 -182 -223 -29 216 176 -82
5812 -82 -237 -78 145 56 -177 -96 -102 69 -164 -110 -70 -345 -52 33 19 -183 60 401 12 -88 -37 74 170 93
$$ packed form
5654C52m50J40j06K67P0m10qQ3J77K98n58q5J72J52M21o36K62j10J08K08n87J41
5676i9R6M65k50k87L3J27q9l8k24J53J18L1O3l72m2L44J84j37r6j61L66Jj1n1
5700A24k12L82Om24J15k38J97j27P4l14M75K17ro49O3L07R5P7k38k04N8O23n10
5723a12R1m6N1L51j12j26k05K17K26j04n46K38M2J46l26r4n2M03r5J64n30K14
5745b05K51J82l11J21j47Q2P3ll53L40L07k84k3l15K26K06J71k76j16r4K98L25
5767D55l76m46M78R7n09J79M7L0M60m84m7L30q0K18m4l95k6J55Lk72j09K90J8
5790b8o3L25k99n4L37K29k68l43J60R4J86l50j19N4L27J82n52m1J94K45m0k58
5812h2j55J59K23q9k33Q1oJ71k33N4M0k75K93Q5j4k02K43L41l89j00N1J11R6p7
$$ plain form
5836 93 -175 -182 -83 222 148 -76 -378 131 280 -204 -140 47 -190 511 -91 -535 87 223 255 -54 81 -68
5858 -68 115 271 159 -216 -237 68 40 -15 -78 -34 -138 6 -147 -253 171 66 -12 -256 -151 226 43 207
5880 207 -222 -72 43 216 107 -136 -265 173 236 -42 -159 -114 177 -69 -117 73 -290 12 343 229 -277
5901 -277 149 30 58 -156 -149 -58 128 250 0 427 -150 -62 156 -60 -242 72 253 11 -152 -65 379 -28
5923 -28 209 -240 38 -75 -221 56 -303 -105 107 77 327 -108 -85 166 -61 29 -29 348 -142 -17 30 -193
5945 -193 -15 -233 437 265 -168 49 107 -63 -208 16 -370 86 -230 -15 -180 223 16 -121 -112 -189 65
5966 65 140 293 322 -89 -246 46 358 62 -156 86 259 63 8 -222 75 -28 209 19 45 263 26 121
5988 121 -77 -8 33 313 12 -323 102 -22 212 -130 -279 68 185 226 220 -190 108 173 232 56 -172 12
$$ packed form
5836I3k68pR9L05p4k24l02N09J49m84O4J87k37P01o02m44O22J36L2l09J35j49
5858f8J83J56j12l75k1L05k8n5o3M4j04J44j53j06M24j05p8k44J05L77j83J64
5880B07m29J50J15J73j09k43j29M38O3k78j17M5K91k46m8J90l63L02L31j14n06
5901b77M26j19K8k14PR1J86J22k50M27n77Q8K18k16j82L14J81k42j63Q7M44m07
5923b8K37m49K78j13j46K77l59J98K12l0K50m35K3K51k27R0n8L77m90J25M7k23
5945a93J78k18O70j72m33K17N8j70j45K24l86M56l16K15j65M03k07j37Rp7K54
5966F5P5J53K9m11j57K92L12k96k18K42J73j96n5k30K97j03K37j90K6K18k37R5
5988A21j98O9M1K80l01l35M25j24K34l42j49L47J17M1om10K98O5N9j76k28J84
$$ plain form
6010 12 142 122 -246 -26 223 -105 350 -139 -284 -53 31 419 242 76 -313 101 -254 -116 -306 33 3
6031 3 -191 -207 -17 93 -14 -132 -297 -195 -203 150 168 -241 -105 149 68 208 -8 143 12 101 -99 -245 139
6054 139 173 207 184 110 252 374 356 -390 -183 0 -69 397 85 183 -17 295 243 -125 6 371 8 116 -87
6077 -87 296 179 95 -9 -192 -114 317 223 -189 -213 -171 -142 296 180 -100 -42 65 116 130 -30 42 -99 239 46
6101 46 -198 167 289 157 245 -133 36 -80 94 44 -155 5 10 352 -301 -133 -29 112 170 222 164 275 -253
6124 -253 32 82 -301 72 65 46 13 -210 231 121 -52 -42 -256 94 49 -55 1 -283 37 -90 -268 -86 -116
6147 -116 205 232 27 -55 -247 93 25 -16 -218 -11 167 65 19 -12 -11 33 137 -101 -30 253 64 -14 37 23
6171 23 319 323 -58 -310 257 301 191 3 -27 -234 72 -204 -8 -75 -323 44 123 70 -385 148 161 66 -118
$$ packed form
6010A2J30k0l68K20K49l28M55m89j45K31Q4L88j77j66l89M14l55J38j90L39l0
6031Cj94j6J90J10j07j18j65J02qL53J8m09J36K54q1J40k16J51j31Q9k00j46L84
6054A39L4L4k3p4J42J22j8p46K07J83o9M66l12R8k00L12n2l68J31L65l63J08k03
6077h7L83j17q4j04j83P8M31r4m12k4M2K9M38j16k80N8J07N1J4j60P2j41L38j93
6101D6k44L65J22j32Q8l78J69j16J74n0j99J60NL42o53J68J04J41N8N2n8J11n28
6124b53K85N0l83L73pj9l3k23M41j10j73J0k14L50m5j04N6k84L20j27j78J82l0
6147a16L21K7k05q2j92L40o8m1k02K07J78j02m6l1JM4J04k38P1K83j89p8N1j4
6171B3K96Ml81k52N67M4j10j88l0k07L06k76J96o7k48L67P9n3m55N33J3r5j84
$$ plain form
6194 -118 62 -324 -83 196 -66 -44 -14 328 384 147 -217 -190 47 82 256 31 -243 156 -44 -137 -216 40
6216 40 307 26 -183 -449 172 76 214 -18 -387 -59 -70 6 -291 -96 266 215 -221 -50 -95 66 263 -46
6238 -46 -528 -255 -34 510 54 -195 -130 249 293 -31 103 -125 164 -33 -142 -421 16 136 177 -293 -20
6259 -20 -147 265 177 -157 -423 23 320 87 -447 -318 -185 71 74 -222 102 -1 342 98 161 47 147 -9
6281 -9 43 -43 41 -66 158 -78 -142 25 -5 -84 256 -127 -270 410 238 259 -147 154 200 106 -43 -82 -77 114 142
6306 142 31 -185 -71 -34 56 -106 -344 -47 106 232 -189 -108 -152 147 174 -146 -119 37 135 -106 -101 340 107
6329 107 99 204 5 139 180 141 225 -61 -289 156 -27 -69 72 -180 175 -51 -94 -359 -101 14 83 -55 -285
6352 -285 94 112 -92 204 -193 -72 88 -58 -41 -370 -185 216 255 -108 -48 111 -250 81 -36 -104 -103 113
$$ packed form
6194a18J80l86K41K79k62K2L0L42N6k37l64K7K37L5J74k25k74L99k00r3p9K56
6216D0K67k81k09k66O21r6J38k32l69L28j1P6k97J95L62n1m36J71m5J61J97l09
6238d6m82K73K21N44m56k49O5L79M4l24J34k28K89j97j09k79M37J20M1m70K73
6259b0j27M12q8l34k66M46K97k33n34J29J33K56Lk96L24j03L43k44O3j14J00j56
6281iN2q6Q4j07K24k36o4J67l0p9L40l83j43O80j72K1m06L01M6r4j49l9NJ91K8
6306A42j11k16J14L7R0j62k38K97J53J26m21Q1m4K99K7l20K7J56R8k41NM41k33
6329A07qJ05j99J34M1l9Q4k86k28M45j83m2J41k52L55k26m3k65K58J15O9j38k30
6352b85L79J8k04K96l97J21J60j46J7l29J85M01L9l63O0J59l61L31j17o8JK16
$$ plain form
6374 113 106 -165 -84 88 58 25 -166 -507 -61 96 107 -182 -268 -24 -78 -4 -466 412 -322 59 -219 -70 220
6397 220 446 47 66 -71 -207 58 131 -70 -280 -147 106 -52 -206 186 -110 179 154 -113 21 151 195
6418 195 -98 -137 -11 172 349 213 254 38 45 175 61 -167 -50 213 176 136 -63 -142 125 203 -371 -280 266
6441 266 225 183 -157 67 -76 237 404 -456 80 -241 80 324 -221 -134 41 108 -31 -119 -156 -329 49 -25
6463 -25 -10 -42 -150 276 -117 -56 -427 -212 168 -27 -83 -523 -25 24 393 72 -389 -145 96 -69 -227 -200
6485 -200 -118 293 -53 -373 -70 -9 -59 38 -169 -222 -80 193 40 -207 -48 409 291 375 -82 119 212 44
6507 44 -163 -33 -96 103 129 -253 -218 -152 114 113 31 -188 75 76 16 -14 -13 -164 75 -8 -147 177 6 104 139 14
6533 14 -171 -18 129 -187 -55 -21 167 -50 0 -232 -5 357 190 -47 -114 -68 122 77 195 -174 -84 121
$$ packed form
6374A13pk71Q1J72l0l3j91l41M46J57J1k89q6K44n4P4m62Q78p34L81k78J49K90
6397B20K26l99J9j37j36K65P3k01k10J33K53j58j54L92k96K89k5k67J34J30M4
6418A95k93l9J26J83J77j36M1k16PJ30j14k28J17K63l7m0j99p9K67P8n74R1N46
6441B66m1m2l40K24j43L13J67q60N36l21L21K44n45Q7J75O7j39q8l7j73L78p4
6463b5J5l2j08M26l93O1l71K15L80j95n6m40M98M9L69l21m61K44K41j65j58K7
6485b00Q2M11l46l20L03O1n0R7k07n3J42K73j53k47J59M57j18Q4m57K01R3j68
6507D4k07J30o3J99K6l82L5O6K66jq2k19K63Jo0l0Jj51K39q3j39L24j71R8L5j25
6533A4j85J53J47l16J32L4J88k17N0k32K27L62j67k37o7M6J90m5J18l69R0K05
$$ plain form
6555 121 -3 -114 -149 77 162 -72 -327 -139 -200 260 114 -184 -81 -133 -34 86 -155 -65 28 442 -47 -56 181
6578 181 29 149 157 -150 -363 212 98 330 -416 45 83 236 -338 66 42 -281 69 132 143 48 198 48
6600 48 -281 -12 -5 -140 -61 14 81 52 335 85 -240 11 236 98 243 159 -83 -64 304 79 -35 -47 -43 236
6624 236 -197 -303 44 -20 528 -226 -340 -105 25 104 -235 -153 26 -190 56 -16 -176 -32 208 41 -46 -112
6646 -112 -338 126 267 -257 -132 98 -9 302 -160 -61 -87 128 3 30 -343 -197 322 158 -167 -135 186
6667 186 22 -46 4 -111 235 347 108 -17 75 192 109 234 -104 -365 85 143 -70 -26 107 47 -6 141 -109
6690 -109 -95 148 216 185 247 -53 56 61 114 -195 -113 394 -51 13 -181 68 589 381 155 -233 53 166 -11
6713 -11 -171 -70 184 199 -92 -133 -31 302 258 -151 -114 41 -76 316 -138 -286 46 267 332 -54 -256 -6
$$ packed form
6555A21j24j11l5K26Q5k34k55J88o1M60j46k98J03n2R9J20k41R0R3M14m89rK37
6578A81j52J20Ql07k13N75j14K32p46M61L8J53n74M04k4l23L50O3J1r5J50j50
6600D8l29K69Pj35P9P5O7k9K83k50l25K51K25j38J45q4k42J9L68k25j14j2MK79
6624B36m33j06L47o4N48p54j14K35J30P9l39Q2J79k16K46p2j60J44K40j67q7o6
6646a12k26M64J41n24J25K30j07L11m62R9k6K15j25K7l73J46N19j64l25L2L21
6667A86j64o8N0j15L46J12k39j25R2J17q3J25l38k61M50N8k13M4J33o0n3J47k50
6690a09J4K43O8l1O2l00J09NN3l09Q2N07m45O4j94K49N21k08k26l88K86J13j77
6713a1j60J01K54J5k91m1J02L33m4m09L7J55j17L92m54j48L32K21O5l86k02K50
$$ plain form
6735 -6 -13 -27 -135 -138 63 -6 50 -215 -235 -205 184 -117 260 160 -212 -25 124 -257 -395 -271 154 74 -207 194
6759 194 -11 160 -315 -317 -93 243 -346 -448 183 -281 -59 -93 -146 95 -309 77 384 -94 -86 -184 42 216
6781 216 -51 -88 287 19 250 -308 45 -95 263 66 99 -120 -225 57 234 9 -106 244 234 364 -240
6802 -240 -199 -194 246 253 118 -98 160 -175 -193 -99 -164 -86 402 -112 89 -229 -67 429 168 -213 140 65 74 -17
6826 -17 185 -143 -72 387 -59 -40 -211 -63 51 -146 -446 -179 393 -173 -70 -320 -232 190 -131 58 -161
6847 -161 -101 85 238 -30 -34 213 -84 20 -315 -74 235 323 169 -161 -206 -20 160 254 -113 -452 -165 -88
6869 -88 -197 -216 116 -95 203 -47 -196 132 96 -14 64 -218 -103 241 188 40 -199 -143 93 397 59 -200
6891 -200 -65 -106 -92 -237 105 -36 -126 -49 108 -266 187 155 140 -129 45 -13 23 129 18 -265 334 118 56
$$ packed form
6735fpj4j08lK01o9N6k65k0L0L89l01L77j00l72J87J49l81j38J24M25q0k81M01
6759A94k05J71m75kK24L36n89j02O31m64K22l4n3K41m04L86L07m78Qr8K26J74
6781B16k67l7L75k68K31n58L53j40L58j97L3k19j05K82J77k25j15L50j0J30o04
6802b40M1NM40Pj35k16K58l35j8R4o5P8M88n14K01l18J62M96k61l81L53p5Rr1
6826a7K02l28P1M59m46J9j71J48J14j97l00K67N72n66J03k50Q8M22l21J89k19
6847a61O0J86J53k68mK47k97J04l35K41L09Q8j54l30m5J86J80R4l67l39K87P7
6869h8j09j9L32k11K98k50j49L28l6j10P8k82J15L44n3j48k39N6K36L04l38k59
6891b00J35m1J4j45L42j41r0P7J57l74M53l2j5k69J74n8L6J06j11k83N99k16o2
$$ plain form
6914 56 -104 -292 -47 193 -12 -176 21 115 328 -129 33 -59 312 45 180 -113 51 171 161 126 -10 0
6936 0 297 -68 -8 -127 -121 95 399 134 -264 -57 103 71 -391 -314 -212 63 22 -178 -167 112 212 142 -152
6959 -152 -233 -97 304 181 83 -311 82 20 -237 87 233 163 155 175 -438 -37 -139 47 146 84 87 40 -23 132
6983 132 108 -84 106 76 -38 -1 -17 38 61 -355 -9 135 117 257 -133 -126 1 66 -115 -305 -102 -7 201 -178
7007 -178 -181 -10 -108 337 -67 130 96 174 -264 74 -231 -76 -30 211 22 -183 -21 182 405 61 182 -232
7029 -232 8 347 -88 -38 -211 -183 20 -110 -105 218 370 -44 -80 3 -114 134 339 -281 95 -191 273 20
7051 20 49 -215 164 -12 166 184 -31 100 265 161 18 -8 142 201 -121 -91 -355 85 303 120 -295 -32
7073 -32 -67 -127 -58 14 -76 -133 -25 -264 -354 -244 -51 269 -141 -26 -20 -85 101 -50 -41 -442 54 259 -144 -225 -22
$$ packed form
6914E6j60j88K45K40k05j64J97R4K13m57J62r2L71k67J35k93J64J20j0l5j36J0
6936@K97l65O0j19OK16L04k65l98K07J60l2m62P7J02K75m1k00J1K79J00p0k94
6959a52q1J36M01j23r8l94L93o2k57L24J46p0qK0o13M01j02J86R9o2Lm7o3J55
6983A32k4j92J90l0j14L7j6N5K3m16L46J44j8J40l90PJ27O5j81j90K03R5K08l79
7007a78lJ71r8M45m04J97l4P8m38L38l05J55M6K41j89k05J62K03K23l44J21m14
7029b32K40L39m35N0j73K8K03j30NL23J52m14l6Q3j17K48K05o20L76k86M64k53
7051B0K9k64L79j76J78J8k15J31J65j04j43k6J50N9l22L0k64M40K18j83m15K63
7073c2l5o0O9P2r0n7J08k39r0J10J93L20m10J15Oo5J86j51Rm01M96K05m03q1K03
$$ plain form
7098 -22 85 285 -181 -180 -404 -53 168 -129 153 106 215 208 -240 -151 70 351 89 -92 58 347 -163 131
7120 131 108 -191 127 92 293 -88 -249 0 57 17 -278 -134 169 9 93 -158 3 53 211 59 74 62 204
7143 204 150 -13 -139 15 132 64 -107 -351 99 157 82 -263 -78 -241 226 85 -6 -216 146 239 103 -401
7165 -401 -309 123 -134 48 9 -143 129 -38 91 -579 -91 362 -71 -63 -244 -130 -54 436 -142 -356 -173 17
7187 17 6 -202 -225 51 3 224 155 -122 -176 343 138 285 -130 57 192 -145 -141 6 -95 449 -53 -121 -332
7210 -332 -44 42 184 -33 -20 114 211 -90 0 -1 -59 -62 91 156 140 324 166 -144 -446 -167 -9 127 143 -123
7234 -123 -14 55 104 95 124 -40 -49 -197 -77 -195 4 485 53 -61 -391 114 47 113 1 -412 124 8 76
7257 76 94 -53 32 129 85 -225 -90 285 175 163 -48 -81 117 -22 -185 -190 -81 -71 -251 -100 -213 -5 52 -11
$$ packed form
7098b2J07K00m66Jk24L51K21k97K82m7J09pm48Q9K21K81k62j81J50K89n10K94
7120A31k3k99L18l5K01l81j61K49N7m0k95J44L03j60Q4k51J61N0J58j52J5j2J42
7143B04n4j63j26J54J17o8j71k44M50N8p5l45J85j63M67j41r1k10L62R3j36n04
7165d01R2M32k57J82l9j52K72j67J29o70M88M53m33Qj81J14P6M90n78k14J83J90
7187A7j1k08k3K76m8K21o9k77n4N19k05J47m15J87J35l37MJ47j01N44n02o8k11
7210c32K88Q6J42k17J3J34R7l01R0jn8lJ53O5j6J84j58l10l02K79J58J36J6k66
7234a23J09O9M9rK9j64rj48J20j18J99M81m32j14l30N05o7O6j12m13N36j16O8
7257G6J8j47Q5R7m4l10J35L75j10j2k11l3J98j39j63nJ09J0j80J51j13K08N7o3
$$ plain form
7281 -11 -61 -226 110 -6 -207 -69 -339 -6 -146 154 -212 -89 -29 14 -48 -188 -352 181 188 80 -39 -182
7303 -182 -2 -76 199 90 16 -50 -94 -66 -36 -21 64 165 121 -99 -80 -57 476 65 -129 80 470 241 12 -13
7327 -13 105 -36 389 -105 109 -127 254 -213 22 -67 -35 543 -179 -94 -289 152 100 -205 -334 -248 -195 313
7349 313 44 -90 -374 97 52 -126 -238 -86 -52 233 43 -465 86 289 113 -286 -139 -347 66 197 -32
7370 -32 -125 1 162 86 137 -176 41 409 -122 158 -102 -9 22 -18 -10 -16 158 71 294 -207 -325 -247 158 -17
7394 -17 -169 -53 -109 204 -79 -91 326 -73 58 -27 -338 -129 113 197 -419 100 -70 -81 96 -155 -214 4
7416 4 169 234 232 47 -181 237 189 4 -39 250 105 238 121 -47 188 112 250 -212 -69 -164 389 175 4
7439 4 -344 138 100 97 -147 138 14 49 58 -247 24 -70 285 -305 -143 -141 129 -61 180 -209 5 228 351 104
$$ packed form
7281a1n0j65L36j16k01J38k70L33j40L00l66J23O0M3o2j40j64N33Pj08j19j43
7303a82J80p4K75j09p4o6m4K8L0J5Q5J01m4k20J9K3N33m11j94K09L90k29k29k5
7327a3J18j41M25m94K14k36L81m67K35q9L2N78p22Q5j95M41n2l05j29Q6N3N08
7349C13k69j34k84M71m5j78j12J52L4K85j90n08N51K03j76l99J47k08M13J31k29
7370c2r3J26J61p6N1l13K17L68n31K80k60R3L1m0QoJ74q7K23n01j18P8M05j75
7394a7j52J16n6L13k83j2M17l99J31q5l11K09K42Q4o16N19j70j1J77k51n9K18
7416DJ65O5kj85k28M18m8j85m3K89j45J33j17j68K35p6J38m62J43r5N53k14j71
7439Dl48M82l8lk44K85j24L5Rl05K71r4L55n90J62KK70j90K41l89K14K23J23k47
$$ plain form
7463 104 -4 -24 167 205 -270 -269 77 -433 49 -36 -54 -8 113 -36 -315 -280 113 96 -83 -3 -233 -130 334
7486 334 289 23 -297 -243 379 -12 -116 -76 44 150 59 305 203 245 124 18 -273 -189 124 -26 23 52 -133
7509 -133 134 142 78 -103 -151 -70 147 113 -101 -78 -198 -121 2 -238 30 135 383 -38 -365 -26 367 166 -269
7532 -269 -15 190 25 103 -286 -173 245 -58 189 -192 -232 179 176 77 -193 -363 3 282 -60 -170 -195 -88
7554 -88 79 5 -273 -223 180 150 5 193 -117 280 137 -23 -240 -50 148 112 -83 -519 -148 -38 264 -20
7576 -20 -68 65 -71 186 -385 -71 -185 -26 430 -48 -107 -119 82 321 -373 -129 174 149 40 -232 -38 -46
7598 -46 -15 199 -172 -264 31 23 209 -212 194 113 -239 59 95 44 -64 -178 -156 -358 -111 -31 3 46 -484 -100
7622 -100 223 215 185 -354 -71 177 64 -64 -341 -91 191 253 -382 -199 78 63 94 -100 -108 215 90 -30 -75
$$ packed form
7463A04j08k0J91L8m75JL46n10M82q5j8M6J21j49k79L5L93j7j79Q0k30J03M64
7486C34m5k66l20N4O22l91j04M0J20J06r1K46j02M2j21j06k91Q4L13j50M9K9j85
7509a33K67Qo4j81m8Q1K17l4k14K3j20P7J23k40K68J05K48m21l27L39L93k01m35
7532b69K54K05j65P8l89J13M18l03K47l81m0M11lr9k70j70L66K79l42j10k5J07
7554h8J67p4k78N0M03l0j45J88l10L97j43j60k17J90J98l6j95m36L71J10L02k84
7576b0m8J33j36K57n71L14j14J59M56m78n9j2K01K39o94K44L03k5j09k72J94q
7598d6L1K14l71r2K95qJ86m21M06q1l52K98L6n1j08j14K2k02K47Q0L4M3n30L84
7622a00L23ql0n39K83K48j13j28k77K50K82O2o35J83K77j5L1j94qL23j25j20m5
$$ plain form
7645 -75 -213 4 217 -61 -234 159 191 -43 82 -356 93 -78 -10 77 -105 49 113 139 -42 -93 -198 428
7667 428 312 75 -229 -386 44 49 -115 -177 -203 32 15 -150 -215 -111 310 63 -88 -340 -200 69 55 -348
7689 -348 -48 -46 -104 174 -197 -266 -91 85 -150 -38 -49 273 120 -50 -337 -221 37 157 -87 -243 -462 165
7711 165 111 -176 6 -311 148 80 -90 -140 1 -133 -78 -202 46 213 153 -84 -213 -141 -236 206 94 -486
7733 -486 -479 -172 183 137 77 -161 -106 320 -231 -55 -249 -81 50 13 -161 -224 86 226 293 -322 82 398 48
7756 48 197 -188 220 226 256 148 -271 -7 -21 245 -134 -48 265 129 59 139 -24 -244 -17 157 -281 47 215
7779 215 3 -121 -228 42 248 217 93 -337 12 246 27 58 86 -10 -33 0 59 -240 -144 192 33 -157 -231
7802 -231 -37 -21 174 217 -114 -361 110 135 -102 -27 -129 198 389 139 91 25 200 154 -147 -133 25 164 87
$$ packed form
7645g5j38K17K13k78j73L93L2k34J25m38M49j71O8Q7j82J54O4K6j81n1j05O26
7667D28j16k37l04j57M30Nj64o2k6K35j7j65o5J04M21k47j51k52J40K69j4m03
7689c48L00Kn8K78l71o9J75J76k35J12j1L22j53j70k87J16K58J20k44j56k19O27
7711A65n4k87J82l17M59o8j70n0J41j34N5j24K48J67o0k37j29P2r5M42j12n80
7733d86PL07L55m6o0k38N5M26n51J76j94J68J31l7j74o3L10J40O7o15M04L16l50
7756D8J49l85M08OL0j08m19K64j4K66l79Q6L13j36p0Q0j63k20K27J74m38L28J68
7779B15k12j24j07K70K06l1j24m30L49K34k19L1K8r6k3L3N9k99R6L36j59j90p4
7802b31J94J6J95M3l31k47M71K5k37P5j02L27J91k50m8o6J75m6l01J4J58J39p7
$$ plain form
7825 87 -177 -84 140 153 251 -46 -208 88 153 370 -327 71 238 231 -149 -256 -162 116 190 84 166 -69 163
7848 163 -1 -238 216 -154 68 74 -36 -11 -15 75 172 -67 -66 -144 115 60 -453 -41 -30 -16 -83 127 -35 -58 124
7873 124 105 61 -101 -19 -24 55 -279 -6 143 76 -84 54 -191 34 236 -69 -316 -164 -54 92 -46 -186
7895 -186 152 -227 76 -26 55 100 211 97 -101 -116 36 15 98 260 -162 15 109 -67 2 75 -404 142 -58
7918 -58 43 -32 -69 146 132 2 -81 97 166 -52 137 -194 -20 86 170 -218 -107 -204 85 -225 -294 -251 -120
7941 -120 -13 -233 177 -399 273 138 127 -154 19 130 272 172 72 152 107 224 -454 -114 58 -29 340
7962 340 -3 -234 73 -102 212 -65 -133 115 145 142 86 13 126 33 -161 -57 -144 -57 67 195 192 90 152 395
7986 395 212 -231 11 296 230 -249 -325 9 -125 314 -109 -120 20 224 -179 -17 -172 -5 373 -163 -393
$$ packed form
7825H7k64R3K24J3R8k97j62K96O5K17o97L98J67pl80j07R4K78P4j06Q2k35K32
7848A63j64k37M54l70K22Oj10K5mR0R7k39Jp8K59n5n13M12J1J4o7K10j62k3J82
7873A24j9m4j62Q2nP9l34K73J49o7j60J38k45K25K02l05k47J52J10J46j38j40
7895a86L38l79L03j02Q1M5J11j14j98j5J52k1Q3J62m22J77R4j76O9P3m79N46k00
7918e8J01p5l7K15j4j30q3J78O9k18J89l31J74J06Q4l88J11r7K89l10o9M3J31
7941a20J07k20M10n76O72j35j1k81J73J11J42j00j00Q0m5J17o78L40J72q7L69
7962C40l43k31L07j75L14k77o8K48L0ln6p3J13r3j94J04q7Q7J24J28lj02O2K43
7986C95j83m43K42K85o6m79p6L34j34M39m23j1J40K04m03J62j55J67L78n36k30
$$ plain form
8007 -393 -209 -154 47 -18 72 220 -206 280 81 43 140 -139 8 17 91 98 -89 232 177 -53 -264 215 169 17
8031 17 -321 188 93 60 -46 -151 -41 219 -74 -151 15 -107 82 46 169 -23 -260 273 64 -71 -236 32
8053 32 -12 62 -63 -218 45 -76 3 54 -258 -184 -29 -138 107 -66 173 161 -21 50 5 266 102 358 -197
8076 -197 53 69 317 313 -237 -4 -102 12 61 124 34 158 275 -2 -126 117 197 351 6 -202 -56 255 270
8099 270 -17 -32 -32 161 11 4 -382 12 174 348 61 -97 -94 152 165 -265 69 158 314 -155 -141 -144 209 194
8123 194 76 -54 -51 103 -132 166 -280 9 0 110 -100 -120 -158 215 5 -107 42 -197 -194 -11 117 -61 52
8146 52 547 189 -14 -248 -310 441 -79 85 -95 139 100 27 -71 -227 268 -212 -350 -308 90 92 -49 190 183
8169 183 -403 385 202 93 -210 12 33 131 182 -148 -66 109 -49 -5 -93 -164 299 220 69 -253 54 384
$$ packed form
8007c93J84N5K01o5R0J48m26M86j99l8R7k79J47RP4Pj87L21n5k30k11M79m6j52
8031A7l38N09r5l3j06j05J10K60k93p7J66j22J89l6J23j92k37N33k09j35j65K68
8053C2m4P4j25j55K63j21P9N1l12P4J55j09K45j73K39j2j82P1m5K61j64K56n55
8076a97K50J6K48mn50K33r8J14M9O3r0J24J17k77j24K43Q0J54l45k08J46L11J5
8099B70k87j5%J93j50pl86L94J62J74k87j58LK46J3m30L34Q9J56m69J4lL53j5
8123A94j18j30LJ54k35K98m46K89rJ10k10k0l8L73k10j12J49k39LJ83J28j78J13
8146E2M95l58k03k34o2P51n20J64j80K34l9p3r8j56M95m80j38M2L98Kj41K39p
8169A83n86P88j83j09l03K22K1R8N1l30Q2J75j58M4q8p1M63p9j51l22L07L30
8191C84
$$ Imaginary data points
##PAGE= N=2
##DATA TABLE= (X++(I..I)), XYDATA
$$ plain form
0 0 0 0 0 0 0 0 0 0 0 3 -8 8 -8 8 -16 16 -17 24 -25 32 -35 41 -48 56 -65 73 -82 94 -106 119 -134 151 -169
33 -169 189 -212 235 -262 291 -322 356 -396 438 -485 536 -593 661 -734 819 -915 1029 -1163
51 -1163 1325 -1524 1778 -2115 2580 -3274 4415 -6627 12554 -61248 -176379 -70247 18892
64 18892 -1022 -100156 -120825 -64548 -11535 -34370 -81801 -92040 -44604 -8903 -35897 -93118
76 -93118 -87589 -15202 27551 -27727 -104234 -91275 4539 54819 -3266 -89192 -82794 7154 59812
89 59812 9188 -63391 -51803 24055 50835 -3838 -48924 -10243 55856 47269 -25621 -52393
101 -52393 11658 80696 59893 -21036 -55377 458 73598 72213 -329 -49031 -8619 64446
113 64446 66732 -4061 -41727 7507 64232 37916 -30103 -32682 35249 70814 15785 -56247
$$ packed form
0@%%%%%%%%%Lj1J6j6J6k4L2l3M1m9N7o7P6q9J04j21J38j55J76k00K25k53K85l20
33a69L58m01M47m97N53o13O78p52Q34r23J021j129J254j395J553j734J944k192
51a163K488k849L302l893M695n854P689j1042J9181p3802j15131J06132Q9139
64A8892j9914r9134k0669N6277N3013k2835m7431j0239M7436L5701k6994n7221
76i3118N529P2387M2753n5278p6507J2959R5814N0280n8085q5926O398Q9948N2658
89E9812n0624p2579J1588P5858K6780n4673m5086L8681O6099q587p2890k6772
101e2393O4051O9038k0803q0929l4341N5835P3140j385p2542m8702M0412P3065
113F4446K286p0793l7666M9234N6725k6316o8019k579O7931L5565n5029p2032
$$ plain form
125 -56247 -42766 41267 80704 17893 -64424 -55078 30573 71856 16216 -52645 -43222 19393
137 19393 44613 4233 -38506 -24726 23547 34714 -13430 -53834 -20485 49213 51245 -28473
149 -28473 -78636 -20891 66883 58700 -32166 -76057 -14773 58621 45923 -23288 -49221 -4236
161 -4236 40442 25149 -21587 -29782 14219 47745 16825 -39299 -36972 30514 71337 22715 -51313
174 -51313 -45930 33718 78904 30032 -42314 -41053 27516 67764 28829 -28488 -20738 37270 55313
187 55313 5377 -33091 3169 62040 52967 -14315 -42889 9012 71209 60209 -9903 -47864
199 -47864 -5223 62387 65927 1550 -43229 -9274 50932 49464 -8070 -32938 9958 51406
211 51406 23912 -34504 -35039 26471 60265 12480 -55055 -48078 25056 62975 12041 -58678 -55070
$$ packed form
125e6247J3481Q4033L9437o2811q2317R346Q5651M1283n5640o8861R423O2615
137A9393K5220m0380m2739J3780M8273J1167m8144m0404L3349O9698K032p9718
149b8473n0163N7745Q7774q183r0866m3891O1284P3394j2698o9211k5933M4985
161d236M4678j5293m6736q195M4001L3526l0920n6124K327O7486M0823m8622p4028
174e1313N383P9648M5186m8872p2346J261O8569M0248l8935n7317P750N8008J8043
187E5313m9936l8468L6260N8871r073o7282k8574N1901O2197j1000p0112l7961
199d7864M2641O7610L540o4377m4779L3955O0206j468n7534k4868M2896M1448
211E1406k7494n8416n35O1510L3794m7785o7535O977P3134L7919n0934p0719L608
$$ plain form
224 -55070 11546 47156 6677 -48919 -44871 3727 24558 -10335 -47841 -31879 13300 20304
236 20304 -28586 -64981 -30737 32285 32655 -38052 -81162 -32763 40369 36598 -34735 -70429 -26784
249 -26784 29590 23136 -26464 -46512 -12414 24794 12003 -29823 -36880 6609 40024 9741
261 9741 -44194 -40768 21445 58492 16690 -47110 -44995 19498 59765 24630 -34363 -36558 16729
274 16729 48591 16305 -29164 -18447 29911 40790 -5500 -38253 -4787 47712 41310 -17898
286 -17898 -48186 -7494 49439 46606 -11969 -48836 -17050 39978 45040 -7026 -42798 -13767
298 -13767 34424 30359 -16870 -34224 5455 39557 13513 -36217 -34899 19898 51184 12667
310 12667 -44946 -43579 16710 53728 18123 -39354 -41053 10368 41927 12639 -30137 -26985 12886
$$ packed form
224e5070O6616L5610m0479n5596M048M8598K0831l4893l7506J5962M5179P004
236B0304m8890l6395L4244O3022L70p0707m3110M8399P3132l771p1333l5694M3645
249b6784N6374o454m9600k0048L4098L7208j2791m1826p057M3489L3415l0283
261I741n3935L426O2213L7047m1802o3800K115O4493M0267l5135n8993k195N3287
274A6729L1862l2286m5469J0717M8358J0879m6290l2753L3466N2499o402n9208
286a7898l0288M0692N6933k833n8575l6867L1786N7028N062n2066l5772K9031
298a3767M8191m065m7229j7354L9679L4102k6044m9730J318N4797L1286l8517
310A2667n7613J367O0289L7018l5605n7477j699N1421L1559k9288m2776L152L9871
$$ plain form
323 12886 29318 -905 -32157 -16415 25484 31251 -13883 -47572 -17562 38953 40973 -18228
335 -18228 -56904 -21590 38128 39333 -14707 -47444 -18408 25856 24499 -14600 -32974 -6338
347 -6338 24726 11922 -27222 -33171 7962 38543 11093 -39920 -41513 12014 48147 16765 -38411
360 -38411 -42600 7984 43897 18808 -29032 -32813 9244 35440 8622 -28216 -17437 24652
372 24652 32298 -8625 -36859 -7950 38896 36841 -12900 -43217 -13077 37362 42000 -4596 -40284
385 -40284 -18676 29074 36528 -4110 -33006 -9618 27981 21990 -17376 -28559 6619 34803
397 34803 12075 -31677 -33066 12312 43020 14904 -35275 -39893 7878 42804 18897 -28404
409 -28404 -34636 5433 32183 11453 -22335 -19356 13620 26175 -614 -27220 -11581 27554
$$ packed form
323A2886J6432l0223l1252J5742M1899N767m5134l3689L0010N6515K020n9201
335a8228l8676L5314N9718J205n4040l2737K9036M4264j357l9099j8374K6636
347f338L1064j2804l9144n949M1133L0581k7450n1013j593N3527L6133l1382n5176
360c8411m189N0584L5913k5089m7840l781M2057K6196k6818l6838J0779M2089
372B4652P646m0923k8234K8909M6846k055m9741l0317L0140N0439M638m6596l5688
385d0284K1608M7750P454m0638k8896K3388L7599n991l9366j1183L5178K8184
397C4803k2728m3752j389M5378L0708k8116n0179m618M7771L4926k3907m7301
409b8404o232M0069K6750k0730l3788K979L2976J2555k6789k6606J5639L9135
$$ plain form
421 27554 33957 -6335 -38207 -13646 36822 42767 -4804 -40106 -14722 34153 39453 -1556 -29347
434 -29347 -7955 27012 26520 -5904 -20761 3494 29920 16964 -19344 -26046 11296 40273 16481
447 16481 -30199 -35393 8622 41940 18909 -28700 -37671 1454 31504 13280 -25159 -29691 3355
460 3355 21991 -1870 -31863 -20699 14774 20219 -15660 -42395 -19514 21536 24458 -16365 -46378
473 -46378 -26115 17797 26892 -9810 -42018 -26655 12122 19802 -11952 -33108 -13055 16031
485 16031 9296 -23086 -30658 809 26433 8266 -30393 -35013 3749 34754 15533 -27723 -36397
498 -36397 1489 33827 17756 -20476 -26247 4975 26698 10264 -16565 -12657 15574 26396
510 26396 1892 -22607 -8604 28125 36410 639 -30044 -11623 33366 43474 5080 -26826
$$ packed form
421B7554O403m0292l1872K4561N0468N945m7571l5302K5384M8875N300m1009k7791
434b9347K1392L4967m92l2424j4857K4255K6426j2956l6308o702L7342K8977k3792
447A6481m6680n194M4015L3318k3031m7609q971L9125L0050j8224l8439m532L3046
460C355J8636k3861k9993J1164L5473N445l5879k6735K2881M1050K922m0823l0013
473d6378K0263M3912R095l6702l2208J5363L8777P680l1754k1156K0053K9086
485A6031o735l2382p572L1467K5624j8167l8659m620L8762L1005j9221m3256q674
498c6397L7886L2338j6071l8232n771L1222K1723j6434k6829L908K8231J0822
510B6396k4504k4499J4003L6729Q285l5771l0683J8421M4989J0108l8394l1906
$$ plain form
522 -26826 -9689 30216 37102 6419 -15468 523 28373 27397 486 -11315 10907 35850 24667
535 24667 -9806 -17414 15986 44202 26501 -14789 -23684 11608 42776 27532 -11967 -22459
547 -22459 6573 31420 18202 -12127 -15745 9962 23610 1940 -23254 -13662 17269 22622 -9105
560 -9105 -35454 -20551 16371 23503 -10000 -40447 -28605 7763 18461 -10394 -38366 -28295
572 -28295 2181 7223 -18555 -35355 -17721 5767 -1590 -29946 -37196 -9887 14782 1226 -34461
585 -34461 -42564 -9846 20640 8780 -28873 -40068 -9638 18933 8336 -21324 -25950 -992
597 -992 16464 2436 -19051 -14211 12237 22636 752 -22675 -11319 23649 34860 4991 -24478
610 -24478 -10908 28225 39655 10800 -16682 -5110 26568 34004 11169 -6114 5926 28475
$$ packed form
522b6826J7137L9905O886l0683k1887J5991K7850r76k6911j1801K2222K4943j1183
535B4667l4473p608L3400K8216j7701m1290q895L5292L1168j5244l9499j0492
547b2459K9032K4847j3218l0329l618K5707J3648k1670k5194R592L0931N353l1727
560i105k6349J4903L6922P132l3503l0447J1842L6368J0698k8855k7972J0071
572b8295L0476N042k5778j6800J7634K3488p357k8356p250K7309K4669j3556l5687
585c4461q103L2718L0486j1860l7653j1195L0430K8571j0597k9660m626K4958
597i92J7456j4028k1487M840K6448J0399k1884k3427J1356L4968J1211k9869k9469
610b4478J3570L9133J1430k8855k7482J1572L1678P436k2835j7283J2040K2549
$$ plain form
622 28475 27249 4330 -5710 14537 37806 28260 -3493 -13242 15010 43234 31616 -4689 -16160
635 -16160 11086 38416 28879 -2443 -12474 9226 29447 19371 -5014 -7463 14183 25010
647 25010 6327 -15929 -8095 20327 26809 -864 -26344 -15698 16542 26688 -493 -28925
659 -28925 -22429 7754 18311 -4741 -27259 -20113 3338 6075 -16256 -29247 -13884 6092 -1003
672 -1003 -28112 -37140 -13987 10074 -33 -32939 -44289 -18033 9546 805 -31555 -42342 -19475
685 -19475 3789 -4397 -27996 -32437 -12808 755 -11769 -30238 -26230 -1689 8247 -11824 -34942
698 -34942 -26335 5838 18491 -6173 -33138 -24045 8719 20717 -951 -22603 -14446 10276 17328
711 17328 325 -12894 -2272 17325 17199 -3290 -12554 6290 29051 22643 -5655 -15616 8622
$$ packed form
622B8475j226k2919j0040K0247K3269r546l1753r749K8252K8224j1618l6305j1471
635a6160K7246K7330r537l1322j0031K1700K0221j0076k4385k449K1646J0827
647B5010j8683k2256P834K8422O482k7673k5480J0646L2240J0146k7181k8432
659b8925O496L0183J0557k3052k2518P146K3451K737k2331j2991J5363J9976p095
672a003k7109r028K3153K4061j0107l2906j1350K6256K7579q741l2360j0787K2867
685a9475K3264q186k3599m441J9629J3563j2524j8469M008K4541R936k0071k3118
698c4942Q607L2173J2653k4664k6965R093L2764J1998k1668k1652Q157K4722P052
711A7328j7003j3219J0622J9597j26k0489r264J8844K2761o408k8298r961K4238
$$ plain form
724 8622 35560 28108 -2103 -13537 7612 31323 26654 3364 -5544 11129 27349 19093 -236
737 -236 -1005 19175 29505 12250 -9058 -3190 23271 33044 10525 -14104 -7780 21073 32565
750 32565 11415 -12771 -9196 15294 25147 7769 -10137 -3981 15210 16962 -1600 -12496 1172
763 1172 20536 14937 -9829 -20035 36 23803 17154 -11632 -24351 -4149 20010 15767 -9948
776 -9948 -20554 -4225 13837 7418 -11464 -15292 654 11693 632 -17516 -14771 6358 16068
789 16068 -2079 -25130 -19522 7667 19796 -312 -24796 -20495 4594 15218 -454 -18806
801 -18806 -14383 3810 8944 -4828 -16704 -7599 9726 9045 -10938 -20814 -3978 17462 13147
814 13147 -12856 -23856 -4368 18642 14819 -9088 -20182 -4383 14599 12181 -6545 -14022 -373
$$ packed form
724H622K6938p452l0211j1434K1149K3711m669k3290q908J6673J6220q256j9329
737b36p69K0180J0330j7255k1308N868K6461R773k2519k4629O324K8853J1492
750C2565k1150k4186L575K4490R853j7378j7906O156J9191J752j8562j0896J3668
763A172J9364n599k4766j0206K0071K3767o649k8786j2719K0202K4159m243k5715
776i948j0606J6329J8062o419j8882l828J5946J1039j1061j8148K745K1129R710
789A6068j8147k3051N608K7189J2129k0108k4484M301K5089J0624j5672j8352
801a8806M423J8193N134j3772j1876R105J7325o81j9983r876J6836K1440m315
814A3147k6003j1000J9488K3010l823k3907j1094J5799J8982k418j8726p477J3649
$$ plain form
827 -373 13439 6177 -10640 -11046 7714 17660 2497 -18227 -13391 11149 21495 3305 -19290
840 -19290 -16151 7427 19299 4329 -15905 -13870 5248 13757 547 -14162 -8432 8019 9667
853 9667 -7414 -17178 -4289 13679 10491 -11467 -21749 -5531 16187 13769 -10147 -22142 -7118
866 -7118 13679 11928 -7564 -16547 -3930 10186 6282 -8786 -11002 2816 12805 3075 -13770
879 -13770 -12646 7791 19023 4315 -16781 -14321 8974 21016 6122 -14293 -12822 6657 16393
892 16393 4919 -9845 -7433 7472 12225 -228 -11170 -2559 13332 12854 -6187 -16609 -2339
905 -2339 17727 15228 -6938 -18763 -4507 15904 14726 -4394 -15383 -4376 11473 10147 -4705
918 -4705 -11006 437 12198 5287 -10561 -11194 6617 16520 3622 -15262 -12691 7848 18613
$$ packed form
827c73J3812p262j6817m06J8760R946j5163k0724M836K4540J0346j8190k2595
840a9290L139K3578J1872j4970k0234K035J9118Q509j3210j4709N730J6451J648
853I667j7081r764J2889J7968l188k1958j0282J6218K1718k418k3916j1995J5024
866g118K0797j751j9492q983J2617J4116l904j5068k216J3818R989r730j6845
879a3770J124K0437J1232j4708k1096K460K3295J2042j4894k0415J471J9479R736
892A6393j1474j4764K412J4905M753j2453j0942Q611J5891m78j9041j0422J4270
905b339K0066k499k2166j1825J4256K0411j178j9120j0989J1007J5849j326j4852
918d705o301J1443J1761o911j5848o33J7811R903j2898j8884K571K0539J0765
$$ plain form
931 18613 5453 -14245 -13733 4873 16691 6700 -10467 -9918 4954 12011 1767 -10074 -4524
944 -4524 10423 11155 -4232 -13712 -2378 14602 13452 -6035 -17048 -4681 14457 14427 -4355 -15822
958 -15822 -5844 10948 11032 -3992 -11699 -2079 9162 5500 -7710 -9854 2894 12323 2872 -13025
972 -13025 -12386 5739 16498 4210 -14452 -14364 4150 15920 5758 -11184 -11390 3175 11683 3089
986 3089 -9045 -6518 6286 10423 -1389 -11365 -3180 12003 12103 -5085 -14619 -3488 14582 13985
1000 13985 -3893 -14769 -5053 11748 12866 -1959 -11307 -3980 9160 8281 -4478 -9518 997
1013 997 10877 3933 -10370 -11034 4537 13526 3452 -13048 -13099 3500 13939 4627 -11385 -13285
1027 -13285 990 11060 3875 -9685 -9943 2341 7997 -1027 -10638 -5382 7192 8043 -5252 -13769
$$ packed form
931A8613j3160j9698N12J8606J1818r991j7167N49J4872P057j0244j1841N550
944d524J4947P32j5387r480J1334J6980j150j9487j1013J2367J9138l0j8782j1467
958a5822R978J6792Q4j5024p707R620J1241l662j3210k144J2748R429r451j5897
972a3025O39J8125J0759j2288j8662Q8J8514J1770j0162j6942k06J4565Q508q594
986C089j2134K527J2804M137j1812r976Q185J5183J00j7188r534J1131J8070n97
1000A3985j7878j0876R716J6801J118j4825r348P327J3140q79j2759n040J0515
1013I97R880o944j4303o64J5571Q989j0074j6500n1J6599J0439r312j6012j900
1027a3285J4275J0070p185j3560k58J2284N656r024r611N256J2574Q51j3295q517
$$ plain form
1041 -13769 -4668 10956 11004 -4438 -14911 -6191 10154 12358 -2389 -12334 -4997 8326 9130 -2559
1055 -2559 -8738 -595 8983 5019 -6441 -8297 3570 12542 4435 -10281 -10885 4847 14812 5682
1069 5682 -10386 -11859 2741 12721 5208 -8238 -9516 2099 8978 1509 -8187 -5655 5552 8034
1083 8034 -2928 -11823 -4322 9715 10306 -4578 -14053 -5386 9975 10976 -2894 -13030 -6109 7570
1097 7570 8974 -2226 -9406 -3431 7135 5406 -4606 -8047 1577 9966 3647 -8706 -9128 4204
1111 4204 12618 4874 -9448 -10483 2695 12580 6052 -7286 -9484 1837 10162 4294 -6551 -5782
1125 -5782 4645 8264 -414 -8278 -3189 8242 9409 -2824 -10859 -3442 10138 11238 -1877 -11524
1139 -11524 -4996 8792 10799 -405 -8747 -2842 7658 7654 -2055 -6270 970 8896 4697 -5707
$$ packed form
1041a3769R101J5624M8j5442j0473Q720J6345K204j4747r945P337J3323Q04j1689
1055b559o179Q143R578l964j1460j856J1867Q972q107j4716o04J5732R965r130
1069E682j6068j473J4600R980p513j3446j278J1615O879p469r696K532J1207K482
1083H034j0962q895P501J4037N91j4884r475Q667J5361J001j3870j0136O921J3679
1097G570J404j1200p180N975J0566j729j0012l441R624Q389o319j2353m22J3332
1111D204Q414p744j4322j035J3178R885o528j3338k198J1321Q325n868j0845P69
1125e782J0427L619q678p864N089J1431J167j2233q035P417J3580J100j3115r647
1139a1524O528J3788K007j1204q342N905J0500mr709m215P240P926m199j0404
$$ plain form
1153 -5707 -7094 3984 12356 5472 -7632 -8699 3751 13070 6542 -6622 -8613 2524 11106 5348
1167 5348 -4963 -5729 3379 8155 1458 -6356 -3436 6080 7480 -2497 -10071 -3668 8097 8893 -3188
1182 -3188 -12228 -5576 6660 8385 -2254 -11002 -6305 3935 5334 -3340 -9275 -3583 3998 2095
1196 2095 -7160 -9710 -286 6390 823 -10226 -11157 291 8226 2396 -9830 -11509 -1010 7675
1210 7675 2985 -7623 -9179 -478 5636 978 -6852 -5631 3430 5576 -1845 -8476 -3243 7135
1224 7135 7754 -2130 -9739 -3816 7765 9751 -491 -8797 -3939 6770 8701 -82 -6129 -1414
1238 -1414 6351 5821 -1993 -4559 1989 8149 4325 -4786 -5837 3490 10719 5225 -5785 -7675 2775
1253 2775 10751 6002 -4522 -6726 1946 8278 3936 -3691 -3739 3446 6630 1040 -5124 -2287 6182
$$ packed form
1153e707j387J1078Q372o884j3104j067J2450R319o528j3164j991J1137Q582n758
1167E348j0311p66R108M776o697p814K920R516J400r977p574O403J1765P96j2081
1182c188r040O652J2236J725j0639q748M697J0240J399q674n935N692P581j903
1196B095r255k550R424O676n567j1049r31J1448P935n830j2226j679J0499Q685
1210G675m690j0608j556Q701O114m658p830J221R061K146p421o631N233J0378
1224G135O19r884p609N923J1581J986j0242q306M858J0709J931q783o047M715
1238a414P765n30p814k566O548O160l824r111j051R327P229n494j1010j890J0450
1253B775P976m749j0524k204Q672O332m342p627m8P185L184n590o164K837Q469
$$ plain form
1268 6182 7432 -1520 -8055 -2852 7240 8519 -1369 -8697 -3938 5990 7626 -340 -7115 -3434 4458
1283 4458 5008 -2233 -6191 -950 4740 2034 -5765 -7053 594 6830 2012 -7884 -8952 116 7096
1298 7096 2225 -7573 -9446 -1050 5780 1424 -6676 -7040 -428 3586 -862 -7003 -4779 2452 4239
1313 4239 -2714 -8366 -4077 5109 5987 -2875 -9368 -4277 5363 7181 -1129 -7586 -3645 4723 6344
1328 6344 -452 -4662 -492 5453 4058 -2583 -3861 2550 7890 4242 -3659 -4922 3251 9607 5644
1343 5644 -3776 -4863 2982 9624 5734 -2549 -3847 2960 6940 3696 -1949 -1811 4302 6371 951
1358 951 -4297 -1047 6689 7314 -342 -6219 -2131 6502 8128 -218 -6494 -2911 5172 6595 -270
1373 -270 -4832 -1591 4176 4083 -2006 -4607 450 4781 2227 -4806 -5521 1362 6776 2700 -5560 -7073
$$ packed form
1268F182J250q952o535N203J0092J279r888p328M759R928J636p966o775L681P892
1283D458N50p241l958N241N690k706p799j288P647O236m818r896j068R068O980
1298G096m871r798j873Q396O830m356q100l64O612M014m448o141K224P231J787
1313D239o953n652M289R186Q78q862o493N091R640J818q310o457L941Q368J621
1328F344o796m210M170N945j395o641j278O411N340l648p901j263Q173O356l963
1343E644r420j087P845O642l890q283j298O807L980l244n645J38O113K069n420
1358I51n248L250P736O25p656n877M088Q633J626q346o276L583Q083J423o865
1373b70m562L241N767r3o089k601N057M331k554p033p15O883N414m076q260j513
$$ plain form
1389 -7073 773 6626 3160 -5151 -6261 -224 4607 1631 -4459 -4617 938 3460 -1111 -5645 -3374
1404 -3374 2698 3362 -2715 -7585 -3915 3601 4903 -2606 -8359 -4768 3170 4735 -1930 -7047 -3982
1419 -3982 2201 2462 -2427 -5288 -1720 2605 905 -4088 -5311 227 4452 1404 -5572 -6708 443
1434 443 5912 2590 -4796 -6132 127 5236 2176 -3879 -3985 1008 3960 992 -3415 -2334 2962
1449 2962 4278 -417 -4605 -1823 4458 5568 -1053 -5522 -2353 5168 6045 -264 -4929 -2462 3530
1464 3530 4363 -396 -3577 -988 3524 2710 -2125 -3638 913 4864 2290 -4060 -4500 1617 6107 3056
1480 3056 -4079 -4945 1104 5518 3042 -3200 -4017 990 4394 1812 -2547 -2163 2035 3898 24 -3721
1496 -3721 -1298 4393 4791 -709 -4691 -1604 4497 5308 -254 -4795 -2083 3836 4752 238 -3321 -1238
$$ packed form
1389g073P846N853l466q311j110O037M831k976o090j58N555K522m571m534K271
1404c374O072O64o077m870L670P516J302p509n753L591P938J565o665n117L065
1419c982O183K61m889k861L568M325j700m993j223N538M225l048o976j136P151
1434D43N469l322p386j336O259N109l060o055j06M993K952k968m407J081N296
1449B962J316m695m188K782O281J110o621m469L169P521Q77o309m665K467N992
1464C530Q33m759l181K589M512q14m835j513M551L951k574o350m40O117M490l051
1480C056p135q66O049M414k476o242q17N007L404k582m359L84M198J863l874l745
1496c721K423N691L98n500l982L087O101Q11n562m541K712N919R16m514l559K083
$$ plain form
1512 -1238 3247 3176 -1036 -2684 265 3714 2237 -2804 -3602 1351 5181 2131 -3547 -4710 841 5164
1528 5164 2330 -3346 -4100 370 3984 1720 -2591 -2739 942 3038 -148 -3232 -1884 2705 3376 -1119
1544 -1119 -4738 -1942 3710 4574 -813 -5060 -2292 3352 4079 -401 -3862 -1804 2722 3007 -718 -3075
1560 -3075 -599 2920 1805 -1966 -2807 920 3951 1587 -3715 -3838 1392 4559 2145 -3466 -4132 541
1576 541 3811 1646 -2860 -3334 257 2930 497 -2638 -1929 1804 2545 -1220 -3980 -1590 2803 3130
1592 3130 -1422 -4802 -1755 2693 3534 -950 -4542 -2037 2417 2993 -871 -3277 -813 2027 1456 -1670
1608 -1670 -2536 341 3223 1537 -2864 -3282 1065 4243 1701 -3311 -3733 744 3946 1874 -2624 -3363
1624 -3363 397 2918 1006 -2175 -2118 1018 2460 -241 -2896 -1472 2551 2727 -1227 -3932 -1684 2856
$$ packed form
1512a238M485p1m212j648K949L449j477n041p98M953L830l050n678j163N551M323
1528E164k834n676p54M470L614k264m311j48L681K096l186l084J348M589O71m495
1544a119l619K796N652Q64n387m247K768N644P27m480l461K058M526K85l725k357
1560c075K476L519j115l771q41L727L031k364n302j23N230L167k414n611o66M673
1576E41L270k165m506m74L591K673k433l135P09L733P41l765k760K390M393L27
1592C130m552l380L047M448Q41m484l592K505M454N76l864k406K464K840n71l126
1608a670q66K877K882j686m401m18M347L178k542n012m22M477L202k072m498p39
1624c363L760K521j912l181N7L136J442k701k655J424M023J76l954k705K248M540
$$ plain form
1640 2856 2987 -984 -4143 -2003 2529 2739 -725 -3086 -1528 1675 1633 -873 -2392 -172 2192 1028
1656 1028 -2456 -2504 787 3077 1172 -2976 -3044 981 3777 1558 -2550 -2569 387 2946 1390 -1582
1672 -1582 -1970 949 2657 438 -2063 -635 2298 2520 -737 -2580 -896 3072 2991 -819 -3450 -1007
1688 -1007 2796 2991 -246 -2813 -1189 1911 2053 -998 -2085 -87 2525 926 -1687 -1849 972 2740
1704 2740 971 -2752 -2596 1239 3351 1405 -2252 -2560 765 3303 1375 -1860 -2001 1141 2543 951
1720 951 -1458 -847 1966 2314 -393 -2008 -378 2722 2752 -625 -2579 -700 2824 2869 -480 -2494 -889
1737 -889 2292 2789 -244 -1906 31 2021 1703 -778 -1398 494 2567 730 -2180 -1887 1221 2917
1753 2917 625 -2114 -2400 537 2748 838 -2236 -2184 380 1855 819 -1924 -1699 887 1283 -774
$$ packed form
1640B856J31l971l159K140M532K10l464k361J558L203m2k506j519K220K364j164
1656A028l484m8L291K290j905m148o8M025K796k219m108j9K956K559j556k972
1672a582l88K919J708k219k501J428K933K22l257j843J684L968q1l810k631K443
1688a007L803J95l237k567J624L100J42l051j087J998K612j599k613j62K821J768
1704B740j769l723J56L835K112j946l657l08L325K538j928l235j41L142J402j592
1720I51k409O11K813L48k707j615J630L100L0l377j954J879L524M5l349k014J605
1737h89L181M97l033j662J937J990l18k481o20J892K073j837k910K93L108J696
1753B917k292k739k86K937K211j910l074N2K564J475j036k743K25K586L96k057
$$ plain form
1769 -774 -2157 -705 1945 1641 -1352 -2923 -968 2315 1952 -1133 -2777 -1067 1661 1754 -1000 -2483
1785 -2483 -971 1617 882 -1457 -1900 -237 1267 58 -2187 -2271 924 2055 55 -2529 -2516 553
1801 553 2183 76 -2859 -2065 -142 1552 346 -2169 -2067 184 1125 -442 -2202 -820 1148 1140 -1010
1818 -1010 -2400 -399 1960 1605 -1067 -2759 -692 1998 1723 -1141 -2104 -554 2091 1540 -577 -1409
1834 -1409 273 1953 857 -761 -879 1618 2526 508 -1514 -1095 1828 2800 651 -1687 -1076 1636
1850 1636 2527 1019 -1215 -837 1189 1985 330 -1006 -154 1779 1596 -382 -1274 300 2481 1333
1866 1333 -730 -2351 67 2218 1946 -692 -2086 12 2004 1694 -759 -1407 171 1549 729 -859
1882 -859 -1210 621 1662 113 -1593 -1254 1071 1998 -98 -2160 -1561 810 2012 284 -1988 -1760
$$ packed form
1769g74j383J452K650l04k993j571J955L283l63l085j644J710K728R3k754j483
1785b483J512K588p35k339m43J663J504j209k245q4L195J131k000k584J3L069
1801E53J630k107k935P94J923J694j206k515J02K251R41j567j760J382J968qk150
1818a010j390K001K359l55k672j692K067K690k75k864r63J550K645n51k117q32
1834a409J682J680j096j618j18K497R08k018k022M19K923R72k149k338O11K712
1850A636Q91j508k234L78K026P96j655j336Q52J933j83j978q92J574K181j148
1866A333k063j621K418K151k72k638j394K098J992l10k453o48J578J378q20j588
1882h59l51J831J041j549j706L39K325R27k096k062N99K371J202j728k272K28
$$ plain form
1898 -1760 576 1594 -327 -1894 -1296 678 502 -949 -1767 -539 1290 776 -1722 -2213 -303 1721
$$ packed form
1898a760K336J018j921j567N98J974j76j451q18J228J829n14k498m91J910K024
$$ [...]
8191G2
##END NTUPLES=NMR FID
##END=
