##TITLE=1H_AM A513
 CDCl3, 8 sc, 
 1.8.2019
##JCAMPDX= 6.0         $$ Bruker NMR JCAMP-DX V2.0
##DATA TYPE= NMR FID
##DATA CLASS= NTUPLES
##ORIGIN= UXNMR, Bruker Analytische Messtechnik GmbH
##OWNER= root
$$ XWIN-NMR		Version 3.5
$$ Thu Aug  1 15:27:40 2019 Russian Standard Time (UT+4h)  she@DPX200
##.OBSERVE FREQUENCY= 200.13155
##.OBSERVE NUCLEUS= ^1H
##.DELAY= (6, 6)
##.ACQUISITION MODE= SIMULTANEOUS
##.ACQUISITION SCHEME= undefined
##.AVERAGES= 8
##.DIGITISER RES= 18
##SPECTROMETER/DATA SYSTEM= spect
##.PULSE SEQUENCE= zg30
##.SOLVENT NAME= DMSO
##.SHIFT REFERENCE= (INTERNAL, DMSO, 0, 15.7039)
##AUDIT TRAIL= $$ (NUMBER, WHEN, WHO, WHERE, WHAT)
$$ ##TITLE= Audit trail, XWIN-NMR		Version 3.5
$$ ##JCAMPDX= 5.01
$$ ##ORIGIN= Bruker BioSpin GmbH
$$ ##OWNER= she
$$ F:/spectra/data/she/nmr/H-F/1/audita.txt
$$ ##AUDIT TRAIL=  $$ (NUMBER, WHEN, WHO, WHERE, WHAT)
(   1,<2019-08-01 15:26:36.98 +0400>,<she>,<DPX200>,
      <created by zg, POWCHK disabled, PULCHK disabled
       configuration hash MD5:
       00 E9 B6 7A A2 85 ED C7 34 08 36 98 17 FE 4E 26
       data hash MD5: 16K
       5E 59 33 62 95 D7 D5 5F 25 FD 92 F1 94 71 23 AD>)
$$ ##END=
$$ 
$$ hash MD5
$$ B3 EC 5D 8C 6A A4 DA 20 57 21 4E 38 BF 07 20 57
##$RELAX= 
##$RELAX= 
##$RELAX= 
##$RELAX= 
##$RELAX= 
##$RELAX= 
$$ Bruker specific parameters
$$ --------------------------
##$DU= <F:/spectra>
##$EXPNO= 1
##$NAME= <H-F>
##$PROCNO= 1
##$TYPE= <nmr>
##$USER= <she>
##$AMP= (0..31)
100 100 100 100 100 100 100 100 100 100 100 100 100 100 100 100 100 100 
100 100 100 100 100 100 100 100 100 100 100 100 100 100 
##$AQSEQ= 0
##$AQ_mod= 1
##$AUNM= <au_zg>
##$AUTOPOS= <>
##$BF1= 200.13
##$BF2= 200.13
##$BF3= 200.13
##$BF4= 200.13
##$BF5= 200.13
##$BF6= 200.13
##$BF7= 200.13
##$BF8= 200.13
##$BYTORDA= 1
##$CFDGTYP= 0
##$CFRGTYP= 5
##$CHEMSTR= <none>
##$CNST= (0..31)
1 1 145 1 1 1 1 1 1 1 1 1 1 1 1 1 1 1 1 1 1 1 1 1 1 1 1 1 1 1 1 1 
##$CPDPRG= <>
##$CPDPRG1= <>
##$CPDPRG2= <>
##$CPDPRG3= <>
##$CPDPRG4= <mlev>
##$CPDPRG5= <mlev>
##$CPDPRG6= <mlev>
##$CPDPRG7= <mlev>
##$CPDPRG8= <mlev>
##$CPDPRGB= <>
##$CPDPRGT= <>
##$D= (0..31)
0 1.2 0 0 0 0 0 0 0 0 0 0.03 0 0 0 0 0 0 0 0 0 0 0 0 0 0 0 0 0 0 0 0 
##$DATE= 1564658796
##$DBL= (0..7)
120 120 120 120 120 120 120 120 
##$DBP= (0..7)
150 150 150 150 150 150 150 150 
##$DBP07= 0
##$DBPNAM0= <>
##$DBPNAM1= <>
##$DBPNAM2= <>
##$DBPNAM3= <>
##$DBPNAM4= <>
##$DBPNAM5= <>
##$DBPNAM6= <>
##$DBPNAM7= <>
##$DBPOAL= (0..7)
0.5 0.5 0.5 0.5 0.5 0.5 0.5 0.5 
##$DBPOFFS= (0..7)
0 0 0 0 0 0 0 0 
##$DE= 6
##$DECBNUC= <off>
##$DECIM= 24
##$DECNUC= <off>
##$DECSTAT= 4
##$DIGMOD= 1
##$DIGTYP= 9
##$DL= (0..7)
0 120 120 120 120 120 120 120 
##$DP= (0..7)
150 150 150 150 150 150 150 150 
##$DP07= 0
##$DPNAME0= <>
##$DPNAME1= <>
##$DPNAME2= <>
##$DPNAME3= <>
##$DPNAME4= <>
##$DPNAME5= <>
##$DPNAME6= <>
##$DPNAME7= <>
##$DPOAL= (0..7)
0.5 0.5 0.5 0.5 0.5 0.5 0.5 0.5 
##$DPOFFS= (0..7)
0 0 0 0 0 0 0 0 
##$DQDMODE= 0
##$DR= 18
##$DS= 0
##$DSLIST= <SSSSSSSSSSSSSSS>
##$DSPFIRM= 0
$$ [...]
##$SUBNAM2= <"">
##$SUBNAM3= <"">
##$SUBNAM4= <"">
##$SUBNAM5= <"">
##$SUBNAM6= <"">
##$SUBNAM7= <"">
##$SUBNAM8= <"">
##$SUBNAM9= <"">
##$SW= 24.9336996594482
##$SWIBOX= (0..15)
0 0 2 0 0 0 0 0 0 0 0 0 0 0 0 0 
##$SW_h= 4990.01996007984
##$TD= 16384
##$TD0= 1
##$TE= 0
##$TE2= 300
##$TE3= 300
##$TEG= 300
##$TL= (0..7)
0 120 120 120 120 120 120 120 
##$TP= (0..7)
150 150 150 150 150 150 150 150 
##$TP07= 0
##$TPNAME0= <>
##$TPNAME1= <>
##$TPNAME2= <>
##$TPNAME3= <>
##$TPNAME4= <>
##$TPNAME5= <>
##$TPNAME6= <>
##$TPNAME7= <>
##$TPOAL= (0..7)
0.5 0.5 0.5 0.5 0.5 0.5 0.5 0.5 
##$TPOFFS= (0..7)
0 0 0 0 0 0 0 0 
##$TUNHIN= 0
##$TUNHOUT= 0
##$TUNXOUT= 0
##$USERA1= <user>
##$USERA2= <user>
##$USERA3= <user>
##$USERA4= <user>
##$USERA5= <user>
##$V9= 5
##$VALIST= <valist>
##$VCLIST= <CCCCCCCCCCCCCCC>
##$VD= 0
##$VDLIST= <DDDDDDDDDDDDDDD>
##$VPLIST= <PPPPPPPPPPPPPPP>
##$VTLIST= <TTTTTTTTTTTTTTT>
##$WBST= 1024
##$WBSW= 4
##$XGAIN= (0..3)
0 0 0 0 
##$XL= 0
##$YL= 0
##$YMAX_a= 204668
##$YMIN_a= -263172
##$ZGOPTNS= <>
##$ZL1= 120
##$ZL2= 120
##$ZL3= 120
##$ZL4= 120
##$ABSF1= 10
##$ABSF2= 0
##$ABSG= 5
##$ABSL= 3
##$ALPHA= 0
##$AQORDER= 0
##$ASSFAC= 0
##$ASSFACI= 0
##$ASSFACX= 0
##$ASSWID= 0
##$AUNMP= <proc_1d>
##$AZFE= 0.1
##$AZFW= 0.1
##$BCFW= 1
##$BC_mod= 2
##$BYTORDP= 1
##$COROFFS= 0
##$CY= 11.3945322036743
##$DATMOD= 1
##$DC= 2
##$DFILT= <>
##$DTYPP= 0
##$F1P= 20.1537800932815
##$F2P= 0.134698688090026
##$FCOR= 0.5
##$FTSIZE= 0
##$FT_mod= 4
##$GAMMA= 1
##$GB= 0.15
##$INTBC= 1
##$INTSCL= 1
##$ISEN= 128
##$LB= 0.24
##$LEV0= 0
##$LPBIN= 0
##$MAXI= 10000
##$MC2= 0
##$MEAN= 0
##$ME_mod= 0
##$MI= 1.114404
##$NCOEF= 0
##$NC_proc= 0
##$NLEV= 6
##$NOISF1= 3.799351
##$NOISF2= 2.8
##$NSP= 1
##$NTH_PI= 0
##$NZP= 0
##$OFFSET= 15.70392
##$PC= 1
##$PHC0= -8859.008
##$PHC1= 9.600972
##$PH_mod= 1
##$PKNL= yes
##$PPARMOD= 0
##$PSCAL= 0
##$PSIGN= 0
##$REVERSE= no
##$SF= 200.130013532006
##$SI= 16384
##$SIGF1= 3
##$SIGF2= 2
##$SINO= 400
##$SIOLD= 16384
##$SREGLST= <1H.CDCl3>
##$SSB= 0
##$STSI= 0
##$STSR= 0
##$SW_p= 3612.71676300578
##$SYMM= 0
##$S_DEV= 0
##$TDeff= 0
##$TDoff= 0
##$TI= <>
##$TILT= no
##$TM1= 0
##$TM2= 0
##$TOPLEV= 0
##$USERP1= <user>
##$USERP2= <user>
##$USERP3= <user>
##$USERP4= <user>
##$USERP5= <user>
##$WDW= 1
##$XDIM= 8192
##$YMAX_p= 0
##$YMIN_p= 0
$$ End of Bruker specific parameters
$$ ---------------------------------
##NTUPLES= NMR FID
##VAR_NAME=  TIME,          FID/REAL,        FID/IMAG
##SYMBOL=    X,             R,               I
##VAR_TYPE=  INDEPENDENT,   DEPENDENT,       DEPENDENT
##VAR_FORM=  AFFN,          ASDF,            ASDF
##VAR_DIM=   8192,          8192,            8192
##UNITS=     SECONDS,       ARBITRARY UNITS, ARBITRARY UNITS
##FACTOR=    0.0002004,     1,               1
##FIRST=     0,             0,               0
##LAST=      1.6414764,     0,               0
##MIN=       0,             -263172,         0
##MAX=       1.6414764,     204668,          0
$$ Real data points
##PAGE= N=1
##DATA TABLE= (X++(R..R)), XYDATA
$$ [...]
2191e94k40n00K127J595k189l727J358L144N60k442j95J572q84j957J573K924
$$ -594 -834 -1334 793 2388 199 -3528 -2170 974 1534 -908 -1103 469 -415 -2372 -799 2125
2207B125q39m116n09M122J518k192j420J371j62j981O96L782j56k862k378K435
$$ 2125 1286 -2830 -3339 783 2301 109 -1311 60 -102 -2083 -1387 2395 2239 -623 -3001 -566
2223e66K591j261r95Q11k94j309Q38K356K55k587j714J143J528K30L86M83j537
$$ -566 2025 764 -231 580 286 -1023 -185 2171 2426 -161 -1875 -732 796 1026 1412 1895 358
2240C58k275Q58L046M06k719q51J565K57j284R17J994j431l713L26M567J356l211
$$ 358 -1917 -1059 1987 2393 -326 -1177 388 645 -639 278 2272 841 -2872 -2546 2021 3377 166
2257A66k181K038L56k057K16L450K30m189j654L602K528k221k885J551J332j332
$$ 166 -2015 23 379 -1678 -1462 1988 2218 -1971 -3625 -23 2505 284 -2601 -1050 282 -1050
2273a050l52K675J071l516k555K080L216l44j492j77J75j030j02K290R78k377
$$ -1050 -1402 1273 2344 -1172 -3727 -1647 1569 1225 -267 -444 -269 -1299 -1401 889 1867 -510
2289e10j911J780J936n59o35N27q69k096R75L515J240l284k105J461J539j308
$$ -510 -2421 -641 1295 736 101 628 -241 -2337 -1362 2153 3393 109 -1996 -535 1004 -304
2305c04k87K339K17l393j082L999K416l447l179J880K492q66j530K256J160l655
$$ -304 -591 1748 1965 -1428 -2510 1489 3905 458 -2721 -841 1651 785 -745 1511 2671 -984
2321i84k620K878L959j386l234M58K021n33j606J742J056k373k247J544L721m36
$$ -984 -3604 -726 3233 1847 -1387 -929 1092 559 -1047 695 1751 -622 -2869 -1325 2396 1960
2337A960k698q40J236r47K41K335P60k117k381J258K008l38j602J007M97k122
$$ 1960 -738 -1578 -342 -1289 -1048 1287 2047 -70 -2451 -1193 815 477 -1125 -118 379 -1743
2353a743p3L020J421l230l449K342K971o71j290J136Q40k723j899K927L768k166
$$ -1743 -1816 1204 2625 -605 -4054 -1712 1259 588 -702 434 1274 -1449 -3348 -421 3347 1181
2369A181l966J022L515l58k051N93J731j843k727K201M423n25m150r98K216J031
$$ 1181 -2785 -1763 1752 1394 -657 -64 1667 -176 -2903 -702 3721 3196 -954 -1952 264 1295
2385A295j598R05J665j393k565J034L140j28k868p97J484M03k66J003J036k267
$$ 1295 -303 602 2267 874 -1691 -657 2483 2355 -513 -1310 174 577 311 1314 2350 83
2401H3k691R62L692k48j956J67N84j509j354K674J918k109l615J226L935o6k753
$$ 83 -2608 -1646 2046 1798 -158 9 593 -916 -2270 404 2322 213 -3402 -2176 1759 1693 -1060
2418a060l46J715j398k096K069M213j045m927o78L878J202k315p43K145j30k698
$$ -1060 -1406 309 -1089 -3185 -1116 3097 2052 -2875 -3553 325 1527 -788 -1531 614 484 -2214
2434b214O75L642q7l937j242K796K009q36n42P11o19k439O23L292R69k413j470
$$ -2214 -1539 2103 2016 -1921 -3163 -367 1642 806 264 975 356 -2083 -1460 1832 2801 388 -1082
2451a082J231R59n96K07J066j283k237R50L547L88k598j450J331l7j276J314L074
$$ -1082 149 1108 512 719 1785 502 -1735 -785 2762 3150 552 -898 433 396 -880 434 3508
2468C508j593m010O8L429R67k637j511K276K22k112N60L178k72m523j569L997
$$ 3508 1915 -2095 -2027 1402 2369 -268 -1779 497 719 -1393 -833 2345 2073 -2450 -4019 -22
2484b2K024j752j756J196O89k311j56K759J416l475k083K362K708j172j225l1
$$ -22 2002 250 -1506 -310 379 -1932 -2088 671 2087 -1388 -3471 -1109 1599 427 -798 -829
2500h29K32j366O48K645J119k425k279J487J330j27j75R43m26k675O75K880R54
$$ -829 -597 -1963 -1315 1330 2449 24 -2255 -768 562 435 260 1203 777 -1898 -1223 1657 2611
2517B611k635j364J570Q26p04J04K084j093l231o01L868J950k714j652Q64J331
$$ 2611 -24 -1388 182 1008 304 408 2492 1399 -1832 -2433 1435 3385 671 -981 -117 1214
2533A214j434n03K101P08k925j907K688K960j398k741N2J447l53p68J740J076
$$ 1214 -220 -723 1378 2086 -839 -2746 -58 2902 1504 -1237 -1185 262 -91 -859 881 1957
2549A957k164k482J039K702K7j730j7On76M98J342N75j806j880J276J902R6n68
$$ 1957 -207 -2689 -1650 1052 1079 -651 -668 -662 -1238 -740 602 1177 -629 -2509 -1233 669 765 197
2567A97L63n66j993K31L218N46j985k058J163J682n34o23J378j73k294p95K735
$$ 197 560 -6 -1999 -1768 1450 1996 11 -2047 -884 798 264 -359 1019 846 -1448 -2243 492
2584D92K638j807l188K67K241k40m83P53J114j946k342J892K889l43k745q33J177
$$ 492 3130 1323 -1865 -1598 643 403 -80 673 1787 -159 -2501 -609 2280 1937 -808 -1641 -464
2601d64J199m66N68N30j588j710N93K721P61j550j656M55J33J92J594J47j662
$$ -464 735 269 837 1367 -221 -1931 -1338 1383 2144 594 -1062 -607 -474 -282 1312 1459 -203
2618b03j521P56J619N57o37m63j57j178K73J931J391k138k383R36J739M93j232
$$ -203 -1724 -968 651 1208 571 108 -49 -1227 -954 977 2368 230 -2153 -1217 522 1015 -217
2635b17L29j2r31q63J714K313j157k779o44K167Q53m02l18K58o90j555Q90K534
$$ -217 112 100 -831 -1694 20 2333 1176 -1603 -2247 -80 773 371 53 311 -379 -1934 -1044 1490
2653A490M39k410j216P45J242M74k87j62o79j045Q86J596L04p87j777q8P18Q11
$$ 1490 1929 -481 -1697 -952 290 764 477 315 -364 -1409 -523 1073 1377 590 -1187 -1275 -557 254
2671B54J312j01j394j521N94J559P14n88r44k73o30O30J660P68j538k102M39K203
$$ 254 1566 1465 71 -1450 -856 703 1417 829 -115 -388 -1018 -388 1272 2040 502 -1600 -1161 1042
2689A042L63o88n46J0n20o63J352J679m86k682j025J741J692R5j576l93j55j89
$$ 1042 1405 717 171 181 -339 -1002 350 2029 1543 -1139 -2164 -423 1269 1364 -212 -605 -760 -949
2707i49M68J281M26j320j727Q5J546J164k90j175m34l00N67J039P23o40j449p13
$$ -949 -481 800 1226 -94 -1821 -1736 -190 974 684 -491 -925 -1225 -658 381 1104 464 -985 -1698
2725a698P50J360Q05o02j591n71Q20J459L98q36p47jo11J053J051L73j556j365
$$ -1698 -948 412 1217 615 -976 -1547 -727 732 1130 294 -453 -454 -1065 -12 1039 1412 -144 -1509
2743a509L53J417J219l76j306k61k77N53Q01R88o78j169j215O70J814N67j025
$$ -1509 -1156 261 1480 1104 -202 -463 -740 -187 614 1602 924 -245 -1460 -790 1024 1591 566
2760E66j473J75K82O86N97o9o97j330j98J439J644l69j617r77L22J165L65r2n39
$$ 566 -907 -732 -450 236 833 764 67 -1263 -1461 -22 1622 1253 -364 -1341 -1019 146 511 419 -120
2779a20l70m67J25J430R27r79j982J38Q07J326m6p60n7n21k71O09J362m2j307
$$ -120 -490 -957 -832 598 1525 546 -1436 -1298 -491 835 789 29 -28 -549 -820 -211 1151 1109 -198
2798a98j201J83J541P87Pj278j060M72P60P12K96p27q22k33J06J356Q86p96j851
$$ -198 -1399 -1216 325 1112 1119 -159 -1219 -747 13 725 1021 294 -528 -761 -655 701 1587 791 -1060
2817a060o68J619J187j98o00l33l15p30Q41J706k0j891j122M21J766L54m12r77
$$ -1060 -1728 -109 1078 880 280 -53 -368 -1098 -257 1449 1429 -462 -1584 -1163 603 957 545 -432
2835d32K20j50l40J200J164o26k599l25K050J253n08r84l39j74j21Q88Q06o3j375
$$ -432 -212 -362 -702 498 1662 1036 -1563 -1888 162 1415 907 -77 -416 -590 -711 177 983 920 -455
2854d55r71R83R70M27N1j116r25J01P95J429j87j284o13K28M11L19J024l73j775
$$ -455 -1426 -443 527 954 1005 -111 -1036 -935 -140 1289 1102 -182 -795 -567 -156 163 1187 814 -961
2873i61n14P52J936l71j406o24J125l42J6P42R89j193k015L73K094R34j515o50
$$ -961 -1475 -723 1213 842 -564 -1188 -63 -405 -389 353 1342 149 -1866 -1493 601 1535 20 -630
2891f30N8M47p44P07J487r8k555o3J517J354q66j120K00j06j45P98J270m29j700
$$ -630 -572 -125 -869 -162 1325 1227 -1328 -1391 126 1480 614 -506 -306 -412 -557 241 1511 1082 -618
2910f18q34R14J243J01l91j54p02m89J183J351n07j781m90J004N33j53M39J24
$$ -618 -1452 -538 705 806 415 261 -441 -930 253 1604 1097 -684 -1174 -170 363 210 649 773
2928G73r08j230Q12J877J7j627j083J230M91m67K07Q94k75k529K96K348J041k001
$$ 773 -135 -1365 -553 1324 1341 -286 -1369 -139 352 -115 92 986 711 -1818 -1522 826 1867 -134
2946a34r53N88O36j22m12J277Q2j828j226K124J787j084j410j64J187p79L96J005
$$ -134 -1087 -499 137 15 -397 880 962 -866 -2092 32 1819 735 -675 -839 348 -431 -35 970
2964I70Q7j669j150J372J387L7j046j33oq51O15J485L69j706r89J102J170l50
$$ 970 1057 -612 -1762 -390 997 1034 -12 -145 -151 -1002 -387 1098 1467 -239 -1228 -126 1044 694
2982F94o86L99k11j435M30J924P94k195j414Q75J745o55n75O08P7j296p74K016
$$ 694 8 407 196 -1239 -809 1115 1909 -286 -1700 -825 920 265 -310 298 375 -921 -1695 321
3000C21J570j390j998K64J632L40q96P78J50j422j149J430K136o65j901k04Q87
$$ 321 1891 501 -1497 -1233 399 739 -157 621 771 -651 -1800 -370 1766 1101 -800 -1004 -117
3017a17j65P5O34M15j316o17Q77J700m13j251k34J35j37j52J594L81j539j599
$$ -117 -282 -207 427 842 -474 -1091 -214 1486 1073 -178 -412 -277 -414 -566 1028 1409 -130 -1729
3035a729J139J892n80j050M10K82r89m96J879R26j709k217J197K308k63j324K43
$$ -1729 -590 1302 722 -328 82 364 -625 -1121 758 1684 -25 -2242 -1045 1263 1000 -324 -81
3052h1N70j280j078J849J663q21k317J8J999L04j288J50O30o42j144J332J810
$$ -81 489 -791 -1869 -20 1643 822 -1495 -1477 522 826 -462 -312 318 -324 -1468 -136 1674
3069A674m55k233j61R41Q76m45L01L15q04j404J111J685m13j305j30N65L21n64
$$ 1674 1219 -1014 -1175 -234 642 197 498 813 9 -1395 -284 1401 988 -317 -447 118 439 -125
3087a25Q87N76j371j957J372K196l33j519k36R46o04m93P90J352j155j929M86
$$ -125 762 1338 -33 -1990 -618 1578 1245 -274 -510 436 -168 -661 129 1481 326 -1603 -1117
3104a117K079J08j560k79N54R4q57P48J689n27k359n50K050J070j044l41M78m15
$$ -1117 962 1070 -490 -769 -215 -121 -978 -230 1459 932 -1427 -1977 73 1143 99 -242 236 -179
3122a79o04K79J233o8j531n96J363P40Pl35l4n18j048Q05J562J91j632k54P41
$$ -179 -783 -504 729 661 -870 -1466 -103 637 644 309 275 -243 -1291 -486 1076 1267 -365 -619 122
3141A22M31p08N81M51j036r25N83J800K93j903j048J647r5n87P06J049l94k173
$$ 122 553 -155 426 877 -159 -1084 -501 1299 1592 -311 -1359 288 193 -394 312 1361 967 -1206
3159a206l20K194P89j769o69J020N15j102K41J139J34k123m91J660J331r09q21
$$ -1206 -1526 668 1457 -312 -981 39 554 -548 -307 832 966 -1157 -1648 12 1343 434 -387
3176c87KM55p63O1J085N41j342p66J085Q07n47p04N12m05j63K31J120K87j464
$$ -387 -385 70 -693 -632 453 994 -348 -1114 -29 778 231 -473 39 -366 -529 -298 822 1109 -355
3195c55r04Q76R15m90J89O14n23j424L19J654N75j617j212J358Q61p34o94J232
$$ -355 -1259 -383 532 42 231 845 322 -1102 -783 871 1446 -171 -1383 -25 836 102 -592 640
3213F40j84j326n82K025O67r92j054P4J248n66l56O59M29j187q23J417J189n04
$$ 640 456 -870 -1452 573 1240 248 -806 -732 516 -50 -406 253 682 -505 -1328 89 1278 774
3231G74j226l80Q58k01j11P51M11j125j031Q03J219j63p22K88k30n9O0P38J28
$$ 774 -452 -832 26 -175 -286 465 876 -249 -1280 -477 742 579 -143 145 -85 -144 -84 654 782
3250G82q57j160P84J060k55n37L80j44q37k7J527L95j165j120O84J204m55l65
$$ 782 -75 -1235 -451 609 354 -183 197 53 -784 -811 716 1111 -54 -1174 -490 714 259 -106
3268a06J46N15r20n24Q59J191q13j435p8J303L0K82l42N19p61q82P02R00J60j245
$$ -106 40 555 -365 -889 -30 1161 348 -1087 -1165 138 168 450 108 627 -134 -1016 -314 586 746 -499
3288d99m54Q16M44j16J27K4m62j068P18J380o7q08n67O68l33K9N71N75j107j041
$$ -499 -953 -137 307 191 318 342 -120 -1188 -470 910 843 35 -532 136 -197 -168 403 978 -129 -1170
3308a170Q49R34J15p59p2K76l47J6M87P53q98j019K32J082K62r01k67O91k96o66
$$ -1170 -321 613 728 -31 -103 173 -174 -158 329 1082 184 -835 -603 479 741 -160 -427 264 -32 -698
3328f98N41J287m98j349k77R76P00o87j61K06j45n06l7J177J19r33k76R8N63J25
$$ -698 -157 1130 632 -717 -994 -18 682 -5 -166 40 -105 -611 -648 529 648 -285 -561 -463 100 225
3348B25j06k8l51m44O21O07J18n47m68O1K59o3R00j27p80o49J80J172K32p75k48
$$ 225 119 91 -260 -704 -83 524 642 95 -373 -312 -53 -116 784 657 -123 -772 -592 580 812 37 -211
3369b11K02j35M8M80L20o29r44K97R34M84o33m81J63J29l7j43Q02j87q08l99N31
$$ -211 -9 -144 -96 384 704 75 -869 -572 362 846 213 -268 -105 24 -13 -156 646 459 -349 -748 -217
3390b17N09o4m66K4P6j95R9N80K74o64n62L51M64K03l6n42k36J39J06N07K39n70
$$ -217 292 228 -238 -214 -138 -333 -234 346 620 -44 -606 -255 209 412 376 -166 -402 -263 -157 350 589 19
3412A9n52K62J27K92j1M04n25m41L81N90M03j086j43R4J01K2K70K07l43m24q4
$$ 19 -533 -271 -144 148 137 541 16 -425 -44 546 949 -137 -280 -186 -85 -63 207 414 71 -353 -437
3433d37J38Q09j73p23J07K24j3j37P11l21k98k52J95P59o7o69l52K80p1M16N4
$$ -437 -299 510 337 -386 -279 -55 -68 -205 506 185 -113 -365 -170 589 522 -147 -499 -219 -290 126 180
3454A80j03j93n81N59M31M46m54j47m67k52M71M55o1r6n10PJ45K77K06j90q6n92
$$ 180 77 -116 -697 -138 293 739 285 138 -329 -581 -110 345 284 188 -322 -315 -170 107 313 123 37 -555
3476e55P42L71J16o88k47N0M33P8N6q1j08o06J31L76O66j95n74m48J88M68j31
$$ -555 187 558 674 -14 -261 -211 222 300 356 275 167 -439 -308 68 734 539 -35 -483 -295 173 42
3497D2J47o0n06m01M29M58J47l52n92L54N38J61q7k48j31l63L15J00L05j62l53
$$ 42 189 129 -377 -778 -349 109 256 -96 -688 -334 204 365 278 30 -101 -464 -149 -49 256 94 -259
3518b59k99j04Q02L18k11m36p7K31k34N22K63m83l89j74P34L31k01l00m85n4M40
$$ -259 -558 -662 140 458 247 -189 -266 -35 -269 253 516 33 -356 -530 204 535 334 34 -451 -505 -65
3539f5M06o4M8m76J7l89P00j3J22m62l28M54K23K0M0l40o2L4o3M14K00l11m27
$$ -65 341 277 325 -151 -134 -523 177 164 286 -176 -504 -50 173 193 233 -107 -169 -135 -198 216 416 105 -322
3562c22k33L31P06l6p20l68L52l2L85J65Nj48n62J17N49L6J01l19m94N66m7J26
$$ -322 -555 -224 482 446 -274 -642 -290 -322 63 228 233 85 -477 -360 189 225 326 7 -487 79 32 158
3584A58J88j93n05n3K55P26j93n35j85J03K09K08jj61l51L01J00K46j73L09k29
$$ 158 346 153 -352 -405 -150 576 383 -152 -337 -234 -25 183 182 21 -330 -29 71 317 144 453 224
3605B24m47J92K88j36J04n01r4L19J95J5q6j75J90l74J89K77Mk08m33N38J3k08
$$ 224 -223 -31 257 121 225 -276 -370 -51 144 159 73 -102 88 -286 -97 180 184 -24 -457 81 94 -114
3627a14P9K55l66m82O7J098q1k81p20J17O34j67P5J4K66o66QK66K68P9n45l36
$$ -114 -35 220 -146 -628 -561 537 456 175 -545 -428 206 39 114 128 394 -272 -264 2 270 349 -196 -532
3649e32M36l6K52K66o07J8j21J18L84k62Q4j71J10l17M10N04m34n56J28L15J30
$$ -532 -96 -132 120 386 -221 -203 -324 -206 178 -84 0 -171 -61 -378 32 536 102 -454 -326 -11 119
3670A19K99k18q4L4o85K55M76K53r16p2M82K95R0n60Q4j16J1K16K9N22n28k77
$$ 119 418 200 116 150 -535 -280 196 449 -467 -539 -57 238 328 -232 -148 -264 -253 -37 -8 514 -14 -291
3692b91J14M49J83k88k94L69m74j92N48L96m21l62q8K77J63j89L95j22n06k7J98
$$ -291 -177 272 455 167 -127 242 -232 -424 124 520 99 -263 -351 -74 89 -100 295 173 -333 -360 -162
3713a62L70k23j65J22m43J76L24J10L1n12l50P45M59m69o4q2J99k24j62M61J39
$$ -162 208 -15 -180 -58 -501 -325 -1 109 140 -372 -722 23 482 13 -51 -133 66 -158 -320 141 280
3734B80k81o38L44Q09p00J44k07K28j3n17Q73Km8l85l37O58M3j98k27J40n9q2
$$ 280 -1 -639 -295 514 -186 -42 -249 -21 -34 -551 322 324 276 -109 -446 212 255 57 -170 -30 -89 -171
3756a71L36L5J27n09L3K89q0J9L60m62k41L7J28O22l84J1j13J76m9j61L22Q2n15
$$ -171 165 200 327 -182 -149 140 60 79 439 -23 -264 -227 -99 523 139 150 37 213 164 3 325 407 -108
3779a08k93N16L63j65n49R3K76k45k41M21L42l12m82K19N52K7q34J99M62j17k86
$$ -108 -401 115 478 313 -236 -143 133 -112 -353 68 410 98 -384 -165 387 414 -420 -221 241 124 -162
3800a62L07M0r9l34m9K97N67p49K34o4j3k87J28N34k08l97J94j6J24o1J20ko05
$$ -162 145 185 86 -248 -297 0 567 -182 52 -12 -25 -312 -184 350 142 -255 -61 -77 47 -14 106 104 -501
3823e01L47J16K97L8l48j7K98j47l51M61O3j82m54K45P47k04p32j05L84K49j09
$$ -501 -154 -38 259 297 -51 -68 230 83 -268 193 256 74 -380 -135 612 408 -324 -429 -45 204 95
3844I5j64K66j96l82Q3O53K1k09m24K83K23l89N7L09k09j25n22P31q4J25k74o
$$ 95 -69 197 1 -381 -298 355 376 167 -257 26 249 -140 -83 226 17 -108 -630 101 17 142 -132 -138
3866a38q9J6Q8L12J25k61k25P9K10j68q7n8L47l41O9N99m43p0j05K82l2k37m3
$$ -138 -227 -211 -123 189 314 53 -172 -93 117 -51 -138 -196 151 -190 -121 478 35 -35 -140 142 110 -127 -170
3889a70M27m18j76J20M66L09o08l84M14L45m11L5L12k09k88J13L72M80n90o10
$$ -170 257 -161 -337 -217 249 558 -50 -434 -20 325 -86 -51 261 52 -236 -123 249 729 139 -471
3909d71J48M22n9q7L02j22r9l19N16J80l44K3k9l01J79O5J05k57p1N5J30N36m34
$$ -471 -323 99 40 -47 255 133 34 -285 231 411 67 90 61 -240 -61 4 109 -148 -219 -164 -34 502 68
3932F8k96J53K46k28J82K50m14qk50N07J22m34l06N46j6j98j17L30J96k39k25
$$ 68 -228 -75 171 -57 125 375 -39 -47 -297 210 332 -102 -408 138 122 -76 -193 137 333 94 -131
3953a31M6K17j4k47J08O7l49L26R3Q2N2o88J25M72N5j55o9j78K08q5O1L02k89
$$ -131 -85 132 118 -129 -21 46 -303 23 116 198 250 -438 -313 159 214 59 -10 -188 20 -65 -4 298 9
3976IN9l14L82O6k12K86k62l03K06K16q4j2K9K8l54K28J34N1J65l35j77j34N27
$$ 9 68 -246 136 202 -10 276 14 -289 -83 133 49 37 66 94 -260 -32 102 153 318 -17 -194 -328 199
3999A99k02j17K6m5J35l33L67K8o5k33o2N15l19N4P9J17o3l55M16J77o05J9j37
$$ 199 -3 -120 -94 -139 -4 -337 30 58 -7 -240 -302 213 -106 -52 27 144 81 -274 142 319 -286 -267 -404
4022d04J54N69l45K5j12K49K0l76L37j72m1m0k1M39q2L5k89j61K39K9O2j15J4
$$ -404 -250 319 -26 -1 -113 136 156 -220 117 -55 -96 -136 -157 282 200 235 -54 -215 24 53 115 0 14
4045A4k7L51j64l26LJ59N9k86J52J23k74J37n8K54m3j99J00J83J8j74r0L59o4
$$ 14 -13 338 174 -152 -149 10 69 -217 -65 58 -216 -79 -137 117 74 -125 -25 158 176 2 -88 271 207
4068B07n7j53q8M5j43L5K56J77l55J91l52O37l41m53K0J59J7J99M00k02q1m07
$$ 207 150 -3 -91 -46 -189 -154 102 279 -76 115 -237 400 59 -394 -374 -215 -198 1 401 199 118 -289
4090b89N21J00k79j20M10k56j59K70q7j51j58O6L41j20j79j18M91m91j50K74M79
$$ -289 232 332 53 -67 343 87 -72 198 111 -40 -198 -132 209 89 -90 -208 283 -208 -358 -84 395
4111C95k03j01k10L3Mj47oL66K48n04J98K78j85J1m48L22r0K14l04k5J7j73M08
$$ 395 192 91 -119 -86 -82 -229 -235 131 379 -125 73 351 166 177 -271 51 -39 175 -129 -154 -137 -310 98
4134I8j01J61k35j12K77k52L71j59k20L37q4KK08k59J14m15M52m72K75j08J63
$$ 98 -3 158 -77 -189 88 -164 207 48 -172 165 81 83 291 32 146 -269 183 -289 -14 -122 41
4155D1J85l82L66k52K8l1K27k48j5o3R4K21j05R2m82K34K62j92J14k02k0J36j69
$$ 41 226 -156 210 -42 -14 -45 182 -66 -81 -144 -50 171 66 158 -324 -90 172 -20 94 -108 -128 8 -161
4178a61J92K30k85J84l32J85K09r1l24N63m31k8J35J64k32j04K07l1QP6J3m34
$$ -161 31 261 -24 160 -172 13 222 131 -193 370 -61 -89 46 210 -22 -126 81 50 58 134 147 -287
4200b87o1K55J12j48L05R4l10j71L60J5m2k81R1J21j01J46oo2J98p1o9l55L71
$$ -287 -348 -93 19 -129 176 270 -40 -211 149 164 122 -159 -68 53 -48 98 92 30 228 157 88 -267 104
4223A04K36o22J27rL26m6J41l89j80N24l90J77j69K65k8r6J53J91l00k06J54P9
$$ 104 340 -282 -155 -164 162 116 257 -132 -312 212 -178 -1 -170 95 67 -29 124 315 15 -191 -37 42
4245D2l82L98K1k38n4L92k8m64L27P3j8m10K48L26l15o7J14O4j80P1K90j55o7
$$ 42 -340 58 79 -159 -213 179 151 -313 14 87 69 -341 -93 233 -82 -149 -35 29 -151 -80 210 55 -12
4268a2j76J05Q0O9l1j63K27O9j79K6M1J98l42j83K77L25k08j74J05j39M20l07
$$ -12 -188 -83 -3 66 35 -128 99 168 -11 15 56 254 -88 -271 6 331 123 -51 54 -85 335 28
4290B8j03L88k90%l7M8L3j20L4j27j71L18K21l82j07L13P2j56j37O51m58j13R3
$$ 28 -75 313 23 23 -14 34 67 -53 -19 -146 -317 1 222 -160 -267 46 118 -38 -175 476 18 -95 -2
4313bJ24k45j14q8K5M05o9k87K95mo4J34j54J48k27o1P2j7N0L16k94J52j67O6
$$ -2 122 -123 -237 -325 -300 105 36 -251 44 40 -24 110 -44 104 -123 -184 -112 -129 -79 237 -57 95 -72 -6
4337fj68kJ82j1Qp4LN7J50j51k3J4J97k22j11L7K86k30NM6k25K96k02j3K49j32
$$ -6 -174 -176 6 -5 3 -71 -68 -11 139 -12 -35 -21 176 -46 -157 -120 166 -64 -59 -13 -238 58 -144 -157 92 -40
4363d0k47O42l09J23k19J1jO0k56K52j10M6J23J59l70n8M2M2J90l8QK05l69K87
$$ -40 -287 355 46 169 -50 -39 -40 20 -236 16 -94 -48 75 234 -136 -194 -152 -110 80 42 50 255 -114 173
4387A73k01O5K64m16Q3K8K00l22j16M40n6j12j47J50L12l75n6K94q5J07n60L16
$$ 173 -28 37 301 -115 -32 -4 196 -126 -242 198 142 30 -117 33 345 -30 -86 208 123 230 -330 -14
4409a4j32K94k42J11J64j92M08l82L25j89k18PN5J76k25j63J59J16J32k15J35
$$ -14 -146 148 -94 17 181 -11 397 15 340 151 -67 -60 -5 171 -54 -217 -58 58 190 -25 110
4430A10r3J13L4k82j6O3K46Qj77K11j99J21Kj11L7j35j38N91k41j1j52P5L5n6
$$ 110 17 130 164 -118 -134 -71 175 183 6 217 18 139 141 30 67 -68 -206 385 144 133 -19 56 91 35
4454C5j41k39M26m4j18M16l64k1K21l26J22mk55L52P2q6j0m1j13j17L02Jpj32
$$ 35 -106 -345 81 37 -81 335 -29 -50 171 -155 -33 -37 -292 60 132 46 36 -5 -118 -235 67 68 61 -71
4478g1q0J65p0K34j90p5J16P4r2o6O6J47k3l59K33Q4j7LK4n0O0J03j07R8k93k57
$$ -71 -151 14 -56 178 -12 -87 29 103 11 -55 11 158 135 -224 9 93 76 79 103 53 113 216 109 207 -86 -343
4504c43N25k87J57j50J68O7N7j21J2j14r4M7k54M52r1j49j16P5L91k41j95K47
$$ -343 182 -105 52 -98 70 137 194 73 85 -29 -123 -76 -330 122 31 -118 -234 -159 232 -9 -204 43
4526D3J03J04k30j01M7J24k22J93j79K70m0k54J75j10j92L11l2Q7j34K0L99l58
$$ 43 146 250 20 -81 -34 90 -132 61 -118 152 112 -142 33 -77 -269 42 10 97 -37 -17 382 24
4548B4J53m8K62n83J18j00p0K33K90m46J05J40j43J33O7q1j07l8R3p6q3M20l88
$$ 24 177 129 391 -192 -74 -174 -244 -11 279 -167 -62 78 -65 68 135 54 -53 -91 2 -74 -157 263 -125
4571a25K21L7l2l1q1l58M52m4J7k06M8qQ6J47j13P3j80p9J64L05l39K41l6k08
$$ -125 96 133 101 70 -11 -369 83 39 56 -150 -102 -110 -24 123 10 83 -97 -176 -12 293 -46 195 159 -49
4595d9Q2J82l55K59j63o2P7K01j49j91M79l57K51j35R7j93m22N72j43j54M3J25
$$ -49 33 215 -140 119 -44 -106 -29 172 23 -168 311 -46 205 70 167 -26 -448 124 -19 -173 -130 -5
4617eP5qj4j13k3k13J56L64k57lj3J04Q8r8j55L87j81R8k72j62K19K2j98M08O5
$$ -5 70 62 48 -65 -88 -301 -145 219 -38 -41 -54 50 138 40 -115 272 91 189 -83 -245 -26 -4 -202 206 271
4642B71m00K5O9l00N04p9q0K72k6n64M28k8j51L13l13J67J3J3m04J88P4p4L0j7
$$ 271 -129 -104 -35 -335 169 90 10 282 256 -308 120 92 -59 254 -59 108 121 134 -270 -82 -8 -82 -52 -69
4666f9m3K52j00j14N9J17m25M30rk29kK55p7n6j39K52k15K56k18J93l48J54l2
$$ -69 -112 140 40 -74 -15 102 -323 107 98 -131 -133 122 45 -11 -150 102 -113 143 -75 118 -230 -76 -108
4689a08L74k65o9K61m15J18J36k07L53J4J05k09J12k00K01ll73J41N2J10pk99
$$ -108 266 1 -68 193 -222 -104 32 -175 178 192 297 88 200 0 201 198 -175 -34 18 128 121 -178
4711a78K56j33j42K23rj92J32%J51l83M02k31k85N38l12p2K25k81m2L89k49m5
$$ -178 78 -55 -197 26 17 -175 -43 -43 108 -275 127 -104 -389 149 -163 -235 -10 -291 -333 56 -193 -238
4733b38K61q9J06L04m43M6K45l85M19k98j55M26k86M1M4J27l1r5J44l59M04n3
$$ -238 23 -66 40 344 -99 -53 192 -193 226 -72 -227 199 -87 -46 -2 125 94 -1 143 -216 188 135
4755A35l88L19J53p8j22Q4k77L56l9k51J53J7k24K61J77k31Ok39L12n9k51l3K31
$$ 135 -253 66 219 141 19 103 -174 182 143 -108 45 62 -162 99 276 45 51 -188 124 65 -186 -219 12
4778A2P1j92R8j36j46J72P4j56J71k19K21L00j09k1k58K90l60J35Q5k13R5N6P5
$$ 12 83 -109 -11 -147 -293 -121 -47 -203 -32 -251 -30 270 161 140 -118 172 -188 -53 32 -181 -86 -30 45
4801D5j72L3r1J36R8j81n3K78q1j5p5kK56%m54J24Qk85J47M00o9j67j56j9J81
$$ 45 -127 -94 -185 -49 49 -132 -185 93 12 -3 -78 -80 176 176 -278 -154 -146 -431 -284 116 47 -120 -276 -295 -114
4826a14L63j89K68j25o4j10K18p9M7m3l94R5L21m10K15J50j28j1J4L41l48m3J16
$$ -114 249 60 328 203 139 29 247 168 215 172 -222 -127 194 -216 -1 149 21 10 24 365 17 -26 90
4849I0M9j42J33J87l61k4K2M0J17J56l25J50M5J15k04K59l19P1k92J90RK11k53
$$ 90 139 -3 130 317 -44 -68 -46 -6 111 267 -58 92 137 252 48 307 -12 59 -233 -43 -34 177 -76
4872g6K77j4r9o5j65L87j95J09k39j04L07L6k85K18l09M61m09K05P4j8q8j89J78
$$ -76 201 187 88 23 -142 245 50 159 -80 -184 123 159 -126 92 -217 244 -165 40 114 96 8 -181 -3
4895cJ41l89K05K07j20J38k45n0lK04J60l67L01J65j66o3r3J65l42K02j98j13
$$ -3 138 -251 -46 161 41 179 -66 -116 -119 85 245 -122 179 344 178 115 22 187 -155 47 -151 -264
4917b64K78P0Q3j19O0j60m10N20k71J47K04q7j29M5j24K35M0j95Pk44L03J49k82
$$ -264 14 84 167 48 108 -52 -462 58 -213 -66 138 51 -78 -33 -157 78 118 -77 -70 -314 -11 138 -144
4940a44KJ83j05J51l35N63l00pJJ48o2k08L1J47l16J22J20J59l03j06L56o6Q9
$$ -144 -142 41 -64 87 -248 315 15 8 9 157 95 -113 -82 65 -251 -129 -9 150 -153 -259 97 31 120
4963A20j93R1j5l59K32K69N1j02j36l37L71k2O0J64j08k0k26k5R9p4J54j92K32
$$ 120 -73 18 3 -356 -124 145 196 94 -42 -379 -8 -30 30 194 86 66 -160 -185 -86 -160 -6 -198 34
4986C4j04J57m5J26l01J45K44k6pn09N06k54j25K89j04p8j03J10J9o4K37l6P4
$$ 34 -70 87 42 168 -133 12 256 230 223 -286 220 -34 -159 130 26 -52 -155 -45 -26 -90 147 111 185
5009A85j13L8j78l26L26O5r2r4MJ66k18L08O8l58K71l51J15J60r3K09k47L90k28
$$ 185 72 110 -68 -394 -68 -3 -95 -189 -185 -19 -237 71 139 -219 52 -299 -184 -24 -117 92 -155 235 7
5032Gk18M29k38j60L48r5J57k1j59k2j63L59j17j28J72l64K59j61J43j0L93n83
$$ 7 -211 218 -20 -180 168 73 230 209 50 28 -135 224 107 -21 151 -213 46 -115 28 18 411 -172
5054a72K57j66q9K55j81J41j10P6j60P5K1J90j38L8J22j43Q3q0R8j51K58k5l17
$$ -172 85 -81 -170 85 -96 45 -65 11 -149 -74 -53 137 -1 37 159 16 99 19 117 -34 224 199 -118
5077a18K97m27J86J20j21o6j10O5L32M5j28j43J0J82Q4l31J42J20N6k45J92N7
$$ -118 179 -248 -62 58 -63 -129 -239 -174 158 203 75 -68 -58 124 208 -123 19 139 195 -50 142 199
5099A99J38n8l47K15l40J99j08N5J27j09K0p4K22l7k6J17j25l19L24Q2k92l13
$$ 199 337 279 -68 147 -193 6 -102 -47 80 -29 -9 -83 139 102 76 193 68 -251 73 155 -137 -450
5121d50Q70j98r6j56n7J49k39%J95k12J24L05k84J43K3k57J47j96PJ96J12j02
$$ -450 420 222 126 -30 -87 62 -177 -177 18 -194 -70 235 -49 94 117 -140 7 -189 -182 14 126 24
5143B4qPm0K28j01J16J01l62K61l21K81l53K79l23K39k57Q6J39Q5l35J3K51l7
$$ 24 16 23 -17 211 110 226 327 -35 226 -95 186 -167 112 -211 28 -229 -143 -4 81 -254 -241 10 -27
5166b7l72J49J63L58l12k71M90k4j76k47J50J31j41n3J82K7l9k8M8J4P5n5N8J54
$$ -27 -399 -250 -87 271 -41 -312 178 154 -22 -269 -119 12 -129 -182 0 27 -12 -40 8 22 97 42 100 254
5190B54l42N1K12k48J49j53J1k20M85Ol26L50j97P0n1M0k34J92l07J75J86j54
$$ 254 -88 -37 175 -73 76 -77 -66 -286 199 205 -121 229 32 102 51 91 -143 49 -258 -83 103 -51
5212e1q9J49j40n3J29k1P5Kk2K64k63k3J38J56j19j15k28P1J79j05L11j13p0j33
$$ -51 -140 9 -131 -184 -55 -76 -1 1 -21 243 -20 -43 95 251 132 17 -211 -140 39 -66 245 132 62 -71
5236g1J94q9OK87k50Rk06P3J89l47k6J53J15N4l7Ok04K84j4j45k01J04j2r2K09
$$ -71 123 34 40 327 77 86 -120 -47 142 -205 -231 -78 37 91 54 60 -144 140 126 -19 -220 -116 -128 -220 -11
5261a1N7J32l21L82k47j32R6M2J98j14R4k70J24o6N2k8N5j34P9j00J37o8Ll40
$$ -11 46 178 -143 239 -8 -140 -44 -2 196 82 176 -94 30 -36 16 -12 43 -91 -12 -112 25 -43 -40 -380
5285c80O14k91O6k22P1K57m26L58O1q0o1j8r5oJ83k21R5L40l21L4j99L67k67O1
$$ -380 234 -57 9 -213 -142 115 -311 47 108 28 -33 -51 -146 -152 31 -190 -95 245 -76 -42 -241 126 -141 -80
5309h0j71L79J08j89k3j16j6r2J12K7j82M39kj07r4L09n3j67j91R5J10j36m2K31
$$ -80 -251 128 236 47 24 -92 -108 -200 -88 -61 -243 196 194 87 -7 302 249 82 -109 -14 96 -40 -82 149
5333A49l44k8J94l5K11k68J92j20M1J25Q3k57Q8o2M3Oo2J03j21J7nL29n01J28
$$ 149 -195 -223 -29 -64 147 -121 71 -49 -8 117 200 -57 31 -31 12 18 -44 59 -62 -45 -50 279 -222 -94
5357i4mJ08K06l51J09L38m00K53J2k36L20k39j59K17j28O6P0j07J8j02K02n5J63
$$ -94 -98 10 216 -135 -26 312 -88 165 177 -59 261 22 -137 80 -48 18 88 -19 -1 -103 99 44 207
5380B07k30k9N4O2k23J55Q0k67J47n9K80j17P8j98J19l14J80r6K77L2q8k53J95
$$ 207 -23 -52 2 64 -159 -4 76 -191 -44 -103 177 60 138 -60 59 -255 -75 -171 106 138 50 -203 -8
5403hL02m87J16j8L4J97j69J37j11r0O0K65j80l91M37j76M0j2J75m2k6k61J16
$$ -8 294 -193 -77 -95 -61 136 -33 104 -7 -97 -37 228 48 -343 94 -82 -42 -54 121 79 53 -208 -92
5426i2M1K9J57k70O3N8j2j07K60j84p5K23r9o1j84P4Q7Q2M8k15K35M9j40J45j22
$$ -92 -51 -22 135 -135 -72 -14 -26 -133 127 -57 -132 91 -8 -69 -253 -179 -92 -10 38 -177 58 107 -33 112 -10
5451a0k64K26PR0j8Q1r9j06K66kj42k1J59q2k7L33m78j6L2n4L52j33n2L61l65
$$ -10 -274 -48 -41 49 31 112 13 -93 173 171 29 8 167 85 58 391 -87 -103 -71 -125 227 94 42 403 38
5476C8j84L10j52M66m13m80O74j2j85K37j49k01L6O0M1q0j5Qk10L05l2p8J50q3
$$ 38 -146 164 12 478 65 -415 259 247 62 299 150 -51 -15 45 86 6 -9 -1 -211 94 62 -16 134 51
5500E1j60R1K09l5q9j6r5l3o3K90k60M12j25k82K13k38K76j62K51j57K03l69K66
$$ 51 -109 -18 191 156 67 51 -44 -77 -140 150 -110 302 177 -105 108 -130 146 -16 235 78 281 -88 178
5523A78j24L39o85K16o5J03J51p4j00Lj42L67n1k30J64j16p9j29K03j1J42m6J31
$$ 178 54 393 -292 -76 -141 -38 113 39 -61 -58 -200 167 116 -114 50 -66 -145 -274 -71 -82 60 14 145
5546A45j02J13j81N5r4K10j00j18J99j45r9Q2J30o2L5K4l26J96Q6J0k47J89J25
$$ 145 43 156 -25 30 -64 146 46 -72 127 -18 -117 -35 95 33 68 92 -234 -38 48 58 -189 0 125
5569A25J49m36L56Nj42k0K22j66p8j69J97l30K03K41k67k6J38m0J82j9Pq5k04
$$ 125 274 -162 194 199 57 37 259 93 15 -154 43 -287 -84 157 -110 -136 2 -38 144 125 132 47 -157
5592a57K78j41j38L67k19j23n2J0L31l84L16M5j2j60N5J3q6J06r6j0K20Rl37L3
$$ -157 121 -20 -158 209 -10 -133 -185 -175 156 -228 88 133 121 -39 16 29 -57 49 -47 -57 163 172 -165 -132
5616a32pK2L01K23m85L09K4j14j51O4r7p1M23m01J13Qj95k0L18j06K80o22N27
$$ -132 -139 -117 184 407 -78 231 255 141 -10 54 -43 -114 309 -92 21 29 -166 -186 132 26 306 -316 211
5639B11r6J24k7l36J82J68m00J69QJ28q5K6J25k68J01k32P4K8K83k09J62r7O2
$$ 211 115 239 212 -124 58 226 -174 -5 3 131 46 72 197 -71 30 -202 -128 -100 183 -26 136 39 101
5662A01R3k40Q4P9l85J87M3l5J6J0K23j38R1l06K2K98r2O5J31l55K1K15r1J29
$$ 101 194 -46 38 117 -268 -81 -38 -73 -57 -47 176 38 129 -177 -155 143 51 116 247 -108 -87 128 37 166
5686A66k72j45K04m7j99L02r8N8M1J35J64r6l7j12l21K34l7K8J37j40p5MO2l4
$$ 166 -106 -251 -47 -94 -293 9 -89 -31 10 145 309 213 176 64 -257 -23 -60 -32 105 -35 -110 -106 -44 -78
5710g8r1J26k15L01k91n6K28k03M80j71k98L07j44qJ25k54L50m1j62L37o07L2
$$ -78 -169 -43 -258 43 -248 -304 -76 -279 201 30 -268 39 -105 -113 12 -242 108 67 -95 242 -365 -333
5732c33M95k14o4J17J30m2k35K20O5Q5k22j11j5K43M2j55k01J42J83k30J50j38
$$ -333 162 -52 -116 1 131 89 -146 74 139 224 2 -109 -124 119 161 6 -195 -53 130 -100 50 -88
5754h8J28j52K86j31j84L9N79n34r6O1OJ73k07K04J78j82J44j67k10L30k21n3
$$ -88 40 -112 174 43 -141 -102 477 -57 -153 -92 -86 87 -120 84 262 80 224 57 -153 177 -44 -97
5776i7J57k71Q7n8K82n5j37K6K4J16j02M7j26K9Q0j55P5j04J25k18M57k7k71j1
$$ -97 60 -211 -124 -182 100 45 -92 -66 -42 74 -28 19 -107 -78 2 -153 -78 -182 -57 -275 182 155 -116 -127
5800a27K70J7ok06j29J68L31k42j80J22m8j26P5k25K53Q0l72J05J25K76j32j30
$$ -127 143 160 154 -52 -181 -13 318 76 -104 18 -30 -156 -81 -306 -53 27 -345 -240 -115 161 29 -101
5822a01J27K4m54M12j33p6K89j06m9K27j83K65n71L09k2J02M3q0J15j69j4j89
$$ -101 26 50 -404 8 -125 -201 88 -18 -67 160 -23 242 -329 -20 -42 60 103 23 138 -31 -45 -234
5844b34L19lJ3l4J31j57K21k99K9L8N9k20K70n3j46k41K15J27N6j05j99M66k89
$$ -234 85 82 95 61 192 35 256 -43 -14 24 83 -137 133 80 -66 -307 -92 35 91 -14 -213 253 -36
5867c6N0j23q5L17l9r9K04k95m7K30r6J6K97k23m8j16J31n5r2j0J22J4j62J52
$$ -36 14 -109 -194 123 84 -15 189 -106 -153 77 -19 -3 294 71 23 -93 38 -17 -109 -119 3 17 -145 7
5891Gk01J18k3k13L38N0k11P8K45k86J5J04m23K79q2K16J47l54L17l35J10K82
$$ 7 -194 -76 -99 -312 26 76 -135 -57 188 -98 -83 21 -402 -123 -205 11 158 -196 121 -214 -104 178
5913A78k25o9J63j41j6O1J28j34P5J23j46M5J16j55J78L7p3mj68P5m72L57j11
$$ 178 -47 -116 47 -94 -110 -49 79 -55 20 143 -3 42 158 3 181 218 145 141 -27 48 -424 -67 -178
5936a78J84J32j34q0K4N4k00K71j53J39O2k62j24K03O4l2N0K17k04m3P3Pl24L99
$$ -178 6 138 4 -76 -52 2 -198 73 -80 59 121 -141 -265 -62 2 -30 20 237 33 -10 63 70 -254 145
5960A45l33J46j19L11Q3m28R4k6N8K16k93K83j52L3k47r2L47j70L57j83K17j49
$$ 145 -188 -42 -161 150 233 -195 -101 -127 -69 147 -146 137 -15 18 -229 -321 26 -144 213 30 247 98
5982I8r7p9qK56k23l5j29L86j46j09J94J76l52J14K23m27j1M03j80M5j01j57K64
$$ 98 1 -78 -86 170 -53 -88 -217 169 23 -86 108 284 -68 46 269 -158 -169 234 54 99 -2 -159 105
6005A05J81l01L1j48J44j06j19k1N46m05j78L78m98N00j09j92L9J95j13p5Q3J58
$$ 105 286 -15 16 -132 12 -94 -213 -234 312 -93 -271 107 -391 109 0 -192 -153 42 -71 -146 -63 95
6027I5k55K32m4k38M80J86n79J90K15m65K23j48R8j78J49j63L2K23l06K50J22
$$ 95 -160 72 28 -210 270 456 -123 67 282 -183 40 -108 -10 -188 -39 -202 -170 53 -253 -3 119
6048A19k96N12l59J9N5k01K18J1k4k99L81r8J12p1Q0j34j66N5J63k29M09j56J3
$$ 119 -177 335 -24 -5 50 -151 67 78 54 -245 136 38 150 79 159 25 -141 -86 77 -152 257 101 114
6071A14k31J2Q3j98K63K05l93N7Q5J4k67J34J48j0j79Q6j87N3M24k48r8K76j34
$$ 114 -117 -105 -22 -220 43 248 -145 -88 -3 11 -256 -122 26 16 -163 -77 -264 -211 213 -35 -133 143 9
6094IN0J59r5R3m22J50M3k57J21L5O1K19L1lQl65R2R4J02j78j45M92l19r4j5k6
$$ 9 59 218 123 216 -206 -56 -13 -270 -149 -114 -53 166 197 194 202 -163 -71 23 125 -53 -198 294 -25 -119 -134 -160
6120a60J38K41m47L04j73K75k5j24k11O7L14k72J37j45oM2K2J90m33J47J77m3
$$ -160 -22 219 -228 76 -97 178 153 29 -182 -115 199 -73 64 -81 -87 -45 -23 167 -266 -119 58 15
6142A5k41K56n1j18J00M2j12K27O0j48J53m54J6K95O4J52j36j94L78n93M26j13
$$ 15 -226 30 -21 -139 -39 3 -109 118 178 30 183 -271 -255 40 104 256 120 -74 304 -289 137 24
6164B4K27J41n39L03l29M72o12L46J92k43j82J21K92L6k83q7p0N6J58Q8r0L0m3
$$ 24 251 392 -147 156 -173 299 -313 33 225 -18 -200 -79 213 249 -34 -121 -191 -135 23 111 21 51 8
6187Hk30M96r9o0j24j82L45j24P1j70n8M23k00k20KpK54J31n02M28l53k35K38
$$ 8 -222 274 175 115 -9 -191 154 30 101 -69 -127 296 96 -124 -122 -129 125 256 -246 182 -171 -406 -168
6210a68L93m16K38r0L78j50l25J00K70k56J05J68l52M2J25n1J57P7k06J01r1k58
$$ -168 225 -191 47 -43 335 185 -140 -40 230 -26 79 247 -105 -63 62 11 168 245 39 140 49 -209
6232b09L30J83l21l0n3J04M7r2M5K26k38n6r9K74J06n53L03m8p4l6M72j31J35
$$ -209 121 304 -17 -47 -100 4 51 -41 4 230 -8 -64 -163 111 217 -336 -33 -81 -155 -191 281 150 285
6255B85k88p0J72M8Pn11J27L43qK17n19J17k31M37q5j43K72l66P4k7J16L41k13
$$ 285 -3 -73 99 147 154 -357 -230 113 105 322 -197 -80 -311 126 41 -102 170 -196 -122 -149 -33 308 95
6278I5j19J9m05M83ko1r2m1L92l47m8J31M3m2L3J62q6k01M5Q3k03K27p3K55j90
$$ 95 -24 -5 -410 73 71 10 -82 -123 269 -78 -126 5 48 6 39 201 115 -86 -41 42 -161 66 -7 248 58
6303E8M8k23L82o0k86K20l29K45o2l13J05K98k18K60j32J23n13M70r7j15J26K44
$$ 58 106 -117 265 205 -81 139 -190 55 -7 -320 -215 83 -135 125 -7 116 -397 73 -24 -139 -13 231
6325B31k6k6j30Q9k70r8l2L78j43k55MP8J35p4k9J58N9k09L88j1q6k41j02R6K40
$$ 231 205 179 49 138 -132 -230 -262 116 -27 -282 -278 -200 -65 -139 -168 -10 49 -160 228 217 131 -110 -212 -116 124
6350A24j18%r2K67n2%l04J75O9o4j99L29L06m9k02k03J3m9l3K36Jj84J8n3K7P8
$$ 124 6 6 -86 181 129 129 -175 0 69 5 -194 135 441 392 190 -13 0 -49 -82 154 155 -29 -11 -64 -37 41
6376D1r5OJ34Qk22J18J32k96J7q3L32J46m89J58K1J1L8L62m7j91j22M9J38l53
$$ 41 -54 -48 86 94 -128 -10 122 -174 -157 -240 92 238 -251 -93 -72 -61 -23 339 292 101 -21 28 166 -187
6400a87L24k34p9N8P3K42j15m40K78j77L14L1K5Kj97M6P3J60k05L82m02P7k00
$$ -187 137 -97 -176 -118 -45 197 82 -358 -80 -257 57 88 113 115 -82 -36 37 197 -8 374 -28 49 -151
6423a51q4K37j91L04j84J2K17l86K41l14J36J92K47j54r4j91K66j76m3L4K13k12
$$ -151 -235 2 -189 115 -69 -57 160 -226 15 -299 -163 29 276 122 28 -163 103 -73 -116 -82 131 -81
6445h1p9K16j57K43k15k9j32K57L22k36k0j53K02k13j05K15l4L04l01j86J43J76
$$ -81 -160 56 -101 142 -73 -102 -234 23 345 109 89 -64 138 -75 -180 35 1 305 4 -182 -39 137
6467A37J38l76L63k41k3J4K2J8j98K03l65O0J75K3Q9j2j47J08P9o0K09k40o5R7
$$ 137 275 -101 262 21 -2 12 34 52 -146 57 -308 -248 -73 -50 39 27 -120 -12 67 7 216 -24 -89 8
6491HO1k04L13j05q4j9j15K63J17k96P2J42l75J0K27Q1l2j09L1K82m16J23j26
$$ 8 69 -135 178 73 -11 -30 -145 118 235 -61 11 153 -222 -212 15 96 64 -45 -14 268 -148 -25 -151
6514a51j6N5L74j08k63N82j60m42Q1L39l46j05J14l8L48l36KO1j15J54k08rK62
$$ -151 -167 -112 262 154 -109 473 313 -129 -48 291 -55 -160 -46 -84 264 -72 -70 -9 -124 30 -178 -187 75
6537G5r2j53Q1J40j5J97k56L2J57l27J59k69M07l05J45r8k5L49n5K53m58k7o3
$$ 75 -17 -170 -89 51 36 233 -23 9 166 -161 -2 -271 136 -169 -24 -122 -147 202 147 400 -58 -85 -148
6560a48J17O9j29R8j14j3J30K37q5l42J26K1L1j30j35P5K33k22M17j23J52j08
$$ -148 -31 38 -91 7 -107 -120 10 247 162 -180 -54 -33 -2 -132 -267 -192 41 -181 236 113 265 157
6582A57l28q6Q0L19j89L5J69m43K78k86O41r5l89L47l36K58M3p1j67J27j64Q5
$$ 157 -171 -257 -177 142 -47 -12 157 -286 -8 -294 347 252 -137 210 -126 132 175 104 -63 64 -100 -15
6604a5kK55m22L46m51J78L03j76j31K22j97J70M2k66M00n23l1L23P6j07j94L77
$$ -15 -17 238 -184 162 -289 -111 192 16 -115 107 -90 80 122 -144 256 -267 -298 25 101 -6 -200 177
6626A77k43K6J3J55M5k23k0l84L09L17m09K16j28q5K16K80m50R1P1o7R1J44J48
$$ 177 -66 -40 -27 128 173 -50 -70 -454 -145 172 -237 -21 -149 -234 -18 262 -188 -97 -26 -93 -2 142 290
6649B90j79L8l12L3J28J46L7p6k67J44jJ97j94K44n05K75r6Nj11P6J58j2L44m96
$$ 290 111 149 -163 -130 -2 144 181 105 -162 -18 -19 178 -16 228 -277 -2 -98 -93 -204 -128 30 18 362 -134
6673a34O2J28lk70M58j39J67k92m1K61l57K87k30J40l5k10K53j50K99n29M01k56
$$ -134 -72 56 53 -217 241 102 269 -23 -64 197 -160 127 -103 37 2 -208 45 -105 194 -335 66 -190
6695a90K08K56j69k26l8K94L2k59j31N99j71k06l69M44o9J60j61l08J99j80M69
$$ -190 18 274 105 -121 -159 135 167 -92 -223 376 205 -1 -370 74 5 165 4 -304 -105 -285 184
6716A84k74J9L40n89N43l85R8J16j51J05j47J19J51N2k79J5J40L8l4l3q7j30K93
$$ 184 -90 -71 269 -320 223 -162 -64 52 -99 6 -141 -22 129 181 -98 -83 57 95 61 28 -59 -189 104
6739A04l8k18n3K62Pj23j65K63K97j68j9o3k5K79j80N0k92l10K29K15k27L25J33
$$ 104 66 -152 -205 57 64 -59 -224 39 336 168 149 86 61 340 160 210 -82 -392 -163 52 -175 150 283
6762B83k84Q5n4j77N8L38l35K87j95K82k12j99J96p2j95N86k33J39o19J59K32
$$ 283 -1 84 30 -147 -89 249 -86 201 6 288 76 -123 73 1 -194 392 159 298 -321 -162 70
6783G0J39j80p6K17k02r3Q5j50K47j40R7J19m71N7M62k37r9O3J66k8K66l31J49
$$ 70 209 29 -47 170 -32 -125 -40 -190 57 -83 14 133 -338 -281 181 -56 -155 -92 74 46 312 -19 130
6806A30n9j97J07L27n41K12n4j09J80M6J24j50l9j89j7K09J30k1k01JJ49J09k28
$$ 130 71 -126 -19 308 -233 -21 -75 -184 -4 42 166 16 -23 -212 -229 -20 110 89 -112 -111 38 147 -81
6829h1J22J26n73L76J40J3N0k66k57L27j16J01J42k21r9R5L9l0j33J60M0m0K5
$$ -81 41 167 -406 -30 110 123 173 -93 -350 -23 -139 -38 104 -117 -216 -121 -82 -112 -245 -85 -45 -85 -60
6852f0j7L0J57q4j5J8P9r5O6k77P1k05K99j34K18K71j80n09J67J64j04J94j13
$$ -60 -77 -47 110 26 11 29 108 13 79 -198 -127 -332 -33 -167 51 322 142 -367 -200 -36 -140 54 -59
6875e9J15j10K64n4k56p6k0K84J55k79m32L23J01j1P9r7K23q8J05j3l13nQ4P7
$$ -59 56 -54 210 156 -100 -176 -196 88 243 -36 -468 -145 -44 -55 24 -73 150 62 167 154 -159 -164 -80 -3
6899cPm6J97l30K84k60J55J98k89M8Q7j83k3K35j39K5L04l00QO9r6k67J44k0j1
$$ -3 4 -42 155 -175 109 -151 4 202 -87 -39 48 -135 -158 77 -62 -37 267 -33 -25 44 -52 -319 -175 -195 -206
6924b06O0k34N73N1j71n9k72L63k80K63Q6p7p5P2n7Q6j56j00n1r7n1N18j65K6
$$ -206 -146 -380 193 244 73 14 -258 105 -175 88 174 97 22 94 37 123 -33 -133 -184 -281 -332 186 21 47
6948D7l72PP48l03j85J18j26k40L70n0L74k61k5j05N3l05R4Q5N3p4q2J01K5k2
$$ 47 -325 -318 430 127 -58 60 -66 -306 64 14 388 127 102 -3 50 -255 -161 -76 -23 -97 -179 -78 -53 -75
6972g5J3J32j49J11j3q7K85k37o6M1j97m2M00l22L27j79J6K5K07k17lm59L65K23
$$ -75 -62 70 -79 32 19 -68 217 -20 -86 -45 -242 -284 116 -206 121 -58 -42 -17 190 -27 -30 -489 -124 99
6996I9l58M05r6Q6j83K2m5L22j83p9K47k46j14J27q6J44J29Q3k37J86j83m8J11
$$ 99 -259 146 50 136 -47 -25 -70 252 69 -10 237 -9 -123 4 -82 62 191 274 37 223 40 -8 103
7019A03j12%J8j9J55j79QR1N5l74M67j28k94K22j23J39m6j69K12M7j2J23r2j46
$$ 103 -9 -9 9 -10 145 -34 -26 65 120 -254 213 85 -209 13 -110 29 -17 -186 26 73 61 184 92 -54
7043e4q3L77l22J79J98n34MN23k32R8m25J85j4q3Q9L83l56j69J47L59l2l51l9
$$ -54 -137 240 -82 97 295 -239 -235 288 56 154 -271 -86 -100 -183 -94 289 -67 -236 -89 270 238 -113 -152
7066a52J41M5J17l9o6k17L1n6q9N75K2p4nq2j45j30J85j94K98k09J93l16r4RN01
$$ -152 -11 34 151 112 46 -171 -140 -196 -285 290 312 238 233 151 6 -124 61 -133 165 -44 149 -167 -261 -252 249
7091B49k59K19l08R9Q0K2j28J55Q0j84j37K6N4Q2Q0j48J75k82o7QK60O3k7k21
$$ 249 -10 209 -99 0 80 102 -26 129 209 25 -112 -86 -32 50 130 -18 157 -125 -192 -184 76 139 112 -109
7115a09K59l27M92m16J28J59O4k47k04O0L94k07J12k86R4N3j55K64l85L90J8l6
$$ -109 150 -177 315 -101 27 186 250 3 -201 -141 253 46 158 -128 -34 19 -136 128 -257 133 151 115
7137A15j62J94M8k38l0r0K17J32k4k40K37l40LJ32J33k15k8J32LK25j31l07K47
$$ 115 -47 147 195 -43 -73 -163 54 186 162 -78 159 -181 -178 -46 87 -128 -156 -24 -21 204 73 -234 13
7160A3k09K00K7k14M1K48n9l25K23K7L1Q9l47K71j76L42J08l33J44N5J07j80k37
$$ 13 -196 4 31 -183 -142 106 47 -278 -55 -28 3 92 -255 16 -160 182 290 -43 101 156 263 83 -154
7183a54J54N5j3l74J09J02K38p1j05KJ24j57J6j42K41N6k70J62j78J85j61K00
$$ -154 0 55 42 -332 -223 -121 117 46 -59 -57 67 -90 -74 -216 25 81 -189 -27 -205 -20 -181 19
7205A9k18K30q3l6J65M0L0J3k6lr1k6R0j13l47nK53K05j7j77M88n54M42l61O2
$$ 19 -199 31 -52 -88 77 117 147 160 134 131 40 14 104 -9 -356 -361 -108 97 80 -97 391 -163 279 -82 -20
7230b0m2M6L9l07L32NM19k97k36k38L34Pk27K84m9L07p66M93O6J02j40k23K04
$$ -20 -62 -16 23 -284 48 53 472 175 -61 -299 35 42 -185 99 50 357 -409 84 150 252 112 -111 93
7253I3j67K00j30J0j64J0K92R0k79j36J80l06J86P2k77L24k69J31N3K34k07k0
$$ 93 -74 126 -4 6 -158 -148 144 234 -45 -181 -1 -307 -121 -49 -326 -2 -271 -140 -87 147 -60 -80
7275h0M8J54m4k9M15n51j91L50L5J2j98J18j90L99k93J23k07J34J01k93J31J4
$$ -80 -32 122 78 49 464 -87 -278 72 107 119 -79 39 -151 248 -45 78 -129 5 106 -187 -56 -42
7297d2K56r0R1j89r1l6M32l48j00K26m2k08K05O5m4j29j09J21J57j91r0J43j84
$$ -42 214 124 215 26 -65 -101 331 -17 -117 109 67 -141 64 129 85 -44 -153 -32 125 -66 -156 -13 -197
7320a97K35L6k10K06k42k04K10J87J77l34MJ31o5K03j34N3R7l04K42l23J75M07
$$ -197 38 74 -136 70 -172 -376 -166 21 198 -136 -132 -1 -66 137 3 56 153 -151 91 -232 -57 350
7342C50m24K64k89K36j73R5Q7p0k19J88p2M80n75K01j30j25O5R9jJ30n7j81K66
$$ 350 -74 190 -99 137 -36 59 146 76 -143 45 -27 453 -122 79 -51 -176 -111 -12 -13 117 60 -121 145
7365A45j83K86n55L76n5n6j2O1N7P0r8n4j31n9L34j10K3l10J46r1K20K67k80j46
$$ 145 -38 248 -307 69 14 -42 -54 7 64 134 36 -18 -149 -208 126 16 39 -271 -125 -216 4 271 -9 -155
7389a55P1J48j18M0p7k27L5M4M32L7K39n08q4J74J44k42j55P0J12Q7o8k7L56l15
$$ -155 -84 64 -54 -14 -91 -318 -283 -239 193 230 469 -39 -123 51 195 -47 -202 -132 -20 67 -1 -28 328 13
7413A3j99L47J79l40K53m72J88j4o9O6k9n1j16K84j36K72k07J26l3n8P1j37L11
$$ 13 -186 161 340 0 253 -219 -31 -45 -114 -48 -77 -128 -244 40 -96 176 -31 95 62 4 75 -62 249
7436B49m14K00j22J58l2O0k00M6j46K4K70n7k97K24P0J21k45j67L6J88J45j68
$$ 249 -165 35 -87 71 39 99 -101 -55 -201 -177 93 36 -261 -37 33 154 -91 -258 -222 -34 111 -57
7458e7K30j50k79L33Q8k25k3R8l2J45j73o3J72k6p0K30m8k72k50L94J0q3j07K4
$$ -57 173 23 -256 77 165 -60 -83 15 -17 128 -45 -108 64 38 -32 198 150 -122 -372 22 32 -51 -158 -134
7482a34J72k17j24J1K40J96k57K33k55M0o5L10k35J01o0R4N3q4j93L1L38j89K2
$$ -134 38 -179 -303 -292 -52 144 -113 120 -135 -95 -160 150 -85 16 -44 50 103 19 -174 -143 195 6 28
7505B8j67K1J44L9q0k99K50rj83K84j28L50k87J53k36J05j07J93R6m1j00P2j08
$$ 28 -139 -118 26 65 -15 -314 -64 -73 -256 28 -100 250 -37 116 -120 -15 -122 71 167 126 26 98 -10
7528a0P6j42pj14R1J40j77N81l89J1p0o9K4J04J36k11p8K42p5lJ66l56K56N6J7
$$ -10 66 -76 -83 -197 -106 34 -143 438 49 60 -10 -79 -55 49 185 -26 -104 138 63 60 226 -130 126 182 199
7553A99Pjl52k15Q8K92j18M9J49o1L39l16K62m26J89J09m17K95J77j31L6k4j93
$$ 199 206 205 -147 -362 -274 18 -100 -51 98 37 376 60 322 -104 85 194 -223 72 249 118 154 130 -63
7576f3K23l45K00r6K07p9m8J7K1j73M7J22L9j48J47q4j19j24J6K96L14l85K1J01
$$ -63 160 -185 15 -81 126 47 -1 16 37 -136 -89 33 72 -76 71 -13 -132 -256 -240 56 370 -15 6 107
7600A07k64J55j50n5M55l29j73q5J85L77m03J08M7N0J92j91OJ13j34J25k20K99
$$ 107 -157 -2 -152 -207 248 -81 -254 -339 -154 223 -180 -72 -25 25 217 26 32 145 11 136 -84 215
7622B15l87M43m19J40K05k24j26J00J67j27K80m96J60J1m3%j42M96l64J25J61
$$ 215 -172 271 -148 -8 197 -27 -153 -53 114 -13 267 -229 -69 -58 -101 -101 -243 253 -111 14 175
7643A75p0l8k34L50j17n2j9j46K62p5m9J8K31k62l9M8M0k4k31J16K55k81j2L35
$$ 175 105 67 -167 183 66 14 -5 -151 111 36 -13 5 236 -26 -65 -17 23 -1 -232 -116 139 -142 -154 181
7667A81jP5m36J85J60J9j49J28m31J25j15m8J61N1j96L69k48K6K87o4q2J72k89
$$ 181 180 255 -181 4 164 183 34 162 -269 -144 -259 -307 -146 -95 -291 78 -170 -144 143 79 -3 169 -120
7690a20J67Lj23j4r8K77q9J67l31J42k0%P2Q7l28K36k62R2K53K8l32R3K28k58
$$ -120 47 50 -73 -87 -185 92 3 170 -161 -19 -39 -39 33 120 -208 28 -234 -142 111 139 -193 -100 128 -130
7714a30K24J92m3j21m3l56L45J80l76N1j12J68m4P6R8l06J76P6K6q4O2J63m21
$$ -130 94 286 243 122 79 -277 68 248 -128 -77 -189 -21 -65 11 109 -197 -21 55 81 -3 59 222 -199
7737a99L4r2L29J06Q5m49N1L90k10P4j22k40J65N9L91m87J32j25j0J72j75K46
$$ -199 -165 -257 72 178 263 -186 -135 255 45 119 -3 -243 -78 -19 372 -115 17 -108 -118 54 -121 125
7759A25j61j00J04p0Q4J03P7k81J30l93M19kJ12k71j19M00j07J75m19P5N68m67
$$ 125 -36 -136 -32 -102 -18 85 162 -119 11 -382 37 35 147 -124 -243 157 50 225 -194 -119 449 -18
7781a8j05K02q6K28p1m04L35M5J30k98J41j44n8K58k25R0l39J31M4O28l53k26
$$ -18 -123 79 -7 221 150 -254 81 126 256 -42 99 -45 -103 155 -70 20 -319 -188 -144 484 131 -95
7803i5J22j90j21M47nl24J33n3j07M36k33N3j02M1p9K46j34J6l26J66O8r2KQ9
$$ -95 27 -163 -284 163 158 -166 -33 -86 -193 243 10 63 -39 2 -77 169 35 51 -275 -109 -41 -133 -131 -42
7827d2K92j49j2k66N65k87k54j42K29J09O9O5r9J28k59o3j17L59m9jL3r7M3O5
$$ -42 250 101 89 -177 388 101 -153 -295 -66 43 112 177 78 206 -53 -116 -233 126 77 76 109 12 55 120
7851A20L0m40K34j49K81j20K98n51K87K12ml10L72l05K17j18j48J63j71j54J35
$$ 120 150 -290 -56 -205 76 -44 254 -297 -10 202 198 -112 260 -45 172 54 -94 69 -102 -256 -121
7872a21n3J50J30j56K12j99j29K99J18j95K16k04p4q6N6r3K63n6j72J70j63n1
$$ -121 -174 -24 106 -50 162 -37 -166 133 251 56 272 68 -6 -92 -36 -129 134 78 -94 76 -87 -138
7894a38KJ31m9n2m6J69K59j04l01l2L5k97O71k53N9j02N0j07J70j27J6r9k92M5
$$ -138 -136 -5 -54 -106 -152 17 276 172 -129 -161 -126 -423 248 -5 54 -48 2 -105 65 -62 -46 -145 -437 -392
7918c92L74O8k75L68nK07j80J25k43Q6R3m83L00O7p8k28P5M2q2N41n60M68m53
$$ -392 -18 50 -225 143 138 345 165 290 47 133 226 -257 43 110 32 -196 -121 -79 -161 380 -180 288 -165
7941a65L67j00j70J91l06J56m0J36J38k69j4R5J5L4j87J41J12j33l34M22l97K12
$$ -165 202 102 -68 123 -183 -27 -67 69 207 -62 -76 19 34 68 -119 22 134 1 -333 89 -308 -96
7963i6K40n0j95L0m8K73Kk17O9J17K7j34j26k3M2L0j34L77j39P0j05L2J47k20
$$ -96 144 94 -101 -71 -119 154 156 -61 8 125 152 18 -108 -131 -89 -59 -193 184 45 115 10 42 189 -31
7987c1J89j56Q6L58o01K74R4k30oj7n8k66L87K49k4l36k9j94L89j95PJ0m7J38
$$ -31 158 2 88 446 -155 119 213 -17 -23 -40 -98 -364 23 272 248 -88 -117 -311 78 -117 -110 -100 -147 -9
8011iJ55j36k7n8o9K12J88j29k56o1J58m13N18o4J54j52R7l80J91K41j79j71R6
$$ -9 146 10 -17 -75 -144 68 256 127 -129 -190 -32 -445 73 9 163 11 108 -272 -81 160 -19 -190 -94
8034i4Q9l10K14K63k30J30l5q7l2L2J70nr8k95N9J73J70k49J53m4K17j13M4k30
$$ -94 -5 -315 -101 162 -68 62 27 -60 -92 -60 110 105 7 -288 -229 -56 114 -135 18 -26 191 78 122 -108
8058a08q4L3J66j21K54j74r8j05J59K92J7P8l91r8K12R3j15O9j44k83K86J5K70
$$ -108 -192 -159 7 -114 140 -34 -132 -237 -78 214 231 309 -82 -180 32 125 10 79 -65 -348 -62 -47 223
8081B23o5j47k16LP01l31M0k57K75m66K96J05P0j25k3po1L14k83Oj58N0q0J52
$$ 223 158 11 -205 -202 499 168 208 -49 226 -240 56 161 231 106 83 76 15 329 46 52 -106 -56 -136 16
8105A6K18l74J61q4p6l6M67k67Q4kR2m2k04k11K76k00J77j21J79k4J24m7o20L19
$$ 16 234 -140 21 -63 -139 -175 292 25 109 107 199 157 -47 -258 18 -182 -5 -126 53 29 153 106 -514 -195
8129a95N05k56J22k97L24j92J81l62J52k66J11L99l63J65j33l0J7OK53k22r6J03
$$ -195 310 54 176 -121 203 11 192 -170 -18 -284 -173 226 -137 28 -105 -135 -118 -112 141 -81 -177 -74
8151g4L30n55K94L1k9J11J01k89M5l8j24J26K2p6L8jK09M5k80R8j1k3j3M32p34
$$ -74 256 -299 -5 26 -3 108 209 -80 -35 -73 -197 -71 -49 -125 -87 -88 121 166 -114 -16 -27 -50 -63 369 -365
8176c65L57k04J90K29l73L63l10J17K62l73J88k3M2l41K78
$$ -365 -8 -212 -22 207 -166 197 -113 4 266 -107 81 58 100 -241 37
8191C7
$$ Imaginary data points
##PAGE= N=2
##DATA TABLE= (X++(I..I)), XYDATA
0@%%%%%%%Kj0J6j6J6k4L2l2M0m9N7p1Q1r2J08j25J45j68J92k18K48k83L19l59
$$ 0 0 0 0 0 0 0 0 2 -8 8 -8 8 -16 16 -16 24 -25 32 -39 42 -50 58 -67 78 -90 102 -116 132 -151 168 -191
31a91M04m53N08n68O32p02P80q66R61j063J175j301J443j601J774j969K195k452
$$ -191 213 -240 268 -300 332 -370 410 -456 505 -558 617 -684 759 -842 932 -1037 1158 -1294
49a294K749l099L520m035M683n528O680q350J1003j5889K7820j08551j72881J75947
$$ -1294 1455 -1644 1876 -2159 2524 -3004 3676 -4674 6329 -9560 18260 -90291 -263172 -87225
63h7225J05330q2624q7156P9323K5629j14782n4415J31847P2104j20244j05407
$$ -87225 18105 -64519 -151675 -72352 -46723 -161505 -215920 -84073 -11969 -132213 -237620
74b37620R6197J22092k6889p5482J5025J3336n5063j846J23814Q1979o8660q6582
$$ -237620 -141423 -19331 -46220 -121702 -106677 -93341 -148404 -150250 -26436 55543 -13117 -99699
86i9699K5243N3925R1J2071N5767n078o9440J3969J15850L7657r6794n6279O3437
$$ -99699 -74456 -20531 -20440 -8369 47398 42320 -27120 -13151 102699 140356 43562 -12717 50720
99E0720M2554l2221K9204J02493j6668j58478n2445J42531R6978q9519q2817O7418
$$ 50720 93274 61053 90257 192750 176082 17604 -34841 107690 204668 115149 32332 99750
111I9750N3199q3141n2026R4493M8129j32006j05365J08509J40575n5672j36308
$$ 99750 152949 69808 17782 112275 160404 28398 -76967 31542 172117 116445 -19863
122a9863n738N3334m5503n5196P7569Q9946p6821j35547J3982J05590K403q3114
$$ -19863 -25601 27733 -17770 -72966 4603 94549 17728 -117819 -103837 1753 4156 -78958
134g8958j7523L6753j3088k1900N2772M6869o8783r4345J7675P7551J8620r340
$$ -78958 -96481 -59728 -72816 -94716 -41944 4925 -63858 -158203 -140528 -62977 -44357 -53697
146e3697K4217p390p9194k5894R8235P1770o7340p2693N4063P2186l0480l3525
$$ -53697 -29480 -36870 -116064 -141958 -43723 28047 -39293 -111986 -57923 14263 -16217 -49742
158d9742N9829K8282r7823n7132J23496J29510n9984j25063J9817Q6019k2746
$$ -49742 10087 38369 -59454 -116586 6910 136420 76436 -48627 -28810 57209 34463
169C4463n6011O7011Q8585o6269j15542M7676J35778o388j22798k8157Q0929K5482
$$ 34463 -21548 45463 134048 67779 -47763 -87 135691 129303 6505 -21652 59277 84759
181H4759m0974J9507N6760m2819j06490j951J01340M2676n4593l9518J0515p166
$$ 84759 43785 63292 120052 77233 -29257 -31208 70132 112808 58215 18697 29212 22046
193B2046j9669K8460L6318m0656o8632J1434O3980J1481l4934j0979q945n0507
$$ 22046 2377 30837 67155 26499 -42133 -30699 33281 44762 9828 -1151 -10096 -60603
205f0603j8781P8954O9345n8567r8913J0572O9309p372m7871K6816M5693n3528
$$ -60603 -79384 -430 68915 10348 -88565 -77993 -8684 -16056 -63927 -37111 8582 -44946
217d4946p4396N6364J11225k5979j26765k2879R5031L8815m9490j527N5960k2485
$$ -44946 -119342 -62978 48247 22268 -104497 -127376 -32345 6470 -43020 -44547 11413 -11072
229a1072r2406L906J14974M5076q4762n9136N1482N2995k0989j6543L2620K111
$$ -11072 -103478 -99572 15402 60478 -24284 -83420 -31938 21057 68 -16475 16145 18256
241A8256n5265r193P6028N3696l7962n6408k038K1118J3237K6985K7318k4965
$$ 18256 -37009 -46202 29826 83522 45560 -10848 -12886 8232 21469 48454 75772 50807
253E0807n3820J803N4446J9922k8570j1926R672j9741k0199M6619N9797l7931
$$ 50807 -3013 -1210 53236 73158 44588 32662 42334 22593 2394 49013 108810 70879
265G0879r5204q354P8189K9741m5805j5331L0259k0881o4120J5271Q9461R679
$$ 70879 -24325 -32679 45510 75251 29446 14115 44374 23493 -40627 -25356 64105 73784
277G3784j00068n1870O6943N7207l8451m2543K2434Q365n2399j7634P1625M8957
$$ 73784 -26284 -78154 -11211 45996 7545 -34998 -12564 -4199 -56598 -74232 -2607 46350
289D6350n9330p7958J2415N8828J1792k2462k278Q07k5352j0316L8615L6728j8783
$$ 46350 -12980 -90938 -78523 -19695 -7903 -30365 -32643 -31836 -57188 -67504 -28889 7839 -10944
302a0944m2501r669J9996K3286K2518R256k7669m0308O860N1295K6536j9749j6983
$$ -10944 -53445 -63114 -43118 -19832 2686 11942 -15727 -56035 -49175 2120 28656 8907 -8076
315h076N272n913r926L2072M9041j5480o9154j4633O5865M5802l1522l5140J5470
$$ -8076 -2804 -8717 -18643 13429 62470 46990 -22164 -36797 29068 74870 43348 8208 23678
328B3678J0438k8695l34N8754K6939o2573o1681L2442O8488Q95m7332j2675J6027
$$ 23678 34116 5421 5087 63841 90780 28207 -33474 -1032 67456 68351 21019 8344 24371
341B4371r592j6441K7003L6807k5269o2816j1939M7679L3297j6967l0115j3317
$$ 24371 14779 -1662 25341 62148 36879 -25937 -37876 9803 43100 26133 -3982 -17299
353a7299n236J412J7695J9405q567l2848k1001Q034K4758K0807k921l2816l3283
$$ -17299 -22535 -21123 -3428 15977 7410 -25438 -46439 -38405 -13647 7160 4239 -28577 -61860
366f1860R739M2905J9202k4326k4678J751L897m469J7264L3964o131n3329k3590
$$ -61860 -52121 -9216 9986 -14340 -39018 -37267 -33370 -37839 -20575 13389 7258 -46071 -69661
379f9661M7603N0676j3773m1476l894J9906q51k622K8449K3058l2820m7345J3593
$$ -69661 -22058 28618 14845 -26631 -30525 -10619 -11470 -14092 14357 37415 4595 -42750 -29157
392b9157O0235K2621l4973l1433P908J7043K881P842J6607m632l3393j9022K6465
$$ -29157 31078 53699 18726 -12707 -4799 12244 15125 22967 39574 34942 1549 -17473 8992
405H992M2058M623l4913l0279M779K5985J7141l121j2693j3698j1541j449J8646
$$ 8992 51050 55673 20760 -9519 -4740 21245 38386 35265 22572 8874 -2667 -4116 14530
418A4530K4846j883l7215l0447J4478L8055J1786k4613k3566k750M050K101J2823
$$ 14530 39376 37493 278 -30169 -15691 22364 34150 9537 -14029 -16779 -12729 -10628 2195
431B195J6559j1790l9056j8221L0943L9379m135l7749k0153J2158J6077M045L917
$$ 2195 18754 6964 -32092 -50313 -19370 20009 15874 -21875 -42028 -29870 -13793 -9748 -5831
444e831M497j3844k6778k545L5404L1622j4982m1226j2904K6189K6623O38j0367
$$ -5831 -1334 -15178 -41956 -44501 -9097 22525 7543 -33683 -46587 -20398 6225 6863 -3504
457c504l709o771j1336P569L2918J9738k6407l9054J966L9818K3628j4089j9536
$$ -3504 -7213 -13984 -25320 -17751 15167 34905 8498 -30556 -28590 11228 34856 20767 1231
470A231j121J545l235J0913K6723M529l4763l0131J8741M1987J0194k6563k2707
$$ 1231 110 1655 -1580 9333 36056 40585 5822 -24309 -5568 36419 46613 20050 -2657
483b657J577Q953N737J0097Q016j2525k7479r739K2500K7776J78k7530k4227J502
$$ -2657 -1080 7873 13610 23707 31723 19198 -8281 -18020 4480 32256 32434 4904 -19323 -17821
497a7821K0608J5951l324j5000j2697o526O63J3881K0701n30l3077k8492J6999
$$ -17821 2787 18738 15414 414 -12283 -18809 -18146 -4265 16436 15906 -17171 -45663 -28664
510b8664L9887O819k9307j7444R578M728o995J2069K5162r147m4229j3565M3282
$$ -28664 11223 18042 -11265 -28709 -19131 -14403 -21398 -9329 15833 6686 -37543 -51108 -7826
523g826L7961j9597l6455N34J8758n45k133K0085J2039k8070l1051J7835M3322
$$ -7826 30135 10538 -25917 -25383 -6625 -7170 -9303 10782 22821 -5249 -36300 -18465 24857
536B4857Q259k8255j8756O382R386O146J2600O532j6790k3584J657K4061J7555
$$ 24857 33116 4861 -13895 -7513 1873 8019 20619 27151 10361 -13223 -11566 12495 30050
549C0050k512j5740j8292o285J7699K6277n14k7692j6287J0869J1641r87M934
$$ 30050 27538 11798 -6494 -12779 4920 31197 30683 2991 -13296 -2427 9214 8227 13161
562A3161R441j6869l4261K039M4895K2018l4565l5618J1425K3901o443q621J8117
$$ 13161 22602 5733 -28528 -26489 18406 40424 5859 -29759 -18334 5567 -876 -9497 8620
575H620O937l4914k5534L3277M5056j4844m7368p002K9445R669j1673P450J5054
$$ 8620 15557 -19357 -44891 -11614 33442 18598 -28770 -35772 -6327 3342 -8331 -881 14173
588A4173j8530l3681R526M3585J3098k9672k2784R187J3860L250O666N237j5083
$$ 14173 -4357 -38038 -28512 15073 28171 -1501 -24285 -15098 -1238 2012 8678 13915 -1168
601a168k0987P402K7334J0735j1163j1389p085q550P236K9691J3465k8504k9501
$$ -1168 -22155 -14753 12581 23316 12153 764 -6321 -14871 -7635 22056 35521 7017 -22484
614b2484J2508K7541k023j3885P071M816k4050j4221L5772L5418k8064n1131M363
$$ -22484 -9976 17565 15542 1657 8728 13544 -10506 -24727 11045 46463 18399 -32732 -28369
627b8369M1941O357k3548L042J9891j9357l6210J5887N0344J000m9852j8665L4236
$$ -28369 13572 19929 -3619 -577 19314 -43 -36253 -20366 29978 30978 -18874 -37539 -3303
640c303K1698j6892r782J3067n962k7127L532M0814J6086l1019k7752Q945J5696
$$ -3303 18395 1503 -8279 4788 -1174 -28301 -24769 16045 32131 1112 -26640 -17695 -1999
653a999J549N101R101j1169k2838M356K8650P938j9380j1503M794o97J33K2087
$$ -1999 -450 4651 13752 2583 -20255 -15899 12751 20689 1309 -10194 -5400 -6097 -5964 16123
667A6123J8471k5828l9732P463M0678Q498k4085l194J6843j0875k6260J5800M1115
$$ 16123 34594 8766 -30966 -23503 17175 25673 1588 -1606 15237 4362 -21898 -6098 35017
680C5017q167n1206q952M7030K3149l0401j9962J7278J841k8547K145M5780J5862
$$ 35017 26850 -24356 -33308 13722 36871 6470 -13492 3786 5627 -22920 -20775 25005 40867
693D0867m5497l3872K6015L1469j2788j9240J1110R137j9756p839K9025J7258
$$ 40867 -4630 -38502 -12487 18982 6194 -13046 -1936 7201 -12555 -20394 8631 25889
705B5889k7938l1210J0595K6450M202k551M376r805k5345l90L0971J5679k0779
$$ 25889 -2049 -33259 -22664 3786 7988 5437 9813 8 -25337 -25727 5244 20923 144
718A44j4996J1879O493j1170N140K0802r077l7217p94M5605K1543l1406k4815
$$ 144 -14852 -2973 3520 -7650 -2510 18292 9215 -28002 -28796 16809 38352 6946 -17869
731a7869J5677Q285k0828J746M0290J0193m5689k6984L6835L4502k4669l2318
$$ -17869 -2192 6093 -14735 -12989 27301 37494 -8195 -35179 1656 36158 11489 -20829
743b0829J5568K2915j5692j3527K8449K0299l5659m0165J9842M3559J123k5136
$$ -20829 -5261 17654 1962 -11565 16884 37183 1524 -38641 -18799 24760 25883 747
755G47j828R525j3921j2982K0754K1433j7744k6955R099K5113k04j3704o00k295
$$ 747 -1081 8444 -5477 -18459 2295 23728 5984 -20971 -11872 13241 13037 -667 -1267 -3562
769c562j7094j107L2131J9927k4342k8165P024J4539p950k503K1547N568l1861
$$ -3562 -20656 -21763 10368 30295 5953 -22212 -15188 -649 -8599 -11102 10445 16013 -15848
782a5848j5591L4093K6839k8464l4665J4947K8652q116j3791K1792J6146l4788
$$ -15848 -31439 2654 29493 1029 -33636 -18689 9963 1847 -11944 9848 25994 -8794
794h794l5858K6319M6792n666l6296j63K5076m837k1246J1413K4517j4512l2317
$$ -8794 -44652 -18333 28459 22793 -13503 -13666 11410 6573 -14673 -3260 21257 6745 -25572
807b5572J1777M0853N181l1709j4443J1850K343o069J5193K0974j2425l0204j085
$$ -25572 -13795 27058 32239 530 -13913 -2063 280 -5789 9404 30378 17953 -12251 -13336
820a3336K2951N303j2307J27O326r044p081K0378J6715k3244l1857Q372K9270
$$ -13336 9615 14918 2611 2738 9064 20 -7061 13317 30032 6788 -25069 -16697 12573
833A2573J531j2980Q098Q250k5296k5108K3603L6905j2126l7185K359L0711q35
$$ 12573 14104 1124 9222 17472 -7824 -32932 -9329 27576 15450 -21735 -19376 11335 10500
846A0500k4947L504K0383j3704k9956J4526M4496J715m2858j7406K4060J1886
$$ 10500 -14447 -10943 9440 -4264 -34220 -19694 24802 26517 -16341 -33747 -9687 2199
858B199j4661K013K2783l266l0385m291L0250J2493k4142j5308J3805J2309l672
$$ 2199 -12462 -10449 12334 9068 -21317 -25608 4642 17135 -7007 -22315 -8510 3799 127
871A27L746J0724j0304k5622L74K8074J3172j1812o498M109o141j0293J2347K1372
$$ 127 3873 14597 4293 -21329 -20955 7119 20291 8479 1981 6090 -51 -10344 2003 23375
885B3375r082k6659L220K8201N511k0038n634J1807p762j8022J4784L5191k970
$$ 23375 14293 -12366 -9146 19055 24566 4528 -1106 10701 2939 -15083 -299 34892 31922
898C1922m0396j3548K7769J3853j8679p051J8673K308k5667m152L0222R953l2218
$$ 31922 -8474 -22022 5747 19600 921 -6130 12543 14851 -10816 -14968 15254 25207 -7011
911g011k2603K0172K3946p300j1565P399k36k1326p795K4722J9010j5565k0398
$$ -7011 -29614 -9442 14504 7204 -4361 3038 2802 -18524 -26319 -1597 17413 1848 -18550
924a8550N096J1652k811k885O427j723j5950m34K1565J1691j4574j3991L456K585
$$ -18550 -13454 -1802 -4613 -7498 -1071 -2794 -18744 -19178 2387 14078 -496 -14487 -11031 -8446
938h446m727R395K0162m099k7570p003K4866J3755j6362j0968J3550N748j4064
$$ -8446 -13173 -3778 16384 12285 -15285 -22288 2578 16333 -29 -10997 2553 8301 -5763
951e763L6K4041M771l0345j7775K4828K5974j0384j7046O619P078j4672q966K1751
$$ -5763 -5727 18314 23085 -7260 -25035 -207 25767 15383 -1663 4956 12034 -2638 -11604 10147
965A0147J7559j7687k4385R284K3253j136j5896j843N442o184n665J4238J4455
$$ 10147 27706 10019 -14366 -5082 18171 17035 1139 -704 4738 -1446 -7111 7127 21582
978B1582j1139k0819j576J2075M781j488K732k361j3072m203J4563J0917j1635
$$ 21582 10443 -10376 -11952 123 4904 3416 6148 3787 -9285 -13488 1075 11992 357
991C57j4050L976Q204k579M63J0723j848k1557r801K0848J9301j0712j7203M406
$$ 357 -13693 -9717 -1513 -4092 -3629 7094 5246 -16311 -26112 -5264 14037 3325 -13878 -9472
1005i472R435p724o027J5184J1622j8454j9488J3985K5676k899k1426l065J2011
$$ -9472 -37 -7761 -13788 1396 13018 -5436 -24924 -10939 14737 11838 -9588 -12653 -642
1018f42q18o701R595J5082r179k1601R3K0660Q287j0709o854L813P47l269O814
$$ -642 -1460 -8161 1434 16516 7337 -14264 -14171 6489 14776 4067 -2787 1026 1773 -1496 5318
1033E318R363n799j4992j662J2131Q238j760l421l611p826j772J2554J0459p821
$$ 5318 14681 8882 -6110 -7772 4359 12597 10837 7416 3805 -4021 -5793 6761 17220 9399
1047I399j3561N90Q297J51k447N699J449j3840r743J3985J8493p132j9716k810
$$ 9399 -4162 -3572 4725 4876 2429 8128 9577 -4263 -14006 -21 18472 11340 -8376 -11186
1061a1186J1686J481n966N067Q386r788j7382M502K0839L916j6935r423Q301O186
$$ -11186 500 1981 -3985 1082 9468 -320 -17702 -13200 7639 11555 -5380 -14803 -6502 -316
1075c16m336J131P575l882j4252l023J5551J0881p116j1475j180L885K670L592
$$ -316 -4652 -3521 4054 172 -14080 -17103 -1552 9329 2213 -9262 -10442 -6557 -3887 -295
1089b95M434l344r098k008P843P222j30l268l978m481J056J0651Q285o591j2280
$$ -295 4139 795 -8303 -10311 -2468 4754 4624 1356 -2622 -7103 -6047 4604 12889 6298 -5982
1104e982m36R088L831j350J289P87p439o963Q664J4611j614j6048n137R373P086
$$ -5982 -6418 2670 6501 5151 6440 7227 -212 -7175 1489 16100 14486 -1562 -6699 2674 9760
1119I760l438j812L931l879j0466N85J4661P462j1856j3089K624R505J957l177
$$ 9760 6322 4510 8441 4562 -5904 -5319 9342 16804 4948 -8141 -5517 3988 5945 2768
1133B768r9j225o143l484P648Q642k526j0696n083L376O064L576q54n371n762
$$ 2768 2669 1444 -4699 -8183 -535 8107 5581 -5115 -10198 -6822 -758 2818 1964 -3407 -9169
1148i169l18N086N394M64l581n156l642K783Q762N109o633r449m07P952M692j214
$$ -9169 -9487 -4401 993 1457 -2124 -7280 -10922 -8139 623 5732 -901 -10350 -10757 -2805 1887 673
1164F73j729lm046l702N872J1072M93j1924o915O938R390M28l974r97q56l127
$$ 673 -1056 -1059 -5105 -8807 -2935 8137 8630 -3294 -10209 -3271 6119 6547 2573 1576 720 -2407
1180b407L47Q109O601o075j0363j371Q604O920j961m893k463q05M53L198M822
$$ -2407 -2060 6049 12650 6575 -3788 -5159 3445 10365 8404 3511 1048 243 696 3894 8716
1195H716L87o674p429J587Q673N370m328p840l345K907M407J362m0j798n103m078
$$ 8716 9103 2429 -5000 -3413 5260 10630 6302 -1538 -4883 -1976 2431 3793 3753 1955 -3148 -7226
1211g226K897Q255K742o939q250j20O480M591j331k604k728k674o88N004O062
$$ -7226 -4329 3926 6668 -271 -8521 -8641 -2161 2430 1099 -1505 -4233 -6907 -7595 -2591 3471
1226C471q33p723n914L765P700L323l868m542j392J075K310L349K756j476o947
$$ 3471 2638 -5085 -10999 -7234 466 3789 -79 -4621 -6013 -4938 -2628 721 3477 2001 -4946
1241d946l560N716Q857J070p214n540K253N077J737K91O10k167n213j210P652
$$ -4946 -8506 -2790 6067 7137 -77 -5617 -3364 1713 3450 3741 4351 2184 -3029 -4239 3413
1256C413P421l587r228k887N978M945p66j150l60l318l598K694P896J872p035
$$ 3413 10834 7247 -1981 -4868 1110 6055 5289 4139 3779 461 -3137 -443 7453 9325 2290
1271B290p126J253O152L360j629k507l126k152R28M494K878j870n241l560J457
$$ 2290 -4836 -3583 2569 5929 4300 1793 -1333 -3485 -2557 1937 4815 2945 -2296 -5856 -4399
1286d399N283L709j672o620l806L345N165J323k398j532j912l191J586O930M035
$$ -4399 884 4593 2921 -3699 -7505 -4160 1005 2328 -70 -1602 -3514 -6705 -5119 1811 5846
1301E846o196q751J674Q466K075l821j346J219k535k989N152Q146j574j0719l498
$$ 5846 -350 -9101 -7427 1039 3114 -707 -2053 -834 -3369 -6358 -1206 6940 5366 -5353 -8851
1316h851P930O860k579l733M76R9l717J587P307K366o624o795K855O177K029j789
$$ -8851 -921 5939 3360 -373 103 202 -3515 -1928 5379 7745 1121 -5674 -2819 3358 5387 3598
1332C598j508k418k868K516N969J626m576m510k09K087K512K332M91n496n452
$$ 3598 2090 -328 -3196 -680 5289 6915 2339 -2171 -2380 -293 2219 4551 5042 -454 -5906
1347e906K876P240J351n191k836J628m44j373M054N317m548r975k33J0097M700
$$ -5906 -3030 4210 5561 370 -2466 -838 -1282 -2655 1399 6716 2168 -7807 -8040 2057 6757
1362F757o225m493K322J295l544Q03P360O59q877n235P371P691l067n731o5K021
$$ 6757 532 -3961 -1639 -344 -3888 -3085 4275 4934 -3943 -9178 -1807 5884 2817 -2914 -2979 -958
1378i58j926K31N896K688o634o410K927O736J051k389j667p53k339J891N275J529
$$ -958 -2884 -2653 3243 5931 -703 -7113 -4186 2550 3601 1212 -455 -1208 -3547 -1656 3619 5148
1394E148m996m440K184L072P43P40J278l500o181J385Q532L306o682m713L451
$$ 5148 152 -4288 -2104 968 1711 2451 3729 229 -5952 -4567 3965 7271 589 -4124 -673
1409f73K257k512LM830l12q602j892R442O275o358p742K089M826k362j232N474
$$ -673 1584 -928 -925 3905 3593 -5009 -6901 2541 8816 2458 -5284 -3195 1631 -731 -1963 3511
1425C511K885p779o623N724Q702j990p311l83M298k53j527K916K316n174n468
$$ 3511 6396 -1383 -8006 -2282 6420 4430 -2881 -3264 1034 781 -746 2170 4486 -688 -6156
1440f156L070O935Q69l652j846j12j641l1N377K544n171m827K516M824p87k163
$$ -6156 -3086 3849 4718 1066 -780 -892 -2533 -2564 2813 5357 186 -4641 -2125 2699 1912 -251
1456b51P23n94m129l48P875L866p031o700K861N523j834j979L426J936o023m792
$$ -251 472 -122 -4251 -4599 3276 7142 111 -6589 -3728 1795 -39 -2018 1408 3344 -2679 -7471
1472g471O720P492m746q859J419P412J75l552J695L146n027n692M210Q803m72
$$ -7471 -751 6741 1995 -6864 -5445 1967 2142 -1410 285 3431 -1596 -7288 -3078 5725 5253
1487E253o837k330M309O70k239J814K817k573n229K749N963Q57n538j874J732
$$ 5253 -1584 -3914 395 1065 -1174 640 3457 884 -4345 -1596 4367 5224 -314 -2188 -456
1502d56j0N16L486K179m644n831K505N431j66l261J001J782l226k111M412M349
$$ -456 -466 50 3536 5715 1071 -4760 -2255 3176 3010 -251 750 2532 -694 -2805 1607 5956
1518E956n026p122K313P518L05m756K45K282l460m702M706P223j903q426l87O630
$$ 5956 930 -6192 -3879 3639 3944 -812 -567 1715 -1745 -6447 -1741 5482 3579 -4847 -5234 1396
1534A396Q76m600p05M361j659m510K153O976Q0p529k871M144L339j350O0K064
$$ 1396 2272 -2328 -3033 1328 -331 -4841 -2688 4288 4368 -3161 -6032 -1888 1451 101 161 2225
1550B225j850m535J044N688P23m444j096K377J238j216J813J656l791m574K507
$$ 2225 375 -4160 -3116 2572 3295 -1149 -2245 132 1370 154 1967 3623 -168 -4742 -2235
1565b235O844M20m739q41J997j615k612L149N182k746o594J423O364M82n334j878
$$ -2235 4609 5029 290 -551 1446 -169 -2781 368 5550 2804 -3790 -2367 3997 4479 -855 -2733
1581b733L865j11l480K170O005j511q321j845O177L530l330k291K881K09l837
$$ -2733 1132 1021 -2459 -289 5716 4205 -4116 -5961 216 3746 416 -1875 1006 1215 -2622
1596b622k96N138P16n466k505M377L704j703k369Q74q95k561O99N377J220m615
$$ -2622 -2918 2220 2936 -2530 -5035 -658 3046 1343 -1026 -152 -1047 -3608 -2909 2468 3688 -927
1612i27k031J774J584j205M41J937j497l296J411N335L3n094j805L023R87j515
$$ -927 -2958 -1184 400 -805 -364 1573 76 -3220 -1809 3526 3559 -1535 -3340 -317 670 -845
1628h45J188M008j984o187k54N954K608m364k720L430J723l219m23M023j40n691
$$ -845 343 4351 2367 -3820 -4074 1880 4488 124 -2596 834 2557 -662 -1085 2938 2798 -2893
1644b893j724N795L888l036m129J199K049k641k78M029J518m294k962L092K955
$$ -2893 -4617 1178 5066 2030 -2099 -900 1149 -1492 -1770 2259 3777 -517 -3479 -387 2568
1659B568j347k219K46R71j406J077K294N97l940k678K666K219n99Q5J124j441
$$ 2568 1221 -998 -752 219 -1187 -110 2184 2781 -1159 -3837 -1171 1048 449 534 1658 217
1675B17l167P67M016Q98m165k042L398K033j990p53K147p48m003l83N656K620
$$ 217 -2950 -2183 1833 2731 -1434 -3476 -78 1955 -35 -788 1359 611 -3392 -3775 1881 4501
1691D501m138l682K052K421j649j234K846J358l613k739M045L341k159m155P46
$$ 4501 363 -3319 -1267 1154 -495 -1729 1117 2475 -1138 -3877 168 3509 1350 -2805 -2059
1706b059K850n87k20J670N31l098k509K485L450n23k334J2M93o42L70J866L55
$$ -2059 791 204 -16 1654 2185 -913 -3422 -937 2513 1990 -344 -332 161 -481 -111 1755 2110
1723B110k795j224K072K174p70j153l45l13j842P62L810J248m160k436K426K427
$$ 2110 -685 -1909 163 2337 1567 414 69 -244 -2086 -1324 2486 3734 -426 -2862 -436 1991
1739A991j711j434J919M73k796p80L427K481l275m107J724L494o72j680J088P40
$$ 1991 280 -1154 765 1238 -1558 -2338 1089 3570 295 -3812 -2088 1406 734 -946 142 882
1755H82k345j846K474L824j690l913J82K697O77j576P53M81j678j574J902K726
$$ 882 -1463 -3309 -835 2989 1299 -2614 -2432 265 942 -634 119 600 -1078 -2652 -750 1976
1771A976m08k285n99N79L89N81J146k06k080j099K056J941q92j539K14N92r87
$$ 1976 1568 -717 -1316 -737 -348 233 1379 1173 -907 -2006 50 1991 1099 -440 -226 366 -621
1788f21N86K429N47l547k238K462K780o47k026O08Q66j797r98K852K173k193l640
$$ -621 -35 2394 2941 -606 -2844 -382 2398 1751 -275 333 1199 -598 -1596 1256 3429 1236 -2404
1805b404N56L887J00k165m26Q35p51j218J659K106q46l314n80K286J381n64q00
$$ -2404 -1848 2039 2139 -26 -452 383 -368 -1586 73 2179 1333 -1981 -2561 -275 1106 542 -258
1822b58j25p63k34J074J517m76k029m75P87N04Q91M28m24k328n53K192J970j101
$$ -258 -383 -1146 -1380 -306 1211 735 -1294 -1769 -982 -478 413 841 417 -1911 -2464 -272 1698 597
1840E97j748N18O23n93k06J771O02k468j681K157K811m34k693k78J530l24o74
$$ 597 -1151 -633 -10 -603 -809 962 1564 -904 -2585 -428 2383 1949 -744 -1022 508 184 -490
1857d90J444J542j445l142L26L350J270k215j172O33J39k49Q45R78o41k068p65
$$ -490 954 2496 1051 -2091 -1765 1585 2855 640 -532 101 240 -9 836 1814 1173 -895 -1660
1874a660K022J768l45j464j047L2L10R14R36o85j645m21P55O78M78J09p39j862
$$ -1660 362 2130 1785 321 -726 -694 -384 530 1466 781 -864 -1285 -530 148 626 735 -4 -1866
1892a866k54K110J519j663j210j34Q79L57j76J236k8j910j655J601K996m84k392
$$ -1866 -2120 -10 1509 -154 -1364 -1498 -619 -262 -438 798 770 -1140 -2795 -1194 1802 1318 -1074
1909a074j048J361Q06m53M17J010r97j771J79K548J612k050j926J31J751K39K57
$$ -1074 -2122 -761 45 -408 9 1019 22 -1749 -1570 978 2590 540 -1386 -1255 496 735 992
1926I92r1l87q63o38J363J589Lj505j411K74J520J153k33j234j187K08N38J080
$$ 992 901 514 -349 -987 376 1965 1968 463 -948 -674 846 1999 1766 532 -655 -447 91 1171
1944A171J29m9j207j677P80K230P18j268k293K44J501j58l7M00k15j512r56J448
$$ 1171 1300 1251 44 -1633 -853 1377 2095 827 -1466 -1222 279 121 84 484 269 -1243 -2199 -751
1962g51K004j46k331j404J151J482O74j008p4m93p01M9J553J073p50k079p16J530
$$ -751 1253 1107 -1224 -2628 -1477 5 679 -329 -403 -896 -1597 -1548 5 1078 328 -1751 -2467 -937
1980i37J910J09j311o05o8K60M90J039J91n75j902J35K105J470r28j595m21Q36
$$ -937 973 1082 -229 -834 -902 -642 -152 887 1078 503 -1399 -1264 841 2311 1383 -212 -633 203
1998B03M24N87R5n7q79j413J092J782P38j717k018O75J045P21K53n10o61j157
$$ 203 627 1214 1309 1252 373 -1040 52 1834 2572 855 -1163 -488 557 1278 1531 1021 360 -797
2016g97MJ248J045p8j727j316O71J600P72r64j641o8J45M47M78R21k75j975q48
$$ -797 -793 455 1500 1422 -305 -1621 -950 650 1422 458 -1183 -1251 -1106 -659 -181 740 465 -1510 -2358
2035b358J091K331J21k178j299R29R15L62n77P65k66k146L44K220K245j982j915
$$ -2358 -1267 1064 1185 -993 -2292 -1363 -448 -86 -663 102 -164 -2310 -1966 254 2499 517 -1398
2052a398k17J268J207l12o4m4r06j113J403J819L30j997r66L66J261Q18Ln67j202
$$ -1398 -1615 -347 860 548 484 440 -466 -1579 -176 1643 1973 -24 -990 -624 637 1455 1458 891 -311
2071c11j82M98J159M58m10j146r20K03J423J700r16k102r95J785R03m16m11K19
$$ -311 -493 5 1164 1622 1212 66 -854 -651 772 2472 1556 -546 -1541 244 1147 731 320 539
2089E39o57j409M75K648Q65k717k446J243K443q3j372M67J51j472q87K510J996
$$ 539 -118 -1527 -1052 1596 2461 -256 -2702 -1459 984 901 -471 -4 147 -1325 -2212 298 2294
2106B294j519l359L13J918J179p43k35ro58j016J004K147l97j876r30Q31J171
$$ 2294 775 -2584 -2271 -353 826 83 -152 -161 -819 -1835 -831 1316 919 -957 -1887 -1056 115
2123A15N56K56q25j317n21J742J590m94j336m40L45l45P99J664K01k779j559K211
$$ 115 671 927 102 -1215 -1736 6 1596 1102 -234 -674 -329 -674 125 1789 1990 -789 -2348 -137
2141a37K168m02k075N62P40j247k43K031J768k806l142J430L448K52k057n86J182
$$ -137 2031 1629 -446 116 856 -391 -634 1397 3165 359 -2783 -1353 2095 2347 290 -296 886
2158H86p41j508J336K482p37l178p85K933J323j511j051K51m02q21J201K096l92
$$ 886 145 -1363 -27 2455 1718 -1460 -2245 688 2011 500 -551 -300 -702 -1523 -322 1774 1382
2175A382k524j185J225J041K92j7k06j383j010J838K040p59k309l61J189K47j05
$$ 1382 -1142 -2327 -1102 -61 231 214 8 -1375 -2385 -547 1493 734 -1575 -1936 -747 -500 -605
2192f05J394J095k564k732J866L648n0k961o55K007j76j428J056K609j252l829
$$ -605 789 1884 -680 -3412 -1546 2102 2052 -909 -1564 443 267 -1161 -105 2504 1252 -2577
2208b577O10L931J524l114k351K135Q27j504P17K486l80l498j126K901K282j603
$$ -2577 -1967 1964 3488 374 -1977 158 985 -519 198 2684 2304 -1194 -2320 581 2863 1260
2224A260j517L30J93q15M85K046m10k782q55J910J431j14p37L60j583j432J466
$$ 1260 -257 73 266 -549 -64 1982 1572 -1210 -2065 -155 1276 1162 425 785 -798 -2230 -764
2241g64K742l06l014n47J869N72j545R21J114j519k659J086M282L94l664k062
$$ -764 1978 1672 -1342 -1889 -20 552 -993 -72 1042 -477 -3136 -2050 2232 2626 -1038 -3100
2257c100K388Q91j243L92K442m46l787p71L844K350k832k916J699K183q64p03
$$ -3100 -712 179 -1064 -672 1770 1324 -2463 -3234 610 2960 128 -2788 -1089 1094 230 -473
2273d73J696M09k671k000K985L117j514k313l22J134m66J42J830Q42k838j095
$$ -473 1223 1632 -1039 -3039 -54 3063 1549 -764 -1086 48 -418 -276 1554 2396 -442 -1537
2289a537J910J747p76j549J68Q2j426Q40L226M32l858k060K391J953j275o65J714
$$ -1537 373 2120 1344 -205 -37 45 -1381 -541 2685 3117 -741 -2801 -410 1543 268 -397 1317
2306A317Q0l059m38L884J553l698l103K605L106j390j858J560P17k911k141L623
$$ 1317 1397 -1662 -2100 1784 3337 -361 -3464 -859 2247 857 -1001 559 1276 -1635 -3776 -153
2322a53L797k563l601N37K656m79j584J294J349k084j738K264L211j453l198k39
$$ -153 3644 1081 -2520 -1983 673 194 -1390 -96 1253 -831 -2569 -305 2906 1453 -1745 -1984
2338a984J618N1L3J758K74k850j794J913K511n40j739K68Q13q63j54K499L78l095
$$ -1984 -366 -315 -282 1476 1750 -1100 -2894 -981 1530 990 -749 -481 332 -531 -685 1814 2192 -903
2356i03k763K967L296q84k299P07J184k399j207L279L049k806l904J530L743p34
$$ -903 -3666 -699 2597 1713 -586 121 1305 -1094 -2301 978 4027 1221 -2683 -1153 2590 1856
2372A856k902L94J747j337j453K003L623j704m321p44L462J248j783j42J189r34
$$ 1856 -1046 -652 1095 -242 -1695 308 3931 2227 -2094 -2838 624 1872 89 -53 1136 202
2388B02k291J410K684l41l082q41K453Q03r01L70K45k195j784K158L352n40k812
$$ 202 -2089 -679 2005 1664 -1418 -2259 194 997 96 466 711 -1484 -3268 -1110 2242 1702 -1110
2405a110k96R48l26j117J910J691j785l470J652M497r61l528J87J871l46j467
$$ -1110 -1406 -458 -784 -1901 9 1700 -85 -3555 -1903 2594 1633 -1895 -1708 163 -183 -1650
2421a650J556L151j316n050M31M334J201k883r09K263k14k120O95L396o38l667
$$ -1650 -94 3057 1741 -3309 -2878 1456 2657 -226 -1135 1128 914 -1206 -511 2885 2247 -1420
2437a420p50L400K134k023j283N37l42j737J020K908L17l004j476J845J225q00
$$ -1420 -2170 1230 3364 1341 58 595 253 -1484 -464 2444 2761 -243 -1719 126 1351 551
2453E51k87P04j343j247J439K451n4l331j223J608J065j165J129J797j724l835
$$ 551 264 968 -375 -1622 -183 2268 2214 -1117 -2340 -732 333 -832 297 2094 370 -3465
2469c465R52L790R60l315j713K548J037k007R2K581o01m039l83M382K052k847
$$ -3465 -2513 1277 2237 -1078 -2791 -243 794 -1213 -1121 1460 859 -3180 -3563 819 2871 24
2485B4j824Q77J530j800J21K524N78l200j361K900K230j499k348N51R44n59N53
$$ 24 -1800 -923 607 -1193 -1072 1452 2030 -1170 -2531 369 2599 1100 -1248 -697 247 -312 241
2502B41K102k41k621j516K052J419l23m43M63o87j522N31K842K80l169j417J935
$$ 241 2343 2102 -519 -2035 17 1436 1113 670 1133 446 -1076 -545 2297 2577 -592 -2009 -74
2519g4J823j124p48J519j208k597M62L503J813l454k382J472K026j403o39J622
$$ -74 1749 625 -123 1396 188 -2409 -1947 1556 3369 -85 -2467 -995 1031 -372 -1011 611
2535F11N21k731r94L144K270j930l516N71K099K0o30J129N69j936k450K357K863
$$ 611 1132 -1599 -2593 551 2821 891 -2625 -2054 45 65 -565 564 1133 -803 -3253 -896 1967
2552A967p31k014m26R33m3L43R13K99k319j177J841K171j89j466n20j51n31N69
$$ 1967 1236 -778 -1204 -271 -314 29 942 1241 -1078 -2255 -414 1757 1568 102 -418 -569 -1100 -531
2570e31K471O09l013j901J928K370p76j322N99J83j852n05L090J854k725l191
$$ -531 1940 2549 -464 -2365 -437 1933 1157 -165 434 617 -1235 -1740 1350 3204 479 -2712
2586b712J051K955J15j338K8P13j499j217J622K696j212k781l77K283Q66r41k5
$$ -2712 -1661 1294 1409 71 99 812 -687 -1904 -282 2414 1202 -1579 -1956 327 1193 252 227
2603B27K73j122j160J076K381J39k354p95K11J015O61J75K5j558j204J385J863
$$ 227 500 -622 -1782 -706 1675 1814 -540 -1335 -1124 -109 552 727 752 -806 -2010 -625 1238
2620A238k98j185k72k98O1K99J769M85k446j863J179K554O5j363m59M93q34m70
$$ 1238 940 -245 -517 -815 -754 -455 1314 1799 -647 -2510 -1331 1223 1288 -75 -534 -41 -875 -1345
2638a345J749J684j654k530J90K575J203j564j003N15j84r30J010K053M6k881
$$ -1345 404 2088 434 -2096 -1906 669 1872 308 -695 -180 -364 -1294 -284 1769 1815 -1066
2654a066j091J473K184n23p56k28l85m57R00J432J59j729j188M48J426O19J20
$$ -1066 -2157 -684 1500 977 221 -7 -392 -849 51 1483 1642 -87 -1275 -827 599 1218 1338
2671A338p51j328r10J526J491J13j463p04J84l5P11J089j8j609j530P31K367M95
$$ 1338 587 -741 -1651 -125 1366 1479 16 -688 -504 -539 172 1261 1243 -366 -1896 -1165 1202 1697
2689A697j832o87M86k98J30R04R91q56k163o18K045J805q85j534j48l9N51M13
$$ 1697 -135 -822 -336 -634 -504 400 1391 535 -1628 -2246 -201 1604 719 -815 -963 -1002 -451 -38
2707c8R12k21j488j224J286J640N75j179j294J50N31O88P64k59p34j042j69J040
$$ -38 874 653 -835 -2059 -773 867 1442 263 -1031 -881 -350 338 1102 843 109 -933 -1102 -62
2725f2J346M25j728j335M36J227J200k85j179m86o1O93M70R03m38j442j231J267
$$ -62 1284 1709 -19 -1354 -918 309 1509 1224 45 -441 -502 191 661 1564 1126 -316 -1547 -280
2743b80J444P23j372j156j62O00M71M96N24j201j103n73J473J436l00j603q81
$$ -280 1164 1887 515 -641 -803 -203 268 764 1288 87 -1016 -1589 -116 1320 1020 -583 -1464
2760a464P75N68Q64m48m2p91p14J88J694O57p68j666l70J178J022L13q80m22n77
$$ -1464 -689 -121 743 295 253 -538 -1252 -1064 630 1287 519 -1147 -1517 -339 683 996 116 -306 -883
2779h83J01P96J016K50j408j387L95J577R89m89j347M1l23L97O54P26l79j345
$$ -883 -782 14 1030 1280 -128 -1515 -1120 457 1446 957 -390 -349 -672 -275 379 1105 726 -619
2797f19o86J002J188J87p31p55m11K04Q98P23k26j105n82J60O09R34K49j083j167
$$ -619 -1305 -303 885 1072 341 -414 -825 -621 277 1000 774 -331 -913 -753 -144 790 1039 -44 -1211
2816a211r4J546J184p64j021n9M6pO89M92J28j592j252J525J604k4j373m21L05
$$ -1211 -1305 241 1425 661 -360 -419 -373 -380 309 801 929 -663 -1915 -390 1214 1190 -183 -604 -299
2835b99N6PR96P67j454j697K50K090P27q54j264J01Q1K38Q43P44p06j450n09J265
$$ -299 -243 -236 760 1527 73 -1624 -1374 716 1443 589 -675 -574 -493 -255 588 1332 626 -824 -1333 -68
2855f8R91J64j003p01m56L71J340O04o26j639r5O39R70j11L40n23j310l98J521
$$ -68 923 1087 84 -617 -1073 -702 638 1242 616 -1023 -1118 -479 491 380 720 197 -1113 -1511 10
2874A0J752r49j654l50R91L36k38N44L62j330j411J202K114K42j786j089R12Q56
$$ 10 1762 813 -841 -1191 -200 136 -102 442 804 -526 -1937 -735 1379 1621 -165 -1254 -342 514
2892E14l75K01N90m84j872J54K184R31j371j234R7L64N31K47P71o77j643l67J609
$$ 514 139 340 930 446 -1426 -1272 912 1843 472 -762 -665 -301 230 477 1248 571 -1072 -1439 170
2911A70J085m01r29l36k12P9Q87Q40l27j997m65J572Q65o23l04J96o38p63R59
$$ 170 1255 854 -75 -411 -623 -544 343 1183 856 -1141 -1606 -34 831 208 -96 100 -538 -1301 -342
2930c42J688j77j961r34J551O72j80m87M85k21j423M75K282N19k345j205Q70J270
$$ -342 1346 1169 -792 -1726 -175 497 317 -170 315 94 -1329 -854 1428 1947 -398 -1603 -733 537
2948E37m87l05R87k44j267o70J879J398j457j642N08J075K49m00N06j43j677j76
$$ 537 50 -255 732 488 -779 -1449 430 1828 371 -1271 -763 312 561 161 667 524 -1153 -1329
2966a329J656J124l16j720J23k3J47L64J072k72j671o48J479J297r51j098O85
$$ -1329 327 1451 1135 -585 -462 -485 -338 26 1098 826 -845 -1493 -14 1283 332 -766 -81
2983h1J80r55L15K041j0k279j459J490K058p68r96M52P07j682k90K127J158k010
$$ -81 99 -856 -541 1500 1490 -789 -2248 -758 1300 532 -464 -12 695 -987 -1277 850 2008 -2
3001bj568O92K214k76j576M27P62j160p34J541J595j124k280N25J061M73n24L22
$$ -2 -1570 -878 1336 1060 -516 -89 673 -487 -1221 320 1915 791 -1489 -964 97 570 46 368
3019C68n5r81p67J491J268m40k053j21J209J69K39K05J07j723o57J494J579p36
$$ 368 313 -668 -1435 56 1324 884 -1169 -1290 -81 88 327 532 639 -1084 -1741 -247 1332 596
3037E96j472O36O35p87m19J615O39j925j517J185K193j75j712j83Q19p50l50J352
$$ 596 -876 -240 395 -392 -811 804 1443 -482 -1999 -814 1379 1204 -508 -691 128 -622 -972 380
3055C80J656j500k105O47J854N69j764l55Q39j53p23Q40J683j077k011q7J817
$$ 380 2036 536 -1569 -922 932 1501 -263 -618 221 68 -655 185 1868 791 -1220 -1307 510
3072E10M53p51j26K51m25j403J610J402p17j566j12J376K9m91L75K94j234q86
$$ 510 963 212 86 337 -88 -1491 119 1521 804 -762 -874 502 531 40 415 709 -525 -1411
3090a411J038K121n92j876k84Q72N45p73N87J078j266j861R14K097L3k200k06
$$ -1411 -373 1748 1156 -720 -1004 -132 413 -360 227 1305 39 -1822 -908 1189 1222 -978 -1184
3107a184J354j44n36Q35J031o24k278J24K061P86j299q69O89L61o50K03J207k80
$$ -1184 170 26 -510 325 1356 732 -1546 -1422 639 1425 126 -743 -54 307 -343 -140 1067 787
3125G87j449o03J774R23j280n09N64l45q35J223J180m14j902n1R87L88j90q1L29
$$ 787 -662 -1265 509 1432 152 -357 207 -138 -973 250 1430 1016 -886 -937 50 438 248 167 496
3144D96o08o48M64J931q95j521q49J334R97o77j88R44q94j120n1K225N27j745
$$ 496 -112 -760 -296 1635 740 -781 -1630 -296 701 24 -164 780 -114 -1234 -1285 940 1467 -278
3162b78j100J052R26p75j98P16L53j847M3J482J261j673r06M13O52j90o9R26P2
$$ -278 -1378 -326 600 -175 -373 343 696 -1151 -1108 374 1635 -38 -944 -531 121 -69 -138 788 860
3181H60j227p22J331R62o41r76J14J37J75J12R83l70j551n25J202J108p20m27
$$ 860 -367 -1089 242 1204 563 -413 -299 -162 13 125 1108 738 -813 -1338 -136 972 252 -175
3199a75L44j42q62L13J617j07j544p11J248Q49o45p80P94j36q90l50J931P32j272
$$ -175 169 27 -835 -522 1095 988 -556 -1267 -19 830 185 -595 199 63 -827 -1177 754 1486 214
3218B14j475Q99J050n86k90N09K80q85p28J143J257r43j426L77Q15L82m63M9L50
$$ 214 -1261 -362 688 102 -188 321 601 -284 -1012 131 1388 445 -981 -604 211 593 130 179 529
3237E29j010l68M65J572j94j370m63R47j63m3O88j11r43m93J076Q46l50j071J05
$$ 529 -481 -849 -384 1188 994 -376 -839 108 -55 -98 590 479 -464 -957 119 965 615 -456 -351
3256c51N12o59R6J259J42j463r24J059J142m17o45K24L03o55m97J011J181j078
$$ -351 161 -498 -402 857 999 -464 -1388 -329 813 396 -249 -25 278 -377 -874 137 1318 240
3274B40j467N77J310K09r46J4L43n24p40R47J064l17j262j94R19L96m93o0J74
$$ 240 -1227 -650 660 869 -77 -63 280 -244 -984 -37 1027 710 -552 -746 173 569 76 16 190
3293A90n26k49P27N34O4j202k60L22J46P4Q32n7q40n28O47R81n52p42j48N83j22
$$ 190 -336 -585 142 676 740 -462 -722 -400 -254 -180 652 595 -245 -773 -126 855 303 -439 -587 -4 -126
3314a26l95J258k28p77n19k0J192M74j106l51O78j34j86J39Q80m41j355O10R94
$$ -126 -521 737 509 -268 -787 -807 385 859 -247 -598 80 -54 -240 -101 779 338 -1017 -407 587
3333E87J73p53n51L59J24o9J50O12j52j039l33Q06P68m47O1n1m25J27r7R10l90
$$ 587 760 7 -544 -185 -61 -130 20 632 480 -559 -892 -86 682 235 296 245 -180 -53 -150 760 370
3354C70q79k45P58k69O53j62j05l85l10L40Q19J09j076j08L66J54k23M91Q5n02
$$ 370 -509 -754 4 -265 388 226 121 -264 -574 -234 585 694 -382 -490 -124 30 -193 298 383 -119
3374a19q61L07J209M22j171J06l94K73r6P8P89k67j046k38J169N63n39n55m4M26
$$ -119 -980 -673 536 958 -213 -107 -501 -228 -324 -246 543 276 -770 -1008 161 724 185 -370 -414 12
3394A2nj36O92m12m96k09L24Q89r4n52j75j86J49L91L53k8o58l66L80L86o7o9
$$ 12 7 -129 563 151 -345 -554 -230 659 565 13 -162 -348 -199 192 545 517 -141 -507 -127 259 192 123
3416A23m2p04K45L95L56K20r25m9K26K62j42J28N91r53l24K68N04M80p94l92K85
$$ 123 81 -623 -378 17 373 593 -332 -381 -155 107 -35 93 684 -269 -593 -325 179 659 -135 -527 -242
3437b42K13qJ12R6r5m73j1K88Q71l22p43j68N51L17j44k4j01l53J35o7L83K97
$$ -242 -29 -37 75 171 76 -397 -408 -120 751 429 -314 -482 69 386 242 218 117 -236 -101 -168 215 512
3459E12l12k95n45Q44J88k1j14n12l49P91P7m4m2r5k95k46O32J93J95q51m05L67
$$ 512 200 -95 -640 204 392 371 257 -255 -604 187 264 220 178 83 -212 -458 174 367 562 -289 -694 -327
3481c27L42J81j62J66j83l02J66J95L28m40q03K12O33M92o01j8l8l30L40K32K11
$$ -327 15 196 34 200 17 -285 -119 76 404 -36 -839 -627 6 498 -103 -121 -159 -489 -149 83 294
3502B94O7n66J47j75M75O4m8n68J09J9L34R2M97m43l93j45K66M57l1l51k47k09
$$ 294 361 -205 -58 -233 242 306 258 -310 -201 -182 152 244 741 298 -95 -240 26 483 452 101 -146 -355
3524c55Q32M5l33J69k03n99O0O69K82P5q89l31J79M66L21n2k33k52m7J52L42j11
$$ -355 477 522 189 358 155 -444 -384 285 567 642 -247 -578 -399 67 388 336 103 -149 -196 -44 298 187
3546A87k38j57j95j26Q40pm90j34M5k0N75p5j40l89q1k61P60J99j79n05j32Q27
$$ 187 -51 -208 -403 -529 311 304 -186 -320 -275 -295 280 205 65 -324 -405 -666 94 293 114 -391 -523 304
3568C04l56L06k67J61l42L3n6N97L11p92k58L15n4K64J22qj28k21k45N89K41k57
$$ 304 -52 254 -13 148 -194 -161 -217 380 691 -101 -359 -44 -98 166 288 280 152 -69 -314 275 516 259
3590B59l52j55J06K11K43M0o19j72K88N34j67J37k59n23K72J10O25k98l68j0k60
$$ 259 -93 -248 -142 69 312 352 -267 -439 -151 383 216 353 94 -429 -157 -47 578 280 -88 -98 -358
3611c58J20K86j82K33j41J88m62M28K82k73o41J01O78L7k69j20J60k33l70L74
$$ -358 -238 48 -134 99 -42 146 -316 112 394 121 -520 -419 259 296 27 -93 67 -166 -536 -162
3631a62N06J62p36k79M34L05L6m26K16l97K23j24K58K48j0o10O9J98L13p2j72
$$ -162 344 506 -230 -509 -75 230 266 -160 56 -341 -118 -242 16 264 254 -356 -287 -89 224 152 -20
3652b0j30l31L01K41j4R4l60O1J22L40j4j07j26k52j83N58K62l23j62K1m8J4n9
$$ -20 -150 -481 -180 61 47 141 -219 -158 -36 304 290 183 57 -195 -378 180 442 119 -43 -22 -70 -56 -115
3675a15O00j48o96j85O45M31k94j17l08M2J25lL58L31m43n35J83M19J18l64j88
$$ -115 485 337 -359 -544 101 532 238 121 -187 -145 -20 -23 335 666 223 -312 -129 290 408 44 -144
3696a44O7p3JL38J25k86m28jL67N5J99l75J70l55J1M86M8l24k1m4j42K43K58K19
$$ -144 -77 -150 -149 189 314 28 -400 -401 -34 21 220 -155 15 -340 -329 157 205 -119 -140 -184 -326 -83 175 394
3720C94l16l01P8M41J28k40q08O07Q9j65q1N25O0p35k75P05L92n6l76l90L54j28
$$ 394 78 -223 -145 296 424 184 -624 -17 72 -93 -174 351 411 -324 -599 106 498 442 66 -324 30 -98
3742i8j10J06P49o23k62n4N86Q9j41l75j13K90J8J63L9j23l45o7M96K52n62J05
$$ -98 -208 -102 647 24 -238 -292 294 383 242 -133 -246 44 62 225 264 141 -204 -271 225 477 -85 20
3764B0L1j1K6J58J90m08rr0M38j79j89K27k02m08n6O61L47m97k57j22K10K63k64
$$ 20 51 40 66 224 414 6 -3 -93 345 166 -23 204 2 -406 -462 199 546 49 -208 -330 -120 143 -121
3787a21K85N6m03p8j30N98L19o57l04M83L5k43J87K17k14n17J13N96j59ML6j95
$$ -121 164 220 -183 -261 -391 207 526 -131 -435 48 83 -160 27 244 30 -487 -374 222 63 67 103 -92
3809i2K75l80k4M89l66j11L00J04J9k68P3o7k26J72K55M4K7m70R7L77j00j3m74
$$ -92 183 -197 -221 268 -98 -209 91 195 214 -54 19 -48 -274 -102 153 197 224 -246 -149 228 128 115 -359
3832c59O22q6k16J3N99l03o64j09N90J07O2j51k33J73m29M25K78L66p86J6k4N4
$$ -359 263 177 -39 -26 573 270 -394 -503 87 194 256 105 -128 45 -384 41 319 685 -101 -85 -109 -55
3854e5R4l10L92m7m09J31N72j26m41K6n7J34j37N8K1j62p0P3K93J48R9n47O2K4
$$ -55 39 -271 121 74 -335 -204 368 242 -199 -173 -230 -96 -233 -175 -154 -316 -386 -313 -20 128 227 -320 -258 -234
3878b34M64j58K39l25j18o6K23K86j10l58M71k97l68L5O29J50o19j08L73K00n84
$$ -234 230 72 311 -14 -132 -198 25 311 201 -157 314 17 -351 -316 313 463 -156 -264 109 309 -275
3899b75K71O5k2m61K92O47k44m15l91L36O77k32l05J35Q2j1l43K95J99J1n83L36
$$ -275 -4 61 39 -422 -130 517 273 -142 -533 -197 480 248 -57 78 160 149 -194 101 300 311 -272 64
3921F4K05n1l0j52lj21o8K41k39j42L5M01l71J89j3L07J4p70J01J51N96l81m07
$$ 64 269 218 188 36 33 -88 -156 85 -154 -296 -261 140 -231 -42 -55 252 266 -504 -403 -252 344 -37 -444
3944d44K96K02J53m62M66k7l96j51J95N06q8l54m7K55p3l28M72j00l02J97k60
$$ -444 -148 54 207 -255 211 184 -212 -363 -168 338 250 -104 -151 104 31 -297 175 75 -227 -30 -290
3965b90N73j37k93K46j08K9j16K27k43K25k34J41j4J13j13j57j0J88k39M31j86
$$ -290 283 146 -147 99 -9 20 -96 131 -112 113 -121 20 6 119 6 -151 -161 27 -212 219 33
3986C3k23j89J22K10j35K0K04R5k06r5L13L6j19k76J78J72j22j38M3M3q3l98L89
$$ 33 -190 -379 -257 -47 -182 -162 42 137 -69 -164 149 185 66 -210 -32 140 18 -120 -77 -34 -117 -515 -126
4009a26L51l5j52j92J85k42k6K86O5pr7k52M07p7j24j38M00k59%lk1M8k33L03
$$ -126 225 190 38 -154 31 -211 -237 49 114 107 10 -242 165 88 -36 -174 226 -33 -33 -36 -57 -9 -242 61
4033F1n3J46j98k24M32M0l03j29M20K1n41K92M38k08j76r9Q6j70n0J42N09j13
$$ 61 8 154 -44 -268 164 204 -99 -228 192 213 -328 -36 402 194 18 -81 5 -165 -215 -73 436 323
4055C23o08Q0L74n2l18J8L98m04K66k89M26M8l27n7j10L31L2j32J41k95R6j09
$$ 323 -285 -205 169 117 -201 -183 215 -189 77 -212 214 262 -65 -122 -232 99 131 -1 140 -155 -59 -168
4077a68J18Q5q7Oj99L15j55L56k70L45n72L72J8N0k8j30j60n2J11L17k01n30M66
$$ -168 -50 35 -52 -46 -245 70 -85 271 1 346 -226 146 164 214 186 56 -104 -156 -45 272 71 -459 7
4100Gm5J2L7k5rJ59k19k14M05j39J13l76K00k0L58j48J04N4j83l49J88M24j84
$$ 7 -38 -26 11 -14 -23 136 -83 -297 108 -31 82 -294 -94 -114 244 96 200 254 71 -278 -90 334 150
4123A50k72O8k4Q4R2k37j62l9R9LL70J6Q6m27j42J92J31K41k08p0P8o8k10M17
$$ 150 -122 -54 -78 6 98 -139 -301 -340 -241 -238 132 148 234 -193 -335 -143 -12 229 21 -49 29 -39 -249 168
4147A68m0L0r0J90l01L40m2k75j32J10L99m30M25m64J71J00k00q4K56O7l03r7
$$ 168 128 158 68 258 -43 297 255 -20 -152 -42 357 -73 352 -112 59 159 -41 -125 131 198 -105 -202
4169b02K33l1k04Q8J03l8J4M6Pj58K03k36L15J44l30o3J3jK21j68K01k85J30J56
$$ -202 31 0 -204 -116 -13 -51 -37 9 16 -142 61 -175 140 284 -46 -109 -96 -97 124 -44 157 -128 2 158
4193A58l11Q1J50j29q8K08l60N30j41j74j03J35j4L8R0m6J10k01K3q0L36N8m73
$$ 158 -153 -72 78 -51 -139 69 -291 239 98 -76 -179 -44 -58 -20 70 24 134 -67 -44 -124 212 270 -203
4216b03J27J20K18r8l04K68M8j4l06l4K10K11l1m04K27J35J6J5k62K83n20K45
$$ -203 -76 44 262 164 -140 128 176 162 -144 -178 32 243 212 -192 35 170 186 201 -61 222 -298 -53
4238e3j09L31j58J36j71J01J1j25J36k59p2J47K56m30K01R4K28l10J23k00K22
$$ -53 -162 169 11 147 -24 77 88 -37 99 -160 -232 -85 171 -259 -58 36 264 -46 77 -123 99
4259I9N5Q0l47K02Mk83J20k2J11r4L02l53o4J3K08j17L87m80K16K42l68o9N3M5
$$ 99 154 234 -113 89 93 -190 -70 -92 19 -75 227 -126 -190 -177 31 -86 301 -179 37 279 -89 -158 -105 -60
4283f0j57K25J4K31m59J71Q8k13M38m40o2Q2M68n11J6m0Q8P9K68l47Q1j11K29
$$ -60 -217 8 22 253 -206 -35 53 -160 278 -162 -224 -142 326 -185 -169 -209 -121 -42 226 -121 -40 -151 78
4306G8l25J51J24J07l09k2K37r4j15J13J4L8L42m38j8L3M0n1J28K6j35NJ30j77
$$ 78 -247 -96 28 135 -174 -196 41 -53 -168 -55 -41 -3 339 -99 -117 -84 -44 -95 33 59 -76 -71 59 -118
4330a18J58k70K52k29J83p1j05L40k99K88n68L27j9P0L52k93j72M68l20m7O2O6
$$ -118 40 -230 22 -207 -24 -95 -200 140 -159 129 -439 -112 -131 -61 291 -2 -174 294 -26 -73 -11 55
4352E5O7m7k84R9J63K32k51j17K62k87P2L22k92p0K8J44n8K29k56j07J48k2j06
$$ 55 122 75 -209 -110 53 285 34 -83 179 -108 -36 286 -6 -76 -48 96 38 267 11 -96 52 30 -76
4375g6K1J39j39J5P7k73L06j26l9J81jJ46P5l8l17j0R8j23J6J25M2O4j78j20L88
$$ -76 -55 84 -55 -40 37 -236 70 -56 -95 86 85 231 306 268 -49 -59 39 -84 -68 57 99 163 -15 -135 253
4400B53J28n18Q9L41l55j06L9M0J10m9j25J97J23J61r8k72L3J09j67J17l52L14
$$ 253 381 -137 -48 293 -62 -168 -129 -89 21 -28 -153 44 167 328 230 -42 -9 100 -67 50 -302 12
4422A2ql9Q6j20L16j66l54L71k21J16q4j57J72Q0k29K36p2K29M5l26J35p2k62
$$ 12 4 -35 51 -69 247 81 -273 98 -123 -7 -91 -248 -76 4 -225 11 -61 168 213 -113 22 -50 -312
4445c12K25O1J32M2j77J4j5J00j8l25L84j57L34l68j67L57P2j61k95K84L1j69
$$ -312 -87 -26 106 148 -29 -15 -30 70 52 -273 111 -46 288 -80 -247 110 182 21 -274 10 41 -128
4467a28K46k54p0K76l62K09R5j3p4j93K41j13K28j18N1j86K26O8k99L27j12j41
$$ -128 118 -136 -206 70 -292 -83 12 -1 -75 -268 -27 -140 88 -30 21 -165 61 129 -170 157 45 -96
4489i6K30k89J77K19k04j50n6L22p4j5n5k4K74j9l41J82Rk85R2L68p1m50N89k26
$$ -96 134 -155 22 241 37 -113 -169 153 79 64 9 -15 259 240 -101 81 90 -195 -103 265 194 -256 333 107
4513A07k35R6k62N75k69K00l6k83L4r2J59J93q9l6M8N7l14j1J76J08k32J60J29
$$ 107 -128 -32 -294 281 12 212 176 -107 -73 -165 -6 187 98 62 110 167 -147 -158 18 126 -106 54 183
4536A83K5l46q4K54j03K55j73J26k26J75k85M11l05Q8K39j59K33m79o7M67j00
$$ 183 208 -138 -222 32 -71 184 11 137 -89 86 -199 212 -93 -5 234 75 308 -171 -238 229 129
4557A29Q6l91M55M6l47J00k06M27l32r0J18k6J15l21K84j24J25j63Q7K56j11P4
$$ 129 215 -176 279 325 -22 78 -128 299 -33 -123 -5 -31 84 -237 47 -77 48 -115 -28 228 117 191
4579A91m00J74l5J07m8j07M43l60K2j03J24K74n5l37J32j01O4M3P1l44J16J9N3
$$ 191 -209 -35 -70 37 -11 -118 325 -35 -13 -116 8 282 227 -110 22 -79 -15 28 99 -245 -129 -110 -57
4602e7J62K0rj14J88m96L87j73P6R6jj15M11l44R1j5l06O7M38l08m4j24K18l30
$$ -57 105 125 116 2 190 -306 81 -92 -16 80 79 -36 375 31 122 107 -199 -132 306 -2 -46 -170 48 -282
4626b82K18j23M68n6l53L15j10j32M0o1J40k17j16K00j08L33k48O9R9q8J17Q2
$$ -282 -64 -187 281 225 -128 187 77 -55 -15 -76 64 -153 -269 -69 -177 156 -92 -23 76 -12 105 187
4648A87k10J57L0r7J32q0k85K63p4j39J09K66l35j58N6K65p3J0J45j56K01l71
$$ 187 -23 134 164 67 199 119 -166 97 23 -116 -7 259 -76 -234 -178 87 14 24 169 13 214 -157
4670a57o4L00K14m34K71j42j62K34J89n68L29L3r3K70j12j57N2L8l07j4P3K8K10
$$ -157 -221 79 293 -141 130 -12 -174 60 249 -319 10 43 -50 220 108 -49 3 41 -266 -280 -207 -179 31
4693C1J9M2N7k16k20J17K10j47N2J20J83j17k24J57p1R7Kj57K02k79N1R5r5K56
$$ 31 50 92 149 -67 -287 -170 40 -107 -55 65 248 131 -93 64 -7 90 92 -65 137 -142 -91 4 -91 165
4717A65l32k38J91L82L4l99J61L5K11k91Q2R7N3m69K26Q4R5j48l12K68j2O2l00
$$ 165 -167 -405 -214 168 202 -197 -36 -1 210 -81 1 98 151 -318 -92 -8 87 -61 -373 -105 -117 -55 -355
4740c55P23j88pj04j56R0n2j75M57l67K88j86j27P5l2m9M5K2p4J44M9l1L9k8K9
$$ -355 368 180 173 69 -87 3 -49 -224 233 -134 154 -32 -159 -84 -116 -165 -120 -98 -172 -28 21 -10 29 1 30
4765C0n4K05j68J41l00K08j04j36J91j14j19M93r5o0j02K51o4k82n2K1P9m8K94
$$ 30 -24 181 13 154 -146 62 -42 -178 13 -101 -220 273 178 118 16 267 203 -79 -131 -110 -31 -79 215
4788B15k77P1L0J23k07RK81k42K98j42j31j25J65m8J21j35j23L05n0J54r6J28
$$ 215 -62 9 39 162 -45 -36 245 3 301 159 28 -97 68 20 141 6 -117 188 138 292 196 324
4810C24m79P1K17j14j2%Q3q2J66k99j09O01o27L40j37L18m12J17N6P0J62m20L84
$$ 324 -155 -84 133 19 7 7 90 8 174 -125 -234 367 -260 80 -57 261 -151 -34 22 92 254 -166 218
4833B18j80J45n51L39j01J28j02j0M4pL2R8q8n3q0J18L2l06N11m55K32J90j31
$$ 218 38 183 -368 -29 -130 -2 -104 -114 -70 -77 -45 53 -35 -88 -168 -50 -18 -324 187 -268 -36 154 23
4856B3K87k10j4j00l4R9l29L75j67j5K78m38L93K6l21J88j5q0r0R3k3N4l24L81
$$ 23 310 100 86 -14 -48 51 -278 97 -70 -85 193 -245 148 174 -147 41 26 -54 -144 -51 -74 -20 -344 37
4880C7j10L05l27R0P8J1J77l67N0N88o29L16l26O4J78m1j94J41k07R9J5O3J53
$$ 37 -73 232 -95 -5 73 84 261 -106 -56 532 -97 219 -107 -43 135 94 -100 41 -166 -67 -52 11 164
4903A64l37K9N6%N1N6j67K00J57ql25m6n8K55r6L5M8k90K89k33K79J46k63N8j26
$$ 164 -173 -144 -88 -88 -37 19 -148 52 209 201 -124 -170 -228 27 -69 -34 14 -276 13 -220 59 205 -58 0 -126
4928a26L08k63J36K6j75k15M11j11O8K8l12J76J9J65j29M7m8J57R7l51O9p5o7
$$ -126 182 -81 55 81 -94 -309 102 -9 59 87 -225 -49 -30 135 6 53 5 162 259 -92 -23 -98 -165
4951a65L28j54k55L30k31j0j07M35k90J08M1k2N1l3J54m16K64j10K18l09P1J21
$$ -165 163 9 -246 84 -147 -157 -264 171 -119 -11 30 8 59 26 180 -236 28 -82 136 -173 -102 19
4973A9Oj11J2J60j19q8l3LO04o46K31j43J34L0O8k28J4J73j19K39k45J39q3j05
$$ 19 25 -86 -74 86 -33 -121 -154 -151 453 -193 38 -105 29 59 127 -101 -87 86 -33 206 -39 100 17 -88
4997h8%K56j52r1l0J09j5M14m81J80m21K67K28L7k81rJ55k94K67l17M10l40J77
$$ -88 -88 168 16 -75 -105 4 -11 403 -78 102 -319 -52 176 213 -68 -77 78 -216 51 -266 144 -196 -19
$$ [...]
8191b00
##END NTUPLES=NMR FID
##END=
