##TITLE=1H_AM A512
 CDCl3, 8 sc, 
 1.8.2019
##JCAMPDX= 6.0         $$ Bruker NMR JCAMP-DX V2.0
##DATA TYPE= NMR FID
##DATA CLASS= NTUPLES
##ORIGIN= UXNMR, Bruker Analytische Messtechnik GmbH
##OWNER= root
$$ XWIN-NMR		Version 3.5
$$ Thu Aug  1 15:21:15 2019 Russian Standard Time (UT+4h)  she@DPX200
##.OBSERVE FREQUENCY= 200.13155
##.OBSERVE NUCLEUS= ^1H
##.DELAY= (6, 6)
##.ACQUISITION MODE= SIMULTANEOUS
##.ACQUISITION SCHEME= undefined
##.AVERAGES= 8
##.DIGITISER RES= 18
##SPECTROMETER/DATA SYSTEM= spect
##.PULSE SEQUENCE= zg30
##.SOLVENT NAME= DMSO
##.SHIFT REFERENCE= (INTERNAL, DMSO, 0, 15.7039)
##AUDIT TRAIL= $$ (NUMBER, WHEN, WHO, WHERE, WHAT)
$$ ##TITLE= Audit trail, XWIN-NMR		Version 3.5
$$ ##JCAMPDX= 5.01
$$ ##ORIGIN= Bruker BioSpin GmbH
$$ ##OWNER= she
$$ F:/spectra/data/she/nmr/H-F/1/audita.txt
$$ ##AUDIT TRAIL=  $$ (NUMBER, WHEN, WHO, WHERE, WHAT)
(   1,<2019-08-01 15:20:15.14 +0400>,<she>,<DPX200>,
      <created by zg, POWCHK disabled, PULCHK disabled
       configuration hash MD5:
       00 E9 B6 7A A2 85 ED C7 34 08 36 98 17 FE 4E 26
       data hash MD5: 16K
       60 12 5C EF A2 92 DB DA 68 02 A3 F1 9C DB 5F 3D>)
$$ ##END=
$$ 
$$ hash MD5
$$ 16 3E B3 C0 0B 93 AA E4 FC 17 D8 37 AD 4E E7 31
##$RELAX= 
##$RELAX= 
##$RELAX= 
##$RELAX= 
##$RELAX= 
##$RELAX= 
$$ Bruker specific parameters
$$ --------------------------
##$DU= <F:/spectra>
##$EXPNO= 1
##$NAME= <H-F>
##$PROCNO= 1
##$TYPE= <nmr>
##$USER= <she>
##$AMP= (0..31)
100 100 100 100 100 100 100 100 100 100 100 100 100 100 100 100 100 100 
100 100 100 100 100 100 100 100 100 100 100 100 100 100 
##$AQSEQ= 0
##$AQ_mod= 1
##$AUNM= <au_zg>
##$AUTOPOS= <>
##$BF1= 200.13
##$BF2= 200.13
##$BF3= 200.13
##$BF4= 200.13
##$BF5= 200.13
##$BF6= 200.13
##$BF7= 200.13
##$BF8= 200.13
##$BYTORDA= 1
##$CFDGTYP= 0
##$CFRGTYP= 5
##$CHEMSTR= <none>
##$CNST= (0..31)
1 1 145 1 1 1 1 1 1 1 1 1 1 1 1 1 1 1 1 1 1 1 1 1 1 1 1 1 1 1 1 1 
##$CPDPRG= <>
##$CPDPRG1= <>
##$CPDPRG2= <>
##$CPDPRG3= <>
##$CPDPRG4= <mlev>
##$CPDPRG5= <mlev>
##$CPDPRG6= <mlev>
##$CPDPRG7= <mlev>
##$CPDPRG8= <mlev>
##$CPDPRGB= <>
##$CPDPRGT= <>
##$D= (0..31)
0 1.2 0 0 0 0 0 0 0 0 0 0.03 0 0 0 0 0 0 0 0 0 0 0 0 0 0 0 0 0 0 0 0 
##$DATE= 1564658414
##$DBL= (0..7)
120 120 120 120 120 120 120 120 
##$DBP= (0..7)
150 150 150 150 150 150 150 150 
##$DBP07= 0
##$DBPNAM0= <>
##$DBPNAM1= <>
##$DBPNAM2= <>
##$DBPNAM3= <>
##$DBPNAM4= <>
##$DBPNAM5= <>
##$DBPNAM6= <>
##$DBPNAM7= <>
##$DBPOAL= (0..7)
0.5 0.5 0.5 0.5 0.5 0.5 0.5 0.5 
##$DBPOFFS= (0..7)
0 0 0 0 0 0 0 0 
##$DE= 6
##$DECBNUC= <off>
##$DECIM= 24
##$DECNUC= <off>
##$DECSTAT= 4
##$DIGMOD= 1
##$DIGTYP= 9
##$DL= (0..7)
0 120 120 120 120 120 120 120 
##$DP= (0..7)
150 150 150 150 150 150 150 150 
##$DP07= 0
##$DPNAME0= <>
##$DPNAME1= <>
##$DPNAME2= <>
##$DPNAME3= <>
##$DPNAME4= <>
##$DPNAME5= <>
##$DPNAME6= <>
##$DPNAME7= <>
##$DPOAL= (0..7)
0.5 0.5 0.5 0.5 0.5 0.5 0.5 0.5 
##$DPOFFS= (0..7)
0 0 0 0 0 0 0 0 
##$DQDMODE= 0
##$DR= 18
##$DS= 0
##$DSLIST= <SSSSSSSSSSSSSSS>
##$DSPFIRM= 0
$$ [...]
##$SUBNAM2= <"">
##$SUBNAM3= <"">
##$SUBNAM4= <"">
##$SUBNAM5= <"">
##$SUBNAM6= <"">
##$SUBNAM7= <"">
##$SUBNAM8= <"">
##$SUBNAM9= <"">
##$SW= 24.9336996594482
##$SWIBOX= (0..15)
0 0 2 0 0 0 0 0 0 0 0 0 0 0 0 0 
##$SW_h= 4990.01996007984
##$TD= 16384
##$TD0= 1
##$TE= 0
##$TE2= 300
##$TE3= 300
##$TEG= 300
##$TL= (0..7)
0 120 120 120 120 120 120 120 
##$TP= (0..7)
150 150 150 150 150 150 150 150 
##$TP07= 0
##$TPNAME0= <>
##$TPNAME1= <>
##$TPNAME2= <>
##$TPNAME3= <>
##$TPNAME4= <>
##$TPNAME5= <>
##$TPNAME6= <>
##$TPNAME7= <>
##$TPOAL= (0..7)
0.5 0.5 0.5 0.5 0.5 0.5 0.5 0.5 
##$TPOFFS= (0..7)
0 0 0 0 0 0 0 0 
##$TUNHIN= 0
##$TUNHOUT= 0
##$TUNXOUT= 0
##$USERA1= <user>
##$USERA2= <user>
##$USERA3= <user>
##$USERA4= <user>
##$USERA5= <user>
##$V9= 5
##$VALIST= <valist>
##$VCLIST= <CCCCCCCCCCCCCCC>
##$VD= 0
##$VDLIST= <DDDDDDDDDDDDDDD>
##$VPLIST= <PPPPPPPPPPPPPPP>
##$VTLIST= <TTTTTTTTTTTTTTT>
##$WBST= 1024
##$WBSW= 4
##$XGAIN= (0..3)
0 0 0 0 
##$XL= 0
##$YL= 0
##$YMAX_a= 167657
##$YMIN_a= -219527
##$ZGOPTNS= <>
##$ZL1= 120
##$ZL2= 120
##$ZL3= 120
##$ZL4= 120
##$ABSF1= 10
##$ABSF2= 0
##$ABSG= 5
##$ABSL= 3
##$ALPHA= 0
##$AQORDER= 0
##$ASSFAC= 0
##$ASSFACI= 0
##$ASSFACX= 0
##$ASSWID= 0
##$AUNMP= <proc_1d>
##$AZFE= 0.1
##$AZFW= 0.1
##$BCFW= 1
##$BC_mod= 2
##$BYTORDP= 1
##$COROFFS= 0
##$CY= 11.3945322036743
##$DATMOD= 1
##$DC= 2
##$DFILT= <>
##$DTYPP= 0
##$F1P= 20.1537800932815
##$F2P= 0.134698688090026
##$FCOR= 0.5
##$FTSIZE= 0
##$FT_mod= 4
##$GAMMA= 1
##$GB= 0.15
##$INTBC= 1
##$INTSCL= 1
##$ISEN= 128
##$LB= 0.24
##$LEV0= 0
##$LPBIN= 0
##$MAXI= 10000
##$MC2= 0
##$MEAN= 0
##$ME_mod= 0
##$MI= 1.114404
##$NCOEF= 0
##$NC_proc= 0
##$NLEV= 6
##$NOISF1= 3.799351
##$NOISF2= 2.8
##$NSP= 1
##$NTH_PI= 0
##$NZP= 0
##$OFFSET= 15.70392
##$PC= 1
##$PHC0= -8865.51
##$PHC1= 20.00097
##$PH_mod= 1
##$PKNL= yes
##$PPARMOD= 0
##$PSCAL= 0
##$PSIGN= 0
##$REVERSE= no
##$SF= 200.130013532006
##$SI= 16384
##$SIGF1= 3
##$SIGF2= 2
##$SINO= 400
##$SIOLD= 16384
##$SREGLST= <1H.CDCl3>
##$SSB= 0
##$STSI= 0
##$STSR= 0
##$SW_p= 3612.71676300578
##$SYMM= 0
##$S_DEV= 0
##$TDeff= 0
##$TDoff= 0
##$TI= <>
##$TILT= no
##$TM1= 0
##$TM2= 0
##$TOPLEV= 0
##$USERP1= <user>
##$USERP2= <user>
##$USERP3= <user>
##$USERP4= <user>
##$USERP5= <user>
##$WDW= 1
##$XDIM= 8192
##$YMAX_p= 0
##$YMIN_p= 0
$$ End of Bruker specific parameters
$$ ---------------------------------
##NTUPLES= NMR FID
##VAR_NAME=  TIME,          FID/REAL,        FID/IMAG
##SYMBOL=    X,             R,               I
##VAR_TYPE=  INDEPENDENT,   DEPENDENT,       DEPENDENT
##VAR_FORM=  AFFN,          ASDF,            ASDF
##VAR_DIM=   8192,          8192,            8192
##UNITS=     SECONDS,       ARBITRARY UNITS, ARBITRARY UNITS
##FACTOR=    0.0002004,     1,               1
##FIRST=     0,             0,               0
##LAST=      1.6414764,     0,               0
##MIN=       0,             -219527,         0
##MAX=       1.6414764,     167657,          0
$$ Real data points
##PAGE= N=1
##DATA TABLE= (X++(R..R)), XYDATA
0@%%%%%%%qJ6j6J7k5L2l9M8n7P2q3R6j14J34j57J81k10K43k78L16l59M11m68N27
$$ 0 0 0 0 0 0 0 0 -8 8 -8 9 -16 16 -23 25 -32 40 -43 53 -61 73 -84 97 -113 130 -148 168 -191 220 -248 279
31B79n92O63p43Q30r24J029j145J271j409J562j730J915k120K349k606K892l216
$$ 279 -313 350 -393 437 -487 542 -603 668 -741 821 -909 1006 -1114 1235 -1371 1521 -1695
48a695L589m018M518n116N840o738P893r438J1621j4978K0869l4233J21580O220
$$ -1695 1894 -2124 2394 -2722 3118 -3620 4273 -5165 6456 -8522 12347 -21886 99694 105914
62A05914j50233J00684J03870P422q9081k4701J1988K3347n940r655k1159J0486
$$ 105914 -44319 56365 160235 167657 78576 53875 65863 89210 83270 73615 52456 62942
74F2942J7956j9109o6775q116P6020N5181p2318j13253j2061J00477P1020m4975
$$ 62942 80898 61789 -4986 -13102 62918 118099 45781 -67472 -79533 20944 91964 46989
86D6989j05140l9879N5474P0947j0198p1891l7787L9204L7923l1065m9823K2029
$$ 46989 -58151 -98030 -42556 28391 18193 -53698 -91485 -52281 -14358 -45423 -95246 -73217
98g3217O4299r584r3213m6094P4756R5986j3989j03209o1098M6267Q7951K5731
$$ -73217 -8918 -18502 -111715 -157809 -83053 12933 -1056 -104265 -165363 -119096 -31145 -5414
110e414n9909o8905P892O8209L2431l9568l9346K1298L6323j2450l8602O256N6975
$$ -5414 -65323 -134228 -126336 -58127 -25696 -65264 -104610 -83312 -46989 -59439 -98041 -91785 -34810
123c4810L6950m0118p9016j2099R4506R0462m0062j20499k7988J04685Q5445m0526
$$ -34810 2140 -37978 -116994 -129093 -34587 55875 15813 -104686 -132674 -27989 57456 16930
135A6930q0155j348N5191K3639j8784j1755J6971K2474j502l1550k4008L4516
$$ 16930 -63225 -64573 -9382 14257 -4527 -16282 689 23163 21661 -9889 -33897 619
147F19P3700J5319q0924p1119M8298J10870K3732q7628p2059L4449Q1718K5335
$$ 619 74319 89638 8714 -62405 -14107 96763 120495 32867 -39192 -4743 76975 102310
159A02310m4542m3974P914L7405R952k9128j6675L7535L9780l5536p8601j777
$$ 102310 57768 13794 21708 59113 69065 39937 23262 60797 100577 65041 -13560 -15337
171a5337R4415N7297o8439r9482J758Q7162M9978l8030o6813k5062L0499M4802
$$ -15337 79078 136375 67936 -31546 -29788 57374 107352 69322 2509 -22553 7946 52748
183E2748N472m0980k8785K1961K5217k9167m2229K3970O2612k917q2277n1911
$$ 52748 58220 17240 -11545 10416 35633 6466 -35763 -11793 50819 47902 -34375 -86286
195h6286N2975Q6648L927q6627o9285L1121Q6375K8147o0199o2162J3433N2108
$$ -86286 -33311 53337 57264 -29363 -98648 -67527 18848 46995 -13204 -75366 -61933 -9825
207i825Q926l6042j3109L0319J9511k9534m1403R408N7206L4160l9867p2518j0353
$$ -9825 -899 -36941 -50050 -19731 -220 -29754 -71157 -61749 -4543 29617 -10250 -82768 -93121
220i3121P5569O9897k9283r0052l0154O5381O7034j4405n7349j4753L6453K4566
$$ -93121 -17552 52345 23062 -66990 -97144 -31763 35271 20866 -36483 -51236 -14783 9783
232I783j9383k3364J7040L9695K964n0529l5995M2766P8760N363q3253n8966M8881
$$ 9783 -9600 -32964 -15924 23771 26735 -23794 -59789 -17023 61737 67100 -16153 -75119 -26238
245b6238Q8489J2635o3645m6503J8728M5745J8804j8044k5534P68K5529Q029k9051
$$ -26238 62251 74886 11241 -35262 -16534 29211 48015 29971 4437 5205 30734 38763 9712
258I712j5749L9893M3239l3945p4354k444Q4131N4694n0595q4330r208O6000N1830
$$ 9712 -6037 33856 77095 43150 -31204 -33648 50483 105177 54582 -29748 -38956 27044 78874
271G8874j8261n6230k4111K9141L5666p178l4348l790L1898O811m1412l0097L6365
$$ 78874 60613 4383 -19728 9413 45079 37901 3553 -237 31661 38472 -2940 -33037 3328
284C328N5335r386o9050m1428L8994O7950J2027n8957n9400J1035O3184L0532
$$ 3328 58663 49277 -19773 -61201 -22207 45743 57770 -1187 -60587 -49552 13632 44164
296D4164m0504n1632P201M3630N689l6771j2817L5577K3746l4179m9090Q240O1930
$$ 44164 3660 -47972 -40771 2859 8548 -28223 -41040 -5463 18283 -15896 -64986 -56746 5184
309E184L5519m0324o9078j0022O3409N6300k1273o6173k1945M3061M3135q781
$$ 5184 40703 379 -68699 -78721 -15312 40988 19715 -46458 -68403 -25342 17793 9012
321I012l4380p737K2544J3988j6006j8459J5596L7704M420m7343l9260L4675P2441
$$ 9012 -25368 -33105 -10561 3427 -12579 -31038 -15442 22262 26682 -20661 -59921 -25246 47195
334D7195J1262o8459n5503L2320P1357J7055m6906m1262J1131L7176J3124j9502
$$ 47195 58457 -10002 -65505 -33185 38172 55227 8321 -32941 -21810 15366 28490 8988
346H988j6955J1472K0705j0061l3771k646M6233L2929l5518o2541l116O3329M5414
$$ 8988 -7967 3505 24210 14149 -19622 -22268 23965 56894 21376 -41165 -44281 19048 64462
359F4462k9243o2260j8552M1871M5920l714m3878k5284K4514L1581j0521l1085
$$ 64462 35219 -27041 -45593 -3722 42198 38484 -5394 -30678 -6164 25417 14896 -16189
371a6189N113L7476L669m6540k8503L8458N5484m585n9801l7857K9602N7786J7354
$$ -16189 -11076 26400 30069 -16471 -44974 -6516 48968 44383 -15418 -53275 -23673 34113 51467
384E1467m1942m7797M372M7144K5432k6528l3101Q978K8292k347k7995l298L3100
$$ 51467 9525 -38272 -33900 13244 38676 12148 -20953 -11975 16317 13970 -14025 -17323 15777
397A5777K0578k7117m3646p69M9332L9757k4098o2197k0332M9424N3154j1788
$$ 15777 36355 9238 -34408 -35177 14155 53912 29814 -32383 -52715 -3291 49863 38075
409C8075n5436k1049L2777L0782j0731k4666J113K0282K297k3002j5678J9497
$$ 38075 -17361 -38410 -5633 25149 14418 -10248 -9135 11147 13444 -9558 -25236 -5739
421e739L5905K111m4060l7082K3604N9831J5821n0569m9091J4732N3093K0142
$$ -5739 30166 32277 -11783 -48865 -25261 34570 50391 -178 -49269 -34537 18556 38698
433C8698l0652l4434M084K7804R383j9021j3401J7224K1476j5159l7526k855M6765
$$ 38698 8046 -26388 -22304 5500 14883 -4138 -17539 -315 21161 6002 -31524 -34379 12386
446A2386L3492l1388n6683p292N1180M1635j7935m9358j9041K8063L5956k88l0465
$$ 12386 45878 14490 -42193 -49485 1695 43330 25395 -23963 -43004 -14941 21015 20727 -9738
459i738j5658J8139J8921j3041k2238J0877L2870J359l9930k6785K8332M8655
$$ -9738 -25396 -7257 11664 -1377 -23615 -12738 20132 21491 -18439 -45224 -16892 31763
471C1763O139m5939m0073J5368N1455K3697l2714m2304L152L8261J6366k2005
$$ 31763 37902 -8037 -48110 -32742 18713 42410 9696 -32608 -29456 8805 25171 3166
483C166j8361J4450J8802j2138k3890L494L2228J8590k2457l8682o535M0195L9579
$$ 3166 -15195 -745 18057 5919 -17971 -14477 17751 36341 13884 -24798 -31333 8862 48441
496D8441j2787n1505k3055L5473M5097n692m0920j5846K2637K0965r940j7723
$$ 48441 35654 -15851 -38906 -3433 41664 35972 -4948 -20794 1843 22808 12868 -4855
508d855M980J8994Q76k4883j8647J7950L8118O425m2173l9361J8077N3255J6539
$$ -4855 125 19119 19995 -4888 -23535 -5585 32533 38958 -3215 -42576 -24499 28756 45295
521D5295m0294m1076Q692L7954J4457k0546k1812L183J6487K385j5790p447J7365
$$ 45295 5001 -36075 -27383 10571 25028 4482 -17330 -14147 2340 4725 -11065 -18512 -1147
534a147J9746j4052l6502o774M0367L5078k1128n1255j3137M0104L8997r118l9817
$$ -1147 18599 4547 -31955 -38729 1638 36716 15588 -35667 -48804 -8700 30297 21179 -18638
547a8638j7829K0996K7029j505k0715n993J6487Q655j6834j6229J5480L0875J209
$$ -18638 -36467 -15471 11558 10053 -10662 -16655 -168 8487 -8347 -24576 -9096 21779 22988
560B2988l5386k5925J9874M3169J2264l4636l7142O526M1436K2012k2821l2150
$$ 22988 -12398 -38323 -18449 24720 36984 2348 -34794 -28268 13168 35180 12359 -19791
572a9791J579K6961Q960j6999j0526J4820J4651j2642k4169O94L0302K2619j7752
$$ -19791 -18212 8749 17709 710 -9816 5004 19655 7013 -17156 -16462 13840 36459 18707
585A8707l9931j1771L5693L9008q769m4533k0271K7198L3088m528k6478q357J5201
$$ 18707 -21224 -32995 2698 41706 32937 -11596 -31867 -4669 28419 23891 -2587 -10944 4257
598D257R863r208j0692N743J7755L279k3250k1881J2753L9083J1860l6899l9488
$$ 4257 14120 4912 -5780 -37 17718 20997 -2253 -24134 -11381 27702 39562 2663 -36825
611c6825J2835M6777J6516l1527l2437N648K7140R823j3670j3266M240J0657k286
$$ -36825 -23990 22787 39303 7776 -24661 -19013 8127 17950 4280 -8986 -4746 5911 3625
624C625j5218m673J9988J9144j4075l6383q421L5436L3112j4379m2800j4733K8606
$$ 3625 -11593 -16266 3722 22866 8791 -27592 -36013 -577 32535 18156 -24644 -39377 -10771
637a0771L1642l906k8461j4734J3268J9252j073j5139k487J4474O594j7253j7113
$$ -10771 20871 16965 -11496 -26230 -12962 6290 5217 -9922 -12409 2065 8659 -8594 -25707
650b5707J4908L1794M300l2620k7996J5687M0130J3978k7672l2357L999L2339
$$ -25707 -10799 20995 25295 -7325 -35321 -19634 20496 34474 6802 -25555 -21556 10783
662A0783J7103j5181k1460K406J6947L702j2147n054J4640J3377j0464k4997l833
$$ 10783 27886 12705 -8755 -6349 10598 14300 2153 -2901 11739 25116 14652 -10345 -14178
675a4178K7497K6075j1722l8073j4835K9543L5605o737l6145j6652K0170K2701
$$ -14178 13319 39394 27672 -10401 -25236 4307 39912 33175 -2970 -19622 548 23249
687B3249l177j7306n014R430M676r817j0594P024J9341M485k4466k5600J0570
$$ 23249 20072 2766 -2248 7182 11858 2041 -8553 -1529 17812 22297 -2169 -27769 -17199
700a7199L6418J3138l1569l4733Q000L5172J4161k1369k3875J038J6369P427q162
$$ -17199 19219 32357 788 -33945 -25945 9227 23388 2019 -21856 -20818 -4449 2978 -5184
713e184r212L584J0347k779j7794o845K1034K2580j2252l6135r462L1718L0367
$$ -5184 -14396 -10812 -465 -3244 -21038 -27883 -6849 15731 3479 -32656 -42118 -10400 19967
726A9967j0954l5273j2684J9535K3770R07j7614j1680O861J2071j667j1065P78
$$ 19967 9013 -26260 -38944 -19409 4361 5268 -12346 -24026 -17165 -5094 -6761 -17826 -17048
739a7048J5966O292j8353j9147J2295L1046P654k8620k6943J0923L4233J4881
$$ -17048 -1082 5210 -13143 -32290 -19995 11051 18705 -9915 -36858 -25935 8298 23179
751B3179k0437k6735O47K3330J4136r542j4061L016J2603O26j2273l723J6259
$$ 23179 2742 -23993 -23346 -16 14120 4578 -9483 -6467 6136 6762 -5511 -9234 7025
764G025J5335r476k5283n475K6517K6881q285l3529j4247K3150K9042j133k3868
$$ 7025 22360 12884 -12399 -17874 8643 35524 27239 -6290 -20537 2613 31655 30522 6654
777F654j2802J1900J6092j162j1381k440R541N513r728j2612O793K1692O456k3906
$$ 6654 -6148 5752 21844 20682 9301 6861 16402 21915 12187 -425 6368 28060 34516 10610
791A0610k5416J0241L4243J2049k6161k7891M238K4890J0961j1948j5646j761
$$ 10610 -14806 -4565 29678 41727 15566 -12325 -8087 16803 27764 15816 170 -1591
803a591R484N637o457q633M744J1399m307k0774p457K2330K2033j1905l3571r922
$$ -1591 7893 13530 7073 -1560 3184 14583 10276 -10498 -17955 4375 26408 14503 -19068 -28990
817b8990K4766K4648o424k5535j2395J1748J7654J251j3408r911O247J0257m309
$$ -28990 -4224 20424 14000 -11535 -23930 -12182 5472 6723 -6685 -16596 -10349 -92 -4401
830d401j2290L308J7326M250k0895j9066J1805K9554P330k3788k3889N516K5490
$$ -4401 -16691 -13383 3943 8193 -12702 -31768 -19963 9591 16921 -6867 -30756 -25240 250
843B50J3224j3353j9957j482J6059J0924p420j1376L356J1624k035j4399k959
$$ 250 13474 121 -19836 -21318 -5259 5665 -1755 -13131 -9775 1849 -186 -14585 -17544
856a7544J7637J6357j0217k5265o617K2734K3665n483k6824j2353J6569K2039
$$ -17544 93 16450 6233 -19032 -25649 -2915 20750 15267 -11557 -23910 -7341 14698
868A4698N19j7134r814P168J1114k44q294l34J0399M537j1810j3795P056K3723
$$ 14698 15217 -1917 -11731 -4563 6551 6307 -1987 -2321 8078 12615 805 -12990 -5934 17789
882A7789P742k1769k2467P491K7810J0845j8146k0716J699J7443J0945p216j2344
$$ 17789 25531 3762 -18705 -11214 16596 27441 9295 -11421 -9722 7721 18666 11450 -894
895h94j525Q402L543p621o169R334J3131o550k1988o215K1484K0095r408k7134
$$ -894 -2419 5983 9526 1905 -4264 5070 18201 11651 -10337 -16552 4932 25027 15619 -11515
909a1515q777J8259J9313j879j8234j1921N917J3981L265j0511p155P483P799
$$ -11515 -20292 -2033 17280 15401 -2833 -14754 -8837 5144 8409 -2102 -9257 -1774 6025
922F025q775j2751N361J9251M228k0600j7163R498K4299P133j7976j9634J318
$$ 6025 -2750 -15501 -10140 9111 13339 -7261 -24424 -14926 9373 16506 -1470 -21104 -19786
935a9786J9504J2697p559j6092l198J1631P258p046o949O561J0218l930j5342
$$ -19786 -282 12415 4856 -11236 -14434 -2803 4455 -2591 -9540 -2979 7239 3309 -12033
948a2033l164J6693J5296p802k2313o791J7629K0731k706k0386j1978J0172J6722
$$ -12033 -15197 1496 16792 8990 -13323 -20114 -2485 18246 15540 -4846 -16824 -6652 10070
961A0070K750j2309p338N881P336l057q057J972J1923L516j3710j3597P309K1035
$$ 10070 12820 511 -6827 -946 6390 3333 -4724 -2752 9171 12687 -1023 -14620 -7311 13724
975A3724P064j8130j9879L981K1276J1075j1722j6008j649J1760Q505m546r232
$$ 13724 20788 2658 -17221 -13240 8036 19111 7389 -8619 -10268 1492 9997 5451 -3781
988c781N12Q394J502j0447n497J1794J3327o928k0635n047J8926J7327o391k0142
$$ -3781 -3269 5125 6627 -3820 -9317 2477 15804 8876 -11759 -16806 2120 19447 13056 -7086
1002g086q951J1264J6637J774j2942j0081M431J1276J079r248k862R189M874j0301
$$ -7086 -16037 -4773 11864 13638 696 -9385 -4954 6322 7401 -1847 -4709 4480 9354 -947
1016i47j1155O670J7545L408j6654j5001N600J8878Q241j1434j6329j677J3834
$$ -947 -12102 -5432 12113 15521 -1133 -16134 -10534 8344 16585 5151 -11178 -12855 979
1029I79J0995n464j2908j307R433L607p580m667P109R272n759j4257k880J4741
$$ 979 11974 6510 -6398 -7705 1728 5335 -2245 -6912 197 9469 3710 -10547 -13427 1314
1043A314J3588n384j8413q379J1942J7106Q65j5487j0798O838J3165R37r265m434
$$ 1314 14902 9518 -8895 -17274 -5332 11774 12639 -2848 -13646 -6808 6357 7294 -1971 -6405
1057f405N763N564n199p623L494J2059L056j2576j2956N613J8046P367j3608j6723
$$ -6405 -642 4922 -277 -7900 -4406 7653 10709 -1867 -14823 -9210 8836 16203 2595 -14128
1071a4128J225J6013R488p208j2462k328R328N624m442o420K850P322j534j0777
$$ -14128 -12903 3110 12598 5390 -7072 -9400 -72 5552 1110 -5310 -2460 4862 3328 -7449
1085g449l753J1886J1786n730j7309n848J4085J4711k465j5668q527P002J3348
$$ -7449 -11202 684 12470 6740 -10569 -16417 -2332 12379 9914 -5754 -14281 -7279 6069
1098F069K552r895p089M027P507r72p370M70R245L050j0156r881O651J4915L808
$$ 6069 8621 -1274 -8363 -4336 3171 2199 -5171 -4701 4544 7594 -2562 -12443 -5792 9123 12931
1113A2931j2445j2873J967J5278Q894p089j3591k648J0800Q430m688q254R39P375
$$ 12931 486 -12387 -10420 4858 13752 6663 -6928 -9576 1224 9654 4966 -3288 -2349 5026
1127E026N09p840k879Q371Q114n058j2682l864J1693J2374k433j4767q753Q466
$$ 5026 5535 -2305 -5184 3187 11301 6243 -6439 -10303 1390 13764 11331 -3436 -12189 -3723
1141c723J4243J129j1738p853N013Q514n18o374j472N707K444n932o782L397J1006
$$ -3723 10520 11649 -89 -7942 -2929 5585 5067 -1307 -2779 2928 5372 -560 -7342 -3945 7061
1156G061L483j0298j1955K919J4794P613r574j3936l21J2156P363m725r204o37
$$ 7061 10544 246 -11709 -8790 6004 13617 4043 -9893 -10214 1942 9305 4580 -4624 -5261
1170e261O418K779m280l641M345N902k597r936l010R927J1045m216j4297n676
$$ -5261 1157 3936 -344 -3985 360 6262 3665 -6271 -9281 646 11691 7475 -6822 -12498
1184a2498R377J2453k4j1167p738M373R439K075p245m105L822M662l235n991J968
$$ -12498 -3121 9332 9308 -1859 -9597 -5224 4215 6290 -955 -5060 -1238 3424 189 -5802 -3834
1199c834Q292K685r515r118M469J2585M880r701j1284M97J1112Q143n205j0498
$$ -3834 4458 7143 -2372 -11490 -7021 5564 10444 743 -10541 -10044 1068 9211 4006 -6492
1213f492j350P636M921m069m895K534M997j442o813j411P292P826l515j1238m350
$$ -6492 -7842 -206 4715 646 -4249 -1715 3282 1840 -4973 -6384 908 8734 5219 -6019 -10369
1228a0369Q956J1274m81j2041p258O232J0571J290q423m858L781N452j487m548
$$ -10369 -1413 9861 9380 -2661 -9919 -3687 6884 8174 -249 -5107 -1326 4126 2639 -1909
1242a909M71N140J551o063n723K884J0212L752q695j1073J724J2389O304p352
$$ -1909 -1438 3702 5253 -810 -6533 -3649 6563 10315 1620 -9453 -7729 4660 10964 3612
1256C612j0138p17Q165N038l480n619K83M280Q96m555k252M479N885k599q874
$$ 3612 -6526 -7243 922 5960 2480 -3139 -2856 1424 2320 -2235 -4487 -8 5877 3278 -5596
1271e596l272Q610R181k584j1219n782P552R730J38q105n564L160O481P60m676
$$ -5596 -8868 -258 8923 6339 -4880 -10662 -3110 6620 6758 -1347 -6911 -3751 2730 3490 -1186
1286a186j665L402K451l789m890K671P846K385p924q061K746J0403M884p178r422
$$ -1186 -2851 551 3002 -787 -5677 -3006 4840 7225 -699 -8760 -6014 4389 9273 2095 -7327
1301g327J93Q198O037l995p053m23M824K432l453k599K875L828j855o247j317
$$ -7327 -7134 1064 7101 3106 -3947 -4370 454 2886 -567 -3166 -291 3537 1682 -4565 -5882
1316e882O279O862k888r517m090O987R438m13r252n588M409P344K91m942k559
$$ -5882 397 7259 4371 -5146 -9236 -2249 7189 6776 -2476 -8064 -3655 3689 3980 -962 -3521
1331c521K862K533j829l153J169M915J606n322n970K459R087L622p435q372J246
$$ -3521 -659 1874 45 -3108 -1939 2976 4582 -740 -6710 -4251 4836 8458 1023 -7349 -6103
1346f103R360M673m984o977j10N059L179k069l268M91L266m88l905j694N126N082
$$ -6103 3257 7930 2946 -4031 -4141 918 4097 2028 -1240 -749 2517 2029 -1876 -3570 1556 6638
1362F638k302q328k877P337P335j843q544l846N048O345M48n036l760K036L901
$$ 6638 4336 -3992 -6869 468 7803 5960 -2584 -6430 -1382 4963 5411 375 -3385 -1349 2552
1377B552L2l569l42L434J830m180m254K428P109J914o425o962K042Q357L601m957
$$ 2552 2584 -985 -1327 2107 3937 -243 -4497 -2069 5040 6954 529 -6433 -4391 3966 7567 2610
1393B610o952j03N774L671k082m404j15L105J148l137j774L344L594k032n860
$$ 2610 -4342 -4445 1329 5000 2918 -1486 -1601 1504 2652 -485 -2259 1085 4679 2647 -3213
1408c213j639N795N985k425p600l302N113O966o78n985m181L312M355K94l582
$$ -3213 -4852 943 6928 4503 -3097 -6399 -1286 5680 5002 -983 -5164 -1852 2503 2797 -785
1423g85j163J799J541k181k674J284M945R52n383n025K081P642K389n455o624
$$ -785 -1948 -149 1392 -789 -3463 -2179 2766 3718 -1665 -6690 -4609 3033 5422 -33 -6657
1438f657R62O520K939k912m828L04K892K014k031j774J287K687q62l767j574M594
$$ -6657 -5695 825 3764 852 -3976 -3672 -780 1234 -797 -2571 -1284 1403 541 -3226 -4800 -206
1454b06N110l012o675j671N931N631j746o101k665L011M848O80l852k151J950
$$ -206 4904 1892 -4783 -6454 -523 5108 3362 -2739 -5404 -2393 2455 3135 -717 -2868 -918
1469i18K140o66k817N52L859Q91m112l896K812N739J313n559m810K008O055K213
$$ -918 1222 556 -2261 -1709 2150 3041 -1071 -4967 -2155 3584 4897 -662 -5472 -3464 2591 4804
1485D804l411m598k80L925K557j872k474M56K461P3k979p78L212L469k455n551
$$ 4804 1393 -3205 -3485 440 2997 1125 -1349 -893 1568 1641 -1338 -2116 1096 4565 2110 -3441
1501c441m79M929M803k148o140j907L585M824j05l989k388J974K755l03k139m37
$$ -3441 -3920 1009 5812 3664 -2476 -4383 -798 4026 3921 -68 -2456 -482 2273 1970 -169 -606
1517f06K077J004k574k573J884M515N53n020m092K445N822J652m343m293M59M351
$$ -606 1471 2475 -99 -2672 -788 3727 4280 -740 -4832 -2387 3435 5087 744 -3549 -3090 1261
1533A261J987k260k781K0K137J214k206j004K048K028j731l811n52M610L494k610
$$ 1261 3248 988 -1793 -1773 364 1578 -628 -1632 416 2444 713 -3098 -3650 960 4454 1844
1549A844n323q96M153M064j281m219j977K431K928M40k887j087J455J818j264
$$ 1844 -3479 -4375 -222 3842 2561 -1658 -3635 -1204 1724 2164 -723 -1810 -355 1463 199
1564A99k211J307L344L61m261k688K606N088M25l990l500J206M028J632j896l566
$$ 199 -2012 -705 2639 3000 -1261 -3949 -1343 3745 4170 180 -3320 -2114 1914 3546 1650 -1916
1580a916j02L065J395j491k191J430K007j367k613q6L550K046k215m533j85L927
$$ -1916 -2018 1047 2442 951 -1240 190 2197 830 -1783 -1869 1681 3727 1512 -3021 -3206 721
1596G21L057j586m100j689K590L910o02k970j527J518J952q79j882O97K384L0
$$ 721 3778 2192 -1908 -3597 -1007 2903 2301 -669 -2196 -678 1274 395 -1487 -790 1594 1624
1612A624k867k059J904M467l13l637l157K142M114J028l260l062Q60K592J535
$$ 1624 -1243 -3302 -1398 3069 2756 -881 -4038 -1896 2218 3246 -14 -3076 -2216 376 1911
1627A911j296k029J69K028r5k089l48K542J805k144l051k18L658K804k399l729
$$ 1911 615 -1414 -1245 783 688 -1401 -1749 793 2598 454 -2597 -2815 843 3647 1248 -2481
1643b481q35K746L328q50k887j747J591K171j39j845m0J462O66k185j599J846
$$ -2481 -3316 -570 2758 1908 -979 -2726 -1135 1036 897 -948 -988 474 1140 -1045 -2644 -798
1659g98L057k76l448j976K496L423K59l033l005J267K950J941k030k457J5K273
$$ -798 2259 1983 -1465 -3441 -945 2478 2737 -296 -3301 -2034 916 2857 827 -1630 -1615 658
1675F58M38j845m36J625J261j175k852M51L454J453k057l622l0L502K144j237
$$ 658 1096 -749 -1185 440 1701 526 -2326 -1875 1579 3032 975 -2647 -2677 825 2969 1732
1691A732l270j058J936K550n53j757q30J386Q54j095j472J444J819l68k641j491
$$ 1732 -1538 -2596 -660 1890 1337 -420 -1250 136 990 -105 -1577 -133 1686 1318 -1323 -2814
1707b814K504K783R3l342k261J585L037J153k484k236M21K121J045j508j084R01
$$ -2814 -310 2473 2566 -776 -3037 -1452 1585 2738 254 -1982 -1561 560 1605 97 -987 -86
1723h6J444r53j663L28K449Q01j917k642J33L918J396j785l027n59K542J982l52
$$ -86 1358 405 -1258 -930 1519 2320 403 -2239 -2106 1812 3208 1423 -1604 -2163 379 2361 2009
1740B009k821o95J832J057o63j454O96J804l84k349q47K204K377p55l107j268
$$ 2009 -812 -1507 325 1382 719 -735 -39 1765 1381 -968 -1815 389 2766 2011 -1096 -2364
1756b364J866K941K18k901k032R46K591N97j425j985P92J372j01j461p2K368M29
$$ -2364 -498 2443 2661 -240 -2272 -1326 1265 1862 437 -1548 -756 616 515 -946 -1018 1350 1779
1773A779k370j670R04K866J270k165k751k98L022J867j135k745p89K455J386j255
$$ 1779 -591 -2261 -1357 1509 2779 614 -2137 -2435 587 2454 1319 -1426 -2215 240 1626 371
1789C71j399L86J173J72j626p08J765J650p07k870p61K147K344k8k838j861J594
$$ 371 -1028 -642 531 703 -923 -1631 134 1784 1077 -1793 -2554 -407 1937 1909 -929 -2790 -1196
1806a196K488L97k088j548O10J779K28j668j95J140P22j556j340P55K448O18k372
$$ -1196 1292 1689 -399 -1947 -1337 442 670 -998 -1193 -53 669 -887 -2227 -1472 976 1594 -778
1823g78k158N24L419J299j958k758OK431J831j168j960l60J738P45j190o86J076
$$ -778 -2936 -2412 1007 2306 348 -2410 -2404 27 1858 690 -1270 -1630 108 853 -337 -1023 53
1840E3J629r23k158m42K369K186r32k954j127J819K982j75k403j870J264K218
$$ 53 1682 759 -1399 -1841 528 2714 1782 -1172 -2299 -480 2502 2327 -76 -1946 -682 1536
1856A536J97j603m83J129P83j257j231J132J762N2k237j657J311K629M16k027
$$ 1536 1733 130 -353 776 1559 302 -929 203 1965 2017 -220 -1877 -566 2063 2479 452
1872D52k507K38K982J395j467k425j26K064N24r93r10P34J067l88j647k15J997
$$ 452 -2055 -1817 1165 2560 1093 -1332 -1458 606 1130 137 -773 -39 1028 640 -1007 -1222 775
1889G75J279q46l229l76K499K474r29k900j294K004K197m22j833j071J373J072
$$ 775 2054 1208 -2021 -2397 102 2576 1647 -1253 -2547 -543 1654 1232 -601 -1672 -299 773
1905G73n44j116K92J353K89j947r46R59K290M97k476j831Q49K964R67j875k379
$$ 773 229 -887 -595 758 1047 -900 -1846 -887 1403 1900 -576 -2407 -1558 1406 2373 498 -1881
1922a881K73K065J167r21j617K15J261k18j392j84J877J088j044k348k01K725
$$ -1881 -1608 457 1624 703 -914 -699 562 344 -1048 -1232 645 1733 689 -1659 -1860 865
1938H65J616j094k630j294K089K391J73k402j348J300J466o7j246m01J249O41
$$ 865 2481 1387 -1243 -2537 -448 1943 2116 -286 -1634 -334 1132 1065 -181 -582 667 1308
1954A308j402j248J415J680J37k373j743J340K698R95k126k791L54K881J278j670
$$ 1308 -94 -1342 73 1753 1890 -483 -2226 -886 1812 2807 681 -2110 -1756 1125 2403 733
1970G33j978K30J552L62j344j83R11R94j007k113K34K180J714j095l394l42K457
$$ 733 -1245 -1015 537 899 -445 -628 283 1277 270 -1843 -1609 571 2285 1190 -2204 -2546 -89
1987h9K367r83k738j064J660K104q19j301q05J404O55r11r55Q96J643k28k040
$$ -89 2278 1295 -1443 -2507 -847 1257 438 -863 -1668 -264 391 -520 -1475 -579 1064 836 -1204
2004a204j495J961K709qk552k365R32L134O87j672j933L63J727N88j027j044Q35
$$ -1204 -2699 -738 1971 1963 -589 -2954 -2022 1112 1799 127 -1806 -1443 284 872 -155 -1199 -364
2021c64J303o16j835M61K016J126j506k569o3K629J851j141k928o42J991K059
$$ -364 939 323 -1512 -1051 965 2091 585 -1984 -2047 582 2433 1292 -1636 -2278 -287 1772
2037A772k21k318o15R94J277o17r37N73J138J5j672j089J484K655l16k692j752
$$ 1772 1551 -767 -1382 -388 889 272 -665 -92 1046 1061 -611 -1700 -216 2439 2123 -569 -2321
2054b321J184L183O00k402k381O06K531J280j592j508N53J368l76r04k14J785
$$ -2321 -1137 2046 2646 244 -2137 -1531 1000 2280 688 -820 -267 1101 725 -179 -393 1392
2070A392O55j344j987n7K704J836j964k871m22K554K251j036k317o90J267J304
$$ 1392 2047 703 -1284 -1341 1363 3199 1235 -1636 -2058 496 2747 1711 -606 -1296 -29 1275
2086A275j90j461j30Q66O59j428r78J188K052k46k847j162J465L028J54k834k322
$$ 1275 1085 -376 -506 360 1019 -409 -1387 -199 1853 1607 -1240 -2402 -937 2091 2245 -589 -2911
2103b911J445K378J106j839j839K10J842L73j033p43J138Q13o97k166J20L111
$$ -2911 -1466 912 2018 179 -1660 -1450 392 765 -268 -1011 127 940 243 -1923 -1803 1308
2119A308P63j666k613J5K789J990j389l138j90J727J895k58k249N2J019Q08q76
$$ 1308 2071 405 -2208 -2193 596 2586 1197 -1941 -2131 -404 1491 1233 -1016 -964 55 863 -13
2136a3j159J033J541j88k680p01J965K584l49l061j714J506K899P07k490k055
$$ -13 -1172 -139 1402 1214 -1466 -2167 -202 2382 2033 -1028 -2742 -1236 1663 2370 -120 -2175
2152b175J061K089O22j600r96R32J048n45j384oK017J050k081k290M50K776J892
$$ -2175 -1114 975 1597 -3 -999 -67 981 436 -948 -954 1063 2113 32 -2258 -1808 968 2860
2169B860j795l175l87K753J773p97k051n52J084J057j79j439L91J018J04j363
$$ 2860 1065 -2110 -2497 256 2029 1232 -819 -1371 -287 770 591 -848 -457 561 665 -698
2185f98j368K044K080m83k965j380K022L215m62k870j434O91K518N73j612j355
$$ -698 -2066 -22 2058 1575 -1390 -2770 -748 2467 2005 -865 -2299 -1608 910 1483 -129 -1484
2201a484M76J239o5r26n47J547J096j758j832M75K686J472k351k668j18K868K009
$$ -1484 -1008 231 166 -760 -1307 240 1336 -422 -2254 -1779 907 2379 28 -2640 -2758 110 2119
2218B119j010k745m57J603J770n06j585l27J440O01j548n34J057K261r30k352
$$ 2119 1109 -1636 -2093 -490 1280 774 -811 -1138 302 903 -645 -1179 -122 2139 1209 -1143
2234a143q72K063K666m25k660j761J301K713N86j852k131R44J928J14j009q55
$$ -1143 -2015 48 2714 2289 -371 -2132 -831 1882 2468 616 -1515 -571 1357 1471 462 -393
2250c93J139Q49j128j754O93K462P86j972k529N29K995J665j865k791o37K443
$$ -393 746 1595 467 -1287 -594 1868 2654 682 -1847 -1318 1677 3342 1477 -1314 -1951 492
2266D92J836m99k017o75R51J281q11j222Q25J611n03k428n60K052J993l73l102
$$ 492 2328 1829 -188 -863 88 1369 558 -664 161 1772 1269 -1159 -1719 333 2326 1953 -1149
2283a149j478J996K476N96k509j782O01K326O96j777j608J030J197o10j423K98
$$ -1149 -2627 -631 1845 2441 -68 -1850 -1249 1077 1773 -4 -1612 -582 615 5 -1418 -1120
2299a120K005Q17k124k196P55K962J031k368k381L0K393J888j055k426p67J414
$$ -1120 885 1702 -422 -2618 -1863 1099 2130 -238 -2619 -2589 -196 1692 637 -1789 -2556 -1142
2315a142J707n01j550K51J278J29j923q26K024K097r33k846r87K089K831k38k554
$$ -1142 565 64 -1486 -1235 43 172 -1751 -2577 -553 1544 611 -2235 -3222 -1133 1698 1460 -1094
2332a094j494Q72K639Q93k025j504J077J306l1j179k72J755M55j281j672P51K730
$$ -1094 -2588 -1716 923 1816 -209 -1713 -636 670 639 -540 -812 943 1398 117 -1555 -804 1926
2349A926J032k238k510O44K680J182r30k599n23K005J716o69j450n50J448M54
$$ 1926 2958 720 -1790 -1146 1534 2716 1786 -813 -1336 669 2385 1716 266 -284 1164 1618
2365A618j305p01J155J804j075k406m27K135K275q74k716j562J569K854K16k397
$$ 1618 313 -388 767 2571 1496 -910 -1337 798 3073 2199 -517 -2079 -510 2344 2560 163
2381A63j703L54K383J85j578p12J158R44j249j318M59K151O59k357k038J034K751
$$ 163 -1540 -1186 1197 1382 -196 -908 250 1194 -55 -1373 -914 1237 1896 -461 -2499 -1465 1286
2398A286O88j579k675l69K292J905p52k198p92J786Q57j008q59R67J270o01k270
$$ 1286 1974 395 -2280 -2649 -357 1548 796 -1402 -2194 -408 449 -559 -1418 -451 819 218 -2052
2415b052j87J902K014j132k466r06J609K667q7k336j543N82K072J073j879j130
$$ -2052 -2239 -337 1677 545 -1921 -2827 -1218 1449 1362 -974 -2517 -1935 137 1210 -669 -1799
2431a799J080J033k89j132M56J495L97j732j659Q68K476J327k146k311L3K560
$$ -1799 -719 314 25 -1107 -651 844 1241 -491 -2150 -1282 1194 2521 375 -1936 -1903 657
2447F57K027j091k571l99J811J468q99j093J60J254j07j118n49J462J643o14k830
$$ 657 2684 1593 -978 -1377 434 1902 1003 -90 70 1324 1217 99 -450 1012 2655 2041 -789
2464g89q96K171K351kk312k062J001K780O4j601j701P52J678k0j655O4J161Q61
$$ -789 -1685 486 2837 2835 523 -1539 -538 2242 2306 705 -996 -244 1434 1414 -241 -177 984 1845
2482A845k001j335R55J913O16j989k169K35K449J611j237k400j138K335J788p25
$$ 1845 -156 -1491 -536 1377 1993 4 -2165 -1930 519 2130 893 -1507 -2645 -310 1478 753
2498G53k145k39J448L95j016o75J007J459r86j868o39J981J603j0k698j347J592
$$ 753 -1392 -1631 -183 212 -804 -1479 -472 987 1 -1867 -2506 -525 1078 1068 -1630 -2977 -1385
2515a385K301P53k747j544O77K385K87j276p68J244N87r73j022M79J981K08j666
$$ -1385 916 1669 -1078 -2622 -1945 440 727 -549 -1317 -73 514 -459 -1481 -1002 979 1187 -479
2532d79j581qK889J418j616k377m01K332J793j031k118m73J593J250q07n86L30
$$ -479 -2060 -2068 821 2239 623 -1754 -2155 177 1970 939 -1179 -1652 -59 1191 384 -202 128
2549A28J216o09j591m36J976J288m00j985j057J363K088Q7j891j619R78J906P04
$$ 128 1344 735 -856 -1292 684 1972 1572 -413 -1470 -107 1981 2068 177 -1442 -464 1442 2146
2566B146j589j319J034J130n05j081K68J216O43j460j696P04K146J093j798k048
$$ 2146 557 -762 272 1402 897 -184 84 1300 1943 483 -1213 -509 1637 2730 932 -1116
2582a116n00K486J602r29k200n59J135J483n88j383K15Q84j54q23n50P47J687
$$ -1116 -1616 870 2472 1543 -657 -1216 -81 1402 814 -569 -354 530 376 -447 -997 -250 1437
2599A437o03j828q32J361K340k83k288j600Q83K211N57j827j349N62J426L11j216
$$ 1437 834 -994 -1826 -465 1875 1592 -696 -2296 -1413 798 1355 -472 -1821 -1259 167 478 -738
2616g38j90O96R04j368n84J2J909P72j455j800k68K466J298r05k475p46K192J435
$$ -738 -928 -232 672 -696 -1280 -1268 641 1413 -42 -1842 -2110 356 1654 749 -1726 -2472 -280 1155
2634A155m37j556k88J172J91l21q33P79J080l90j438r40J622J610K9k198j560
$$ 1155 718 -838 -1126 46 237 -84 -917 -138 942 552 -886 -1826 -204 1406 1435 -763 -2323
2651b323J441K132M25j440j811O33J647L92j070q75O80P85k64j175O35J268M76
$$ -2323 -882 1250 1675 235 -1576 -943 704 1096 26 -849 -169 616 352 -823 -188 1080 1556
2668A556j334j553K71J901J332j073k280l85J763J909n49k021l53R81J169m80
$$ 1556 222 -1331 -1060 841 2173 1100 -1180 -1565 198 2107 1558 -463 -816 165 1334 854
2684H54p93J58N04J59j377j77J205J128qk256j023J202K260K68k000j836O88K330
$$ 854 61 219 723 882 -495 -672 533 1661 1653 -603 -1626 -424 1836 2104 104 -1732 -1044 1286
2702A286L21j149j428M74J171o7r18k17R69P63j277j416L07J881R61j408k029
$$ 1286 1607 458 -970 -496 675 608 -310 -527 442 1205 -72 -1488 -1181 700 1661 253 -1776
2719a776J4J780J699j076j835o46J311R97k99j030j61P99L20n40n35O55R55j97
$$ -1776 -1762 18 1717 641 -1194 -1840 -529 468 169 -861 -1022 -223 97 -443 -978 -323 632 435
2737D35j489o59Q56J949j08j761j492J092K056M39j523j278M97J069K95p92j21
$$ 435 -1054 -1713 -857 1092 984 -777 -2269 -1177 879 1318 -205 -1483 -986 83 378 -414 -535
2754e35M03J98k78r74M2J618P92j020j604k12J947J020p79j653q54J701J143j35
$$ -535 -132 66 -212 -1186 -1144 474 1266 246 -1358 -1570 377 1397 618 -1035 -1889 -188 955 820
2772H20j353m50R82L26k31q40M87R99O7j462l45Q52J525k43j453j409R70J888
$$ 820 -533 -983 -1 325 94 -746 -259 740 807 -655 -1000 -148 1377 1134 -319 -1728 -758 1130
2790A130P58j375j852N79J451O88j085l58J2R47k14q52J20J111M28r57j319K32
$$ 1130 1888 513 -1339 -760 691 1379 294 -64 -52 895 681 -171 -51 1060 1488 531 -788 -556
2808e56J556Q79j036j681m37J731J092p5j593q51J160R32m10o65m96J090k6q52
$$ -556 1000 1879 843 -838 -1275 456 1548 1473 -120 -971 189 1121 711 46 -450 640 614 -238
2826b38o26P66J448k55j632j156Q87J734M25j619j141M77J471N69p44j442J76
$$ -238 -864 -98 1350 1095 -537 -1693 -806 928 1353 -266 -1407 -930 541 1110 366 -1076 -900
2843i00Q41P05r01q20R37P18q44r85L33J328Q03q24j832l18J634J195l31j152
$$ -900 -59 646 -255 -1075 -138 580 -264 -1249 -916 412 1215 391 -1441 -1759 -125 1070 739 -413
2861d13r15R51J346k31j124r5L83Q28o16o27N19P61L40j625q25J064J418J42j160
$$ -413 -1328 -377 969 738 -386 -481 -98 730 114 -513 6 767 1107 -518 -1343 -279 1139 1281 121
2880A21j380O04J542M60q74j498M36J097K63n92o28M66O23l33p78J20R05M81l46
$$ 121 -1259 -655 887 1347 473 -1025 -589 508 771 179 -449 17 640 307 -471 -351 554 1035 689
2899F89j352k87J279J047l12j669p51J022J667n82j012m34Q03N50l64o94J54J034
$$ 689 -663 -950 329 1376 1064 -605 -1356 -334 1333 751 -261 -695 108 658 294 -400 -246 788
2917G88k49j000l49M21J363l68j097r54P84J109O70j157j247R6R03J109q61o07
$$ 788 539 -461 -810 -389 974 606 -491 -1445 -661 448 1118 -39 -1286 -1190 -287 822 -39 -646
2935f46L2L40K79p02k72J060L83p48j134L9J378J027q26j610j59R48J364J80j379
$$ -646 -614 -274 5 -697 -969 91 474 -274 -1408 -1369 9 1036 210 -1400 -1559 -611 753 933 -446
2954d46p17O57P72J37p63p1N44M43r07k89M54R93O4q33j053N78J400K03q70j180
$$ -446 -1163 -506 266 403 -360 -431 113 556 -351 -640 -186 807 871 38 -1015 -437 963 1166 296 -884
2974h84L38J221P15m02j115l70R66O36o60m79O52N69n07j143k5J189N88o89j058
$$ -884 -546 675 1390 988 -127 -497 469 1105 445 -34 618 1187 680 -463 -488 701 1289 600 -458
2993d58r8J166P62j82j412m10L63J289k95m60n86M37M46k62n14p3J044l21j166
$$ -458 -556 610 1372 1190 -222 -632 -269 1020 725 265 -321 116 562 300 -214 -287 757 436 -730
3012g30l09O06J462K6j270r78L09J301O00n57j214l55R90O64n57n85K12N72k07
$$ -730 -1039 -433 1029 1055 -215 -1193 -884 417 1017 460 -754 -1109 -119 545 -12 -597 -385 187 -20
3031b0q55K22O27Q06q18p82m47P24J478l62j241j069R07J158K10r91o50L97Q60
$$ -20 -875 -653 -26 780 -38 -820 -1267 -543 935 573 -668 -1737 -830 328 538 -453 -1103 -706 154
3050A54j36l98r0L52K64p42n61Q08N65K14p69o53L62Q01Q45m85j207k24J118N21
$$ 154 18 -380 -470 -118 146 -596 -1157 -349 216 430 -339 -992 -630 171 1016 531 -676 -900 218 739
3070G39n45m81l31J041N1m36k50O28M79o90r52M76O15Q69m59r62m24N84R51K48
$$ 739 194 -287 -618 423 474 38 -212 416 895 205 -747 -271 344 1213 754 -208 -632 -48 903 1151
3090A151j069o01N29N38k01j85j38L8K76l71m09M85N74L18j001q26M93P97N52
$$ 1151 82 -519 10 548 347 162 24 62 338 -33 -442 43 617 935 -66 -892 -399 398 950
3109I50q16r88p3Q25R27m41q20K58N17O9m80l31L96K70l03n38k29Q84O09l72q63
$$ 950 134 -854 -927 -102 825 384 -436 -178 339 408 -72 -403 -7 263 -40 -578 -807 77 686 314 -549
3130e49m75P02J091j61q81r45M42J010L34o57o54N61J88q4k55N7L30K12m55o09
$$ -549 -1024 -322 769 608 -273 -1218 -776 234 568 -89 -743 -182 6 -78 -333 -276 54 266 -189 -798
3150g98L06Q99N01r07r73L29J082M66m15o98l83N59P61m06l95j27M14L0m90K72
$$ -798 -492 407 908 1 -972 -643 439 905 490 -208 -591 -32 729 323 -72 -199 215 245 -245 27
3170B7K30Rl4m87n67R47Q04j17q65q64P59R18j3n92n42M47L90j13l52j80N44N9
$$ 27 257 266 232 -255 -822 125 929 812 -53 -917 -158 760 747 155 -387 60 450 337 -15 -195 349 408
3192D08m36k69K87M24J71l39m89k32O32Q18p66q65J32P45L74n51l51m5M26M7l99
$$ 408 -28 -297 -10 414 585 246 -243 -475 157 975 209 -656 -524 221 595 44 -307 -352 74 121 -278
3213b78j42P88M5n27q6m40O01O03l79p45k55N29O58K25o03r62M64M47L43n74o0
$$ -278 -420 368 413 -114 -200 -640 -39 564 185 -560 -815 -286 372 597 -6 -968 -504 -57 286 -288 -348
3234c48J79M47m49m26O44K50j78l65m91M03J25J028q54o61K32Q26J17l3o68k46
$$ -348 -169 278 -171 -597 47 297 119 -246 -737 -334 -209 819 -35 -696 -464 362 479 446 -222 -468
3254d68M12K64r1l35P4L47J54o30k9N56N22n03n25k40N72N02N8q35n80O95P87
$$ -468 -56 208 117 -218 -144 203 357 -273 -302 254 776 273 -252 -492 80 582 640 -195 -775 -80 707
3275G07m16k58j72K24K10j64l55J9N80p3k12o05N07L56J69k69p83J09M40O44j42
$$ 707 291 33 -139 85 295 131 -224 -205 375 302 90 -515 -8 348 517 248 -535 -426 14 658 516
3296E16p97j01M22L96j14l03l21K68M94k99m27M93o5j73l00j53M89N45k66m84
$$ 516 -281 -382 40 436 322 19 -302 -34 460 161 -266 227 162 -11 -311 -464 25 570 304 -180
3316a80k77J29N50N43p10n40L69J69L75n18N0L42Qm81q8j22K95L26m20m40K86
$$ -180 -457 -328 222 765 55 -485 -116 53 428 -90 -40 302 310 -171 -259 -381 -86 240 -180 -620 -334
3337c34N14Q7Nq88N8O01K62J01o34KJ24Q9j39j73M86J96l97j92J39jN01O0o40
$$ -334 180 267 272 -616 -558 43 305 406 -228 -226 -102 -13 -152 -325 161 357 -40 -232 -93 -94 407 467 -173
3360a73k60L30M54k57k69j90K58N22j71Qn29K16L29j06m69P2M36m7o2n23P2N68
$$ -173 -433 -103 351 94 -175 -365 -107 415 244 252 -277 -61 268 162 -307 -235 201 154 92 -431 -359 209
3382B09P7m7m17j37L52O04m35p65L41L11K31j03k35j65M27j13j67l02M69j3m6
$$ 209 286 239 -178 -315 37 641 206 -559 -218 93 324 221 -14 -179 248 135 -32 -334 135 122 76
3403G6m49O7J63M22J23l41k45k2K92L48n03O4n5K3J52o4n9K68R0j70j8j62M69
$$ 76 -373 -306 -143 279 402 61 -184 -206 86 434 -69 -5 -60 -37 115 51 -8 260 350 180 162 0 469
3426D69j85J11p78N6K88M40R8n36m07J31O50j53k41M4q6K00k71Q6J29om6j37K3
$$ 469 284 395 -383 -327 -39 401 499 -37 -444 -313 337 184 -57 -13 -99 101 -170 -84 45 39 -7 -144 -121
3449a21J26L72j60j59j60J00J80L21l31l60QK45j08J48j08r9N33n28l13N38J97
$$ -121 5 377 217 58 -102 -2 178 499 168 -192 -184 61 -47 101 -7 -106 427 -101 -414 124 321
3470C21m87L00m69J84L34Q1r9r1l81J80M14n28J81j66K07K32m26J02K16P1k86
$$ 321 -166 134 -335 -151 183 264 165 74 -307 -127 287 -241 -60 -226 -19 213 -213 -111 105 176 -110
3491a10m4l8j19N90j92k6m47L02J15M05n22J48k33K90q4J09l7k69J61J32K6l24
$$ -110 -154 -192 -311 279 87 61 -386 -84 31 436 -86 62 -171 119 35 144 107 -162 -1 131 157 -167
3513a67L58j67j50l5Q6N9K98k14k37O0q3L39p0p1k14K25mL73l24J90j40k43n0
$$ -167 191 24 -126 -161 -75 -16 282 68 -169 -109 -192 147 77 6 -208 17 13 386 62 252 112 -131 -181
3536a81J96j76K50J31l09K9L02j00o8O9l60J5J98M00l73j12K7M1L37m17o1K37
$$ -181 15 -161 89 220 -89 -60 242 142 74 143 -217 -202 -4 396 23 -89 -62 -21 316 -101 -162 75
3558G5o9K82j81j76O6L48m78Q2p1K14J15j99o9r9J68n9N0k0M8l46L14o4L41l27
$$ 75 6 288 107 -69 -3 345 -133 -51 -122 92 207 8 -61 -160 8 -51 -1 -21 27 -319 -5 -69 272 -55
3582e5j9N8Q6L9J00m28l5L49j22J31j20k2j12K75j76p3J81L1j69J40R8J3l37J16
$$ -55 -74 -16 70 109 209 -219 -254 95 -27 104 -16 -38 -150 125 -51 -124 57 88 -81 59 157 170 -167 -51
3606e1m7R7L34M8j80l81J20M29j28m90J48n9K07K6J62m25J90NK34p9j24r8k77
$$ -51 -98 -1 333 381 201 -180 -60 369 241 -249 -101 -160 47 73 235 -190 0 5 239 160 36 -62 -339
3629c39M98j56J08j86J74j66K59m27K63J73l97K33j02j44O30m35J99j51m4N7L07
$$ -339 159 3 111 -75 99 -67 192 -235 28 201 -196 37 -65 -209 421 -14 185 34 -10 47 354
3650C54m18J20Q8Q9m48N4l7M63j25m59O61m55q8K60k68L73J4k01L00l71pK09K00
$$ 354 -64 56 144 233 -215 -161 -198 265 140 -319 342 -113 -201 59 -209 164 178 -23 277 -94 -101 108 308
3673C08m30J96nl8N7K11k78j2J24J12j19j93j3N1J48k26K20r6K6jn0p1M3KJ53
$$ 308 -122 74 69 31 88 299 21 9 133 245 126 -67 -80 -29 119 -107 113 17 43 42 -8 -79 -36 -34 119
3698A19j05k59K48R5M40m85j82Mj43L28j07q1J74P6p7K14l61k5K44kj87L3J63
$$ 119 14 -245 3 98 538 53 -129 -125 -268 60 -47 -128 46 122 45 259 -102 -127 117 115 -72 -39 124
3721A24p4J07l97M6kl6K26j4j91p5L63J14k51j69J52O2J26l04K4K45J01j57k12
$$ 124 50 157 -240 -194 -196 -232 -6 -20 -211 -286 77 191 -60 -229 -77 -15 111 -193 -169 76 177 20 -192
3744a92K1M45M2l44J6l73R0M99j64N0q0J6PJ57j61N3k93J53M0j23K02k48J12m7
$$ -192 -171 274 316 -28 -12 -385 -295 204 40 90 10 26 33 190 29 82 -211 -58 -18 -141 61 -187 -75 -122
3768a22R1j61M68r0q1p8m42L42K79k28k7o6K66J16k98P9j2P5q8n4m0K13j78J44
$$ -122 -31 -192 276 186 105 27 -415 -73 206 -22 -49 -115 151 267 -31 48 36 111 23 -31 -71 142 -36 108
3792A08k44j94L36J48K43m85n4j39M59N8l49j08M68r1kl47K92J0J28k76m2q0K99
$$ 108 -136 -330 6 154 397 -88 -142 -281 178 236 -113 -221 247 156 154 -193 99 109 237 -39 -81 -161 138
3815A38O1q6k78K03J63J3l89k91K13j34L90l0nO9j66K2j2L3Q8K53l51o2n1K28
$$ 138 199 113 -165 38 201 214 -175 -466 -253 -387 3 -27 -32 37 -129 -107 -119 -86 2 255 -96 -158 -209 19
3839A9K35l47p5M8j19O08M9n47J69Q7j47MJ25r4j24M7Mn8J8P1P1j74J38r1K3R4
$$ 19 254 -93 -168 -120 -239 369 418 -129 40 127 -20 -16 109 15 -109 -62 -58 -116 -98 -27 44 -130 8 -83 -60 34
3865C4J21M9k95k38N24K09n12J25o5q0K13j96M41m65J2m36M30P6J20J42n50j96
$$ 34 155 204 -91 -329 195 404 -108 17 -48 -128 85 -111 330 -135 -123 -559 -129 -53 67 209 -341 -537
3887e37N60K59J37o13j8J25K5L30m00lk15L72J29k52J05J0J8j17j60J87O0J07
$$ -537 23 282 419 -194 -212 -87 -62 268 -132 -135 -350 22 151 -101 4 14 32 -85 -245 -58 2 109
3909A09J05l10j61M18J46J26p13K39j4L91m63J90J32m14M33o9j76K24k55j09J37
$$ 109 214 -96 -257 161 307 433 -280 -41 -55 336 -127 63 195 -219 214 145 -31 193 -62 -171 -34
3930c4l32K64L61j88k10o8J03K78J00j06m90L29Q2J13N1n28L47k61K43l0J51K75
$$ -34 -366 -102 259 71 -139 -207 -104 174 274 168 -322 7 89 202 253 -275 72 -189 54 24 175 450
3952D50k18o3m21J8L69J60j73m77K28K86J39j86m45L56R8L4j68J14k18L19m38
$$ 450 232 169 -252 -234 135 295 122 -355 -127 159 298 112 -333 23 121 155 -13 101 -117 202 -236
3973b36%J92L4J13K21k71l05J27M73j00n68N8K6N28J50n63J8j6j07K66k27K10
$$ -236 -236 -44 -10 103 324 53 -252 -125 348 248 -320 -262 -236 292 442 -121 -103 -119 -226 40 -187 23
3995B3m6M60m99j06J39J76r6r3r0qK14K54k14k52m5L72p4k4j23K70k79K74l39
$$ 23 -23 437 -62 -168 -29 147 51 -42 -132 -140 74 328 114 -138 -183 189 115 91 -32 238 -41 233 -106
4018a06J77k95Q5L1J42k39J44M14j06l50n5J17J73J5J5l50L80j33n5R7j96j62
$$ -106 71 -224 -139 -108 34 -205 -61 353 247 -103 -158 -41 132 147 162 -188 192 59 4 101 -95 -257
4040b57K45K72o91M71o0K82k13l04K86j87M69j89k69o8L2L90o4j29Q4P1l63L87
$$ -257 -12 260 -431 40 -20 262 49 -255 31 -156 313 124 -145 -213 -181 209 145 16 100 171 -192 195
4062A95j94j35K33j22j05N2K45j05Q9j97j77K25L36mm43k28N01%l19O07m68r7
$$ 195 1 -134 99 -23 -128 -76 169 64 153 -44 -221 4 340 336 -107 -335 166 166 -153 454 -14 -111
4084a11q8L29j49k01K24j2P4k51r0N24p0J3l73M8R9J14j56P3l79L80N9L8l5J07
$$ -111 -199 130 -19 -220 4 -8 66 -185 -275 249 179 192 -181 -133 -34 80 -76 -3 -382 -2 57 95 60 167
4108A67k48pk17k8M91j14K70p52M32j47M83j06l63L6O3J37k67pJ43J53p7k6m5
$$ 167 -81 -88 -305 -333 158 44 314 -438 -6 -153 330 224 -139 -103 -40 97 -170 -177 -34 119 42 16 -29
4131b9K18k46O65q49K8q4L97K83n35j19QM84j5K40n00l60M82N7j45k91L22l1q0
$$ -29 189 -57 608 -241 -213 -297 100 383 -152 -271 -263 221 206 446 -54 -414 68 125 -20 -311 11 -20 -100
4154a00k43K24K86O2j06j38k21mK70L78n52j15J60K07r5J65m11M4J41L2K02j83
$$ -100 -343 -119 167 229 123 -15 -236 -240 30 408 -144 -259 -99 108 13 178 -233 -189 -48 -16 186 3
4176CQ9K8n7P0p0j04J80P9k32J10KJ6j94K02j16J56k8L1q5n5qj05J65m6P9K54
$$ 3 92 120 63 133 63 -41 139 218 -14 96 98 114 -80 122 6 162 134 165 80 25 17 -88 77 31 110 364
4202C64l00j0o9n3L69Nq6n94L11L37Q6m64K21Pq0l2K34m2j65o2K15m15R6j8N29
$$ 364 64 54 -15 -68 301 306 220 -374 -63 274 360 -104 117 124 44 12 246 204 39 -23 192 -223 -127 -145 384
4227C84l42o0j28K07K85R5p15J14K28M17l80k90K0J76K77K7l74p1j42K13M8l27
$$ 384 42 -18 -146 61 346 441 -274 -160 68 485 105 -185 -165 11 288 315 -59 -130 -272 -59 -11 -338
4249c38K17L40J91m75r0L2M9K55l22l71L76K73R1j08k26j16J94P6j49L00j67p
$$ -338 -121 219 410 -65 -155 -123 -74 181 -141 -512 -136 137 228 120 -106 -222 -28 48 -101 199 32 25
4271B5K33l78N8P9J24j45j90N7nM85p8m45j06o8L98l6m09L39J56O8k54J93K03
$$ 25 258 -120 -62 17 141 -4 -194 -137 -142 343 265 -180 -286 -354 44 8 -401 -62 94 162 -92 101 304
4294C04j73L40o28J01j27K77K8j39l78N86k14L13o9m04l6M89J80m43p6J32m4o5
$$ 304 131 471 -157 -56 -183 94 122 -17 -395 191 -23 290 221 -183 -219 270 450 7 -69 63 19 -46
4316d6j58J26K42J85j83n01J21L20K46o9l61j35J81J11m6n97L09J40m1O4p3kO0
$$ -46 -204 -78 164 349 166 -335 -214 106 352 283 -78 -213 -32 79 33 -564 -255 -115 -156 -92 -165 -167 -107
4339a07K03k08l68L69K02j82l2m69L27M36k43J09m33p6M24L25k43k26q9N38k78
$$ -107 96 -112 -480 -111 91 -91 -123 -592 -265 171 -72 37 -396 -472 -48 277 34 -192 -281 257 -21
4360b1k44j88L98K14m55O0l01O53J38J40q36J99K55L06k10k79k08J66K24l1M9
$$ -21 -265 -453 -55 159 -296 -236 -537 116 254 394 -442 -243 12 318 108 -171 -379 -213 11 -20 29
4381B9K24Rn31k4L4M05J40K1n03j54N73R3O8j93n52J37N49J50k15l5l55J75O1
$$ 29 253 262 -269 -293 -259 146 286 307 -196 -350 223 316 384 191 -361 -224 325 475 260 225 -130 45 106
4404A06k38j14L44L03l66m44K03L30n9K38m62j08L45K43M4k53n32R9L70Q3k54
$$ 106 -132 -246 98 401 35 -409 -206 124 65 303 -159 -267 78 321 365 112 -420 -321 49 132 -122
4425a22J71J41k00M9J13l27M40j03n53J76R2M50j3n01j34J25N25n2k27j24j80
$$ -122 49 190 -10 39 152 -175 265 162 -391 -215 -123 327 314 -187 -321 -196 329 277 50 -74 -254
4446b54M66j81n2O3J07j23K1k63j32L24L45k77m98L54J77K62l43j16j82K79K77
$$ -254 212 31 -21 42 149 26 47 -216 -348 -24 321 44 -454 -100 77 339 -4 -120 -302 -23 254
4467B54k51P0m78K29L23l1j28L4L00n22j91J53K17K87k75j46q9j30N52M08n39
$$ 254 3 73 -405 -176 147 116 -12 22 322 -200 -391 -238 -21 266 -9 -155 -244 -374 178 586 47
4488D7m43J21N90Ll15L36m25J66k02l12L32l4M58k27m23L16J24K73j58l81k17
$$ 47 -396 -275 315 318 3 339 -86 80 -122 -434 -102 -136 322 95 -328 -12 112 385 227 -154 -371
4509c71L00M04Mn19j84M60J01R3m43o3M06k8o14j05M97J55J92k30n03K41M94J7
$$ -371 -71 333 337 -182 -366 94 195 288 -155 -218 188 160 -454 -559 -62 93 285 55 -448 -207 287 304
4531C04n7m57N8M34K8m59J49J3n7R9j62k8K08J71m33M5j14K61N99o04m29k5L91
$$ 304 247 -210 -152 282 310 -149 0 13 -44 55 -107 -135 73 244 -189 -144 -258 3 602 -2 -431 -456 -65
4554f5P34n42k52k88M11L82j96k61J28L8N7j69nM8K24k19n6N4j19N80k30l45l59
$$ -65 669 127 -125 -413 -2 380 184 -77 51 89 146 -23 -28 20 244 25 -31 23 -96 484 254 -91 -450
4577d50lQ55O3j82m70j98L95L36l19j33N4K9O5l47R9L14K14n67J69r2J70O24l95
$$ -450 -453 402 465 283 -187 -385 10 346 27 -106 -52 -23 42 -305 -206 108 322 -245 -76 -168 2 626 231
4600B31o98m6N91K33l22k0j28n2L52p2j4m40P35j6o90N3J71N94n0o15l99M33O43
$$ 231 -467 -513 78 311 -11 -31 -159 -211 141 69 55 -385 350 334 -356 -303 -132 462 412 -203 -602 -169 474
4623D74k35m08k71J57L18J75j61j85J55J77j2j03j56J30M13l19n31O7N81J77l92
$$ 474 239 -169 -440 -283 35 210 49 -136 19 196 184 81 -75 55 468 149 -382 -315 266 443 51
4644E1k64j68M06K09K90o43j99L77K32j21k79J29J79r6l23j87L60M33j40n13J51
$$ 51 -213 -381 25 234 524 -119 -318 59 291 170 -109 20 199 103 -220 -407 -47 386 246 -267 -116
4665a16N1L42l09K57p14J51N60M9k14m17J31J27nR3k52L55K13m32J11j19L22J70
$$ -116 -65 277 -32 225 -489 -338 222 271 57 -360 -229 -102 -107 -14 -266 89 302 -130 -19 -138 184 354
4687C54l16k13k59M80K55k69m44j03O46J63M0m71j99K92K29l2o4k46J21K04o30
$$ 354 38 -175 -434 46 301 32 -412 -515 131 294 334 -137 -336 -44 185 153 89 -157 -36 168 -462
4708d62P5K96O17k32m56j63J89O33j81l39k80J27J42O1m9k69L50J43l17n9J69
$$ -462 -387 -91 526 294 -162 -325 -136 497 316 -23 -303 -176 -34 27 -22 -291 59 202 -115 -174 -5
4729eK87j24q3n42L27L2O50l58m42l38Q58J9j57m1k16m7L29Qk66J46J56m5l18
$$ -5 282 158 75 -467 -140 -108 542 184 -258 -596 262 281 124 83 -133 -180 149 157 -109 37 193 148 -170
4752a70j45N68q1J70q44J35N7M98L75n76k84j73O28LK7k94J81q5R1j32K8j43J18
$$ -170 -315 253 172 342 -502 -367 -310 188 563 -13 -297 -470 158 161 188 -106 75 -10 81 -51 -23 -166 -48
4775d8N5j87j04M99J08m35l31K4J57P13k52p40L86K01K24j86Q0j34j57L42m98
$$ -48 7 -180 -284 215 323 -112 -443 -419 -262 451 199 -541 -155 46 270 84 164 30 -127 215 -283
4796b83K7L62j2N3m25l10O56P66n32l95l25M65K79jl62r9J0M00q4j26m26O28j49
$$ -283 -256 106 94 147 -278 -588 68 834 302 -93 -418 47 326 325 -37 -136 -126 274 190 64 -362 266 117
4819A17k43n4o1M76n0r7m53q9L28M61o4k75j09J46M82k28m94Q9J84K08l81L59
$$ 117 -126 -180 -241 235 185 88 -365 -454 -126 335 271 -4 -113 33 515 287 -207 -118 66 274 -107 252
4841B52j61K33p4m02l68K96O14m0n57o8oP12k5m52l80K31K09j71J68m02L65J56
$$ 252 91 324 250 -152 -520 -224 390 350 -207 -275 -281 431 406 -46 -426 -195 14 -157 11 -391 -26 130
4863A30l96J25j5K86J71j85o89J78J97M76k49m29L49k23N74n52K54l64k5L34L47
$$ 130 -266 -141 -156 130 301 116 -573 -395 -198 278 29 -400 -51 -274 300 -252 2 -362 -387 -53 294
4884B94k75l32R06o15j28k53N13L1L5k42l00J97M95N1m24o67N14N37J5k28n57
$$ 294 19 -313 593 -22 -150 -403 110 141 176 -66 -366 -169 326 377 -47 -714 -200 337 352 124 -433
4905d33L03M12j47K5l24K64J43k05K02m33Q09J22p34l28k0M68O60o58l93k67L56
$$ -433 -130 282 135 160 -164 100 243 38 240 -193 616 738 4 -324 -344 124 784 126 -267 -534 -178
4926a78O66j74l36k2K32o8j78j02R6J38O5m01j56N53N67l07o36k85L63J89M6j22
$$ -178 488 314 -22 -44 188 120 -58 -160 -64 74 139 -262 -418 135 702 395 -241 -526 -163 26 72 -50
4948e0l51k97O69N8l15p4R7O23l66m81L29Q8K78l78k76L13N28J29m08p77K86N24
$$ -50 -401 -698 -29 29 -286 -360 -263 360 -6 -487 -158 -70 208 -170 -446 -133 395 524 116 -661 -375 149
4970A49K29l15l47K49mL36j69l76K15J78k07j0l27L85K43j61k69l29L55L38j3
$$ 149 378 63 -284 -35 -39 297 128 -248 -33 145 -62 -72 -399 -14 229 68 -201 -530 -175 163 150
4991A50k80o5l9M08p8k32J8J27j5P8j4j56L23k1r1n40j03N86L15l81n12K78L20
$$ 150 -130 -195 -234 174 96 -136 -118 9 -6 72 58 -98 225 204 113 -427 -530 56 371 -10 -522 -244 76
5014G6M54l65j96J71j61K54J27l92pJ37P0m15K28K02L79m39j50q6M7N82m36j12
$$ 76 530 165 -31 140 -21 233 360 -32 -39 98 168 -247 -19 183 562 123 -27 -113 -66 516 80 -32
5036c2m05J10P01O5m00r1j07J27K94k80o5Q2J39l40j59J77K45R8k1n09k13J031
$$ -32 -437 -327 374 439 39 -52 -159 -32 262 -18 -83 -1 138 -202 -361 -184 61 159 138 -371 -584 447
5058D47k51j76m06j41M87K27Q5k69l13K94K38m36j65o5P28j59j90j88l7P96j56
$$ 447 196 20 -386 -527 -40 187 272 3 -310 -16 222 -214 -379 -444 284 125 -65 -253 -290 506 350
5079C50n54k23J56N21M77n99m93J37M80L6r1l37J59J50q7j42k26N72l5k74o75
$$ 350 -204 -427 -271 250 727 128 -365 -228 252 288 197 -140 19 169 82 -60 -286 286 251 -23 -698
5100f98L86L16M92m32j44k74J99N71j83j89l39P32l27P2k46j79K39J66m11k2J85
$$ -698 -312 4 496 64 -80 -354 -155 416 233 44 -295 437 110 182 -64 -243 -4 162 -249 -271 -86
5121h6L91K04o80j03Q9O19J07p70k93n5P67n2Ml84J60M72k86k07J44l6J63l45
$$ -86 305 509 -171 -274 -185 434 541 -229 -522 -577 190 138 142 -242 -82 390 104 -103 41 5 168 -177
5143a77j43J36O39j94j57n10K2O90J49l46m26j72M50J91M4j91j3j71K58k36k22
$$ -177 -320 -184 455 261 104 -406 -384 306 455 109 -317 -489 -39 152 196 5 -8 -179 79 -157 -379
5164c79M13J47j69l70K1J86N34k26k7l56m8K00J69k62q5L6J68j36J81j82L11J21
$$ -379 34 181 12 -358 -337 -151 383 157 130 -226 -274 -74 95 -167 -252 -216 -48 -184 -3 -185 126 247
5186B47m9n94L75M06J06k28m59q6L97M37k67m16j72P7O08r3k72j25K05L25o87
$$ 247 198 -396 -21 385 491 263 -196 -282 115 552 285 -131 -303 -226 382 289 17 -108 97 422 -265
5207b65j4L18J64j34k9j01K66m8L97o88k79k8P83nm12l71K11M78o1k70J0L05j84
$$ -265 -279 39 203 69 40 -61 205 157 554 -134 -413 -441 342 337 -75 -446 -235 243 182 -88 -78 227 43
5230D3R8o7o09M77K74j26m94L97J18J22j75n63K73J0N82j78l79l91N63L48m6J13
$$ 43 141 74 -535 -58 216 90 -404 -7 111 233 58 -505 -232 -222 360 182 -197 -588 -25 323 277 390
5252C90m82J53l12j07L62J77P8k46k22j46N8O85j01j56m99K11J32M15k57j14o0
$$ 390 -92 61 -251 -358 4 181 259 13 -209 -355 -297 388 287 131 -368 -157 -25 390 133 19 -41
5273d1j39K81l6j45R6K88l66l80O18o9K96l10k62k16N47K27kp82N7J13L64J10
$$ -41 -180 101 65 -80 16 304 -62 -442 176 107 403 93 -169 -385 162 389 387 -395 -338 -225 139 249
5295B49n65J45J0J17k26K01L3J62q4j45o10Q19K16kn08l71M11L60L0m54o3K24
$$ 249 -316 -171 -161 -44 -270 -69 -36 126 42 -103 -713 106 322 320 -188 -559 -148 212 242 -212 -275 -51
5317e1J76J57qm37L86j13j8j60J94j7K83j22n61Q5K44N60p21jm13M80J30j51l8
$$ -51 125 282 274 -163 223 110 92 -68 126 109 392 270 -291 -206 38 598 -123 -124 -537 -57 73 -78 -116
5340a16R8J38O3j86j24j06K74M9R0m27J27M04j61n75J00J73L80K34m15m62L72
$$ -116 -18 120 183 -3 -127 -233 41 90 180 -247 -120 284 123 -452 -352 -179 201 435 20 -442 -70
5361g0M69r3l76j73K36L0J20l86M90k39L27J5l49k00L56K36j32n16j50N70N57
$$ -70 399 306 -70 -243 -7 23 143 -243 247 8 335 350 1 -199 157 393 261 -255 -405 165 722
5382G22n32k70N7K79j10K08l88j55K43o4M1k86J59L80K93n20l05N4J62K61q6m96
$$ 722 190 -80 -23 256 146 354 -34 -189 54 -10 31 -255 -96 284 577 57 -248 -194 -32 229 143 -353
5404c53K24L00J21J27o50K97j6pJ13j45n6L37j84j04k61J77O37k46o98p9N59K64
$$ -353 -129 171 292 419 -231 66 50 43 156 11 -45 292 108 4 -257 -80 557 311 -387 -466 93 357
5426C57j77m34j84L11O18m48q7k03M38j37J51k78K1K59J02m45J42J72o7J33l60
$$ 357 180 -254 -438 -127 491 43 -44 -247 191 54 205 -73 -52 207 309 -136 6 178 111 244 -116
5447a16k70J11N45J63k29m37j39J43M87l38J22k1J23j59m93J73P1M09j98r9j20
$$ -116 -386 -275 270 433 204 -233 -372 -229 258 -80 42 21 144 -15 -508 -335 -264 145 -53 -152 -272
5468b72L46k5K53n11k94M78M37k52k05M1l62M42o9j32J62j52K21k1n18Q6P02j08
$$ -272 74 49 302 -209 -503 -25 412 160 -45 -4 -366 76 7 -125 37 -115 106 85 -433 -347 355 247
5490B47k19l57J32K57L70o21M6J63J91k81o3j18J17J36P1o5O7N0J16k12j18k30
$$ 247 28 -329 -197 60 430 -191 -145 18 209 -72 -135 -253 -136 0 71 6 73 123 239 27 -91 -321
5512c21L45L89l46l93J94j48Q95k47o27N0J61L03j97j60N0PL86m18l07J69M2M12
$$ -321 24 413 67 -326 -132 -280 615 368 -259 -209 -48 255 58 -102 -52 -45 341 -77 -384 -215 -173 239
5534B39k05n69M24N34k02k96k26M74j67L25k49j98J67j4L0m5p5R1K70k6n34J7
$$ 239 34 -535 -111 423 221 -75 -301 173 6 331 82 -116 51 37 67 22 -53 38 308 282 -252 -235
5556b35K49L29p05K33j44M09J25k2m32j95M24M11k63o9j90l0J05J70k71J95R7
$$ -235 14 343 -362 -129 -273 136 261 239 -193 -388 36 447 184 115 -75 -105 0 170 -101 94 191
5577A91J9n45P8L38L9j27p7o77O31J47J02J45l10j46K95j69K34m20J9K65k25q0
$$ 191 210 -335 -257 81 120 -7 -84 -761 -130 17 119 264 -46 -192 103 -66 168 -252 -233 32 -193 -273
5599b73J25M08m2j62l97J13J10K92k00O1l64K77K99qk00p5P5J92j46Qj22j30K76
$$ -273 -148 260 218 56 -341 -228 -118 174 -26 35 -329 -52 247 239 39 -36 39 231 85 93 -29 -159 117
5622A17j09k37K88R8L15n97o0K56P2J36j29j62j07N36l74J7k12kR6P2j04O4M43
$$ 117 8 -229 59 157 472 -125 -185 71 143 279 150 -12 -119 417 43 60 -152 -154 -58 14 -90 -26 417
5645D17m21j31L3k86N61R3j42k71J36K00J46K1l45l05K66K34k76k4j5J17J55l59
$$ 417 -4 -135 -102 -388 173 266 124 -147 -11 189 335 356 11 -294 -28 206 -70 -94 -109 8 163 -196
5667a96k49O34k2n3m49N7j57P19k72q1j52J50j5J11J17j75k19K71L4Q4l48K27
$$ -196 -445 189 167 114 -335 -278 -435 284 12 -69 -221 -71 -86 25 142 -33 -252 19 53 137 -211 16
5689A6K00l90n6M3P8K28k85k50L21L4K50j62k57k94M18K14L02m09M0l98L47L29
$$ 16 216 -174 -230 -187 -109 119 -166 -416 -95 -61 189 27 -230 -524 -106 108 410 1 41 -357 -10 319
5711C19n75K11L93k74k79J29J18L18q1m84j55J04M85N0j39o8l90L16K52l44n5
$$ 319 -256 -45 348 74 -205 -76 42 360 279 -205 -360 -256 229 279 140 72 -318 -2 250 -94 -149
5732a49R2J82M1l67K96k93L03r6l75K62J17L71n72j27K36j5J85J69j84k10L12
$$ -149 -57 125 166 -201 95 -198 105 9 -366 -104 13 384 -188 -315 -79 -94 91 260 76 -134 178
5753A78J5j08N9l53L44q9j14K47k78J89ln6k16K9M38j05k33j37j70L27L86l93
$$ 178 193 85 144 -209 135 46 -68 179 -99 90 87 31 -185 -156 282 177 -56 -193 -363 -36 350 -43
5775d3m7k37J33K84k79o4K91j43P6j00r0K32P7q4l88j18P01r0n6n2l51J66lK52
$$ -43 -90 -327 -194 90 -189 -253 38 -105 -29 -129 -219 13 90 6 -382 -500 201 111 55 3 -348 -182 -185 67
5799F7k11J08j46L14j98k38L19j38N5Jn8Q2M6Q9r0k04M25J0j69K2K4j85R1J37
$$ 67 -144 -36 -182 132 -66 -304 15 -123 -68 -67 -125 -43 3 92 2 -202 223 233 64 86 110 -75 16 153
5823A53J26p39M57J62j84l04K50K29M6j82j08l84M45L24O9l73l07K91K62J31m52
$$ 153 279 -460 -3 159 -25 -329 -79 150 196 14 -94 -478 -33 291 360 -13 -320 -29 233 364 -88
5844h8j27K52q0J00j00j6L54m24J02k38J41O4J44Q7n35K76R1N3m5oK67l2p0Nl12
$$ -88 -215 37 -43 57 -43 -59 295 -129 -27 -265 -124 -60 84 171 -364 -88 3 56 11 5 272 240 170 175 -137
5869a37K25N0R2k05k20M41m5j88j93K62M5j18j02J92l27J49J26j28j1R4J67j5
$$ -137 88 138 230 25 -195 246 201 13 -180 82 127 9 -93 99 -228 -79 47 -81 -92 2 169 154
5891A54J46k38m57M55R6m22j13l2P85l18l63l1K12L94k79J24m08J33o2L75j01
$$ 154 300 62 -395 60 156 -266 -379 -411 374 56 -307 -338 -126 268 -11 113 -295 -162 -224 151 50
5912E0m4k55K69K20l25L5l9J78O4m27M91j26k03L81l20K25j59K61n2k61r1L1N7
$$ 50 6 -249 20 240 -85 -50 -89 89 153 -274 217 91 -112 269 -51 174 15 276 224 -37 -128 -97 -40
5935d0J69k25m1l5o8N76m43J48l2Kq0j6L24J8j99r2l08L20K14K16o31K32j91L4
$$ -40 129 -96 -137 -172 -240 336 -107 41 9 11 -69 -85 239 257 58 -34 -342 -22 192 408 -223 9 -182 -148
5959a48J51mK18k44mj40K6P6K08l4j37J7l0k97J15M00l62L8J7M3L73j80m47L29
$$ -148 3 -1 217 -27 -31 -171 -145 -69 139 105 -32 -15 -45 -342 -227 173 -189 -151 -134 -91 282 102 -345 -16
5983a6L0J19J21o3l7j88j19j12K46J30k19O8K10j5j19R6m1Kl35P53m36r5J09j82
$$ -16 14 133 254 191 154 -34 -153 -265 -19 111 -108 -40 170 155 36 132 91 93 -242 511 75 -20 89 -93
6007i3n2K1K11l0J81m23K57l9k33J35N10l04m6j75K98O4j13ok59K81k76K87l86
$$ -93 -145 -124 87 57 238 -185 72 33 -200 -65 445 141 95 -80 218 282 169 163 -96 185 -91 196 -190
6030a90M36l92L53k39L4o4K84O1j57m52K78J99j02m8l53N09l79J18K66MNk17K53
$$ -190 246 -146 207 -32 2 -62 222 283 126 -326 -48 151 49 1 -352 157 -222 -104 162 166 171 -46 207
6053B07n59J01M16j52j75J11J53J69Mo07N47j96N1M7N7k73j68J97L50j11m21K15
$$ 207 -352 -251 165 13 -162 -51 102 271 275 -332 215 19 70 117 174 -99 -267 -70 280 169 -252 -37
6075c7j70K36k60K53k52M1J26j01L7j53L85j75J57j12m1K75j91N4j55J88j24j7
$$ -37 -207 29 -231 22 -230 -189 -63 -164 -127 -280 105 -70 87 -25 -66 209 18 72 -83 105 -19 -36
6097c6K34j37j2k05J74k73J30Q8K44m77K12k42J54M17k76kJ21p4j94M2L21l90
$$ -36 198 61 49 -156 18 -255 -125 -37 207 -270 -58 -300 -146 271 -5 -7 114 40 -154 -112 209 -181
6119a81M85n29K20k7j52J92J05o1J2k9m4KM8j39n2O44m79J52l06m0K61J9K40p96
$$ -181 304 -225 -5 -32 -184 8 113 52 64 35 -9 -7 41 -98 -150 494 15 167 -139 -179 82 101 341 -455
6143d55M77j88k4J46j37K57Q9j21j58l4P9R8L4K78l65k81N23j0j71j49J84r4k17
$$ -455 22 -166 -190 -44 -181 76 165 44 -114 -148 -69 29 63 341 -24 -305 218 208 37 -112 72 -22 -239
6166b39L06k63J90J97m14K31j67K76q9p7M5q3L41j05k33p8P9n9L3J05J47l90L01
$$ -239 67 -196 -6 191 -223 8 -159 117 28 -49 -4 -87 254 149 -84 -162 -83 -142 -109 -4 143 -247 54
6189E4oJ40r1k89J87K38l54K37N3j72j9J49l54n6K39K4K61n02L23j11j13M4J69
$$ 54 48 188 97 -192 -5 233 -121 116 169 -3 -22 127 -227 -283 -44 -20 241 -261 62 -49 -162 -118 51
6212E1j75L11l52L12j52j37P0j08K39k22J75q1L2p9k68N82l69J75m8p2J36J7n3
$$ 51 -124 187 -165 147 -5 -142 -72 -180 59 -163 12 -69 -37 -116 -384 198 -171 4 -44 -116 20 37 -16
6235a6l7n8J68j46r6Q4M45m29k74M41m4j93K0N7r9M2J53K5rk25L0K71N4Q6l15
$$ -16 -53 -111 57 -89 -185 -101 344 -85 -359 82 38 -155 -135 -78 -177 -135 18 43 34 -191 -161 110 164 250 -65
6260f5K89j30j48J55J34k33j13L06j48j69K11p4j64Q7J09m1J19j84j25J53j88
$$ -65 224 94 -54 101 235 2 -111 195 47 -122 89 15 -149 -62 47 6 125 -59 -184 -31 -219
6281b19M40k91J78j09J31j80J97j8l49J43K53k17m0O7Q3K14r9l39K5J55L48j50
$$ -219 221 -70 108 -1 130 -50 147 129 -220 -77 176 -41 -81 -14 69 283 184 -155 -130 25 373 223
6303B23j70p8k02N44o27R6M44k02O9j34j17K64J37R0l54k74N02o21N35k19p8L49
$$ 223 53 -25 -227 317 -310 -214 230 28 97 -37 -154 110 247 337 -17 -291 211 -410 125 -94 -172 177
6325A77j52k55K27K5p7Q6k35L00n5L14j9l40N7j41J35K18k46k60K78lk81K87Q4
$$ 177 25 -230 -3 22 -55 31 -204 96 41 355 336 -4 53 -88 47 265 19 -241 37 34 -247 40 124
6348A24k6m33K35j28K81j8K53k93l8L0kj29J18j5p5J02m2Q8n9j11J71J71j07R7
$$ 124 98 -335 -100 -228 53 35 288 -5 -43 -13 -15 -144 -26 -41 -116 -14 -56 32 -27 -138 33 204 97 194
6372A94M4l74J87j67L45KR6J04p78O01j64j30J88J1l50K27O2Rj91N4J61k82K09
$$ 194 238 -136 51 -116 229 231 327 431 -347 254 90 -40 148 159 -191 36 98 107 -84 -30 131 -151 58
6395E8j59M9J2r0J18R5p0J31p9k7j51j11J88j6M7J63l01L6K17l02O2j8J72J37
$$ 58 -101 -52 -40 -130 -12 83 13 144 65 38 -113 -224 -36 -52 -5 158 -143 -107 110 -192 -130 -148 24 161
6419A61j70O9q1O4N4K9J7k47J79l8R0j79J67j6l2J38n55O53l99K17N2q7j31j95
$$ 161 -9 60 -21 43 97 126 143 -104 75 37 127 -52 115 99 67 205 -350 303 -96 121 173 86 -45 -240
6443b40L51j61O7j86J34J26m06J86K04P0K60o15J95q1L40k7l76K52q1K11k13J69
$$ -240 111 -50 17 -169 -35 91 -315 -129 75 145 405 -210 -15 -96 244 217 -159 93 12 223 10 179
6465A79k09Q1q5K5L9O0k09M67m09r2o5P3J84R4m21L88n6Rj03L72m71K45j80j08
$$ 179 -30 51 -34 -9 30 90 -119 348 -61 -153 -218 -145 39 133 -288 100 44 53 -50 322 -149 96 -84 -192
6489a92K92k67K12j8Q1m44J86J98K42p9l97L41ql11K0l5K73k03L26j38r6N3j1
$$ -192 100 -167 45 27 108 -336 -150 48 290 211 -186 155 147 -164 -144 -179 94 -109 217 79 -17 36 25
6512B5O4j52k05M27J41q4l58K20L61m74J39k61K38M1jj36P3P5Mk11J39j39j46
$$ 25 89 -63 -268 159 300 216 -142 78 439 -35 104 -157 81 122 121 -15 58 133 137 -74 65 -74 -220
6535b20M73j79R6k16k3K87k98L34n90K55N1j21qJN8L56J17q16Q0L60j50J97M2
$$ -220 253 74 170 -46 -69 218 -80 254 -336 -81 -30 -151 -159 -158 -100 256 373 -443 -363 -3 -153 44 86
6558H6k34J70l9j58J13K0N7J38l51J83q2J97j32nN6N0P7J3J08k72p2j9J90k14
$$ 86 -148 22 -17 -175 -62 -42 15 153 -198 -15 -97 100 -32 -37 19 69 146 159 267 -5 -77 -96 94 -120
6582a20j96K22K31j65J45kj43l18P0J49q1K64J13p4J34l89J09L5j11L75j95J9
$$ -120 -316 -94 137 -28 117 115 -28 -346 -276 -127 -208 56 169 95 229 -160 -51 -16 -127 248 53 72
6604G2m3J80l16L14j36K08k82p9J55J87l67K58k9m07L02K7J77k57J27o9j86Q6
$$ 72 29 209 -107 207 71 279 -3 -82 73 260 -107 151 122 -285 17 44 221 -36 91 22 -164 -78
6626g8n0K62J07l08R3j48K27j60m5j9k0L79j48j27R6k70K40o4N9j62o1R6r5J55
$$ -78 -128 134 241 -67 26 -122 105 -55 -100 -119 -139 240 92 -35 61 -209 31 -33 26 -136 -197 -101 -196 -41
6650d1J26M8k37N16l62j4k69L67R7l64mL98q2j51K75p04M79l2QO0j39oK16k84
$$ -41 85 133 -104 412 50 36 -233 134 231 -133 -137 261 179 28 303 -401 78 46 54 114 -25 -31 185 -99
6674i9J35j83j46M29k49k03L35j2L22k67J6j52P4K88l03r8j57nN70J07n56J40
$$ -99 36 -147 -293 136 -113 -316 19 7 329 62 78 -74 0 288 -15 -113 -270 -275 295 402 -154 -14
6696a4lK58l08R2j45M02l47j31q2M07j21J92j66k56j7J5J95J65p3j46K18k76k2
$$ -14 -17 241 -67 25 -120 282 -65 -196 -278 129 8 200 34 -222 -239 -224 -29 136 63 -83 135 -141 -163
6719a63K3J31m5K77n22K17m4K15k10K86k51O9k1M6j38J0K77J60j47l70J05J10
$$ -163 -140 -9 -54 223 -299 -82 -126 89 -121 165 -86 -17 -38 8 -130 -120 157 317 170 -200 -95 15
6741A5L21l42J70k30K24j14J44k62K46P3j39N1k41J94r9q7K27jj79l0M1j61L44
$$ 15 336 -6 164 -66 158 44 188 -74 172 245 106 157 -84 110 11 -76 151 150 -29 -59 -18 -179 165
6764A65m08J4K5K72q9K9NJ17m38K80L45k27k0j19K6K57j28l4l1L28l02pj36q8
$$ 165 -243 -229 -204 68 -21 8 13 130 -308 -28 317 90 70 -49 -23 234 106 72 41 369 67 60 -76 -164
6788a64L43q5K8k50K07kR0l07k33J30L41m9J60o3k94R8J70J5l41M3j18L83J4j07
$$ -164 179 94 122 -128 79 77 167 -140 -373 -243 98 49 209 146 -148 -50 120 135 -206 -163 -281 102 116 9
6812Im8N7J16k4k41j26Q3J71J81j06k87J23K74l37K08l31K45N2J03j44m7K62j43
$$ 9 -39 18 134 110 -131 -257 -174 -3 178 72 -215 -92 182 -155 53 -278 -33 19 122 -22 -69 193 50
6835E0j00j80%K62p6N2R7m03L75r1K46k13j92M06j36K27n50l8K82j83M29l14J27
$$ 50 -50 -230 -230 32 -44 8 105 -298 77 -14 232 19 -173 233 97 324 -226 -264 18 -165 264 -50 77
6858G7p3k0k91J0J89M26k73P9l11j13K10L27l03J22N2m4M9k05N3R7K4j01j18K25
$$ 77 4 -16 -307 -297 -108 318 45 124 -187 -300 -90 237 -66 56 108 64 113 -92 -39 58 82 -19 -137 88
6882H8j64k2L54n94K51K82Ml83j98L76K37j9j76j08J5O4K56l85K73m41j04K28
$$ 88 -76 -98 256 -338 -87 195 199 -184 -382 -6 231 212 36 -72 -57 7 263 -122 151 -290 -394 -166
6904a66M67m07Q9J2K7j6j49K63j97N5j98J1J05K07nk30J0M8L60j13m63Q7K28N3
$$ -166 301 -106 -17 -5 22 6 -143 120 -77 -22 -220 -209 -104 103 98 -132 -122 -74 286 173 -290 -203 25 78
6928G8J9k76L25R0q3j63l0J74k3l37L19J59l5l53J18J5q5M7J38p5l70M03k18N45
$$ 78 97 -179 146 236 153 -10 -40 134 111 -226 93 252 217 -136 -18 -3 -88 -41 97 22 -348 55 -163 382
6952C82m83k42O7L87K93k52k56p6K50K56k80j74k4K42k8k78P7J16jJ2Qk5R8J55
$$ 382 -101 -343 -276 111 404 152 -104 -180 70 326 46 -128 -152 90 62 -216 -139 -23 -24 -12 -4 -29 69 224
6976B24N7m02K14j30M39l46m7j51j8J15K69k73Q7j85K46m1j41K9K08l16K04k78
$$ 224 281 -121 93 -37 402 56 9 -142 -160 -45 224 -49 38 -147 99 58 -83 -54 154 -162 42 -236
6998b36K79n2K0j31k50L79p4Q9j37K60k48QK52n4r7l80M81P7J43l08M9j21J79
$$ -236 43 -9 11 -120 -370 9 -65 24 -113 147 -101 -93 159 105 8 -372 109 186 329 21 70 -51 128
7021A28p5k11J08K34o6k11o8l2J64J24n8L2q2K17k34M31n02K43j22k10Q1K1K93
$$ 128 53 -158 -50 184 118 -93 -161 -193 -29 95 37 69 -13 204 -30 401 -101 142 20 -190 -109 -88 205
7044B05k31K93n23K30L11j67L7nj11M1L7j85k2j10J72J44p0LK72l75K76%j42j18
$$ 205 -26 267 -256 -26 285 118 155 150 39 80 117 -68 -90 -200 -28 116 46 49 321 -54 222 222 80 -38
7068c8j9K66q0j94k03M82j39j73O5j07J40j45M2k37K56K23m49K80l4J4oJ5J39
$$ -38 -57 209 129 -65 -268 214 75 -98 -33 -140 0 -145 -103 -340 -84 139 -310 -30 -64 -50 -56 -41 98
7091I8k43K8J96l20P5K38N9q1Q3j90j58K40j9%K06j72K42k05J39k67n7p0J74J52
$$ 98 -145 -117 79 -241 -166 72 131 50 133 -57 -215 25 6 6 212 40 282 77 216 -51 -108 -178 -4 148
7115A48l07j6J28K30l57j7k82M68p4P8R2M0k34J81P0k68O2Q4k7l4L26l60k9J50
$$ 148 -159 -175 -47 183 -174 -191 -473 -5 -79 -1 91 131 -103 78 148 -120 -58 26 -1 -35 291 -69 -98 52
7139E2k01J5K87k17K99p5m60M9M30r1N4j84l1Q0Q6m64N43J94l86o6J24J71l56
$$ 52 -149 -134 153 -64 235 160 -300 -251 179 88 142 -42 -73 7 93 -371 172 366 -20 -86 38 209 -147
7162a47K65l12L9K03N2J75k43j82J90Rj42J49J36j05l32L02Lj33J25J2K9k91L00
$$ -147 118 -194 -155 48 100 275 32 -150 40 49 -93 56 192 87 -245 57 60 -73 52 64 93 -198 102
7185A02ol48N75l29l41N29l6J8k12J97k87Q7L09l62J01J3r9o2Mj6L35q1k10k44
$$ 102 96 -252 323 -6 -347 182 146 164 -48 149 -138 -51 258 -104 -3 10 -89 -151 -147 -163 172 91 -119 -363
7209c63M62J69j93PJ12l91L6L68j80p9JJ06Jk9R2k83q9K48K05l84J54r0q1J05
$$ -363 99 268 75 82 194 -197 -161 207 27 -52 -51 55 56 27 119 -164 -253 -5 200 -184 -30 -120 -201 -96
7233i6k13J63M48k22P2m08J29O0l5M26m88K65q9K00k46j55L00L1k57J6j40L44
$$ -96 -309 -146 302 80 152 -256 -127 -67 -102 324 -164 101 12 212 -34 -189 111 142 -115 -99 -239 105
7255A05K06k18n9j42K19R4j9j86j38J00o0J99k90O4J5J84N9o5k95L93q0k5k16
$$ 105 311 93 34 -108 111 205 186 0 -138 -38 -98 101 -189 -125 -110 74 133 68 -227 166 86 61 -155
7278a55J3K06J56k65j31K00MO2J56k90Q5l34L98m0k70N5K36K0k14K02p9J28k8
$$ -155 -142 64 220 -45 -176 24 28 90 246 -44 41 -293 105 65 -205 -150 86 106 -108 94 15 143 115
7301A15k78L4K46K0J68n54M69j81K55l58R3J7j36J91j80l7J41J2L74n64Q5K6j39
$$ 115 -163 -129 117 137 305 -249 220 39 294 -64 29 46 -90 101 -79 -116 25 37 411 -153 -68 -42 -181
7324a81M25n01K53K8J97j06R2j43l92K09NK1K01j54K54m95J30J45j39L76k62j35
$$ -181 244 -257 -4 24 221 115 207 64 -328 -119 -114 -93 108 -46 208 -287 -157 -12 -151 225 -37 -172
7346a72o5J59J67j04r2p5o7K64J73j86m8l34N02n9l23J61J88K0o4k78O6J20J85
$$ -172 -237 -78 89 -15 -107 -182 -249 15 188 2 -46 -380 122 63 -260 -99 89 109 45 -233 -167 -47 138
7369A38k43R7r7o9P32n22p1P4rJ20R7k45k21J06J89l5R1j56O5K23j57k48Q9K81
$$ 138 -105 -8 -105 -174 558 36 -35 39 30 150 247 2 -219 -113 76 41 132 -24 41 264 107 -141 -52 229
7393B29k27O2q7l7K09Q2l8m37M85q5j97m0m0L42r6k41p2J52O9J59J2l7l84L38
$$ 229 2 64 -23 -60 149 231 193 -244 241 156 -41 -81 -121 221 125 -116 -188 -36 33 192 204 167 -217 121
7417A21P3J54n97J86j66M09j07m11K87L5m2K02m3k87K73r3K34m26J21L4J87m86
$$ 121 194 348 -249 -63 -229 180 73 -338 -51 -16 -58 144 101 -186 87 -6 228 -198 -77 -43 144 -342
7439c42J79M35m9j44k10p4k1K28M9o6k01J31P9J11n5j74O37m23j99j33K71L4M6
$$ -342 -163 272 223 79 -131 -205 -226 2 51 -15 -216 -85 -6 105 50 -124 513 90 -109 -242 29 63 109
7462A09j60k85J48J35Q3K71n18J84o7JL36k13P8L03j65j65p7r6k31L46j28j13
$$ 109 -51 -336 -188 -53 30 301 -217 -33 -100 -99 237 24 102 405 240 75 -2 -98 -329 17 -111 -224
7484b24K45k75O8J27J34L2J53P0j90k91L93j21n6l61N07k8L1l69J06J19J29p3
$$ -224 21 -254 -186 -59 75 107 260 330 140 -151 242 121 65 -296 211 183 214 -155 -49 70 199 126
7506A26l1p4j77M96q8j50lk08lJ34j30k63N75l87M85n13K08j34J15L9j16N3m4
$$ 126 95 21 -156 340 252 102 99 -109 -112 22 -108 -371 204 -183 302 -211 -3 -137 -22 17 -99 -46 -90
7529i0N6J05P1j53J22q4J32l58K00j99L03m5l5j76L66O5k91J0L63k60J0r6l28
$$ -90 -34 71 142 -11 111 27 159 -199 1 -198 105 60 25 -151 215 280 -11 -1 362 102 112 16 -312
7552c12P6M04K7m5kk71J40j07J29J44l12J19O3K30m26K6J88j3j25J75j30J90r0
$$ -312 -236 168 195 150 148 -123 17 -90 39 183 -129 -10 53 283 -143 -117 71 58 -67 108 -22 168 78
7575G8J52m40J06P7J34m8j76r7M31j93K3L25n25L74l0k83NQ4K41j15k98M6o9M95
$$ 78 230 -210 -104 -27 107 59 -117 -214 217 24 47 372 -153 221 191 -92 -87 -3 238 123 -175 -129 -198 297
7599B97k76l5k52L69K0j83j12J31k19M62L4k0k57j9l4J79j00p4K95Rj86j35R5
$$ 297 21 -14 -266 103 123 -60 -172 -41 -260 202 236 216 -41 -60 -94 85 -15 -89 206 215 29 -106 -11
7622a1k5J50J10k37k78L76J59j93p6j66J55K29j87N9j61K72j64j30K5j01O63m14
$$ -11 -36 114 224 -13 -291 85 244 51 -25 -191 -36 193 6 65 -96 176 12 -118 -93 -194 469 55
7644E5J75l17J45J55Q1m06K58j52r7K22K2l03K92n1j41Qj0lL13j73j49J50l83
$$ 55 230 -87 58 213 294 -112 146 -6 -103 119 141 -162 130 79 -62 -54 -64 -67 246 73 -76 74 -309
7667c09L98k13N4n3K51K75o02L67k77K44j23J02J05l66J80K2K09l84J02J3J6l36
$$ -309 89 -124 -70 -123 128 403 -199 168 -109 135 12 114 219 -147 33 55 264 -120 -18 -5 11 -325
7689c25L72k82L28j65k7K8J18J58j55O9m23M46J88k27j60J23j89K54R3n30J82
$$ -325 47 -235 93 -72 -99 -71 47 205 50 119 -304 142 330 103 -57 66 -123 131 224 -306 -124
7710a24K25j38mK62j05j79L14k82k84R3O7J51Q2k15P1n4L31k30o5p8L22j71o3
$$ -124 101 -37 -41 221 116 -63 251 -31 -315 -222 -155 -4 78 -137 -66 -120 211 -19 -84 -162 160 -11 -74
7733g4m07K41M19J56l60J20k04J94L6k46j9j27M01q7J12j21k08L94k01o6o0J57
$$ -74 -481 -240 179 335 -25 95 -109 85 121 -125 -144 -271 130 43 155 34 -174 220 19 -47 -107 50
7755E0lK56k24j01R4N5p2l3l68M77N01m18m63P5K55J17j35j75J36J75j04j69K9
$$ 50 47 303 79 -22 72 127 55 22 -346 131 632 214 -249 -174 81 198 63 -112 24 199 95 -74 -45
7778d5M2J16n8m54M17j76M36j36q6j57P0J17n7K53n37L53J42m2j81j66N4K85n18
$$ -45 -3 113 55 -399 18 -158 278 142 56 -101 -31 86 29 282 -255 98 240 198 17 -149 -95 190 -328
7801c28O2J61K69L9j41k14k9J85L5J88m5m27L61J61k48ol88M75j94K1M2K24j28
$$ -328 -266 -105 164 203 62 -152 -181 4 39 227 182 -245 116 277 29 23 -365 110 -84 -63 -21 203 75
7824G5NJ99j72m31K60P7M2J85m89L43J4n3l78K23N84m15j08J2K79k27k06r4L41
$$ 75 80 279 107 -324 -64 13 55 240 -249 94 108 55 -323 -100 484 69 -39 -27 252 25 -181 -275 66
7847F6k85%L53k01l52O45k32K49k91m8k7L54l3k31j18M75p9o4m73J30J98j16J89
$$ 66 -219 -219 134 -67 -419 226 -6 243 -48 -96 -123 231 198 -33 -151 324 245 181 -292 -162 36 -80 109
7870A09k32M0L23Ql61K62o89L68K11J72j44j75L61k44j3K39k36l1O9P4J25k08
$$ 109 -123 -83 240 248 -113 149 -540 -172 39 211 67 -108 253 9 -4 235 -1 -32 37 111 236 28
7892B8O4M9k26k23M39r6N8j15L2k50M86l6k0m84L43pMj74K85rl66K07j1p3L05
$$ 28 92 141 -85 -308 131 35 93 -22 10 -240 246 210 190 -294 49 42 46 -128 157 148 -218 -11 -22 -95 210
7917B10l6l22N4n9L69J3k10J63j84k03J45k18K37j29K33K43k91j43K22k50J77
$$ 210 174 -148 -94 -153 216 229 19 182 -2 -205 -60 -278 -41 -170 63 306 15 -128 94 -156 21
7938B1m02J89N22k18J9j86N5j18K58j52j97R6rJ98J35k24Q1r4r0M9n8M15J6k75
$$ 21 -381 -192 330 112 131 -55 0 -118 140 -12 -209 -113 -122 76 211 -13 68 -26 -116 -67 -125 290 306 31
7962C1p8j14k40N10k7N3o9k9P0J14k24m7o1J25M38j92k02j69Q6P7M3k87J56J65
$$ 31 -47 -161 -401 109 82 135 66 37 107 221 -3 -50 -111 14 452 260 58 -111 -25 52 95 -192 -36 129
7986A29j62J15k20J92j07K92j90p7J28j00K39m61J35J66M2L7j00j95J70k3Q0k16
$$ 129 -33 82 -138 54 -53 239 49 -28 100 0 239 -222 -87 79 121 158 58 -137 33 10 90 -126
8008a26m5j28M17Nl88L3J80l2Q5R7m17N06r3L2j07j76K2J34o9L30k02k1N8J91
$$ -126 -171 -299 118 123 -265 -232 -52 -84 1 98 -319 187 94 126 19 -157 -135 -1 -70 260 58 37 95 286
8032B86n37J04M06R8n37k5L53j82J95n33K21k39K94J39O4k19K90l1k49J34p3J54
$$ 286 -251 -147 259 357 -180 -205 148 -34 161 -372 -151 -390 -96 43 107 -112 178 147 -102 32 -41 113
8054A13j00K2m07N52oo5m75R0K20J9J19j7K6k05J10J43k85m5K67J13l15j56N2
$$ 113 13 35 -372 180 174 109 -366 -276 -56 -37 82 65 91 -114 -4 139 -146 -191 76 189 -126 -282 -230
8077b30K28K3m8J61l60J76J8j17m2j07L16J75j54j87L6M4K00l5L9j60j15K09k6
$$ -230 -2 21 -27 134 -226 -50 -32 -149 -191 -298 18 193 39 -148 -112 -68 132 97 136 -24 -139 70 44
8100D4j18RJ74K6k34j87L00J71O9m6j67j29J34J22K01m75J55l2k37L07j65jJ93
$$ 44 -74 -65 109 135 -99 -286 14 185 254 208 41 -88 46 168 369 -106 49 17 -220 87 -78 -79 114
8123A14N6l60J29J39Q6Qk08l4K7K20k14Q7q9j79M1O5J39J26J7J05m34J46R8k69
$$ 114 170 -190 -61 78 164 172 -36 -70 -43 177 -37 50 -39 -218 -177 -112 27 153 170 275 -159 -13 85 -184
8147a84L13k37m4k47L72L76j63k00j91N80j12M2m42Q9L42n02J15o6J40K47j66
$$ -184 129 -108 -152 -399 -27 349 186 -14 -205 375 263 305 -137 -48 294 -208 -93 -159 -19 228 62
8168F2N4k71P1L26p1k97j32K6K59J83j73k74J13K21j57l0k9P5j06K95m14K54M0
$$ 62 116 -155 -84 242 171 -126 -258 -232 27 210 37 -237 -124 97 -60 -90 -119 -44 -150 145 -269 -15 25
8191B5
$$ Imaginary data points
##PAGE= N=2
##DATA TABLE= (X++(I..I)), XYDATA
0@%%%%%%%%lJ1j6J6j6K4l2L2m0M9n7O8p9R3j07J24j44J64j86K14k44K73l08L48
$$ 0 0 0 0 0 0 0 0 0 -3 8 -8 8 -8 16 -16 16 -24 25 -32 36 -43 50 -57 67 -77 87 -99 115 -129 144 -164 184
32A84l89M36m88N41o00O67p40Q21r10J008j116J235j369J518j686J879k099K352
$$ 184 -205 231 -257 284 -316 351 -389 432 -478 530 -586 649 -720 798 -888 991 -1108 1244
50A244k652L014l453M004m723N702p119R370j3504K3575r2533j42452J41095J13279
$$ 1244 -1408 1606 -1847 2157 -2566 3136 -3983 5387 -8117 15458 -77075 -219527 -78432 34847
64C4847k9390j09903j4925M2905L2555q607j0160r648J2763J7329j2130m0245
$$ 34847 5457 -104446 -119371 -76466 -43911 -52518 -62678 -72326 -59563 -42234 -54364 -94609
76i4609J4665P5874L2915p9994q3956L6627J20080M7842p4083r3704L968Q8947
$$ -94609 -79944 -4070 28845 -51149 -135105 -98478 21602 69444 -4639 -98343 -94375 -5428
88e428O5234k9956p2329j4831N8591M2830k9288m0732K8725N6365j7891p8775
$$ -5428 59806 29850 -42479 -57310 1281 44111 14823 -25909 2816 59181 41290 -37485
100c7485j3330R2205P5176m8441j07213k5508Q0669Q2333r042q0184n3570L4119
$$ -37485 -50815 41390 116566 68125 -39088 -64596 16073 98406 89364 9180 -44390 -10271
112a0271P2588J5017n6189m0087K6519L6444j6687l7002J0556M6654J0858n5364
$$ -10271 62317 77334 21145 -18942 7577 44021 27334 -9668 888 47542 58400 3036
124C036o1859J7639R2284N1039p4767j14273M746J18391O0807p5665q9926J5244
$$ 3036 -58823 -41184 51100 102139 27372 -86901 -82155 36236 97043 21378 -68548 -53304
136e3304O9118J6021l5063j9274J5387J4664j1734k7051p890L7714M9958j3995
$$ -53304 15814 31835 -3228 -22502 -7115 7549 -4185 -31236 -39126 -1412 48546 34551
148C4551q2935m3351P0902R7125j2509j05345n1465O4096Q3939p37o5691l8567
$$ 34551 -48384 -91735 -20833 76292 63783 -41562 -93027 -28931 55008 54271 -11420 -49987
160d9987K5266M3334N009l0530j2010L3614K6040l8920n8217K2476R2058K9971
$$ -49987 -24721 18613 23622 -6908 -18918 14696 40736 1816 -56401 -33925 58133 88104
172H8104q6281q2578L8114J01329K8271o5235o4799N114N3657M1030j0463m5082
$$ 88104 1823 -80755 -42641 58688 86959 21724 -43075 -37961 15696 56726 46263 1181
184A181k0063L0225K7974k3732l1024K8835N1988j7283p6660k2813P3301P2415
$$ 1181 -18882 11343 39317 15585 -15439 13396 65384 48101 -28559 -51372 21929 94344
196I4344k7177r4030m0240O3374Q3942m86p8572n1807L5360N9681M29m4157j3165
$$ 94344 67167 -26863 -67103 -3729 80213 79727 1155 -50652 -15292 44389 44818 661 -12504
209a2504L0207J3306l1974l0550K1622N0621R290n4910n7304J6765P9281M0628
$$ -12504 17703 31009 -965 -31515 -9893 40728 50018 -4892 -62196 -45431 33850 74478
221G4478n8120q7392k605Q1646N3058m0609o7491m695M6386K1086k6431k4093
$$ 74478 16358 -71034 -73639 8007 61065 20456 -47035 -51730 -5344 15742 -10689 -34782
233c4782J7497L0406j0145m6618j7596N0520N9278k1636q6586l3081P1561P9592
$$ -34782 -17285 13121 2976 -43642 -61238 -10718 48560 26924 -59662 -92743 -21182 58410
245E8410j7480q0530l4089M2913N1703L785l2060k4382R166K6167N322k4872r339
$$ 58410 40930 -39600 -73689 -30776 20927 24712 -7348 -31730 -22564 3603 8925 -15947 -25286
258b5286L5442K7958l9096n8599K0147Q5003K9136p1835p4010K1917Q1700L4887
$$ -25286 10156 38114 -982 -59581 -39434 45569 74705 2870 -71140 -49223 32477 67364
270F7364m2907n8842n463M4510L3631j6643l5655K93L1430M777l6583j6504M1734
$$ 67364 24457 -34385 -39848 4662 38293 21650 -14005 -13712 17718 22495 -14088 -30592 11142
283A1142M2883k6289o7036j5817N8467N8995j5152o8966l9398L6701O6139J2119
$$ 11142 54025 27736 -39300 -55117 3350 62345 47193 -21773 -61171 -24470 41669 53788
295E3788n4441m5306K2689M9161J756l9800r535L5086J6497l6275l6467K4907
$$ 53788 -653 -45959 -23270 25891 27647 -12153 -21688 13398 29895 -6380 -42847 -17940
307a7940N8640J2429n5792n5930J7054P1902L6269m5339o6257k138N7510L6397
$$ -17940 40700 53129 -2663 -58593 -41539 30363 66632 21293 -44964 -47102 10408 46805
319D6805k5049m1319k103K7904J1803j8085j4974J6464K7262q809m5190k0733
$$ 46805 21756 -19563 -21666 6238 18041 -44 -15018 1446 28708 19899 -25291 -46024
331d6024M5537N7768j3888p6119l5606N3811O7915o764o3328l3260K8719M2041
$$ -46024 -487 57281 43393 -32726 -68332 -14521 53394 46630 -16698 -49958 -21239 20802
343B0802L387k8169j6875J3846J7829j1381k5665O293M1257J6216m4597m9914
$$ 20802 24189 -3980 -20855 -7009 10820 -561 -26226 -19933 21324 37540 -7057 -56971
355e6971J9169O7618K5774m9634n8079N150N5720L6823k3040m8383j3128L4991
$$ -56971 -37802 29816 55590 5956 -52123 -46973 8747 45570 22530 -25853 -38981 -3990
367c990L0876j5254l1285P684L3335k259m2843j4182M6314M3408k4369o1797j7329
$$ -3990 26886 11632 -19653 -11969 21366 19107 -23736 -37918 8396 51804 27435 -34362 -51691
380e1691M8594N2150n901n3949l6266K3596N1504J2946l7681l2176J6339L0928
$$ -51691 -3097 49053 43152 -10797 -47063 -23467 28037 40983 3302 -28874 -12535 18393
392A8393m847k6878L63L0420J0656l2481l2918J5572N0062K0215m0280n4822J976
$$ 18393 13546 -13332 -12969 17451 28107 -4374 -37292 -21720 28342 48557 8277 -46545 -44569
405d4569O0716M0009l1885n8831o350M5744K9204k0214k8816M415K1832L5k1026
$$ -44569 16147 56156 24271 -34560 -40910 4834 34038 13824 -14992 -10577 11255 11290 -9736
418i736p000K3697K5384j0975m2518j9566L7971N1967n095n9186l5285L4811N5352
$$ -9736 -16736 6961 32345 21370 -21148 -40714 -2743 49224 44129 -15057 -50342 -15531 39821
431C9821M464m3823l0921J6630L2418M770k3169j1673J7248J5906j7580k9979
$$ 39821 44285 462 -30459 -13829 18589 23359 190 -11483 5765 21671 4091 -25888
443b5888Q665M4200J6789m2594m8289J3219N8380K5932l7253m9681k693M0675
$$ -25888 -17223 26977 43766 1172 -47117 -33898 24482 50414 13161 -36520 -39213 1462
455A462L0416j3998l5240j0624K3859J7558j4846k0096J2516K6347o800l7990
$$ 1462 31878 17880 -17360 -27984 -4125 13433 -1413 -21509 -8993 17354 10554 -27436
467b7436j3691L7093L9627j2992n1497k5264L3353N0045M937m5342l5999J7823
$$ -27436 -41127 -4034 35593 22601 -28896 -54160 -20807 29238 34175 -11167 -47166 -29343
479b9343M2572Q966l0164j8286J7050J8220j3023k0075R194K9215P236k9906l0026
$$ -29343 13229 22195 -7969 -26255 -9205 9015 -4008 -24083 -14889 14326 21562 -8344 -38370
492c8370J0260M3286K4396k8844m8807n209M7177L7819k0776m5379o704L2580
$$ -38370 -28110 15176 39572 10728 -38079 -43288 3889 41708 20932 -24447 -31151 1429
504A429K0689j4614j8819O869J8246k603k1637q179K4137K9790p819m2540k2700
$$ 1429 22118 7504 -11315 -4446 13800 11197 -10440 -18619 5518 35308 27489 -15051 -37751
517c7751L3356N0092j36m9868l1485K5863M2937N225k9615k0317J0869K0086N96
$$ -37751 -4395 45697 45561 -4307 -35792 -9929 33008 38233 8618 -11699 -830 19256 19852
530A9852j4921l904J6512J2444j7558k8512N705M1165K0894l4194m5949M177M8795
$$ 19852 4931 1027 17539 29983 12425 -16087 -10382 30783 51677 17483 -28466 -24289 24506
543B4506K8241k6979m2713o664L1105K4177j0979k5593m752J7375O407j7411j2190
$$ 24506 52747 25768 -16945 -23609 7496 31673 20694 -4899 -9651 7724 14131 -3280 -15470
556a5470J6387K2609r839l5895j4747K9446L6417n902m3040k7785K1089M2099
$$ -15470 917 23526 13687 -22208 -36955 -7509 28908 23006 -20034 -47819 -26730 15369
568A5369Q350l4074l0897J0936L0707N185k1812j0997J4708J1714j4265j9158
$$ 15369 23719 -10355 -41252 -30316 391 5576 -16236 -27233 -12525 -811 -15076 -34234
580c4234Q365K8861J0601k6284l3069M681M1631K7638k2963m4731o767L9079K9911
$$ -34234 -25869 2992 13593 -12691 -45760 -41079 552 28190 5227 -39504 -46271 -7192 22719
593B2719j4473l0801k645K1824J0746j0457r079R284J4439k238k0129j0819K1372
$$ 22719 8246 -22555 -25200 -3376 7370 -3087 -12166 -2882 11557 9319 -10810 -21629 -257
606b57L2680r71m0071k6033K7826M6953L042m0118k6578J8916L2551M239j9657
$$ -257 32423 31452 -8619 -34652 -6826 40127 43169 3051 -23527 -4611 27940 32179 12522
619A2522j2720Q429J1815k314j2045M9J8527J1108j9045k8850M193L8458K1663
$$ 12522 -198 8231 20046 17732 5687 5736 24263 35371 16326 -12524 -8331 30127 51790
632E1790k7387m1096q37L7765K4986j6961l2570p506K0468J8269o909j7893k490
$$ 51790 24403 -16693 -17530 20235 45221 28260 -4310 -11816 8652 26921 20012 2119 -371
645c71J3605L211j7052j0981J6955K3725p968l5841j7026K5597L5289j480l7418
$$ -371 13234 16445 -607 -11588 5367 29092 21124 -14717 -31743 -6146 29143 27663 -9755
658i755k6812J5893L3691P445k5180k2499P054J8567Q91j4340n254J2646P401
$$ -9755 -36567 -20674 13017 20462 -4718 -27217 -20163 -1596 -705 -15045 -20299 -7653 -252
671b52j4871j9606M524K7166J4965k2247l4543j799L6344K6734j8956l8739o334
$$ -252 -15123 -34729 -30205 -3039 11926 -10321 -44864 -46663 -10319 16415 -2541 -41280 -47614
684d7614L0063K1745j0394k1001j850J3359N576q991n551R871J5528j972k2630
$$ -47614 -17551 4194 -6200 -27201 -29051 -15692 -10116 -19107 -24658 -14787 741 -1231 -23861
697b3861j3946K0210L4009J409l5460k3852K1847L8777N129k8666k0055J1579
$$ -23861 -37807 -17597 16412 17821 -17639 -41491 -19644 19133 24262 -4404 -24459 -12880
709a2880K2212N680j0694p976O087J0287k833j2755k14K1099J5306j7922k9772
$$ -12880 9332 15012 4318 -3658 2429 12716 9883 -2872 -3086 18013 33319 15397 -14375
722a4375K502L6806K1488k2506l4603j570K9075K1362r141k2107q105J1987J2975
$$ -14375 -11873 24933 46421 23915 -10688 -12258 16817 38179 29038 6931 -1174 10813 23788
735B3788l762j1364O75J3722J246j8761j2579J7120K5760m405l2470j8392K0885
$$ 23788 20026 8662 9337 23059 24305 5544 -7035 10085 35845 31440 -1030 -19422 1463
748A463L2446J862l0184k3679J0101K6291P600j7277j5667N071J2425j428j2598
$$ 1463 33909 35771 5587 -18092 -7991 18300 25900 8623 -7044 -1973 10452 9024 -3574
761c574j746J3641Q490j4863k1582L064K7400J5917j9337l3032l590L0234K3321
$$ -3574 -5320 8321 16811 1948 -19634 -16570 10830 26747 7410 -25622 -29212 1022 24343
774B4343j2642k8843p657J8388J5562o314j4208j103R612L736r716q491R053J7311
$$ 24343 11701 -17142 -24799 -6411 9151 2837 -11371 -12474 -2862 874 -8842 -17333 -8280 9031
788I031j416k4890j5779J8969L1975J068l2552k1891J5736K8673N033j8675j4471
$$ 9031 7615 -17275 -33054 -14085 17890 18958 -13594 -35485 -19749 8924 13957 -4718 -19189
801a9189M469J3346N090p727o639N948R355m942j5665R7K2928J5280j8710k9608
$$ -19189 -14720 -1374 3716 -4011 -10650 -4702 4653 -289 -15954 -15857 7071 22351 3641 -25967
815b5967K275L1585J9173j5988k7154l699J9767J7068m512j6184o504R653J0249
$$ -25967 -23692 7893 27066 11078 -16076 -19775 -8 17060 12548 -3636 -10140 -487 9762
828I762m627j0073L876J4719q21k0462j1444J8637K5627k854k9050j7322J5566
$$ 9762 5135 -4938 -1062 13657 12836 -7626 -19070 -433 25194 22340 -6710 -24032 -8466
841h466K6486M476k0796j8076M830J9181P499j2076j2101M792J0754k862j2593
$$ -8466 18020 22496 1700 -16376 -11546 7635 15134 3058 -9043 -4251 6503 3641 -8952
854h952J59J6441Q877j5711k1478K489K5716J5996j5440k6927m341K3121J8898
$$ -8952 -8793 7648 16525 814 -20664 -18175 7541 23537 8097 -18830 -23171 -50 18848
867A8848q112k0735o288J2299J1475l392q985j36Q556J554j1461q584J1248J9677
$$ 18848 10736 -9999 -16287 -3988 7487 4095 -4890 -5026 3530 5084 -6377 -14961 -3713 15964
881A5964o74k4145j5453J5639K7094J700k4184j7305R761K0840O121j2855j2491
$$ 15964 15290 -8855 -24308 -8669 18425 20125 -4059 -21364 -11603 9237 15358 2503 -9988
894i988J989J0492K914p379m292Q777R089r018j8106R16K3504J3526j6917k5164
$$ -9988 -7999 2493 5407 -1972 -6264 2513 11602 2584 -15522 -14606 8898 22424 5507 -19657
908a9657K83K4075J6323j0555k0673n915J2472J4259p39j2128n586Q456P173p864
$$ -19657 -19374 4701 21024 10469 -10204 -16119 -3647 10612 9873 -2255 -7841 615 7788 -76
922g6r890Q171J6433j030k1564j0904J6696K2660j591k3031j4698J0754K0991
$$ -76 -9966 -1795 14638 13608 -7956 -18860 -2164 20496 18905 -4126 -18824 -8070 12921
935A2921O587j4065j5861J876J3859O204q525p388O431Q104o256j2709J361J6854
$$ 12921 19508 5443 -10418 -8542 5317 11521 2996 -4392 2039 10143 3887 -8822 -7461 9393
949I393R181j3609k0141M02K1504J4452j0406k2785n825J6040J6027l415j5436
$$ 9393 18574 4965 -15176 -14774 6730 21182 10776 -12009 -17834 -1794 14233 10818 -4618
962d618n924Q404P846m087p801K632R782J85j3506q550J1779J8277n64k1473j4278
$$ -4618 -10542 -2138 5708 1621 -6180 -3548 6234 6419 -7087 -15637 -3858 14419 13855 -7618 -21896
977b1896J2265K2100M102j7251j5063M696J4975O132p996r279K301Q528M88q728
$$ -21896 -9631 12469 16571 -680 -15743 -11047 3928 10060 2064 -7215 -4914 3614 4102 -4626
991d626k683J0972R359j0324j7451J751K0988J2033j3488k0696j658J6852J4038
$$ -4626 -7309 3663 13022 2698 -14753 -13002 7986 20019 6531 -14165 -15823 1029 15067
1004A5067m511j5544o962Q866J0985j276j0112k034Q664L694j0054p913Q877J5139
$$ 15067 10556 -4988 -11950 -3084 7901 6625 -3487 -5521 3143 6837 -3217 -11130 -2253 12886
1018A2886k495j8263j0033J2170J8396J573j6629j3630M693J6704O967r738j3046
$$ 12886 10391 -7872 -17905 -5735 12661 14234 -2395 -16025 -11332 5372 12339 2601 -10445
1031a0445J894J1110K997p869m456P721O635p644j1763K506J5706Q117j0699j7276
$$ -10445 -8551 2559 5556 -2313 -6769 952 7587 -57 -11820 -9314 6392 14509 3810 -13466
1045a3466j349J6227J3862n465j7516o608J1583J2977k213j1262l533P321M847
$$ -13466 -14815 1412 15274 9809 -7707 -14315 -2732 10245 8032 -3230 -6763 558 5405
1058E405n244n936M623J0128j231j2773q314J0118J6503Q31j7271j2926P881J7636
$$ 5405 161 -5775 -1152 8976 7745 -5028 -13342 -3224 13279 14110 -3161 -16087 -8206 9430
1072I430M933j2437j2252K137J1464M608o360o092K906O358k054r253m63J1830
$$ 9430 14363 1926 -10326 -8189 3275 7883 1523 -4569 -1663 4695 2641 -6612 -7075 4755
1086D755P996r909j5330M10J6304J1167q372j6352l956J2105J1867j859j2064
$$ 4755 12751 2842 -12488 -12078 4226 15393 7021 -9331 -13287 -1182 10685 8826 -3238
1099c238n471O825P753k286p273J115P868R21j0304o045Q776J3276j377j5112
$$ -3238 -8709 -1884 5869 3583 -3690 -2575 5293 6214 -4090 -10135 -1359 11917 10540 -4572
1113d572r432Q313J5108L626j1440j2682K388J2684O178p247q962K098P652j98
$$ -4572 -14004 -5691 9417 13043 1603 -11079 -8691 3993 10171 2924 -6038 -3940 3712 3514
1127C514p281n85P746M954p569j0475R67J2962Q726p740j4775l273J2782J2276
$$ 3514 -3767 -4352 3394 8348 779 -9696 -8729 4233 12959 5219 -9556 -12829 -47 12229
1141A2229l280j3926n251Q102R126j874p659p29N998J833n849m305N275R477n61
$$ 12229 8949 -4977 -10228 -2126 7000 5126 -2533 -3262 2736 4569 -1280 -5585 -310 9167 8606
1156H606j1512q359P408J4938K369j3182j1746N054J3431M733q437r305J569P784
$$ 8606 -2906 -11265 -3857 11081 13450 268 -11478 -6424 7007 11740 3303 -6002 -4433 3351
1170C351K379n382l356M217M487m140p888j75J0992O380p576j3431j284J2709
$$ 3351 5730 348 -3008 1209 5696 1556 -6332 -6507 4485 10865 3289 -10142 -11426 1283
1184A283R766n172j2971m440Q192R407j332q399l632M996M339l355m974K495P355
$$ 1283 11049 5877 -7094 -11534 -3342 6065 4733 -3666 -7298 -2302 2037 -1318 -6292 -3797 3558
1199C558l13r481n361P526J1246l61j1297q779N190J2565M241q435j0022J577
$$ 3558 3245 -6236 -11597 -4071 7175 6814 -4483 -13262 -8072 4493 8734 299 -9723 -8146
1213h146R590M082n172n214K612N063k108n715M11P889M656o356r776k07J1132
$$ -8146 1444 5526 354 -4860 -2248 2815 707 -5008 -4597 3292 7948 1592 -8184 -8391 2741
1228B741Q459n041j2374l882J0182R469k440r842l503O309N211k353m438R75M369
$$ 2741 11200 6159 -6215 -10097 85 9554 7114 -2728 -6231 78 5289 2936 -1502 -527 3842
1243C842M09n989l199M941Q395r9j0341p749O117J2221K990j0610r190L165R781
$$ 3842 4251 -1738 -4937 4 8399 8300 -2041 -9790 -3673 8548 11538 928 -8262 -5097 4684
1258D684L568n980n705J411M710N67m245p86L953L637l827p585%R477O411o126
$$ 4684 8252 2272 -3433 -2022 2688 3255 -990 -1776 2177 5814 1987 -5598 -5598 3879 10290 4164
1274D164j0951j960R858Q308l630r804l486O075O191r67n734j439L738J760l742
$$ 4164 -6787 -8747 1111 9419 5789 -4015 -7501 -1426 4765 3798 -1936 -3375 363 2123 -1619
1289a619l343L556O162k83q851n177N692R954R10r379q088L740R481L413o373
$$ -1619 -4962 -1406 4756 4473 -4378 -9555 -3863 6091 7001 -2378 -10466 -6726 2755 6168 -205
1304b05o904J376O312J716m062k522K982L281k616m923N48P081M288n066q980
$$ -205 -7109 -5733 579 2295 -1767 -4289 -1307 1974 -642 -5565 -5017 2064 6352 1286 -7694
1319g694m42R386P454m062r742k694O943O982j318o160k182M047K603j639k901
$$ -7694 -8136 1250 8704 4642 -5100 -7794 -851 6131 4813 -1347 -3529 518 3121 1482 -1419
1334a419J925L786J87n287m010M973Q009J39q704o260M369R982J535p313o447
$$ -1419 506 4292 4479 -808 -4818 155 8164 8303 -401 -6661 -2292 7690 9225 1912 -4535
1349d535K258O319J855l123l729J016L009j91l351q19M414L039m195o761j58Q420
$$ -4535 -2277 4042 5897 2774 -955 61 3070 2879 -472 -1291 3123 6162 1967 -4794 -4952 3468
1365C468N253m927q887j263P278N830k424o665k149L575M292j281l623k10K992
$$ 3468 8721 3794 -5093 -6356 922 6752 4328 -2337 -4486 -911 3381 2100 -1523 -1733 1259
1380A259Q92m057l043L688O213q40p782m214M816Q096Q67p389n939K567O727K400
$$ 1259 2151 -1906 -4949 -1261 4952 4112 -3670 -7884 -3068 5028 5895 -1494 -7433 -4866 1861 4261
1396D261m328m461O51M007O14l052j130L067K422k616n221N83O571L580m357p372
$$ 4261 -67 -4528 -3877 130 744 -2308 -3438 -371 2051 -565 -5786 -5203 1368 4948 591 -6781
1412f781l93P394N056k982p036j864M984M386j017l741j335K433J700j901j960
$$ -6781 -7174 220 5276 2294 -4742 -6606 -1622 2764 1747 -1994 -3329 -896 804 -1097 -3057
1427c057K232L653k90n122l341M092P036P7p216m726L959O629J534m950m079J269
$$ -3057 -825 2828 2538 -2584 -5925 -1833 5203 5280 -1936 -6662 -2703 3926 5460 510 -3569 -2300
1443b300M095J355k443j468J217J782p13l319n35N033K700l684o232N38O862M224
$$ -2300 1795 3150 707 -761 456 2238 1525 -1794 -2329 2704 5404 1720 -4512 -3974 2888 7112
1459G112m229o417p24N021L924j340m253j595K163K389o80k572P86L265j29m421
$$ 7112 2883 -3534 -4258 763 4687 3347 -906 -2501 -338 2051 1371 -1201 -415 2850 2721 -1700
1475a700k358L682N160m59o364l548M150O377Qn164m126J920M255J621k318l287
$$ -1700 -4058 -376 4784 4325 -2039 -5587 -1437 4940 4948 -216 -4342 -2422 1833 3454 1136 -2151
1491b151J094K702k19k830J2K973K068l293m519J310N388K939l901o013J6N237
$$ -2151 -1057 1645 1426 -1404 -1392 1581 3649 356 -4163 -2853 2535 5474 1573 -4440 -4424 813
1507H13L662j740m912j124K953K798m53l159n11K512M95k414j559K502L664r26
$$ 813 4475 2735 -2177 -3301 -348 2450 1997 -1162 -1673 839 1334 -1080 -2639 -137 3527 2601
1523B601n125k712M349N179l98n164l521K782M476Q95l248k491Q60K407P92j833
$$ 2601 -2524 -5236 -887 4292 3894 -1270 -4791 -2009 2467 3362 114 -2377 -1517 890 1682 -151
1539a51j223J828J930k141l073O87M572K034m001m821J008N490K708l117m396
$$ -151 -1374 454 2384 243 -2830 -2143 2429 4463 462 -4359 -3351 2139 4847 1730 -2666
1554b666n37L524K510j000k826p52J847J640j698j511J710K255p84l836j595L766
$$ -2666 -3203 321 2831 1831 -995 -1747 100 1740 42 -1469 241 2496 1712 -2124 -3719 47
1570D7L913j167m726k300K799M034M79l477k725P18L136J024k125j847J169K149
$$ 47 3960 2793 -1933 -4233 -1434 2600 3079 -398 -3123 -2405 731 1755 -370 -2217 -1048 1101
1586A101j108k307M10L320J123l305l487J566M384J655l007l764j4L640K670j178
$$ 1101 -7 -2314 -1904 1416 2539 -766 -4253 -2687 1697 3352 345 -3419 -3433 207 2877 1699
1602A699l658o74K362J621o38j912O58J930k68k695j052K944K915p68m532j490
$$ 1699 -1959 -2633 -271 1350 712 -1200 -542 1388 1120 -1575 -2627 317 3232 2464 -2068 -3558
1618c558L272L698m87l725k391J758L508O12k715j606R30K037k2k194o4K142R38
$$ -3558 -286 3412 2925 -800 -3191 -1433 2075 2687 -28 -1634 -704 1333 1311 -883 -947 1195 2133
1635B133k440k592J153L893J245l319l698J327L693J761j988l140o83K507K058
$$ 2133 -307 -2899 -1746 2147 3392 73 -3625 -2298 1395 3156 1168 -1972 -2655 -148 1910
1650A910n97k397k70K020M04j641j349K175K049j029l459q59L622K629j103l482
$$ 1910 1313 -1084 -1354 666 1070 -571 -1920 255 2304 1275 -2184 -3043 579 3208 2105 -1377
1666a377j523K038K986M90k318k593J051K605j9j589m68J222J054j862j955J476
$$ -1377 -2900 -862 2124 2614 296 -2297 -1246 1359 1340 -249 -717 505 1559 -303 -2258 -782
1682g82K759M85l061k004R01L254J818k432l079l22K832K156j507k264j87J952
$$ -782 1977 2462 -599 -2603 -1702 1552 3370 938 -2141 -2463 369 2525 1018 -1246 -1433 519
1698E19O44j213j352J481K000j359k484l51K683K473j382l298j176K554L077l84
$$ 519 1163 -50 -1402 79 2079 720 -1764 -2115 568 3041 1659 -1639 -2815 -261 2816 2432
1714B432l158j735J669K457K61k029r19J228J368j097j423M38K164N26k805j882
$$ 2432 -726 -2461 -792 1665 1926 -103 -1022 206 1574 477 -946 -508 1656 2182 -623 -2505
1730b505J655L343M39k721k995J062K719J872j875k702j0J875J392j009j472N54
$$ -2505 -850 2493 2932 211 -2784 -1722 997 2869 994 -1708 -1718 157 1549 540 -932 -378
1746c78J659r82j570l59K200J560j472k569o56K740J997n71k912j333J831K313
$$ -378 1281 299 -1271 -1630 570 2130 658 -1911 -2567 173 2170 1599 -1313 -2646 -815 1498
1762A498K39k353j553J266K045q54j631M86J796O4k035j387J902K371J5k769k061
$$ 1498 1737 -616 -2169 -903 1142 288 -1343 -857 939 1003 -1032 -2419 -517 1854 1869 -900 -2961
1779b961J218L070R88j968k778L13K121J757j472j763O28J428k94j040p02J859
$$ -2961 -1743 1327 2315 347 -2431 -2118 3 1760 288 -1475 -847 581 287 -753 -1455 404
1795D04J074j682k011K7K961J670j496k970p84K314K575q20k511j234J421K226
$$ 404 1478 -204 -2215 -2188 773 2443 947 -2023 -2807 -493 2082 1262 -1249 -2483 -1062 1164
1811A164n86j374l47J571L24j348q72J168K261k57k715j441J971K546M27k425
$$ 1164 578 -796 -1143 428 752 -596 -1468 -300 1961 1704 -1011 -2452 -481 2065 2492 67
1827F7k516J258K482R78j384j980K98J961L99j266p27J257J006j011j937M82K609
$$ 67 -2449 -1191 1291 2269 885 -1095 -797 1164 1563 297 -430 827 1833 822 -1115 -633 1976
1844A976R45j714k618L5K560K068j305k898p64J894K164o39j977o67J366J130
$$ 1976 2921 1207 -1411 -1376 1184 3252 1947 -951 -1715 179 2343 1704 -273 -940 426 1556
1860A556j531j071J171J906j028k170r04J824K572k60k861j733J543K550P07j959
$$ 1556 25 -1046 125 2031 1003 -1167 -2071 -247 2325 2065 -796 -2529 -986 1564 2271 312
1876C12k628R15K344N83j575j036J106O95q54j009K93J756R59j833k341J17K807
$$ 312 -2316 -1401 943 1526 -49 -1085 21 716 -138 -1147 -854 902 1861 28 -2313 -2196 611
1893F11J773j544k874n45K462K022q67k372m06J220J050m10j098K63J374k43j689
$$ 611 2384 840 -2034 -2579 -117 1905 1038 -1334 -1740 -520 530 120 -978 -715 659 416 -1273
1910a273o36J642J888l58k842j220K020K530K82k827j946R48K755Q00j925j210
$$ -1273 -1909 -267 1621 1263 -1579 -2799 -779 1751 2033 -794 -2740 -1792 963 1763 -162 -1372
1926a372P04J297j40j113m05J894P66j934j689N51L000R51k214k368p1K858J748
$$ -1372 -668 629 489 -624 -1029 865 1631 -303 -1992 -1441 1559 2510 296 -2072 -2143 715 2463
1943B463j147k610n53J973J187n67j203J35R45K36j502l64J521J738r45k577q95
$$ 2463 1316 -1294 -1847 126 1313 746 -457 -322 623 859 -643 -1007 514 2252 1307 -1270 -2165
1960b165K175K530j05k972k030J722K496M70j994j553O58J660Oj107m29R39N52
$$ -2165 10 2540 2435 -537 -2567 -845 1651 2121 127 -1426 -768 892 898 -209 -638 301 853
1977H53q11j574P84J506J251j932k594N37K685J845j802k779j6K379J398q61k127
$$ 853 42 -1532 -748 758 2009 77 -2517 -1980 705 2550 748 -2031 -2047 332 1730 869 -1258
1994a258n9J329P48r71j233J209J480o34k074o31J988K360p34l350r67K064K485
$$ -1258 -1317 12 760 -211 -1444 -235 1245 611 -1463 -2094 -106 2254 1520 -1830 -2797 -733 1752
2011A752j46k212j923J182K350j5j187j086Q82Q58o53j137J53K171P36k137k059
$$ 1752 1606 -606 -2529 -1347 1003 988 -199 -1285 -403 455 -198 -1335 -1182 989 1725 -412 -2471
2028b471R27K993J019k213k476M22K285J900j509k337K22J343J406j115j040N82
$$ -2471 -1544 1449 2468 255 -2221 -1799 486 2386 877 -1460 -1238 105 1511 396 -644 -62
$$ [...]
8191f3
##END NTUPLES=NMR FID
##END=
