##TITLE=1H_AM A510.IPS
 CDCl3, 8 sc, 
 29.7.2019
##JCAMPDX= 6.0         $$ Bruker NMR JCAMP-DX V2.0
##DATA TYPE= NMR FID
##DATA CLASS= NTUPLES
##ORIGIN= UXNMR, Bruker Analytische Messtechnik GmbH
##OWNER= root
$$ XWIN-NMR		Version 3.5
$$ Mon Jul 29 14:45:25 2019 Russian Standard Time (UT+4h)  she@DPX200
##.OBSERVE FREQUENCY= 200.13155
##.OBSERVE NUCLEUS= ^1H
##.DELAY= (6, 6)
##.ACQUISITION MODE= SIMULTANEOUS
##.ACQUISITION SCHEME= undefined
##.AVERAGES= 8
##.DIGITISER RES= 18
##SPECTROMETER/DATA SYSTEM= spect
##.PULSE SEQUENCE= zg30
##.SOLVENT NAME= D2O
##.SHIFT REFERENCE= (INTERNAL, D2O, 0, 15.7039)
##AUDIT TRAIL= $$ (NUMBER, WHEN, WHO, WHERE, WHAT)
$$ ##TITLE= Audit trail, XWIN-NMR		Version 3.5
$$ ##JCAMPDX= 5.01
$$ ##ORIGIN= Bruker BioSpin GmbH
$$ ##OWNER= she
$$ F:/spectra/data/she/nmr/H-F/1/audita.txt
$$ ##AUDIT TRAIL=  $$ (NUMBER, WHEN, WHO, WHERE, WHAT)
(   1,<2019-07-29 14:44:05.81 +0400>,<she>,<DPX200>,
      <created by zg, POWCHK disabled, PULCHK disabled
       configuration hash MD5:
       00 E9 B6 7A A2 85 ED C7 34 08 36 98 17 FE 4E 26
       data hash MD5: 16K
       E8 F6 38 D2 8F DF 0A 31 AE 56 BE B8 EE B5 E9 5F>)
$$ ##END=
$$ 
$$ hash MD5
$$ A5 22 D5 74 4B E9 C5 21 27 82 84 29 77 D5 8A 33
##$RELAX= 
##$RELAX= 
##$RELAX= 
##$RELAX= 
##$RELAX= 
##$RELAX= 
$$ Bruker specific parameters
$$ --------------------------
##$DU= <F:/spectra>
##$EXPNO= 1
##$NAME= <H-F>
##$PROCNO= 1
##$TYPE= <nmr>
##$USER= <she>
##$AMP= (0..31)
100 100 100 100 100 100 100 100 100 100 100 100 100 100 100 100 100 100 
100 100 100 100 100 100 100 100 100 100 100 100 100 100 
##$AQSEQ= 0
##$AQ_mod= 1
##$AUNM= <au_zg>
##$AUTOPOS= <>
##$BF1= 200.13
##$BF2= 200.13
##$BF3= 200.13
##$BF4= 200.13
##$BF5= 200.13
##$BF6= 200.13
##$BF7= 200.13
##$BF8= 200.13
##$BYTORDA= 1
##$CFDGTYP= 0
##$CFRGTYP= 5
##$CHEMSTR= <none>
##$CNST= (0..31)
1 1 145 1 1 1 1 1 1 1 1 1 1 1 1 1 1 1 1 1 1 1 1 1 1 1 1 1 1 1 1 1 
##$CPDPRG= <>
##$CPDPRG1= <>
##$CPDPRG2= <>
##$CPDPRG3= <>
##$CPDPRG4= <mlev>
##$CPDPRG5= <mlev>
##$CPDPRG6= <mlev>
##$CPDPRG7= <mlev>
##$CPDPRG8= <mlev>
##$CPDPRGB= <>
##$CPDPRGT= <>
##$D= (0..31)
0 1.2 0 0 0 0 0 0 0 0 0 0.03 0 0 0 0 0 0 0 0 0 0 0 0 0 0 0 0 0 0 0 0 
##$DATE= 1564397045
##$DBL= (0..7)
120 120 120 120 120 120 120 120 
##$DBP= (0..7)
150 150 150 150 150 150 150 150 
##$DBP07= 0
##$DBPNAM0= <>
##$DBPNAM1= <>
##$DBPNAM2= <>
##$DBPNAM3= <>
##$DBPNAM4= <>
##$DBPNAM5= <>
##$DBPNAM6= <>
##$DBPNAM7= <>
##$DBPOAL= (0..7)
0.5 0.5 0.5 0.5 0.5 0.5 0.5 0.5 
##$DBPOFFS= (0..7)
0 0 0 0 0 0 0 0 
##$DE= 6
##$DECBNUC= <off>
##$DECIM= 24
##$DECNUC= <off>
##$DECSTAT= 4
##$DIGMOD= 1
##$DIGTYP= 9
##$DL= (0..7)
0 120 120 120 120 120 120 120 
##$DP= (0..7)
150 150 150 150 150 150 150 150 
##$DP07= 0
##$DPNAME0= <>
##$DPNAME1= <>
##$DPNAME2= <>
##$DPNAME3= <>
##$DPNAME4= <>
##$DPNAME5= <>
##$DPNAME6= <>
##$DPNAME7= <>
##$DPOAL= (0..7)
0.5 0.5 0.5 0.5 0.5 0.5 0.5 0.5 
##$DPOFFS= (0..7)
0 0 0 0 0 0 0 0 
##$DQDMODE= 0
##$DR= 18
##$DS= 0
##$DSLIST= <SSSSSSSSSSSSSSS>
##$DSPFIRM= 0
$$ [...]
##$SUBNAM2= <"">
##$SUBNAM3= <"">
##$SUBNAM4= <"">
##$SUBNAM5= <"">
##$SUBNAM6= <"">
##$SUBNAM7= <"">
##$SUBNAM8= <"">
##$SUBNAM9= <"">
##$SW= 24.9336996594482
##$SWIBOX= (0..15)
0 0 2 0 0 0 0 0 0 0 0 0 0 0 0 0 
##$SW_h= 4990.01996007984
##$TD= 16384
##$TD0= 1
##$TE= 0
##$TE2= 300
##$TE3= 300
##$TEG= 300
##$TL= (0..7)
0 120 120 120 120 120 120 120 
##$TP= (0..7)
150 150 150 150 150 150 150 150 
##$TP07= 0
##$TPNAME0= <>
##$TPNAME1= <>
##$TPNAME2= <>
##$TPNAME3= <>
##$TPNAME4= <>
##$TPNAME5= <>
##$TPNAME6= <>
##$TPNAME7= <>
##$TPOAL= (0..7)
0.5 0.5 0.5 0.5 0.5 0.5 0.5 0.5 
##$TPOFFS= (0..7)
0 0 0 0 0 0 0 0 
##$TUNHIN= 0
##$TUNHOUT= 0
##$TUNXOUT= 0
##$USERA1= <user>
##$USERA2= <user>
##$USERA3= <user>
##$USERA4= <user>
##$USERA5= <user>
##$V9= 5
##$VALIST= <valist>
##$VCLIST= <CCCCCCCCCCCCCCC>
##$VD= 0
##$VDLIST= <DDDDDDDDDDDDDDD>
##$VPLIST= <PPPPPPPPPPPPPPP>
##$VTLIST= <TTTTTTTTTTTTTTT>
##$WBST= 1024
##$WBSW= 4
##$XGAIN= (0..3)
0 0 0 0 
##$XL= 0
##$YL= 0
##$YMAX_a= 112983
##$YMIN_a= -96818
##$ZGOPTNS= <>
##$ZL1= 120
##$ZL2= 120
##$ZL3= 120
##$ZL4= 120
##$ABSF1= 10
##$ABSF2= 0
##$ABSG= 5
##$ABSL= 3
##$ALPHA= 0
##$AQORDER= 0
##$ASSFAC= 0
##$ASSFACI= 0
##$ASSFACX= 0
##$ASSWID= 0
##$AUNMP= <proc_1d>
##$AZFE= 0.1
##$AZFW= 0.1
##$BCFW= 1
##$BC_mod= 2
##$BYTORDP= 1
##$COROFFS= 0
##$CY= 11.3945322036743
##$DATMOD= 1
##$DC= 2
##$DFILT= <>
##$DTYPP= 0
##$F1P= 20.1537800932815
##$F2P= 0.134698688090026
##$FCOR= 0.5
##$FTSIZE= 0
##$FT_mod= 4
##$GAMMA= 1
##$GB= 0.15
##$INTBC= 1
##$INTSCL= 1
##$ISEN= 128
##$LB= 0.24
##$LEV0= 0
##$LPBIN= 0
##$MAXI= 10000
##$MC2= 0
##$MEAN= 0
##$ME_mod= 0
##$MI= 1.114404
##$NCOEF= 0
##$NC_proc= 0
##$NLEV= 6
##$NOISF1= 3.799351
##$NOISF2= 2.8
##$NSP= 1
##$NTH_PI= 0
##$NZP= 0
##$OFFSET= 15.70392
##$PC= 1
##$PHC0= -9132.204
##$PHC1= 14.00097
##$PH_mod= 1
##$PKNL= yes
##$PPARMOD= 0
##$PSCAL= 0
##$PSIGN= 0
##$REVERSE= no
##$SF= 200.130013532006
##$SI= 16384
##$SIGF1= 3
##$SIGF2= 2
##$SINO= 400
##$SIOLD= 16384
##$SREGLST= <1H.CDCl3>
##$SSB= 0
##$STSI= 0
##$STSR= 0
##$SW_p= 3612.71676300578
##$SYMM= 0
##$S_DEV= 0
##$TDeff= 0
##$TDoff= 0
##$TI= <>
##$TILT= no
##$TM1= 0
##$TM2= 0
##$TOPLEV= 0
##$USERP1= <user>
##$USERP2= <user>
##$USERP3= <user>
##$USERP4= <user>
##$USERP5= <user>
##$WDW= 1
##$XDIM= 8192
##$YMAX_p= 0
##$YMIN_p= 0
$$ End of Bruker specific parameters
$$ ---------------------------------
##NTUPLES= NMR FID
##VAR_NAME=  TIME,          FID/REAL,        FID/IMAG
##SYMBOL=    X,             R,               I
##VAR_TYPE=  INDEPENDENT,   DEPENDENT,       DEPENDENT
##VAR_FORM=  AFFN,          ASDF,            ASDF
##VAR_DIM=   8192,          8192,            8192
##UNITS=     SECONDS,       ARBITRARY UNITS, ARBITRARY UNITS
##FACTOR=    0.0002004,     1,               1
##FIRST=     0,             0,               0
##LAST=      1.6414764,     0,               0
##MIN=       0,             -96818,          0
##MAX=       1.6414764,     112983,          0
$$ Real data points
##PAGE= N=1
##DATA TABLE= (X++(R..R)), XYDATA
0 0 0 0 0 0 0 0 0 0 0 0 0 -8 8 -8 8 -8 11 -16 16 -17 24 -25 31 -33 40 -45 50 -58 66 -74 82 -94 104 -117 129
35 129 -144 160 -176 197 -218 242 -267 296 -328 363 -405 449 -501 562 -632 715 -818 946 -1109
54 -1109 1329 -1633 2096 -2870 4399 -8534 41539 112983 -34055 -65167 59626 62738 -76968
67 -76968 -70476 49792 39090 -52076 -12167 62213 10673 -52224 78 36474 -17029 -28862
79 -28862 36153 38424 -25824 -29674 16206 3509 -38819 -21561 27749 33636 6605 -5764 6423
92 6423 15663 -7486 -43752 -27597 29228 27630 -28282 -16682 49243 26889 -54023 -31823 48295
105 48295 21238 -47488 -3690 57302 -2523 -59633 1414 36952 -30263 -36350 51607 48570
117 48570 -39420 -20890 56366 4894 -81433 -18232 67290 3334 -61196 18604 74181 -12347
129 -12347 -63244 12800 45710 -22570 -36950 26510 31267 -20431 -18893 12689 -1435 -18466
141 -18466 6448 18410 -2259 -531 17172 632 -23060 -9660 6231 -4229 -6120 9047
153 9047 8999 1743 6177 -1426 -18386 -3331 19412 -3400 -25036 11303 33743 -14423 -38719
166 -38719 13602 33482 -20184 -29281 29188 31999 -25330 -23184 23479 8263 -30742 -4166 28862
179 28862 -935 -19510 16145 19797 -23580 -18629 25023 10961 -28774 -3570 33740 1882
191 1882 -31850 613 25379 -6865 -20956 11340 18252 -8996 -9016 8303 -2219 -12445 5628
204 5628 10012 -9398 -3412 18153 2307 -22854 -3758 18309 -3551 -18652 8685 20623 -6557
217 -6557 -14494 7008 5464 -13088 -3970 12119 727 -7074 8446 7586 -13817 -9333 12403 4315
231 4315 -13326 1965 18791 421 -15501 -280 7807 -6862 -7568 8287 7544 -1814 3543 4780
245 4780 -9066 -8379 6875 1825 -11328 3250 19097 44 -16639 2018 12047 -10453 -15140
258 -15140 11457 15077 -8130 -6086 12439 746 -18462 -3462 12684 -3072 -9929 12634 15380
271 15380 -11456 -13489 9685 4561 -17987 -6174 19049 8361 -12222 -709 12929 -3493
283 -3493 -16348 -673 10170 -540 -3794 7307 6745 -5029 -5806 446 -1456 -3801 2377 6591
297 6591 3168 404 253 -1828 -3619 -3163 -2464 963 6509 4864 -2180 -596 4513 -3435 -12248 -1639
313 -1639 10423 1271 -6978 6237 12397 -6260 -14892 2219 7610 -8576 -7346 13123 11240 -9004
327 -9004 -6489 8762 -302 -15628 -2638 13855 2616 -8579 5083 11839 -6568 -14592 2012
340 2012 7967 -5512 -5218 11082 10419 -6000 -7263 3477 752 -8940 -3451 8454 6738 -1331
354 -1331 16 3892 -1181 -7727 -4514 2688 3401 477 2222 5499 1633 -6049 -6097 165 777 -2848
370 -2848 1261 8883 4917 -5182 -4324 1694 -3037 -8965 -32 10132 3987 -3685 2307 5201 -6363
385 -6363 -11398 340 6242 -1690 -1578 9029 6700 -6998 -7482 2093 -256 -7265 457 10998 4995
400 4995 -4311 -318 3354 -5158 -9332 679 7263 1745 -445 5475 4238 -5390 -7519 -626 1451
415 1451 -1647 1082 7074 5062 -2266 -4054 -1328 -2144 -4389 -824 5481 5560 663 -928 450 -2207
431 -2207 -6547 -4006 3093 4293 693 1624 4346 -417 -7348 -4872 1546 478 -1955 3599 7587
446 7587 672 -5695 -1877 837 -4334 -4347 4637 7238 57 -1837 2847 176 -7106 -4288 3975 3290
462 3290 -1074 2366 5707 -597 -6156 -2122 1576 -1605 -1588 4505 5379 -630 -2590 194 -1034 -4301
478 -4301 -1558 3590 3102 169 702 1334 -1824 -4159 -1977 1002 1218 854 1810 1921 -417 -2921 -2804
495 -2804 -680 310 28 1273 3164 1490 -2353 -2521 -93 -808 -2407 1057 4642 1533 -2393 47
511 47 1674 -3039 -4370 2167 4787 -658 -1694 3691 2170 -5248 -3889 3532 2444 -2875 779 5853
527 5853 436 -5665 -1332 2695 -1856 -3129 3762 5396 -1168 -2708 1721 -28 -5214 -2263 3878
542 3878 2252 -1550 989 3062 -1584 -4672 -1043 1774 138 -63 2395 2075 -1161 -2768 -2258 -1526
558 -1526 -268 1241 2100 2665 2451 -204 -2955 -2502 -1243 -1748 -520 3200 3600 227 -296 1187 -1670
575 -1670 -4335 -44 4191 879 -1479 2952 3071 -4699 -6237 1531 3230 -2234 242 7764 4265
590 4265 -4865 -3656 1387 -2787 -6549 781 6503 1503 -1400 3350 2420 -5220 -4762 2437 1847 -2928
606 -2928 614 5306 18 -5996 -2331 1965 -958 -2026 3615 6028 1498 -2002 -1640 -2287 -3877 -2870
622 -2870 -231 2200 4103 3744 882 -654 -94 -1651 -3759 -1151 2732 1655 -539 1098 1140 -2775
638 -2775 -2936 1546 2047 -389 2509 5496 -99 -5753 -2070 915 -4276 -4919 4227 7570 294 -1718
654 -1718 3864 1942 -6156 -5164 1994 1240 -2681 869 4158 -493 -3432 552 1459 -2325 -360 4865
670 4865 2263 -3388 -1468 1615 -2784 -5725 23 4696 1799 80 3151 2991 -1618 -3375 -1714
685 -1714 -1233 -909 965 1406 449 1355 1814 -1132 -2407 859 2344 -471 -900 1812 926 -2550 -2227
702 -2227 9 -518 -318 2546 2585 -240 372 2082 -1801 -5137 -816 2986 -1085 -3154 2812 4906
718 4906 -1650 -3957 1645 2626 -2700 -2457 2582 1803 -2351 -1061 1448 -968 -2043 1600 2215 -1186
734 -1186 -288 3227 588 -3854 -1361 2615 -199 -3120 695 3783 483 -2081 389 1617 -711
749 -711 -1285 311 374 -64 726 225 -1271 -196 1581 -58 -1858 442 2377 -163 -2119 35 1378
766 1378 -637 -1414 241 657 -25 240 65 -966 -135 1295 -461 -2198 354 2468 -571 -2709 681
783 681 2694 -905 -2598 967 2160 -1089 -1657 1124 1007 -1030 -174 1230 -387 -1050 1167 1053 -1737
800 -1737 -912 2355 1049 -2333 -641 2754 660 -2660 -609 2403 478 -1922 -105 1765 205
815 205 -1090 -92 419 -229 -82 193 -483 -356 821 362 -1164 -548 1165 528 -1112 -551 888 319
833 319 -1027 -760 164 284 -2 -100 -90 520 921 -167 -1197 -220 893 -348 -1573 -26 1580 310
851 310 -875 379 1438 136 -736 70 275 -477 -328 173 -406 -430 889 994 -545 -214 1698 1021
869 1021 -1493 -1110 1132 213 -2179 -1165 1521 879 -988 156 1969 759 -1027 -371 364 -887
885 -887 -1472 -251 181 -589 -44 1273 724 -454 236 1220 -6 -1401 -499 523 -570 -1644 -465
902 -465 1006 593 -170 643 1608 983 -439 -764 -306 -489 -1164 -1035 115 962 702 447 946 1097 198
921 198 -464 -224 -161 -752 -798 -121 -131 -582 129 1108 609 6 895 1406 -360 -1557 -531 -44 -1547 -1766
941 -1766 578 1578 132 -57 1563 1241 -920 -1130 194 -285 -1551 -598 740 -51 -751 544 1235
958 1235 9 -225 1159 1016 -840 -977 116 -388 -1607 -730 1028 904 192 852 1511 452 -680
975 -680 -580 -279 -641 -703 -150 313 391 304 240 266 426 246 -102 20 220 -370 -922 -481 -67 -542 -430 815
997 815 1136 147 9 842 91 -1487 -1017 392 -171 -1101 236 1484 177 -875 405 1011 -534 -954
1015 -954 604 786 -754 -731 566 169 -925 -142 1078 500 -259 510 768 -423 -810 -2 42 -555 -93
1034 -93 779 437 -108 279 326 -321 -369 157 96 -284 85 321 -215 -380 161 106 -372 9 570 111 -412 26
1056 26 151 -525 -592 246 273 -235 33 554 -26 -528 -13 210 -415 -296 504 389 -400 -3 557 -166 -674
1077 -674 197 607 -244 -319 621 463 -597 -285 629 97 -599 170 798 -96 -564 314 435 -552 -429 553
1097 553 336 -481 -41 584 -84 -644 27 356 -329 -391 376 278 -379 -153 339 -63 -442 65 261 -186 -221
1118 -221 196 63 -342 -137 209 -18 -163 172 204 -101 -58 165 -81 -193 156 178 -124 16 371 23 -273
1139 -273 160 345 -275 -259 462 314 -475 -94 662 67 -628 114 706 -165 -632 352 634 -494 -656 547
1159 547 448 -706 -382 722 267 -795 -160 690 -25 -743 24 632 -157 -612 148 448 -248 -476 140
1178 140 327 -168 -303 142 300 -70 -287 14 270 47 -315 -42 431 113 -446 -18 559 44 -586 50
1198 50 734 -87 -688 304 761 -349 -703 532 716 -622 -631 758 546 -812 -395 839 259 -897 -135
1217 -135 874 -15 -857 90 726 -235 -759 209 539 -367 -532 333 429 -339 -370 280 252 -302 -272 181 234
1238 234 -170 -245 131 299 -61 -337 99 479 -55 -467 148 624 -180 -618 336 709 -388 -591 600 712
1258 712 -646 -528 846 468 -921 -351 1010 199 -1014 11 1065 -149 -1028 290 930 -459 -852
1275 -852 507 682 -645 -645 589 433 -654 -356 539 247 -507 -178 333 64 -329 -115 160 138 -67 -145
1295 -145 0 246 12 -370 -18 484 7 -531 139 685 -142 -684 324 744 -475 -697 674 723 -735
1314 -735 -541 906 505 -975 -322 1067 159 -1055 39 958 -209 -986 339 772 -431 -638 571
1331 571 453 -619 -321 520 69 -610 -6 424 -161 -321 219 164 -276 -73 186 -91 -126 216 21 -302
1351 -302 92 355 -277 -343 488 382 -549 -223 677 95 -811 42 857 -170 -743 445 811 -535 -619 670
1371 670 429 -826 -252 934 109 -854 155 850 -300 -789 427 625 -607 -494 598 303 -657 -152
1389 -152 584 -14 -494 185 365 -326 -268 275 -59 -419 107 363 -228 -149 494 126 -535 -3 467 -316 -589
1410 -589 382 459 -558 -305 791 241 -756 136 940 -234 -908 393 729 -748 -792 791 588 -757
1428 -757 -164 1140 294 -891 -23 724 -405 -967 254 558 -476 -349 710 399 -426 27 571 -122
1446 -122 -567 70 107 -562 -340 305 47 -202 424 526 -117 -56 428 -178 -804 -69 347 -506 -571 679 710
1467 710 -425 -87 1045 289 -913 -94 765 -437 -1146 199 743 -548 -526 1014 864 -523 -99 966
1485 966 -31 -1141 -246 499 -525 -825 535 824 -214 -110 848 377 -553 -143 290 -416 -713 -13 107
1504 107 -390 -6 612 260 -62 486 439 -416 -426 69 -332 -806 -59 473 -91 -148 803 708 -327 -159 592
1525 592 -139 -989 -146 505 -446 -706 589 847 -325 -167 1001 498 -783 -258 543 -376 -1116 -38
1543 -38 677 -284 -356 811 769 -330 -177 567 -29 -875 -289 258 -344 -534 321 497 -168 31 560 195
1563 195 -282 22 101 -494 -475 75 -80 -359 238 595 32 -102 482 283 -535 -349 306 -184 -738 57 583
1584 583 -130 -344 621 617 -399 -236 583 81 -790 -192 461 -217 -595 335 665 -173 -237 569 298 -551 -267
1605 -267 331 -202 -610 120 419 -212 -219 421 292 -336 -67 359 -92 -446 72 239 -318 -287 354 146 -251
1626 -251 97 444 -52 -329 152 188 -365 -227 330 100 -298 131 384 -85 -299 239 242 -355 -155 362 37
1647 37 -386 49 400 -136 -310 297 284 -295 -202 375 44 -423 33 390 -133 -342 229 309 -301 -213 315 78
1669 78 -398 -26 364 -89 -309 179 241 -250 -178 257 39 -323 35 268 -101 -244 215 201 -224 -82 308
1690 308 3 -282 41 247 -167 -234 252 209 -192 -52 327 48 -311 64 271 -167 -270 177 201 -259 -85
1711 -85 293 52 -262 57 266 -136 -252 138 142 -276 -132 212 44 -229 112 236 -133 -163 135 98 -233 -93
1733 -93 181 13 -202 104 212 -118 -132 190 117 -230 -48 210 -48 -240 99 240 -143 -132 234 144 -237 -32
1755 -32 245 -14 -269 48 178 -148 -170 186 156 -224 -66 243 14 -240 42 158 -123 -162 150 97 -189 -52
1777 -52 173 -3 -180 66 174 -91 -122 146 57 -143 -33 138 -21 -154 97 106 -142 -62 148 20 -150 64
1799 64 164 -80 -136 148 125 -167 -50 213 11 -241 30 233 -66 -200 132 177 -165 -126 212 74 -238 -15
1821 -15 197 -43 -204 77 174 -105 -126 127 88 -196 -57 119 -39 -99 39 102 -71 -79 109 21 -133 25 100
1844 100 -96 -75 107 67 -144 9 138 -32 -164 104 152 -103 -114 165 87 -175 -24 216 37 -203 60 184
1866 184 -107 -142 119 93 -139 -65 198 14 -153 21 138 -66 -153 97 98 -158 -53 124 -7 -165 36 132
1888 132 -139 -141 116 68 -192 -27 147 -63 -167 89 138 -128 -105 169 81 -166 -38 172 -14 -166 79 167
1910 167 -99 -132 138 73 -165 -34 170 -2 -148 61 142 -126 -80 153 50 -109 -5 116 -15 -126 94
1931 94 77 -140 -64 145 19 -172 42 167 -100 -180 100 95 -184 -104 191 -14 -221 -12 221 -110 -206 108 125
1954 125 -168 -104 202 74 -194 27 254 -79 -202 134 166 -140 -109 185 111 -176 -31 215 -52 -146 111 150
1976 150 -99 -91 170 56 -132 -13 153 -70 -110 124 88 -114 -58 168 20 -175 58 136 -113 -113 163 58 -181
1999 -181 -18 231 -54 -190 102 205 -164 -175 197 89 -272 -103 268 4 -282 74 284 -145 -216 200 161
2020 161 -213 -144 265 91 -233 14 233 -29 -213 139 204 -131 -92 199 25 -212 -3 120 -78 -125 138
2041 138 130 -121 1 207 -41 -212 27 101 -199 -121 161 40 -186 19 209 -59 -212 132 185 -238 -197 209
2063 209 55 -329 -26 279 -21 -208 179 287 -162 -213 192 75 -322 -99 307 33 -255 140 298 -88
2083 -88 -264 191 161 -247 -138 251 64 -278 7 211 -12 -152 175 235 -74 -98 117 -20 -245 -83 101
2104 101 -115 -81 189 132 -100 31 142 -128 -222 47 71 -229 -115 196 46 -242 58 286 -63 -182 211
2125 211 231 -264 -234 180 44 -332 -32 418 60 -203 194 314 -134 -267 142 109 -329 -108 276 70 -184
2146 -184 84 267 -59 -139 147 160 -154 -88 95 -27 -213 -22 134 -53 -48 234 110 -126 -33 102 -86 -248
2168 -248 36 99 -155 -29 228 107 -181 -2 216 -95 -214 119 165 -196 -151 207 53 -233 12 255 5
2189 5 -198 96 206 -161 -221 137 102 -214 -42 252 91 -183 66 205 -129 -203 125 115 -157 -66 177 12
2211 12 -170 67 148 -86 -124 116 53 -147 -57 108 -41 -173 46 113 -101 -88 138 45 -152 11 130 -66 -153
2234 -153 109 116 -143 -90 179 59 -218 -16 175 -31 -167 55 141 -104 -116 145 103 -174 -62 162 -30 -144
2256 -144 51 172 -66 -109 109 62 -120 -44 112 0 -116 29 101 -45 -96 47 8 -135 2 104 -51 -108
2278 -108 69 68 -138 -75 131 25 -112 2 142 -34 -154 7 47 -109 -84 172 106 -82 24 144 -37 -178
2300 -178 23 113 -60 -44 104 102 -71 -49 65 -12 -105 13 133 2 -44 44 18 -111 -32 69 48 -37 75 127 -48
2325 -48 -106 -11 -56 -135 -41 73 47 47 77 76 -52 -97 -20 -47 -91 0 91 -11 -49 30 52 -44 -25 131 65 -35 7 20 -79
2354 -79 -213 -32 42 -10 41 205 184 -5 -11 16 -93 -170 -67 63 -13 -25 94 129 -15 2 58 48 -3 -20 18 -15
2380 -15 -105 -94 -35 -54 11 118 149 113 79 -6 -106 -167 -130 -115 -77 52 122 90 73 103 55 -50 -82 6 14 -71 -21 19 -41
2409 -41 -92 1 88 61 60 146 110 -6 -82 -84 -131 -148 -74 69 142 132 129 122 -12 -49 -71 -83 -89 -36 4 23 24 13 0 -32 15 55
2441 55 41 7 -10 -23 -99 -150 -109 -32 24 64 195 141 57 3 -52 -146 -174 -101 15 56 30 87 69 8 12 2 12 9 29 68
2471 68 16 -46 -65 -30 -43 17 65 123 90 67 37 -21 -80 -107 -93 -49 40 67 91 67 27 19 -27 -25 -12 -34 21 15 31 -56 -72 0
2503 0 -29 -59 20 84 47 -24 -28 -10 -57 -102 -4 39 18 11 60 64 -19 -51 3 -39 -64 10 97 44 -38 3 23 -9 -45 -1 48 -11
2535 -11 -25 17 42 -11 -36 -10 32 -18 -49 15 25 -32 -59 -20 13 26 -18 -11 18 -10 -63 -33 29 -29 -76 -7 47 -31 -65 53
2565 53 79 -35 -43 26 45 -70 -78 5 38 -36 17 98 53 -38 -7 -2 -15 -65 11 61 29 23 28 18 -66 -47 -12 30 16 58 44 22
2597 22 -14 -60 -72 -55 11 28 31 94 54 -39 -83 -19 -27 -62 8 109 57 -1 2 10 -134 -104 28 85 -37 33 108 48 -128 -108
2627 -108 -14 -31 -44 91 182 41 -46 -35 -19 -132 -112 32 91 45 40 74 -12 -152 -105 -30 10 50 112 135 42 -53 -88 -117
2655 -117 -76 -10 35 77 118 69 -28 -95 -65 -46 -106 19 189 97 -15 11 42 -148 -183 7 121 24 35 159 98 -138
2681 -138 -117 -2 19 -91 53 171 88 -97 1 -10 -144 -133 39 114 55 67 107 16 -153 -84 -16 -1 28 135 117
2706 117 19 -18 -20 -112 -111 30 22 53 90 118 -14 -129 -53 -22 -84 -35 151 143 -37 -18 48 -117 -205 -1 120 39 -17 141
2734 141 59 -115 -117 13 0 -82 -1 168 73 -69 36 60 -93 -118 62 110 23 54 110 30 -98 -70 19 -37 -35 97
2760 97 95 0 22 25 -62 -106 11 31 -35 23 108 19 -101 -38 10 -97 -85 93 60 -63 19 88 -29 -159 17 127 -55
2787 -55 -127 132 144 -78 -96 87 33 -117 -65 154 36 -76 8 97 -61 -107 34 60 -83 -27 116 42 -109 15
2811 15 88 -46 -80 41 53 -38 22 52 -11 -31 22 -14 -62 -18 82 -29 -94 68 106 -79 -96 65 78 -130 -65 147
2837 147 68 -123 7 71 -43 -116 38 135 -69 -85 148 57 -161 -58 134 -4 -158 50 190 -23 -134 56
2859 56 89 -127 -72 79 47 -50 -2 105 -1 -53 43 30 -67 47 94 16 -72 25 55 -132 -94 83 86 -41 23 155
2885 155 4 -91 31 -2 -162 -64 122 -21 -118 34 190 -47 -176 28 112 -124 -151 117 118 -129 -96 78 16
2908 16 -79 15 162 11 -80 73 65 -193 -151 76 10 -116 48 230 45 -89 45 98 -51 -132 14 -9 -63 21
2932 21 59 -50 -12 101 27 -79 60 141 -51 -166 -1 43 -164 -163 109 156 -28 97 199 15 -153 -35 -6
2955 -6 -182 -186 129 90 -130 -4 255 30 -180 -10 148 -49 -172 6 104 -116 -155 30 72 8 79 190 85
2978 85 -20 11 -63 -215 -107 22 7 -34 103 247 42 -59 64 18 -139 -90 59 -17 -92 6 58 -92 -62 163
3002 163 103 -92 58 190 -29 -265 -100 17 -161 -157 124 245 57 18 166 25 -165 -103 40 -98 -102 114
3024 114 122 -57 -2 160 47 -107 75 175 -11 -99 -11 -1 -109 -113 47 59 43 127 149 8 -55 0 -62 -213 -38
3049 -38 132 -10 -80 88 142 -42 -142 84 70 -132 -53 94 -21 -152 -11 62 -71 -81 129 124 -61 -24 162
3072 162 -14 -207 -39 123 -11 -117 108 165 -28 -83 62 38 -86 -19 101 43 -38 52 54 -81 -31 49 21 -81
3096 -81 71 86 -55 -96 39 18 -75 -11 121 -1 -79 61 103 -128 -108 57 35 -132 -14 158 0 -121 20
3119 20 134 -82 -138 64 106 -94 -66 104 52 -121 -3 100 -7 -52 55 59 -88 -46 94 34 -96 -4 146 7
3143 7 -64 44 61 -44 -23 62 9 -60 -9 98 -4 -58 74 60 -69 -25 96 -1 -120 -1 88 -22 -62 72 106
3168 106 -47 -49 62 -15 -121 21 76 -41 -71 88 47 -90 -25 101 19 -87 29 79 -44 -130 51 51 -68 -18
3192 -18 113 83 -67 31 80 -77 -82 45 55 -42 -3 121 13 -72 32 100 -1 -46 100 41 -46 -46 55 -21 -108 12
3218 12 81 8 -35 110 66 -99 -37 74 -14 -112 27 115 -31 -67 67 47 -102 -45 63 39 -33 -5 80 -26 -102 45
3244 45 13 -83 -5 82 22 -72 12 44 -24 -49 84 84 -51 28 84 -23 -79 11 73 -58 -31 89 46 -79 15 92 -28
3271 -28 -119 18 83 -7 -62 38 54 -114 -70 46 0 -23 40 89 -30 -56 28 56 -82 -27 99 41 -44 33 49 -34 -48
3298 -48 29 30 -51 2 58 -19 -48 27 66 -52 -70 57 30 -68 -8 103 -19 -95 13 54 -36 -46 92 43 -45 7 56 -21
3326 -21 -89 26 79 -23 -22 68 45 -114 -50 72 19 -46 17 75 -45 -63 49 -15 -39 -17 52 41 -46 33 49 -30 -54 45
3354 45 26 -22 -6 61 5 -51 12 51 -22 -11 50 9 -53 5 83 -21 -34 52 28 -47 -19 64 26 -71 -13 77 -34 -70 35
3383 35 41 -39 -27 48 22 -67 -17 66 13 -64 8 67 -41 -28 55 57 -62 -33 58 -28 -101 21 40 -45 -23 43 45 -71 3 39
3413 39 -18 -37 32 81 -10 -42 58 -1 -66 19 84 19 -41 45 49 -47 -11 54 -4 -66 23 87 -1 -59 11 56 -47 -40 54 -8
3443 -8 -48 -8 61 -32 -69 14 42 -59 -1 62 32 -77 5 52 -28 -53 52 58 -28 17 45 0 -54 -21 54 -13 -26 63 43 -14
3473 -14 -40 54 -10 -70 -22 61 9 -59 40 31 -43 -29 68 8 -43 9 47 -19 -41 83 30 -62 -66 84 4 -64 19 57 -30 -59
3503 -59 3 32 -54 -13 46 10 -53 3 44 -49 -73 31 32 -29 -51 42 14 -36 6 30 -29 -16 61 60 -40 -7 67 -14 -68 36
3533 36 80 -37 -28 66 46 -87 -23 98 14 -44 8 76 5 -48 22 52 -52 9 66 25 -9 19 38 -51 -106 26 48 -46
3561 -46 35 122 33 -80 -4 32 -37 -60 36 51 -43 21 39 -25 -61 37 60 -35 -8 95 51 -82 -45 28 -17 -61 10 66 22
3590 22 0 45 12 -62 -34 32 -40 -34 49 82 -61 -68 50 18 -58 19 103 15 -74 8 28 -38 -64 19 30 -12 58 97 -13 -67
3620 -67 10 8 -44 -54 61 67 -9 -9 80 12 -78 0 41 -6 -6 21 25 -68 2 45 -33 -59 58 53 -42 -25 68 16 -75 -34 82 23
3652 23 -28 44 62 -23 -47 26 14 -63 -4 42 7 -51 42 45 -31 -65 78 39 -36 -12 47 7 -59 -11 20 -6 -13 31 16 -45 48
3683 48 44 -44 -88 24 44 -43 1 81 20 -56 -15 40 -34 -61 26 56 -36 -62 35 10 -40 25 50 -11 -68 24 40 -48 -49 62
3713 62 50 -28 -6 52 -19 -48 11 6 -5 -7 54 9 -30 15 16 -32 -39 60 52 -28 -41 55 19 -93 -14 33 7 4 26 -5 -69 -42 38
3746 38 -12 -36 40 51 -29 -41 46 34 -61 -35 35 14 -49 11 60 -6 -39 17 25 -13 3 52 9 -32 -5 40 -40 -62 33 23 -6
3777 -6 25 47 6 -26 -7 27 -23 -36 5 37 -15 -15 36 -5 -47 28 45 -45 -34 51 45 -75 -13 57 27 -42 10 69 2 -51 46
3808 46 58 -41 -10 46 1 -13 40 60 -67 -58 20 -4 -36 -25 23 26 -9 18 70 2 -41 30 36 -30 -16 23 -22 -33 4 12 -25 -31
3840 -31 53 75 -6 -1 70 -7 -47 -21 -9 -14 -20 34 53 16 9 18 -17 -60 -10 26 -35 -17 51 7 -56 -8 37 -31 -22 29 52 -27 -9
3873 -9 -11 -50 -58 -22 51 8 15 50 72 -16 -42 11 -31 -76 -8 35 21 -43 -18 58 -26 -30 21 63 -23 -35 27 -17 -72 -48 -14 -4 -37
3906 -37 55 81 42 22 30 -29 -67 -57 11 -8 22 59 42 0 42 26 -55 -32 19 60 -10 -15 31 24 -92 -13 27 22 -11 83 58 -28
3938 -28 -29 -1 -36 -75 6 44 39 -11 20 10 -49 -68 -19 32 11 6 41 18 -36 -26 -11 -9 8 52 29 17 23 -6 -26 -67 38 33 35
3971 35 43 66 24 -32 -22 -5 -22 -22 53 41 28 4 -8 -12 -73 14 42 32 -10 33 45 -56 -43 -10 -10 -22 -20 24 35 -36 -16 6
4003 6 -17 -70 1 59 4 31 37 1 -45 -51 21 18 -19 18 20 23 0 8 -26 -28 -30 11 3 10 46 -10 -44 19 23 -14 9 80 49 -9 -29 10
4039 10 -28 -61 22 50 65 -5 16 20 -58 -42 24 20 9 -2 30 -3 -60 -17 14 -11 -4 9 45 -8 -29 -23 -39 -37 -29 -5 19 14 39 -5
4073 -5 -47 26 19 1 -29 43 25 0 -32 27 -15 -7 12 48 29 30 31 7 -35 -62 57 13 -46 29 66 23 -50 10 9 -51 -29 37 35
4106 35 -38 -17 15 14 -47 -33 5 -10 11 45 25 -15 -56 -38 -3 -37 1 65 55 22 -14 -36 10 -4 -10 10 42 36 12 13 -23 -12
4138 -12 -11 9 9 53 -7 -18 46 12 -63 -25 35 34 -9 26 62 -5 -53 -33 4 -12 -27 46 35 3 -53 7 -10 -68 -34 28 54 -8
4170 -8 28 26 -60 -62 -37 -4 7 -17 36 48 16 -18 -15 -21 25 12 9 30 42 12 -22 8 17 -20 0 21 67 -11 -7 31 -11 -60 -21 49
4204 49 15 -11 28 38 15 -42 -12 34 -20 -43 19 69 -59 -42 21 8 -41 -36 36 27 2 -21 32 5 -27 -42 -1 26 -18 12 9
4235 9 -18 -7 -29 -20 -38 3 -32 21 38 5 20 -3 11 1 -28 43 0 -12 23 44 15 -34 -39 22 17 -47 21 76 -3 -30 19 39
4267 39 -14 -18 34 42 18 10 2 49 -22 -30 12 11 -11 6 13 0 -22 0 45 -23 -27 10 37 18 -31 4 6 -31 -43 -6 45 9 9 -17 10
4302 10 8 -11 -37 30 9 -11 16 43 39 -52 -13 9 10 -51 -13 49 -22 -3 16 33 -21 -21 0 44 -34 -32 1 15 -65 -67 45 -16 -38
4335 -38 2 51 6 -45 18 -13 -33 -19 10 -1 -8 -42 0 -5 -7 -19 -13 5 9 17 26 -11 -24 -21 -37 -14 14 8 4 36 10 -9 -30 -8 -10 -34
4371 -34 -11 35 1 -33 -1 21 -17 -43 -3 35 1 -12 9 -7 -33 -16 10 33 15 23 39 0 -13 -25 -2 -20 -31 1 10 -5 -1 21
4403 21 -11 -8 -6 -4 -15 5 12 -4 -40 -42 -18 -24 9 17 13 23 -4 6 -37 -16 -19 -9 7 23 52 11 -22 -13 4 4 12 3 -4 -3 -8 -37 -44 -52 -3
4442 -3 51 33 12 67 5 3 -27 -34 14 -28 9 54 30 4 -19 -7 -9 4 24 17 14 -22 -31 -33 -47 -28 5 21 66 10 22 -1 -35 -14
4476 -14 -37 -17 -2 26 34 27 23 14 -23 -12 18 18 14 55 3 -23 -20 -33 -6 0 20 64 22 5 -4 -40 -62 -39 -13 29 14 16 16 -8 -17 -32
4512 -32 24 -28 -19 15 27 15 -15 -5 -30 -42 -10 21 48 29 28 -6 -65 -79 -10 -17 11 10 39 46 20 -38 -34 -13 0 -7 13 29 22 18 -11
4547 -11 -52 -17 14 -4 56 45 -5 -3 -3 -11 -57 -15 50 50 43 -5 44 -2 -39 -23 47 13 -8 22 18 -19 -30 -7 19 -22 21 51 0
4580 0 16 12 -49 -27 -20 6 9 30 43 17 21 -8 -30 -1 -18 4 27 45 39 34 -18 -57 -3 -26 44 -6 25 47 11 -23 8 13 -2 -25
4614 -25 25 -8 -18 -7 -15 -5 -27 -14 19 12 -14 16 3 -24 -46 -17 1 -41 -4 49 10 -28 9 6 -25 -27 -3 23 -2 -11 -3 -2 -25 -6
4648 -6 -3 32 24 16 -4 6 -20 -22 -28 -13 33 21 14 -2 3 -10 -25 15 13 -39 -11 1 10 -38 -26 0 -6 -20 3 42 -19 -25 -21 26 -17 -22 14
4685 14 24 -14 1 59 20 -19 -10 16 -3 -14 0 17 -36 -6 33 7 7 14 -6 8 10 6 0 -9 -32 6 5 -19 17 43 1 8 1 2 -32 2
4721 2 13 -15 -3 41 25 0 -13 49 7 -35 30 12 -9 -36 26 30 -23 -24 10 31 -24 -19 4 -26 -29 -10 60 2 -40 19 20 -19 11
4754 11 3 1 -16 20 -4 21 5 19 25 1 4 37 29 -32 -13 3 8 -9 30 1 0 13 19 -36 -3 -2 -20 -1 10 58 5 -20 -10 56 -9
4789 -9 -20 -9 36 9 -17 16 15 -26 3 38 24 -8 -1 13 -8 -3 26 -7 -17 -5 8 17 -39 18 -13 -7 -35 3 12 -2 29 21 -20 -14 5
4824 5 25 -16 18 27 4 -15 10 22 -27 -12 17 -15 5 -1 44 10 -23 -16 0 16 -6 22 2 -35 -31 21 17 -40 -3 37 1 -3 -16 3
4858 3 -40 6 0 13 -27 -3 10 5 -44 -14 26 -41 -2 9 39 -11 23 -1 -1 -29 18 21 9 -10 -11 25 -42 23 36 -13 -8 19 18 10 7
4893 7 -4 -4 -13 24 40 2 -13 47 12 -45 -24 36 21 -8 -2 50 -20 -26 8 -23 -5 -15 25 48 -14 9 17 12 -13 11 19 -21 21 45
4927 45 17 -49 16 3 -17 -5 20 33 -11 21 18 -4 -29 5 6 -3 -5 26 19 -26 -48 2 -9 0 -15 -9 -3 4 -14 13 -40 -32 18 15 -12 16
4963 16 25 -8 -57 -8 15 -1 6 42 44 -2 -6 19 -24 -14 43 2 13 -5 25 27 -13 -1 -15 10 -31 35 24 23 -14 6 -10 4 23
4996 23 12 1 15 -13 -14 -8 -13 16 11 -12 -24 28 -26 -4 3 -5 -23 7 5 -5 -4 -16 13 1 -29 14 54 11 38 28 -15 -20 -22 20 -29
5031 -29 -20 31 26 -11 -1 23 1 -25 -6 8 -10 -9 5 26 -16 -8 -7 7 19 -3 10 0 3 11 -3 -15 -16 3 25 -2 -12 9 -7 -4 -41
5066 -41 16 -10 3 7 -8 -7 4 27 -21 19 -24 11 -2 -10 -4 0 -2 -2 24 31 12 14 18 9 -4 -29 -13 -2 0 24 12 -12 8 -8 11 -12
5102 -12 -8 9 -15 -18 -1 -2 -15 -10 -3 -12 -1 13 23 -21 -12 -17 -25 -11 -26 -6 -27 -26 -11 13 -29 -5 7 -2 -8 6 9 0 -29 35 -14 12 -7
5139 -7 -7 -19 -1 13 29 -2 -36 29 -1 5 32 15 8 -40 -6 0 -20 33 37 10 2 -8 -13 17 -25 -4 4 -6 -10 34 5 -11 -15 -32 5 -8
5175 -8 3 -6 -24 1 -18 4 -22 -1 0 -21 -10 -13 33 -12 -15 27 11 -24 -3 36 9 -14 7 16 -54 22 6 -13 -46 -9 -14 -9 15 14 -10
5210 -10 -12 8 5 2 -19 -2 13 -18 -24 36 -1 -16 4 4 -8 -42 28 29 -11 -26 -2 -16 -30 6 5 4 -9 14 39 -14 -31 -13 -18 -11 -20 0
5246 0 6 -9 1 -1 -14 -24 -6 -18 -9 -10 -2 38 16 -3 39 -16 -7 -28 6 -43 24 3 7 -10 -14 26 -7 10 -7 -10 -24 -16 18 -4 -14 15
5282 15 0 0 1 8 -19 -1 -2 -4 -20 -4 4 3 -9 -11 21 -18 1 -19 16 2 -37 -9 -6 -13 -18 4 2 -24 -17 5 23 3 38 1 17 -25 42
5319 42 11 23 1 -1 5 15 10 40 8 -3 5 4 -11 -1 -9 -1 16 25 3 3 2 -18 51 -19 -1 13 -7 11 15 7 -2 -4 11 -13 -10 1 12 -11
5357 -11 -14 2 -4 17 7 2 8 -9 -5 19 -4 -22 23 24 1 -2 -1 -8 4 19 26 3 -5 -3 6 11 -42 6 1 -27 -9 14 15 11 6 8 -20 -12 19 -16
5397 -16 -16 1 -2 -32 -3 1 -6 -20 -16 -6 -6 -10 -3 -23 -23 -30 -8 -15 15 -25 -23 12 12 9 0 5 -20 9 33 -6 -10 22 4 1 -3 26 3 4 -17 -8 18
5438 18 8 21 -11 -21 -10 19 -12 0 -1 -23 17 -23 6 -3 7 23 -22 -11 22 28 14 -11 -14 -15 14 -33 1 27 8 -18 3 3 -10
5471 -10 -18 -10 -21 10 1 3 23 -21 8 28 -23 -8 -22 10 -6 24 37 9 24 20 13 5 -23 5 -20 9 5 -28 7 2 7 11 12 1 14 -26
5507 -26 -23 22 19 2 2 -15 32 14 15 7 6 21 -29 8 3 -19 5 29 -11 -1 23 43 0 7 39 0 -5 -7 -5 12 -14 -7 4 -29 9 -11
5543 -11 18 -16 3 17 -18 -13 11 -12 -3 7 12 5 0 1 -16 1 -6 14 8 -4 -3 29 -16 8 -7 -9 -14 -23 13 -8 -16 20 -18 -2 -5 2 -2 -4 -3
5582 -3 -23 -17 22 16 -14 -11 -17 2 14 -12 1 -3 17 -2 -5 -17 -8 9 2 14 19 11 -17 13 -31 0 9 -3 -27 -23 -21 -1 -6 -11 -10 -11 43 9 10 -1
5622 -1 -31 9 28 -5 -25 -17 14 13 28 -8 -4 7 -13 2 40 -37 -17 13 -19 7 14 2 5 -18 13 -5 -15 8 -12 -1 12 -13 -21 3
5656 3 3 5 15 14 4 -3 -33 18 22 6 18 -16 -2 19 26 17 -9 19 -15 -21 11 -14 -7 -12 -11 -6 -14 22 -39 11 -16 -3 20 -3 21 12 -2 9
5694 9 4 14 -15 -8 -7 30 29 -5 12 0 9 17 7 6 7 -2 -13 9 -31 -16 8 -18 24 28 23 20 -6 28 -2 -5 -7 5 1 -40 26 0 -15 12
5732 12 -16 -17 12 -11 23 -23 -10 12 -23 23 3 14 -6 -34 -28 14 -1 4 5 -2 -22 6 30 -17 -31 -14 15 -33 -4 -10 24 -14 1
5765 1 -5 8 -13 -17 -18 -10 -5 -10 7 15 -4 20 16 0 -5 5 0 24 28 -28 8 -17 -21 -12 -28 20 0 -1 17 -21 -19 2 -4 -3 12 -2 -32 -15 28
5804 28 4 -11 -2 5 14 2 -13 12 -24 13 17 -11 -1 -20 -1 20 -3 -18 -13 -1 13 -19 -24 16 -17 40 12 -44 15 -26 -19 5 6 17
5838 17 -24 -11 -12 -9 -11 19 10 18 -19 -9 4 -35 8 14 10 22 8 -10 -7 6 -11 7 -8 15 25 -15 -6 10 -10 -35 11 -16 -23 12 -3
5873 -3 -1 0 -4 0 -30 1 -19 7 -27 -24 -4 -24 9 15 -10 -15 22 -14 -3 -18 15 8 -22 2 2 -4 -14 -1 20 -8 -15 -29 -23 0 10 -6 26
5910 26 41 -6 -19 -20 -7 20 10 14 -11 21 35 46 22 10 19 3 -35 -3 15 11 -8 -17 -10 17 3 -14 -3 9 20 -19 -10 4 12 9 -6
5945 -6 -2 10 -13 -14 -28 40 7 0 -15 2 -8 27 13 0 -9 7 -4 13 4 -15 1 31 12 -19 4 -2 -12 0 14 11 3 -16 0 31 0
5980 0 38 -2 5 -3 24 5 -15 25 -7 7 31 -3 10 5 -20 -17 -9 -1 14 -7 -19 7 17 14 -20 -1 9 18 0 1 14 -6 -1 15 29 -19
6016 -19 -12 -10 -16 17 -4 11 -11 -21 -17 6 8 12 6 7 -2 6 -10 7 13 4 4 2 15 -10 14 3 -33 -21 5 17 15 18 -9 -16 -5 -16 11 -16 8
6055 8 -17 21 16 1 34 1 -4 -7 -18 -4 12 24 10 15 12 -28 18 -20 -36 17 13 20 2 6 -29 8 3 31 3 8 14 -27 3 1 -8 -21 4
6092 4 -12 3 -12 15 8 -10 -21 34 18 -7 0 -3 30 -21 -4 25 15 -5 -31 -18 8 -6 3 4 -32 -3 -5 15 18 21 5 -17 0 -5 -2 -5
6128 -5 -6 25 7 22 -12 33 -24 -2 6 -3 18 -22 23 5 9 -4 -9 10 4 11 14 -20 -1 9 14 5 -13 -6 24 7 32 17 -36 -10 2 -6 14
6165 14 -6 -11 -6 13 -7 -25 -20 -5 -6 -13 9 -22 -16 16 18 12 -34 23 14 7 6 -20 37 -38 -19 -29 19 -5 -9 6 18 5 -1 -12 -4 6 10 10
6203 10 -7 20 8 2 -4 -8 -3 17 -11 -6 9 17 -36 22 -13 3 -13 -7 -29 1 -12 -4 9 3 9 -37 -10 -11 3 30 -18 -2 -11 -37 -13 1
6239 1 -19 -4 -12 8 11 3 -12 -2 0 -10 25 6 2 -6 4 7 0 15 -23 5 15 9 8 -5 3 23 21 18 -33 21 17 5 28 4 -4 -4 35 11 -15
6278 -15 3 3 45 13 -14 12 17 14 0 16 6 5 17 -15 5 -12 14 36 1 -21 -13 -3 2 10 13 -3 17 -18 -5 -25 -11 9 -1 -16
6312 -16 14 23 7 -10 3 28 7 2 -2 21 4 20 20 20 24 0 -3 -26 -19 4 -7 -13 23 11 -9 1 -12 -23 3 4 -3 7 -7 7 -19 -8
6348 -8 2 14 -18 -23 18 -19 2 -6 23 -29 -12 -3 -12 11 -8 1 5 -21 8 -27 30 -15 -5 14 8 -12 11 4 -16 13 4 -7 -15 23 23 -3
6384 -3 6 18 -12 17 22 11 36 -15 -19 1 -4 -19 -11 4 3 2 -23 -15 8 10 -14 -21 -7 22 6 -9 -15 -32 -22 -2 -8 3 -14 -7 -7 30 19 6
6422 6 2 -17 -13 2 24 40 22 10 2 11 5 -5 1 20 -3 2 -14 -13 17 -2 -12 -33 -2 -5 -3 -11 -5 3 4 -19 -27 -21 12 0 -39 1 -5 -14 14 -9
6462 -9 30 3 -28 -13 -18 11 -11 -4 -23 11 -6 5 -25 -12 14 3 -3 -11 20 -17 -17 -2 13 -4 17 4 12 1 16 -24 -16 -2 23 0
6496 0 -13 -1 2 -10 21 -7 20 3 6 14 -5 17 -28 12 -5 -17 -7 -10 -26 -6 39 29 12 -7 -6 -25 36 3 4 3 -7 -26 1 13
6530 13 -25 -6 -14 1 -6 -12 -15 0 -31 10 -7 16 -4 -8 -11 -34 3 -6 -5 31 4 21 18 17 -17 13 20 -4 12 -6 6 -6 -3 4 -5 -5 -3 -23
6568 -23 -16 9 10 8 -2 22 -16 12 -3 3 10 11 -6 17 -4 -10 -11 19 31 4 15 -29 24 -24 27 -21 7 -20 -1 6 1 9 6 -9 -9 7 17
6605 17 3 -1 -27 14 22 -1 11 7 38 -1 -10 25 12 -5 13 -25 12 4 -10 7 -19 -4 5 18 -20 -3 -10 -5 5 -16 -28 12 -21 -13 -8
6640 -8 -21 14 -12 -17 15 11 -1 4 1 -7 1 -22 -26 0 -5 -25 7 14 -40 -2 18 11 21 -3 1 -13 -21 -1 -22 0 12 24 -12 -5 7 8 11 5 -14
6679 -14 5 1 26 6 -16 2 10 5 5 20 1 -27 -11 22 -6 -6 5 -21 11 -15 -29 8 17 -31 -7 7 2 4 -16 10 -17 -13 16 18 -2
6714 -2 -6 -13 -12 -19 6 0 16 -38 25 -9 -21 1 18 -1 17 -16 -10 9 -28 -3 -26 16 -2 -6 -10 2 -42 -8 19 18 17 -10 -27 23 25 6
6750 6 -7 8 -44 9 -9 18 -15 -23 16 15 -4 -24 1 3 -5 -11 2 12 -13 12 13 -16 -23 12 19 10 -1 -26 -17 -15 25 27 1 19 -21 -19 -16 5
6788 5 40 -15 5 23 -15 -25 5 -2 11 17 -12 28 -17 17 -22 -20 5 9 -1 -32 26 4 14 -16 -7 -1 -4 -20 20 -13 23 7 -3 0 6
6823 6 -28 -5 3 -33 -24 -11 20 5 -15 -9 -22 -17 20 -3 -1 11 -7 17 -5 19 29 19 1 -8 14 12 6 -21 -19 11 -4 -26 -24 3 0 -19
6859 -19 5 -30 12 -24 -14 -24 28 -19 7 20 -1 3 -4 24 -20 5 -24 17 -2 0 -15 2 -2 -32 3 -16 17 -19 -13 23 3 -2 -38
6892 -38 5 13 17 -33 -30 4 0 -15 10 17 -24 -9 0 22 2 11 13 -6 32 23 8 -15 -16 0 1 -1 23 3 -12 -4 -13 -4 22 -5 -26 -16 -7 -2 -5
6931 -5 -8 -13 16 6 12 -25 -7 10 25 -6 43 -13 -16 -9 -1 9 -8 -23 17 -23 3 -7 0 0 -21 7 -11 -16 -1 16 20 -7 17 17 -3 41
6967 41 -17 -10 21 -35 -19 16 3 11 15 -17 48 5 -37 1 -13 5 -29 -17 7 7 7 -19 20 -32 -30 12 6 -29 3 4 0 9 -11 -9 -10 9
7003 9 3 -3 19 13 -21 9 2 5 -22 7 19 11 23 0 -4 26 -3 9 21 18 -10 0 18 1 13 6 2 39 8 -19 24 -10 19 17 -10 0
7039 0 -14 -37 -6 -8 -10 28 -31 -2 -2 -19 -10 -1 -20 -18 9 21 9 3 -3 -11 -5 -8 14 23 -6 -4 -11 -9 -11 22 14 14 -21 6 22 2 9 22 -16 25
7079 25 5 26 0 -15 38 -6 10 24 20 9 2 44 35 23 -16 -31 -1 20 28 8 -16 13 17 3 -4 -1 14 -18 -12 15 -5 32 11 -33
7113 -33 -21 -9 -30 -15 11 13 -7 16 9 -5 -17 30 -3 2 19 -7 11 10 -3 2 2 21 14 16 20 9 8 29 2 32 13 4 -16 17 7 3
7149 3 12 -14 32 6 12 12 -4 0 24 7 18 -12 5 -4 -22 -7 -21 -2 1 -17 -3 18 -9 15 22 -7 7 -4 10 -2 18 20 -11 -21 19
7184 19 24 -8 5 8 19 8 12 -16 -32 2 -2 -12 4 -5 8 10 16 -12 38 -7 -4 12 -34 17 -33 18 12 14 -4 42 41 -11 -15 7 -16 25
7220 25 -3 7 -1 18 -11 13 -6 -2 4 -5 -1 0 -3 18 -16 -13 11 -6 3 -37 -13 -9 -4 6 -12 -32 3 10 -19 37 18 3 12 -2 5 -36 14
7257 14 -17 17 16 37 28 9 6 1 18 4 -12 12 29 9 -13 -2 -24 14 15 2 -5 4 -4 5 -15 -11 0 -20 -9 62 38 38 -16 -4 -4 3 21
7294 21 5 -14 -18 18 22 11 -8 0 -7 15 6 -28 -7 3 -1 -22 14 -10 8 12 48 8 16 7 2 6 8 -19 5 30 -1 -6 15 20 -14 -25 7
7331 7 -7 11 28 -6 10 7 13 8 -12 -1 8 9 -4 6 13 -4 -10 -35 -3 -25 -5 1 2 -37 -8 20 19 -10 -14 5 5 -1 -6 -13 5 -19 5 8 15
7370 15 8 -2 -7 -6 -13 18 -11 13 -7 -16 5 6 34 -18 20 24 18 20 7 11 16 11 0 11 14 -2 -6 -25 -24 -16 -2 11 18 22 -17 14 7 -1 7 -24 14
7411 14 8 -12 6 24 -4 -13 -10 11 -9 -3 8 -19 35 2 17 19 -23 26 -8 3 5 13 -7 18 11 -17 -4 32 20 26 -20 32 18 -22 2
7446 2 3 0 -1 5 7 -19 -16 -26 4 -3 -45 -21 27 8 -13 14 15 -2 -7 0 10 8 6 -9 -7 -29 0 23 29 -6 -9 -18 11 11 7 -5 -4 9 25 13
7486 13 -4 -6 6 -5 0 5 -23 8 16 12 9 -4 -14 9 -14 -1 27 37 7 7 24 -3 -1 29 8 -4 -25 14 -16 -32 25 26 5 -16 0
7521 0 -36 -6 16 12 -22 -23 30 9 -21 6 1 -5 22 2 -29 0 -6 9 6 -3 0 38 -16 -46 0 27 10 -2 8 -11 -13 10 -4 11 -7
7556 -7 17 11 28 -1 9 5 3 -14 3 -11 -18 24 -10 -18 -21 -3 1 27 -22 -10 19 -10 -28 -8 -27 9 -9 10 1 10 35 1 25 0 -28
7591 -28 8 -3 -14 -6 -19 -11 -32 0 -21 14 17 -19 7 22 -4 11 62 22 10 2 10 24 -10 5 -2 5 7 10 -28 -6 2 16 -18 5 27
7626 27 7 -36 0 -15 -17 -6 3 -13 -5 2 -32 25 -16 4 15 4 9 2 17 51 2 -26 -2 -8 11 5 12 5 36 12 23 9 -33 21 2
7661 2 1 12 22 41 14 6 11 -14 15 -1 -5 2 12 3 -3 -5 1 9 7 -12 1 -27 47 -21 -24 12 17 -6 19 -8 -21 -23 10 9 14 4 -3 -13 -12 -2
7701 -2 -17 1 9 -9 25 12 -26 -12 4 5 -14 -20 -1 6 -13 5 -10 -29 1 27 -8 3 28 2 7 2 -17 1 -19 17 -2 -20 -10 11
7735 11 17 7 22 -5 -16 5 -14 17 -7 -16 7 5 11 -12 8 -5 -14 -17 -23 -8 -9 -23 -4 10 -7 32 26 -2 -7 -13 -19 -11 -34 -17 -5 -5 -3 -9
7773 -9 25 17 -2 4 -10 -3 6 8 3 14 18 -5 17 27 29 1 -4 12 -36 6 -3 25 -18 0 2 -5 10 -6 -13 1 -6 20 1 9 23 -20 12 -7
7811 -7 -16 35 4 -24 -11 -22 2 -19 27 -35 19 -5 13 3 -5 -3 8 -17 -8 13 -18 26 7 -5 -25 -40 -26 -11 4 -19 -26 4 2 -6
7845 -6 0 1 -16 -8 10 4 7 -2 22 -14 -4 -5 -1 3 8 0 -4 -42 12 -4 -16 1 9 -24 11 -5 -8 -27 2 -9 1 7 0 8 3 -11 2 18 1 -19
7885 -19 -2 16 -24 20 -11 -24 13 2 20 25 -2 24 -15 -15 -6 -11 -5 21 -3 22 -13 17 8 -27 0 -8 -11 4 -11 17 19 -26 -24 4 27
7920 27 7 1 -1 40 -12 35 11 -10 -1 -25 10 -7 -3 6 -16 -26 -20 -10 17 -23 14 -29 13 9 -10 -6 -5 1 19 -2 4 8 7 -28 -7 0 -23
7957 -23 -4 14 8 -1 -31 -24 -17 -42 9 9 -20 -9 -17 8 2 -3 29 10 -24 -11 -1 3 7 27 -22 3 12 -17 10 -14 3 -3 8 9 -26 1 22
7994 22 10 12 -14 1 11 -13 -12 -3 5 -8 8 6 16 27 10 -16 19 -6 4 20 33 21 12 -4 -16 -10 26 8 0 0 26 16 8 18 33
8029 33 7 3 12 -11 20 1 19 3 29 11 -13 24 10 19 4 11 -12 -36 22 4 -7 14 8 -15 -1 10 13 -18 -3 -14 -18 -15 16 12 -8
8064 -8 -17 -18 11 13 10 25 -4 -7 2 -8 16 16 3 29 4 -6 12 10 -22 5 -2 -8 13 25 16 21 -5 20 -22 -1 27 27 -34 1 1 11 27 4
8102 4 -4 31 29 -6 12 6 0 -29 0 7 -13 4 7 10 9 17 -21 17 35 8 5 27 -5 8 39 -20 -5 11 10 11 -4 24 7 0 8 18 -21 8
8140 8 -18 17 0 -6 -8 -22 6 16 25 6 9 -5 -15 26 23 -10 -7 -20 1 3 -6 -29 3 17 -6 -13 -30 22 31 34 -9 -12 28 7 -13 29 -12
8177 -12 3 14 31 10 -6 2 33 5 18 0 25 25 17 12
8191A2
$$ Imaginary data points
##PAGE= N=2
##DATA TABLE= (X++(I..I)), XYDATA
0 0 0 0 0 0 0 0 0 0 0 -8 8 -8 8 -8 16 -16 17 -24 25 -32 39 -42 49 -57 66 -76 89 -98 113 -129 144 -163 181
33 181 -203 228 -253 281 -312 346 -385 426 -472 522 -578 641 -710 790 -878 981 -1098 1236
51 1236 -1403 1607 -1861 2187 -2631 3264 -4250 6011 -10082 38341 -27401 -96818 45796 53097
65 53097 -73247 -73116 65676 56833 -44766 -22516 60574 9952 -58266 -7422 44810 -8318
77 -8318 -30129 27587 32813 -35640 -38924 16026 14091 -26875 -6957 40590 34209 -7395 -20270
90 -20270 -5332 3209 -14160 -33839 -10646 39790 33139 -23645 -19564 39199 20429 -54125 -31439
103 -31439 51287 28101 -46697 -12432 51328 -1943 -61765 156 49463 -12043 -31239 46488
115 46488 45954 -45905 -38498 42435 7155 -72902 -11798 77804 15585 -59784 10969 68727 -17370
128 -17370 -71941 10147 53289 -17951 -40619 25501 34084 -24845 -26725 15340 8390 -14235 6826
141 6826 21195 -3150 -9875 7581 -3256 -24201 -7391 14806 4468 -3353 9860 9645 -3609
154 -3609 -2878 -3516 -14168 -1964 19258 1093 -21230 7954 29537 -13475 -37122 14055 37312
167 37312 -15352 -29963 25917 30973 -28499 -29511 22991 15072 -26891 -4855 31879 3245 -23526
180 -23526 8421 18686 -21386 -20252 24309 15267 -26453 -6707 31602 2127 -33890 -1258
192 -1258 28600 -3609 -22785 9760 19780 -10896 -14769 7648 2566 -10601 4611 12310 -6859
205 -6859 -6600 13405 1758 -21880 -3731 20920 956 -17500 7290 20321 -7999 -18664 5857
218 5857 9448 -10018 -3907 13955 3430 -9132 3743 6681 -12011 -8842 13638 7888 -11792
231 -11792 -289 16452 -1423 -18542 -1447 11236 -2992 -6571 9178 8798 -4827 -2744 1867
244 1867 -8030 -7812 7864 5921 -7968 1804 15801 -2087 -19336 -532 13434 -6502 -13107
257 -13107 12137 16230 -9556 -11265 8974 1926 -16594 -2181 16593 1766 -9815 8773 12521
270 12521 -13357 -16109 9364 8635 -13274 -3852 20412 8570 -15330 -5125 11431 -2661 -15280
283 -15280 1845 14517 1531 -5753 4453 4725 -7388 -7484 2120 2329 -1144 3409 6392 725 -3676
298 -3676 -2678 -2640 -3133 -898 1341 3309 5682 2571 -4728 -4034 1632 -2780 -8992 1255 12560 2807
314 2807 -7884 2439 8777 -7807 -15257 3388 11441 -4338 -6045 12136 9882 -11567 -10127
327 -10127 7563 2219 -12232 -251 16271 4093 -10430 1158 9310 -7143 -14233 4205 12082
340 12082 -2338 -5023 9441 7979 -9402 -10240 3443 3358 -5852 -920 10241 6313 -4492 -3980
354 -3980 1263 -2167 -6864 -1757 5964 5184 72 -133 1952 -1631 -7332 -5071 2748 4109 -206 1524
370 1524 6511 1452 -8319 -6374 2051 148 -4769 2921 11216 3149 -6783 -1759 2942 -5807 -9053
385 -9053 3765 10209 696 -2522 5830 3561 -9296 -8481 3740 3817 -3497 2109 10690 2898 -8103
400 -8103 -3893 2391 -3422 -6386 3941 9882 1964 -3129 1548 1155 -7050 -7150 2016 5111 818
415 818 1191 5108 1703 -5856 -6182 -957 366 -1108 1875 6238 4014 -2523 -4272 -1699 -2060 -4131
431 -4131 -550 5986 5568 -200 -1205 1082 -2368 -7124 -2828 4786 3815 -288 2709 5160 -1988 -7754
447 -7754 -2404 2698 -959 -1568 5918 6996 -1831 -4946 432 -71 -5586 -2085 6409 4987 -1566 -92
463 -92 3046 -2467 -7057 -1475 3889 901 -595 3889 3732 -3004 -4971 -633 15 -2447 212 4731
479 4731 2954 -1520 -1623 -286 -2239 -3399 -132 3085 2343 589 507 186 -1835 -3180 -1661 1211
495 1211 2177 1205 1161 1837 -91 -3316 -2601 866 1090 -486 1775 4207 496 -3727 -1293 1517 -1773
512 -1773 -2887 3193 5324 -878 -3159 1861 1379 -4974 -3236 4651 3681 -2702 -607 4190 -711 -6503
528 -6503 -1452 4016 69 -2380 3356 4533 -2752 -4769 570 614 -3828 -898 5146 2847 -2408 -726
544 -726 1805 -1947 -4334 175 3571 1180 -404 1343 796 -2419 -3011 -903 826 1820 2444 2156 1178
561 1178 -23 -2260 -3702 -1885 767 988 1352 3548 2810 -1346 -2407 -226 -1262 -2955 1046 4837
577 4837 1011 -2733 663 1564 -4640 -5084 3332 5537 -804 -647 5243 1439 -7644 -5532 1982 2
593 2 -3586 2846 7800 1319 -3746 462 1026 -5279 -4228 3720 3659 -2157 -295 4075 -748 -6239 -1402
610 -1402 4277 1517 -868 3294 4435 -1473 -5106 -2969 -1312 -1525 266 3178 4167 3555 1511 -1850
626 -1850 -3100 -1595 -1384 -2224 440 3851 1966 -1361 -402 534 -2202 -2030 2582 3178 -362 405 2479
643 2479 -2398 -7065 -2213 2829 -820 -1890 5737 7568 -1367 -4894 810 512 -6335 -4328 4009
658 4009 3690 -1600 404 3757 -612 -3959 439 2591 -1100 -528 3797 1106 -4727 -2677 1819 -935
674 -935 -3312 2378 6580 2101 -1656 676 828 -3449 -4266 -701 996 859 1880 1921 266 179 585
691 585 -1530 -2378 892 2408 -671 -1781 805 419 -2708 -1901 1370 1346 542 2167 1815 -1545 -1714
708 -1714 276 -1992 -4261 309 4368 422 -2464 2449 4222 -2335 -4754 1312 3109 -2254 -2498
723 -2498 2734 2211 -2491 -1455 1929 138 -1477 1667 2549 -1125 -1156 2080 149 -3905 -1180 3282
739 3282 784 -2495 874 3821 7 -3037 -247 1627 -744 -1528 481 877 -145 189 99 -1104
755 -1104 -295 1406 69 -1748 223 2057 -460 -2454 -67 1618 -424 -1393 490 1099 -128 -245
771 -245 19 -688 -179 1073 -173 -1746 484 2459 -390 -2547 673 2767 -760 -2601 978 2477
787 2477 -926 -1837 1202 1463 -976 -520 1198 -56 -1111 772 1086 -1444 -933 2118 983 -2329
803 -2329 -858 2518 576 -2781 -666 2561 567 -2175 -319 1802 82 -1518 -312 636 -158 -311
819 -311 171 -217 -309 615 338 -1042 -485 1139 498 -1195 -597 990 380 -988 -524 673 682 77 -14 102
839 102 384 511 -392 -1175 -138 997 -20 -1107 426 1821 434 -1050 133 1199 -167 -1230
855 -1230 -177 384 -397 -338 372 68 -168 851 848 -623 -589 1019 397 -1903 -1410 1034 435 -1730 -587
874 -587 2054 1295 -1010 -219 1477 121 -1835 -947 258 -560 -1039 373 1055 146 242 1266 608 -784
892 -784 -332 679 -371 -1567 -512 863 -42 -961 385 1767 1011 -172 309 972 9 -1381 -1284 -352
910 -352 -115 -465 -54 1035 1482 789 83 204 216 -649 -1192 -642 -189 -565 -459 364 463 18 469 1141 459
931 459 -479 26 331 -1095 -2036 -579 492 -551 -621 1499 2208 259 -535 762 442 -1667 -1621 188
949 188 189 -910 -28 1408 620 -386 642 1286 -81 -689 519 426 -1268 -1311 223 204 -763 137 1785
968 1785 1316 -32 191 625 -501 -1502 -963 -144 -223 -204 399 756 476 173 50 -23 33 -130 -441 -361 -101
989 -101 -438 -791 -197 472 146 92 1014 1039 -266 -676 87 -289 -1493 -760 889 528 -513 480 1544
1008 1544 162 -1110 91 867 -540 -1061 579 865 -745 -785 707 551 -616 39 1197 466 -579
1025 -579 8 376 -662 -1004 69 426 -204 83 826 340 -413 -168 95 -441 -503 151 186 -288 -38 267
1045 267 -205 -384 163 258 -217 -12 470 6 -587 -142 161 -325 -370 474 526 -159 -26 438 -79 -569 -35
1066 -35 407 -173 -161 558 407 -426 -152 482 -81 -610 201 691 -143 -437 438 399 -630 -389 606 212 -603
1087 -603 70 702 -162 -733 145 440 -487 -436 559 367 -520 -229 482 -93 -712 -16 480 -204 -401 365
1107 365 343 -382 -245 329 -10 -386 18 400 -119 -244 176 153 -277 -36 343 104 -126 151 188 -147 -106
1128 -106 131 5 -143 201 276 -58 -39 302 -7 -350 83 325 -212 -325 353 262 -477 -261 509 79 -712
1149 -712 -13 653 -194 -706 251 620 -477 -670 481 527 -631 -457 671 302 -779 -266 726 60 -740
1168 -740 -6 700 -68 -572 160 528 -197 -456 239 437 -159 -282 182 321 -74 -228 116 330 23 -250
1188 -250 12 447 84 -396 -31 530 29 -608 0 653 -94 -717 174 687 -343 -776 412 678 -598
1207 -598 -699 653 547 -798 -500 837 297 -922 -212 879 40 -909 27 793 -209 -777 247 647
1225 647 -307 -520 373 509 -349 -377 317 294 -283 -200 266 289 -145 -197 152 308 -62 -294 85 461 -59 -452
1247 -452 161 527 -172 -593 322 670 -321 -673 494 696 -642 -653 715 457 -883 -421 958 265 -1027
1266 -1027 -121 1010 -94 -1096 171 937 -386 -943 458 778 -581 -676 594 528 -647 -432 614
1283 614 270 -531 -151 453 122 -292 -38 281 152 -47 -126 33 244 18 -279 -4 426 49 -443 42
1303 42 607 -129 -700 245 748 -385 -712 575 734 -687 -638 827 524 -975 -438 992 229 -1078
1321 -1078 -98 1020 -159 -1006 287 874 -385 -724 509 542 -626 -401 575 170 -579 8 526 -42
1339 -42 -387 183 254 -224 -122 226 -28 -146 163 90 -242 50 313 -174 -320 402 388 -511 -306 633 168
1360 168 -769 -40 815 -92 -755 361 763 -515 -704 596 529 -741 -357 866 174 -906 0 830
1378 830 -263 -874 367 694 -519 -573 584 404 -664 -229 638 50 -547 92 419 -291 -337 267 123
1397 123 -347 148 466 -152 -212 431 122 -583 -99 491 -184 -531 382 560 -436 -334 703 289 -761 -59
1417 -59 825 -230 -992 256 785 -561 -713 838 793 -690 -376 972 193 -1141 -269 718 -286 -878
1435 -878 326 807 -294 -416 649 392 -601 -205 400 -191 -677 41 297 -320 -185 539 303 -99 303
1454 303 452 -297 -359 169 -196 -748 -16 622 -117 -317 764 779 -480 -369 710 104 -1099 -323 708
1473 708 -260 -1008 352 1046 -233 -486 911 727 -832 -554 587 -173 -1242 -237 775 -96 -574
1490 -574 716 996 -247 -407 522 141 -870 -464 254 -259 -585 236 512 -21 106 631 299 -298 38
1509 38 97 -621 -642 66 -13 -449 233 847 209 -126 568 476 -621 -553 307 -166 -935 -86 770 -75 -478 680
1531 680 957 -345 -453 648 235 -1089 -582 507 -136 -892 230 1031 29 -336 667 633 -635 -619
1549 -619 303 -110 -875 -206 562 -11 -288 480 646 -112 -177 382 32 -554 -225 78 -361 -325 291 310 -121
1570 -121 308 614 -9 -343 128 109 -670 -432 318 34 -476 201 758 -32 -400 400 448 -554 -520 373 36
1591 36 -778 -160 611 16 -456 372 691 -214 -427 340 189 -667 -391 397 -20 -462 151 546 -77 -275
1611 -275 360 251 -392 -198 288 -51 -466 66 344 -180 -186 406 302 -242 -12 398 -63 -421 59 214 -254
1632 -254 -209 379 203 -298 13 412 -94 -382 144 231 -302 -264 293 116 -382 31 419 -120 -368 219 273
1653 273 -312 -258 329 68 -409 -12 429 -63 -371 195 316 -313 -259 287 156 -336 -51 401 -15 -318 101
1674 101 279 -218 -243 259 125 -289 -27 330 -11 -217 168 269 -186 -141 246 41 -268 8 247 -87 -237
1695 -237 190 221 -207 -129 249 5 -357 -31 245 -111 -296 167 200 -218 -134 230 53 -287 -43 242 -121
1716 -121 -268 121 171 -197 -112 244 126 -214 21 257 -123 -221 133 115 -205 -141 215 47 -184 98 236 -110
1738 -110 -174 174 149 -277 -93 236 4 -257 57 265 -102 -155 204 126 -231 -114 197 -18 -257 27 241
1759 241 -132 -197 180 154 -212 -115 194 13 -249 -2 193 -91 -185 113 116 -175 -88 160 32 -187 41 137 -59
1782 -59 -114 110 105 -119 -28 183 12 -128 64 112 -87 -49 159 66 -128 28 202 -72 -161 94 102 -180 -120 195
1806 195 36 -215 -32 226 -60 -225 115 166 -173 -209 198 120 -236 -40 234 -2 -221 43 156 -108 -179
1827 -179 105 84 -159 -81 124 19 -135 40 118 -69 -83 111 6 -131 24 108 -45 -116 101 106 -99 -5 167
1850 167 -18 -154 85 162 -88 -128 139 98 -181 -74 182 16 -180 66 177 -104 -201 87 124 -163 -77 151
1872 151 46 -197 3 156 -85 -160 87 77 -93 -84 157 -8 -170 25 116 -95 -117 124 95 -162 -44 182
1894 182 -23 -182 65 190 -98 -154 154 73 -156 -53 159 33 -173 59 204 -85 -159 146 120 -148 -28
1915 -28 156 15 -129 19 159 -102 -140 81 56 -140 -19 155 -40 -138 84 98 -139 -94 157 11 -175 -6
1937 -6 131 -65 -190 69 130 -144 -87 186 57 -186 3 246 -58 -214 123 176 -143 -125 199 73 -177 -11
1959 -11 230 -18 -200 95 194 -119 -113 180 110 -180 -51 218 -13 -194 46 176 -84 -121 124 71 -181 -77
1981 -77 160 -56 -133 46 117 -113 -68 125 7 -152 31 134 -116 -133 134 106 -187 -44 216 -20 -230 92
2003 92 189 -128 -178 173 150 -254 -100 298 48 -263 31 268 -67 -260 144 206 -196 -147 286 120 -205 -17
2025 -17 239 -26 -203 75 184 -136 -155 152 75 -206 -69 172 -15 -158 107 163 -152 -75 112 -30 -240 -10
2047 -10 145 -78 -106 204 133 -165 -41 210 -43 -190 85 205 -195 -199 210 92 -265 -13 316 43 -229 104
2069 104 267 -178 -266 155 127 -276 -80 364 112 -233 91 304 -103 -275 143 190 -272 -180 209 105 -254
2090 -254 -6 251 -5 -147 140 193 -178 -191 61 -53 -239 -34 171 22 -48 179 126 -149 -96 66 -113 -228
2112 -228 31 116 -135 -47 237 89 -200 28 284 -16 -256 114 179 -276 -260 218 132 -251 20 408 81 -282
2134 -282 35 224 -238 -367 97 178 -230 -119 297 133 -227 -21 249 -76 -217 67 157 -180 -147 104 58
2155 58 -199 43 208 -9 -92 132 71 -197 -136 55 -79 -190 86 180 -62 -46 197 67 -201 -54 174 -69
2177 -69 -235 99 159 -138 -106 203 133 -179 -3 262 26 -244 48 181 -151 -241 165 172 -159 -84 300 63 -248
2200 -248 6 150 -121 -216 113 140 -148 -79 183 1 -191 28 188 -58 -176 102 82 -134 -75 131 -18 -127
2222 -127 46 148 -58 -70 124 39 -172 -27 153 -67 -155 98 136 -98 -118 128 79 -180 -56 180 11 -174
2244 -174 67 197 -86 -124 135 87 -173 -84 160 15 -164 18 171 -57 -147 48 77 -143 -67 80 53 -110
2266 -110 20 84 -43 -98 21 61 -133 -3 116 -20 -116 37 64 -80 -95 95 49 -104 -38 126 -28 -154 17
2289 17 129 -46 -62 149 91 -120 -49 100 -39 -155 19 150 -4 -75 130 112 -105 -112 94 -18 -99 15 69
2312 69 -40 -64 27 22 -82 -45 75 11 -70 26 63 -92 -176 -51 8 -29 18 135 69 -31 -17 10 -80 -106 -15 30 -33
2339 -33 30 98 -8 -61 -1 85 -56 -29 72 40 -81 -69 -24 -70 -142 36 165 107 48 145 52 -157 -182 -66 -98 -134
2365 -134 21 149 78 12 67 71 -74 -81 5 -8 -67 -65 13 -23 -90 -66 37 62 91 121 82 12 -60 -129 -166 -158 -47 19 85
2394 85 141 172 94 -34 -16 -14 -118 -99 3 26 -33 -8 54 16 -72 68 91 93 64 51 8 -145 -165 -88 -38 -21 102 208
2422 208 138 74 25 -27 -116 -147 -110 -64 -14 27 90 60 12 23 28 -20 -11 45 -14 -50 -59 -68 -113 -91 -12 102 110 111 104 72 -60 -115
2454 -115 -87 -113 -89 24 130 85 67 66 54 -30 -49 -3 -3 -9 -20 8 -27 -59 -41 -13 24 42 79 117 42 -9 -84 -88 -105 -62 -14
2485 -14 57 76 77 52 -4 -40 -73 -61 -37 -4 22 16 6 -5 -4 -7 -6 17 18 33 63 7 -59 -48 -18 -27 -64 58 70 11 12 65 -4 -111
2519 -111 -100 -20 16 -13 36 85 14 -55 -27 21 -33 -49 -4 53 -3 -42 -4 33 -14 -47 14 35 12 -47 -26 -8 -21 -25 9 45
2549 45 2 -18 -17 18 21 -51 13 72 2 -52 -24 91 -19 -43 19 67 -15 -54 36 9 -68 -65 51 62 -15 0 78 15 -79 -28
2579 -28 24 -26 -39 17 82 33 -47 -24 6 -51 -40 7 37 13 -4 -5 -13 -79 -84 -6 1 41 20 32 5 -32 -64 -121 -21 -17 -20 57 124
2612 124 53 -47 -38 -25 -79 -65 62 131 28 -3 83 6 -144 -112 61 43 14 89 145 -20 -138 -72 -37 -76 -50 100
2638 100 145 9 -35 10 -56 -167 -52 23 70 44 70 64 -23 -103 -86 -44 -24 50 103 84 63 -33 -141 -137 -47 32 -17 61 188
2667 188 59 -106 -86 -22 -143 -139 75 180 63 -30 62 3 -195 -156 68 54 5 98 178 20 -178 -80 13 -79 -67
2692 -67 131 169 20 -22 10 -71 -143 -72 34 67 51 120 41 -25 -116 -85 -104 -59 75 71 43 29 49 -95 -172 -49 48 -4
2720 -4 54 155 90 -127 -109 17 -64 -158 65 217 79 -60 87 38 -140 -158 55 95 -33 90 171 49 -121 -47
2744 -47 43 -77 -100 114 134 -36 -17 75 -41 -124 -70 57 14 -9 98 33 -57 -55 -24 -69 -80 36 50 -13 -6 71 -19 -174
2772 -174 -49 38 -32 -32 112 57 -77 -27 73 -44 -127 38 138 -8 -100 107 116 -114 -134 111 109 -136 -10 173
2796 173 48 -93 -23 90 -40 -113 41 93 -36 1 110 16 -132 -32 82 -58 -83 38 71 -26 -28 44 -16 -51
2820 -51 -35 13 -58 8 61 -14 -95 25 51 -102 -117 84 117 -102 -62 106 108 -131 -68 130 -21 -90 85 135 -36 -66
2846 -66 114 62 -173 -52 145 34 -106 59 211 -8 -126 34 105 -98 -105 84 109 -50 -25 67 -14 -72 33
2869 33 29 -80 25 121 -41 -121 -11 52 -102 -92 70 112 -57 7 114 -41 -147 -26 29 -102 -18 137 66 -82
2893 -82 -6 156 -48 -198 16 158 -72 -127 106 146 -100 -74 127 96 -83 16 148 -28 -116 25 3 -153 -114
2916 -114 132 93 -65 56 180 2 -145 -52 29 -70 -145 37 60 -15 22 32 -35 -26 73 17 -118 17 88 -96 -220
2941 -220 -40 80 -102 -78 197 192 -13 -7 120 -56 -221 -61 41 -88 -29 197 168 -71 -5 179 16 -189 -45
2964 -45 153 -6 -183 2 98 -76 -128 97 131 24 56 97 -4 -139 -97 -94 -153 -56 127 113 24 76 179 -24 -152
2989 -152 -28 -23 -158 -98 95 14 -94 35 81 -37 -36 160 118 -125 -55 70 -109 -271 -97 115 30 -34 204 265
3013 265 -22 -101 63 -21 -187 -94 86 -4 -31 120 146 -30 -60 131 38 -93 10 112 -27 -159 -55 25 -64
3036 -64 -71 115 131 44 43 59 -118 -162 -24 -40 -140 12 192 64 -72 61 126 -88 -150 53 56 -108 -83 76 -13
3061 -13 -162 -10 110 -20 -58 118 149 -131 -119 66 -34 -177 -10 162 60 -86 79 186 -60 -124 28 31
3083 31 -69 -8 56 20 -64 22 56 -82 -42 97 53 -69 -7 49 -68 -114 7 0 -87 -13 103 16 -123 12 61 -95
3109 -95 -112 87 62 -86 -15 143 16 -135 -4 119 -39 -116 79 124 -62 -63 104 62 -106 -27 116 -14 -84 18
3133 18 77 -42 -57 67 56 -66 8 119 9 -104 36 32 -61 -59 57 22 -67 -4 88 -32 -77 64 18 -109 -56 65
3159 65 -9 -109 19 71 -24 -74 46 89 -98 -57 47 -8 -131 -14 75 -41 -95 69 68 -74 -37 116 40 -109 20
3184 20 95 -45 -101 57 107 -16 -12 111 86 -70 -26 37 -70 -71 54 96 -41 -14 86 15 -92 -2 67 -28 -61 42
3210 42 26 -118 -55 69 -7 -84 20 108 -25 -41 46 6 -101 -62 44 13 -64 47 111 -28 -106 28 -3 -44 -57 63
3236 63 34 -89 -14 31 -71 -59 68 88 -15 29 86 8 -110 -16 26 1 -56 48 39 -35 -5 68 -37 -103 2 80 -58
3263 -58 -47 84 35 -123 -93 62 -9 -130 5 86 -33 -63 1 -3 -90 -44 60 21 -54 13 56 -52 -68 16 44 -56
3289 -56 -28 73 4 -61 0 20 -22 -70 34 40 -14 -5 70 -12 -80 24 47 -37 -54 72 48 -92 -25 83 -6 -73 29 63
3317 63 -13 -36 54 36 -92 7 20 -41 -67 17 42 -46 -89 67 40 -59 -42 58 4 -67 5 58 -44 -59 24 12 -67 -7
3345 -7 77 -4 -79 23 46 -47 -41 51 42 -42 -16 60 1 -47 18 7 -17 -31 32 9 -50 -21 73 -33 -53 23 64 -48 -38 75
3375 75 8 -47 3 57 -21 -47 25 31 -37 -51 36 35 -51 9 42 -29 -88 6 61 -38 -60 58 31 -56 -12 51 -30 -75 30 78
3405 78 -23 -33 36 41 -55 -5 67 10 -59 19 55 -34 -31 56 30 -50 -30 72 0 -37 38 41 -46 -26 63 48 -67 -3 70 1
3435 1 -54 20 35 -42 -38 84 43 -18 -21 50 -4 -81 5 61 -46 -19 71 29 -48 -3 69 15 -80 31 51 -30 -27 41 13 -63 -2
3466 -2 62 23 -46 -13 79 -42 -47 42 -5 -55 9 76 17 -43 19 34 -32 -21 37 -3 -61 14 52 -20 -61 -2 37 -45 -28 87
3496 87 48 -54 23 56 -41 -115 15 52 -36 -8 74 10 -61 2 45 -25 -65 52 67 -62 -26 33 1 -65 -48 75 16 -14
3524 -14 13 32 -27 -46 -13 -23 -72 30 85 12 -48 58 51 -90 -68 59 -5 -62 41 53 -27 -63 -16 60 -10 1 72 19
3552 19 -18 -53 21 -55 -81 65 75 -44 -4 92 20 -95 -47 23 -13 -43 27 35 -45 -23 -5 -7 -46 29 54 -13 -44 68 5
3581 5 -77 -57 39 20 -74 41 63 6 -20 6 -17 -68 -66 28 -9 -68 29 18 -62 -52 52 19 -73 -3 74 39 -109 -29 16 -30
3611 -30 -61 42 72 -16 -17 30 -28 -89 -33 24 -17 -20 96 66 -45 -24 22 3 -82 -29 48 -8 -41 31 -1 -54 -12 12 -19 -46
3641 -46 46 62 -46 -47 44 -14 -92 -21 81 29 -23 -2 49 -29 -54 33 14 -61 5 39 -3 -33 37 68 -35 -48 64 44 -75
3670 -75 -30 67 -29 -64 -17 54 23 14 55 9 -30 -3 34 -17 -31 24 42 -65 -44 74 -3 -71 0 58 -2 -65 -8 73 -49
3699 -49 -32 32 -1 -67 -7 58 -25 -78 3 67 -58 -38 50 29 -79 -38 58 24 -52 6 20 -26 -22 49 11 -54 -1 50 -2 -42
3729 -42 44 24 -62 -71 49 4 -57 -3 64 -9 -60 6 10 -67 -69 28 9 -26 12 36 -43 -59 -9 30 -65 -25 30 27 -54 -15 49 8
3761 8 -72 -10 31 -37 -18 3 31 -55 -40 39 -28 -64 23 24 -18 -30 34 10 -75 -42 22 -10 -11 26 69 -28 -21 32 -23 -24 36 16 -33
3794 -33 -30 29 28 -51 -25 40 26 -32 32 43 -40 -34 1 8 -57 -39 68 31 -25 8 40 -65 -66 -21 25 -38 -12 46 24 -41 35 67
3826 67 6 -65 9 27 -72 -38 19 2 -43 26 48 9 -2 77 48 9 -33 25 -20 -13 -7 11 -3 -38 66 50 -10 -16 35 -25 -17 4
3858 4 21 -30 -37 17 17 -10 -16 41 28 -49 11 38 -40 -48 -3 -8 -47 -11 51 21 11 21 30 -48 -90 -34 11 -49 21 47 17 1 -2 37
3892 37 -16 -48 2 34 -16 -23 40 -17 -46 -10 27 11 21 61 40 1 -29 -24 -61 -78 -8 63 33 26 31 5 -37 -34 15 -15 -26 21 57
3925 57 -14 -67 -4 -23 -52 -12 61 50 -29 -6 -4 -60 -65 -7 8 -13 47 73 73 -49 -4 -6 -42 -37 26 28 31 25 9 -17 -44 -30 29 6
3959 6 12 15 19 -37 -39 -1 -21 -18 11 51 8 7 -7 3 -59 -29 -17 -18 4 58 58 -44 -52 -24 -34 -26 -11 52 13 -4 4 -9 -27 -62 3 28
3995 28 -20 -10 60 28 -73 -48 8 -47 -35 24 86 11 -12 -9 -4 -56 -9 30 18 -3 16 20 6 -27 -10 -23 10 42 47 -8 26 14
4027 14 -32 -40 -3 33 21 -20 21 43 -39 -57 -20 -14 -25 -7 68 52 -28 -7 27 -55 -73 -4 33 -25 -39 45 -2 -61 -51 34 45
4058 45 -11 15 12 -33 -48 -71 3 -34 25 0 15 -2 5 -25 -45 -5 1 8 22 35 14 -18 -32 13 -2 -16 23 83 14 -14 4 -6
4090 -6 -62 -24 16 22 1 18 17 11 -61 -54 3 -34 -33 58 50 -17 -40 -37 -16 -46 -1 47 33 9 11 1 3 -76 -30 19 3 28 43 41 -60
4125 -60 -27 -57 -1 36 -2 23 28 18 0 -44 -5 50 -21 20 77 33 -9 -26 -8 -8 -37 -45 60 73 -26 22 9 -30 -56 -3 46
4156 46 -22 -15 35 46 -29 -65 -4 -28 -49 -22 37 51 -31 -10 -3 -27 -92 -40 5 22 25 4 17 -38 -47 -15 -27 -6 48 33 48 21
4188 21 -24 -23 -7 43 4 -5 74 42 -6 -42 -7 -12 -33 18 52 34 -14 14 23 -58 -69 9 58 2 -17 23 17 -53 -20 8 9 -54 -26
4221 -26 61 -3 12 -49 -33 -25 -41 12 16 8 -8 14 -11 9 -33 -8 18 -5 9 11 19 17 -25 28 33 -28 8 16 19 6 -7 -4 31 20 -24
4256 -24 -2 -4 4 -24 -16 38 -9 -36 -18 16 5 -55 -11 28 -28 -36 1 3 -60 -44 16 7 -23 -22 42 7 -25 -16 1 -26 -39 30 12 17 -16
4291 -16 9 12 3 -20 7 18 5 -29 11 2 -2 -28 -24 18 3 17 0 14 -4 -34 -28 18 19 -26 -3 37 26 -40 -17 53 -36 -39 19 41
4325 41 -1 7 -10 1 -55 -56 11 6 -7 -18 41 -6 -37 -36 12 -36 -14 6 8 -5 -17 -22 -2 -18 -40 -4 31 16 11 14 -31 -12 -36 -19
4359 -19 -13 36 21 6 12 -16 -51 -9 17 13 -25 17 15 -39 -41 -14 25 -17 -10 20 25 -12 -33 14 -10 -45 -21 16 6 -11 4 -6 -30 -79
4393 -79 -27 -11 -14 -10 26 29 -15 -25 15 3 -5 3 1 -23 -48 -10 -33 -16 -16 -21 23 28 42 1 -14 -34 -25 -22 4 31 23 5 5 6 -9 -49 -29
4430 -29 8 -7 7 21 -6 -78 -73 -14 -3 -7 33 54 35 -7 -18 -11 -52 -72 -28 21 36 -10 26 11 -36 -42 -5 33 -13 1 13 -32
4462 -32 -25 -26 -43 -5 25 48 54 23 -3 -18 -60 -56 -2 -24 -4 19 50 52 10 20 -12 -13 -14 19 20 15 23 -24 8 -55 6 64 18 25 14 6
4498 6 -38 -24 -39 -58 -17 27 53 10 2 12 -9 -45 -46 22 9 -17 31 36 10 -8 14 -2 -1 31 50 34 -19 -1 -23 -25 -31 -18 46 33
4532 33 10 39 20 -16 -39 -24 12 17 52 33 12 -17 -5 -42 -6 -7 28 48 6 27 -10 -37 -21 28 11 34 39 39 5 10 -13 -20 -47
4565 -47 -17 43 13 0 34 32 -34 -42 -9 35 9 11 46 34 15 -35 33 -7 3 30 30 -13 -15 32 -16 -16 -12 25 12 25 15 -11 -1 -28
4599 -28 -5 -21 -11 1 29 0 12 32 -10 -48 13 9 5 14 23 60 -26 -8 -13 7 -6 5 34 7 1 19 -3 -46 -48 8 7 -9 14 39
4633 39 9 -42 -18 20 1 0 28 45 -11 -7 9 -6 -8 6 45 29 -23 9 21 6 -16 3 -11 1 37 54 29 13 30 0 -25 1
4665 1 34 -19 -26 17 -3 -17 -2 22 28 -18 -6 30 6 -49 5 9 -33 -7 64 33 -14 -18 28 15 0 -3 -5 -25 -25 -3 1 -20 6 -15 8
4700 8 -33 4 18 6 10 -16 0 -31 -6 0 -26 -4 16 -8 -2 -13 -7 21 -33 23 29 0 -17 27 9 -45 -18 6 4 -35 0 8 18 -10
4734 -10 -5 12 -12 -41 49 37 -36 25 27 14 -5 24 33 -14 -19 14 27 -17 25 30 17 -29 -13 27 2 -38 -2 25 10 10 20 -22 -13 -24
4768 -24 6 12 -4 22 -20 -28 0 14 -13 -2 9 26 -11 13 26 2 -31 -6 20 3 1 -3 32 -6 -11 -3 28 -29 -23 46 -19 -44 -20 -7
4802 -7 -43 -42 -2 28 37 -1 5 -10 0 -26 35 -19 18 18 2 -15 0 36 21 -31 -3 -7 -17 0 -7 -3 -34 3 23 2 -12 43 45 -22 -5
4837 -5 0 31 -13 1 57 21 -23 0 22 -5 -19 -10 13 -14 20 31 -23 -2 0 8 7 -14 38 12 -17 0 11 1 -58 -24 33 -21 -20 12
4871 12 21 -30 2 9 -16 -34 -3 36 -12 1 28 -12 -10 3 30 -4 17 16 55 -22 -23 8 -2 -28 -6 60 18 -13 17 6 -18 10 26
4904 26 12 -10 -5 22 -28 -42 7 13 -22 -6 43 -14 0 -42 -12 -29 -39 24 41 0 6 -9 -38 -2 7 10 -1 -6 30 19 -27 -7 -20
4937 -20 16 -33 3 -1 14 15 2 31 -25 -5 40 19 10 63 53 20 -46 -29 25 -8 -19 26 33 -12 17 25 -16 9 18 23 -18 24 13 7
4971 7 -16 0 -15 18 -4 12 22 5 -15 12 -11 -62 -11 -8 18 3 30 23 -22 -23 13 -35 6 2 33 -6 -7 -14 3 -27 -12 31 11 -26
5005 -26 11 14 4 -17 10 -11 -23 8 3 19 -16 20 -4 -17 -7 26 23 -10 -5 -5 1 -29 -12 -9 15 -9 25 18 -16 -20 -7 6 -37 -16 23
5040 23 5 0 4 24 -4 -9 4 23 -19 19 14 -24 -23 -18 18 -12 17 27 16 20 0 29 8 -15 10 -2 -2 0 26 -34 -16 -10 8 24 17 -6
5076 -6 6 -2 -23 10 -5 -36 -3 34 11 0 9 34 -58 -14 -3 7 -10 -30 21 -2 -8 -30 -8 -30 -13 -7 -11 -2 -20 -15 -9 -27 3 6 -27
5111 -27 -2 3 2 -13 -8 9 -28 9 27 14 4 -24 17 -8 -30 -17 6 0 5 0 -20 -7 -19 12 13 -25 12 28 2 -20 -6 16 -5 13
5145 13 34 -16 -19 -1 27 -17 -14 40 30 -11 -23 -15 -2 -9 8 13 -24 -5 36 -23 -48 3 19 -8 -30 -10 -3 -10 -33 -5 3 -12 29 -3
5179 -3 4 8 -21 -5 -4 19 -4 2 17 -26 20 -19 6 0 30 1 -13 6 1 5 -22 29 -15 -12 -10 -5 11 5 2 10 -1 -6 24 -7 10 17 -6 -4 -17
5218 -17 -17 20 -13 -26 14 -6 -37 0 6 -24 -18 -2 4 1 0 -3 17 6 -3 20 -4 17 -9 21 47 0 9 20 -9 22 9 -6 38 14 18
5253 18 -13 3 17 -12 -1 -20 13 -14 12 -4 18 -23 -11 -15 -20 0 20 19 -75 -31 -5 15 -23 -24 -18 -10 30 -9 -6 -30 -1 -17 -8 -27
5287 -27 -4 -20 4 -8 3 24 12 -15 30 9 -30 25 4 25 -5 13 17 18 1 10 25 23 -1 23 35 -54 32 -10 -34 2 14 -13
5319 -13 16 -14 6 -2 6 -12 16 9 -18 14 -14 -23 -21 -8 0 -5 20 15 -28 -19 -20 -11 -15 -11 20 23 -25 -13 11 0 0 5 5 10 -9 -1 10 -33 0 21
5359 21 8 -6 -11 24 -6 -22 22 18 8 24 -5 3 8 27 44 17 6 16 -1 -12 8 19 -10 -14 0 31 31 8 -13 -17 -12 -14 5 -13 -2
5394 -2 1 -3 -3 15 6 -11 -12 11 2 -2 0 9 -16 -2 8 3 -1 -13 -13 9 1 13 21 20 -21 -20 30 9 -8 29 28 6 4 13 16 21 0 14 7 -5 -1 21
5436 21 3 20 34 -5 -24 20 2 14 -16 14 0 -18 -8 6 13 -13 15 20 8 -4 25 11 17 -7 -2 27 -10 -26 18 -27 -42 -7
5468 -7 38 6 7 -12 15 -13 -2 6 0 -3 -1 26 17 -1 42 6 -12 16 17 45 -26 -2 -30 -15 -27 6 -10 -17 0 28 1 -21 -14 0 -8 -4
5504 -4 33 -17 -6 -11 -22 -8 -17 4 -12 -10 19 8 30 3 -6 4 9 16 3 8 15 10 2 -12 3 3 9 26 -47 -18 -1 19 17 6 2 27 26 -5
5542 -5 42 22 3 12 7 23 -1 43 8 17 13 -6 8 5 10 -3 3 9 -9 -10 -22 5 -22 -2 12 -1 -8 -21 -17 -2 13 20 -20 10 -25 -9 21
5579 21 2 28 1 8 -3 -7 7 -5 9 6 1 -8 -4 21 6 -16 28 12 -2 6 27 11 4 -12 0 42 3 19 -7 11 -6 29 0 -4 6
5614 6 18 10 20 17 -4 -1 13 -7 -36 -18 -31 22 1 -15 -7 -3 -41 5 16 -18 17 -9 -14 -12 -26 -1 8 -8 -4 -9 15 22 5 0 18 -23 -16
5651 -16 -12 19 7 7 5 9 -2 31 51 25 3 24 7 -20 -8 -5 1 -5 -5 -15 0 1 -10 2 -31 -25 -6 -33 -8 39 -7 -1 28 -27 1 17
5687 17 -6 10 10 -30 29 4 -21 3 7 -40 7 -9 -4 4 -1 -26 -20 9 -3 -10 -10 20 10 14 -16 16 8 32 -22 6 4 18 -8 13 13 11 10
5724 10 -19 -2 -32 5 -16 -1 1 4 -1 4 -14 -3 3 -21 -15 -5 3 -2 -16 9 14 24 -15 15 -39 -27 -14 12 -11 4 11 -9 14 -19 3
5759 3 -16 15 -4 21 -32 -17 40 5 30 -1 18 18 4 -24 12 34 -3 12 8 7 12 -2 -30 8 7 12 -12 -3 2 14 -4 -12 10 10 2 10 6
5796 6 2 0 -35 -34 -31 -16 -22 -18 -2 -12 18 2 -5 -36 -14 -25 -2 16 -14 11 10 14 12 12 -2 6 -15 20 10 3 -8 4 8 -3 -6 -13 -5 25 -14
5835 -14 2 -12 41 29 33 6 34 16 10 -11 -8 -17 30 14 11 16 -1 7 12 -44 24 25 13 7 10 -8 -21 0 -11 -28 -20 -1 -2 -4 -40 11 -13
5872 -13 -13 8 1 -5 -22 -13 -11 16 15 -10 4 -5 16 0 11 40 -1 -7 -30 -8 1 18 -11 0 20 4 -13 -3 -2 -1 12 8 5 -18 4 18 -3
5909 -3 -1 9 12 -10 2 2 5 22 -8 11 28 1 0 24 -11 8 -14 -2 -13 10 -5 -35 17 5 -28 5 -4 -3 -11 -2 33 -9 -2 -17 29 4
5945 4 -1 22 -30 26 -12 40 21 4 27 13 14 38 -10 13 0 0 14 25 -5 -38 11 2 -23 5 -22 -23 -6 3 -10 -9 11 11 28 11 -38
5980 -38 -12 7 11 -1 -6 -18 -38 -20 -19 -11 9 -7 -16 0 -29 8 -55 -3 -17 12 8 13 -7 17 -9 1 5 -19 2 4 5 -2 18 32 -8 32
6016 32 15 0 21 -14 14 8 19 -5 10 9 -4 -15 -25 8 3 -30 4 1 -2 -3 -5 -10 -4 -2 34 -27 -8 8 9 0 21 -28 -2 -9 -28 16 5
6053 5 8 4 -5 40 7 -3 0 1 8 4 -3 11 -40 -15 -7 23 9 -20 -3 14 -24 8 15 4 0 14 -1 4 -19 12 32 3 -9 15 -18 -10 -13 -15
6091 -15 -26 -15 7 -24 -23 -9 -20 12 0 -9 -21 -44 -4 -17 -32 5 -5 13 18 34 -6 3 28 3 14 -23 -18 -9 5 20 0 -20 -3
6124 -3 32 30 5 9 -5 8 20 16 -12 -6 -13 -7 -4 8 -3 28 -3 22 -18 18 27 -12 -2 -1 9 1 -11 -12 -4 7 -1 12 2 -31 12 -25 -23 -7
6162 -7 -39 -31 -9 -24 -24 -17 1 12 1 -7 4 44 -2 19 12 23 -9 9 16 8 9 18 -5 18 -4 22 12 16 25 6 -19 -3 -11 -13 11 -1 -11
6199 -11 -18 16 -11 -24 7 -9 -4 -7 -31 5 -17 -16 11 -17 -7 17 10 -9 -6 18 -14 -45 -12 3 5 -25 -49 0 12 19 -11 6 -19 -21 -13
6234 -13 -21 15 23 5 33 43 -6 27 12 0 23 -10 -2 10 -8 31 20 29 5 -5 26 0 7 2 -9 -5 12 -29 26 -11 -18 4 -18 -2
6268 -2 -14 -40 -2 14 -2 10 33 -14 8 -19 -9 -1 -15 5 8 -17 -4 -22 19 6 -11 -25 24 9 -8 20 -18 21 12 15 -9 -3 -10 4
6302 4 4 36 -10 -9 11 -5 44 -7 13 -7 -11 13 15 24 -8 -2 -11 -11 -38 -8 11 -18 -9 -5 -35 -12 7 -18 -34 -1 -14 8 -19 -3 -17 0
6338 0 -1 1 5 -3 -13 38 -4 3 -3 -14 12 -39 10 19 -20 -7 4 -1 -10 -3 42 11 10 -2 26 -5 -8 -15 -12 15 -5 -18 6 11 17 5 -5 -35 -22
6377 -22 -21 9 -15 1 17 -14 -9 -14 -13 -29 -38 -20 -36 -14 -7 -32 -31 -31 0 -8 6 -9 -10 4 -34 -9 -20 2 -13 -15 7 17 15 -16 -21 19 17
6414 17 2 10 4 -13 -7 7 14 19 -20 4 -1 14 -12 1 43 18 -6 -3 12 7 -39 11 12 -4 0 -1 16 7 -1 -21 -17 6 -15 -17 -11 -10 17 -35 -6
6453 -6 14 -19 28 -6 -4 -7 -17 -4 -26 -27 -36 2 -17 -29 -9 13 11 2 7 21 -3 21 6 -8 -7 -7 14 -7 32 12 3 -8 -12 3 -14 20
6489 20 -19 27 -9 -8 -10 1 -7 -17 -2 19 -22 11 -18 -15 26 -32 -29 -4 11 -2 -10 -5 -8 -12 -22 -7 -16 -14 -2 0 -19 9 12 -14 17 -10 -40
6526 -40 7 -12 5 24 6 -13 13 41 8 0 -21 26 17 -23 -5 1 -5 -10 60 -5 1 0 -14 14 19 -11 -5 -27 -1 -8 -5 -17 -23 -9 -34 -28 -23
6563 -23 -3 26 -9 -40 14 -20 4 15 4 16 6 -12 16 -31 -2 -16 -20 -24 13 -2 -14 -16 -7 -1 -16 -5 -33 -1 -2 20 9 27 -24
6596 -24 -13 5 11 -1 9 -28 4 -5 -2 24 -5 24 11 -40 -42 9 7 2 10 12 -33 -36 -19 -13 -12 -20 -11 -4 0 -18 -16 8 -56 -20 -10 -28 0 -9 -16
6635 -16 -23 16 -2 -11 11 5 -53 6 9 -12 -2 1 -12 16 16 10 -4 4 9 -12 -6 -1 5 -36 -5 -34 -18 -8 11 -3 -4 -24 12 -10 4 -27 -13
6672 -13 -21 -33 -28 18 24 9 16 -32 -37 -13 -18 13 -2 12 -26 -40 -7 -4 -23 19 11 21 12 8 -14 -22 -32 -20 -5 5 -17 14 19 5 -7 -6 8
6709 8 28 -6 26 -25 12 49 -2 4 -11 24 41 12 14 7 12 -10 -9 14 -6 -7 -16 10 10 13 -4 -2 -17 11 2 32 9 -11 10 -9 -13 -14 0
6746 0 -16 2 -6 -11 -10 3 -12 -8 -6 -8 1 20 13 22 10 0 12 -33 -13 -16 -15 -9 -6 6 -15 -2 -13 -20 0 -3 5 3 8 10 -16 -4 -2 18 -6 -21 14
6787 14 -6 -40 -17 19 -25 -37 14 3 -9 -1 -6 -23 0 -13 -21 -23 -23 -13 6 -18 -32 -16 -1 -51 -23 5 11 9 10 -6 -6 1 -4 8 6 2 10
6824 10 3 18 18 2 -10 1 0 -16 9 15 18 15 -15 -1 -15 -24 43 0 -3 -10 -7 8 29 -39 -9 31 -29 16 -3 19 -18 -11 -6 18 -6 -10 -7
6861 -7 -27 -29 -13 -10 -1 -2 -17 -14 -21 -11 -22 -17 -26 27 -18 15 4 -2 -21 -22 8 4 -27 7 15 -1 -6 40 9 -13 -8 -28 11 0 -28 -19 33 -19
6899 -19 -10 8 35 -5 15 3 -29 -17 -18 6 9 -8 -15 2 -31 -9 -3 -3 -19 12 1 -21 -32 1 -11 -7 31 16 -15 -1 -11 2 -31 -7
6933 -7 12 14 1 -3 36 38 34 19 29 -11 28 24 25 8 -3 25 7 19 -7 26 -16 -14 23 14 -9 10 -29 -29 -17 -28 4 -4 -8 24 -3 9
6969 9 4 13 20 -21 -10 12 -20 40 -9 20 -3 -6 2 3 30 16 -5 -2 -3 5 -26 4 12 25 -27 -8 16 -34 -31 -15 -3 9 3 26 -9 8 28
7006 28 -6 8 -12 -16 18 0 27 -13 -8 12 -15 18 -10 8 -25 3 3 -2 10 4 -8 -17 -14 -9 -44 -5 11 -25 -13 -12 15 -7 -15 -18 -13 12
7042 12 -22 -18 7 16 -17 17 -5 3 -2 -6 15 -1 4 -2 2 1 -4 24 1 2 -2 6 -14 23 18 -1 -10 -9 8 -17 5 20 4 14 30 -4 -24 2
7080 2 -7 -33 4 -8 -4 -26 -9 17 -12 -1 -13 -21 -31 7 -26 3 -12 -1 -3 -7 10 -35 -6 -32 6 30 -20 -25 -12 -2 5 1 45 25 -21
7115 -21 -16 -1 -8 13 -30 8 17 10 5 36 -28 2 9 8 21 -5 22 12 9 17 -2 -5 7 -14 32 -1 8 -9 6 17 -10 -4 12 -24 -36 -7
7151 -7 -3 -18 10 0 -34 -4 -3 0 -12 -24 -24 -13 -3 -27 -6 -4 16 4 1 -1 -15 12 14 32 0 15 26 12 -18 12 12 -17 5 -9 0 10
7187 10 -8 -1 -19 10 18 0 14 16 10 -1 -13 32 -4 -7 -9 -18 -24 -28 -3 -20 8 -2 -41 4 -1 -14 10 -16 -13 21 15 -3 10 10 -19 -45 -9
7224 -9 -22 13 -1 2 6 15 12 -13 9 29 -7 -2 23 7 23 2 35 23 14 -10 13 -7 -8 -26 1 18 6 -10 14 -7 -3 4 -1 -20 -4 5
7260 5 -7 -7 -48 3 -11 -10 -22 7 18 -12 -5 -8 -27 -14 13 4 -20 6 18 -6 0 24 -3 -19 -4 16 -16 14 21 0 6 -13 -15 5 12 2
7296 2 19 -6 -7 5 -5 1 5 -1 11 -1 2 17 -11 -2 -12 12 20 -5 9 -11 -38 2 11 -7 2 -11 -7 19 -8 3 -21 -15 -8 12 3 -28 6
7333 6 -28 -19 10 -28 -23 -10 12 2 -20 -16 -15 -12 -2 18 -26 -7 -2 9 26 7 -19 -22 -4 7 7 12 -4 13 -21 23 -37 -1 24 -6 0 27
7369 27 -29 -18 -29 -6 10 -30 -2 24 -12 -34 -7 -19 -8 17 -32 -21 -29 -23 7 15 -35 -2 -6 -21 -1 9 -21 -13 -20 -4 6 -10 17
7402 17 31 4 -10 12 2 21 -6 1 8 -1 -2 -1 -4 12 -3 10 24 24 -10 17 -7 -5 8 17 3 -5 8 -26 11 -8 -10 -6 -24 15 24 8 -12
7439 -12 16 -14 -11 12 -5 19 -10 9 -28 -19 2 -16 -8 3 -29 -12 -16 -16 21 -20 -1 -19 -2 17 -7 -30 29 9 3 41 -6 11 24
7472 24 2 -1 32 9 -1 -1 -8 8 -4 -4 10 -12 23 -11 0 -4 -9 -1 13 20 -10 5 1 -6 -43 -19 5 2 -15 -31 -30 -19 -11 -41 -30 19 16
7509 16 22 -4 17 -1 15 -2 -10 6 -12 -3 2 -5 25 -4 -27 9 -5 -41 -16 3 -7 -5 12 10 6 21 23 17 27 19 3 -5 -11 8 0 12 11 -11
7547 -11 10 40 21 9 -5 27 -35 4 -4 21 -22 2 -5 -28 10 -16 2 -13 -12 17 -26 0 -25 -12 36 -17 -7 -22 4 -23 5 -20
7579 -20 -23 -3 -14 -5 8 14 -3 -6 -15 -14 12 14 7 -4 42 -6 24 23 -20 5 -6 0 -19 -3 -5 14 2 18 0 5 8 20 0 -2 -17 -1 0 19
7617 19 9 5 11 -23 -16 -16 -13 -21 1 -6 -9 -17 2 23 14 14 -10 3 -31 -7 2 3 30 20 -20 15 32 -5 22 10 -17 18 10 18 19 10 37 0 -7
7656 -7 6 -7 17 -23 10 13 14 22 -1 -27 5 -9 1 4 33 20 -18 -54 -2 25 -14 -9 -26 -6 -9 0 4 17 5 -35 -20 -13 10 -21 -28 -13
7692 -13 -45 -18 -1 0 7 -28 -33 -7 11 -21 4 22 23 6 39 15 24 -10 -22 3 19 12 28 9 6 12 -19 13 -21 6 -13 16 -21 -8
7726 -8 -9 28 -12 -16 28 -20 8 11 -13 16 33 -5 4 -5 10 17 -3 -1 5 -16 -38 -19 19 13 29 -14 -16 -2 -10 -8 -17 17 9 -10 -14 -2 -17 -14 14
7765 14 -2 4 18 9 3 8 -14 58 42 6 6 4 13 -26 -10 -27 10 2 2 7 5 -5 4 -24 9 7 12 -3 -11 -29 18 -9 -5 -8 -24 -17 -22 -1 -26 21
7805 21 -22 -8 8 6 0 -8 -1 11 24 -3 6 21 1 31 1 -9 14 9 -25 -1 9 9 1 -6 26 -1 -4 6 -19 14 24 7 -11 11 -6
7840 -6 43 -11 13 -4 -2 -34 11 15 5 14 5 -7 -1 -5 -2 -4 -15 -23 18 42 -12 -25 -26 4 -15 -15 -25 -9 -9 -33 2 -18 8 18 7 14 -7
7877 -7 26 -19 12 33 -4 -5 16 13 21 -25 -2 -12 -9 3 4 32 -7 9 -5 25 17 -7 13 -9 19 25 -28 -3 -23 -31 -37 -9 -10 5 4 -19
7913 -19 -15 -8 -2 -6 -21 -3 14 10 -12 -23 -13 -7 4 -22 -13 13 -12 -33 6 -15 -10 0 -24 19 1 -5 -5 4 2 34 2 29 4 -2 9 -32 17
7950 17 26 24 14 8 -5 -40 -16 -2 -18 -18 2 -28 -8 4 -4 -4 -3 6 -1 6 3 -29 8 1 -6 -28 25 19 15 3 10 -5 -37 2 -34 -4 -5 -12 -4 -8
7990 -8 -28 13 -26 -7 1 4 14 27 -8 6 28 9 9 2 22 11 4 12 1 9 5 -4 29 18 11 6 18 33 -8 -7 -13 -17 -10 4 32 3 23 -9
8028 -9 -7 -12 -6 -6 -13 9 -16 14 -16 -4 17 -2 4 8 -2 3 0 29 -18 10 21 30 -6 10 7 -4 -2 9 -7 -1 23 -13 -3 17 5 -17 -4
8065 -4 21 11 -6 0 -9 20 -29 20 -28 7 37 -15 -17 5 28 -12 -15 -5 -5 -11 2 -1 -14 -7 -4 -5 -31 6 -15 -29 18 -5 -7 -4 -3 12 -30
8102 -30 21 2 35 19 0 -23 3 0 -41 21 11 13 6 -16 -12 2 5 13 -1 2 2 5 -4 14 -3 16 -15 16 15 -23 -11 13 8 -10 13 -24
8138 -24 -19 3 1 -3 -26 -21 -43 -5 1 -10 -6 -23 -10 -8 -2 12 -12 -26 17 0 -9 -41 -6 11 -4 -26 -28 -16 -15 -16 -6 -9 -3 12 14 16 21 6 4
8177 4 -5 32 -33 -2 12 24 -36 0 -4 24 0 -2 4 -9
8191i
##END NTUPLES=NMR FID
##END=
