##TITLE=1H_AM A510.IPS-2
 CDCl3, 8 sc, 
 30.7.2019
##JCAMPDX= 6.0         $$ Bruker NMR JCAMP-DX V2.0
##DATA TYPE= NMR FID
##DATA CLASS= NTUPLES
##ORIGIN= UXNMR, Bruker Analytische Messtechnik GmbH
##OWNER= root
$$ XWIN-NMR		Version 3.5
$$ Tue Jul 30 13:51:55 2019 Russian Standard Time (UT+4h)  she@DPX200
##.OBSERVE FREQUENCY= 200.13155
##.OBSERVE NUCLEUS= ^1H
##.DELAY= (6, 6)
##.ACQUISITION MODE= SIMULTANEOUS
##.ACQUISITION SCHEME= undefined
##.AVERAGES= 8
##.DIGITISER RES= 18
##SPECTROMETER/DATA SYSTEM= spect
##.PULSE SEQUENCE= zg30
##.SOLVENT NAME= CDCl3
##.SHIFT REFERENCE= (INTERNAL, CDCl3, 0, 15.7039)
##AUDIT TRAIL= $$ (NUMBER, WHEN, WHO, WHERE, WHAT)
$$ ##TITLE= Audit trail, XWIN-NMR		Version 3.5
$$ ##JCAMPDX= 5.01
$$ ##ORIGIN= Bruker BioSpin GmbH
$$ ##OWNER= she
$$ F:/spectra/data/she/nmr/H-F/1/audita.txt
$$ ##AUDIT TRAIL=  $$ (NUMBER, WHEN, WHO, WHERE, WHAT)
(   1,<2019-07-30 13:50:53.23 +0400>,<she>,<DPX200>,
      <created by zg, POWCHK disabled, PULCHK disabled
       configuration hash MD5:
       00 E9 B6 7A A2 85 ED C7 34 08 36 98 17 FE 4E 26
       data hash MD5: 16K
       81 7B 21 8A C8 5B E8 0C DB 96 3F 5F 44 DE 79 48>)
$$ ##END=
$$ 
$$ hash MD5
$$ 12 C7 2E 1B C0 D8 D4 8C 54 7A 1C 93 9F 27 05 75
##$RELAX= 
##$RELAX= 
##$RELAX= 
##$RELAX= 
##$RELAX= 
##$RELAX= 
$$ Bruker specific parameters
$$ --------------------------
##$DU= <F:/spectra>
##$EXPNO= 1
##$NAME= <H-F>
##$PROCNO= 1
##$TYPE= <nmr>
##$USER= <she>
##$AMP= (0..31)
100 100 100 100 100 100 100 100 100 100 100 100 100 100 100 100 100 100 
100 100 100 100 100 100 100 100 100 100 100 100 100 100 
##$AQSEQ= 0
##$AQ_mod= 1
##$AUNM= <au_zg>
##$AUTOPOS= <>
##$BF1= 200.13
##$BF2= 200.13
##$BF3= 200.13
##$BF4= 200.13
##$BF5= 200.13
##$BF6= 200.13
##$BF7= 200.13
##$BF8= 200.13
##$BYTORDA= 1
##$CFDGTYP= 0
##$CFRGTYP= 5
##$CHEMSTR= <none>
##$CNST= (0..31)
1 1 145 1 1 1 1 1 1 1 1 1 1 1 1 1 1 1 1 1 1 1 1 1 1 1 1 1 1 1 1 1 
##$CPDPRG= <>
##$CPDPRG1= <>
##$CPDPRG2= <>
##$CPDPRG3= <>
##$CPDPRG4= <mlev>
##$CPDPRG5= <mlev>
##$CPDPRG6= <mlev>
##$CPDPRG7= <mlev>
##$CPDPRG8= <mlev>
##$CPDPRGB= <>
##$CPDPRGT= <>
##$D= (0..31)
0 1.2 0 0 0 0 0 0 0 0 0 0.03 0 0 0 0 0 0 0 0 0 0 0 0 0 0 0 0 0 0 0 0 
##$DATE= 1564480252
##$DBL= (0..7)
120 120 120 120 120 120 120 120 
##$DBP= (0..7)
150 150 150 150 150 150 150 150 
##$DBP07= 0
##$DBPNAM0= <>
##$DBPNAM1= <>
##$DBPNAM2= <>
##$DBPNAM3= <>
##$DBPNAM4= <>
##$DBPNAM5= <>
##$DBPNAM6= <>
##$DBPNAM7= <>
##$DBPOAL= (0..7)
0.5 0.5 0.5 0.5 0.5 0.5 0.5 0.5 
##$DBPOFFS= (0..7)
0 0 0 0 0 0 0 0 
##$DE= 6
##$DECBNUC= <off>
##$DECIM= 24
##$DECNUC= <off>
##$DECSTAT= 4
##$DIGMOD= 1
##$DIGTYP= 9
##$DL= (0..7)
0 120 120 120 120 120 120 120 
##$DP= (0..7)
150 150 150 150 150 150 150 150 
##$DP07= 0
##$DPNAME0= <>
##$DPNAME1= <>
##$DPNAME2= <>
##$DPNAME3= <>
##$DPNAME4= <>
##$DPNAME5= <>
##$DPNAME6= <>
##$DPNAME7= <>
##$DPOAL= (0..7)
0.5 0.5 0.5 0.5 0.5 0.5 0.5 0.5 
##$DPOFFS= (0..7)
0 0 0 0 0 0 0 0 
##$DQDMODE= 0
##$DR= 18
##$DS= 0
##$DSLIST= <SSSSSSSSSSSSSSS>
$$ [...]
##$SUBNAM2= <"">
##$SUBNAM3= <"">
##$SUBNAM4= <"">
##$SUBNAM5= <"">
##$SUBNAM6= <"">
##$SUBNAM7= <"">
##$SUBNAM8= <"">
##$SUBNAM9= <"">
##$SW= 24.9336996594482
##$SWIBOX= (0..15)
0 0 2 0 0 0 0 0 0 0 0 0 0 0 0 0 
##$SW_h= 4990.01996007984
##$TD= 16384
##$TD0= 1
##$TE= 0
##$TE2= 300
##$TE3= 300
##$TEG= 300
##$TL= (0..7)
0 120 120 120 120 120 120 120 
##$TP= (0..7)
150 150 150 150 150 150 150 150 
##$TP07= 0
##$TPNAME0= <>
##$TPNAME1= <>
##$TPNAME2= <>
##$TPNAME3= <>
##$TPNAME4= <>
##$TPNAME5= <>
##$TPNAME6= <>
##$TPNAME7= <>
##$TPOAL= (0..7)
0.5 0.5 0.5 0.5 0.5 0.5 0.5 0.5 
##$TPOFFS= (0..7)
0 0 0 0 0 0 0 0 
##$TUNHIN= 0
##$TUNHOUT= 0
##$TUNXOUT= 0
##$USERA1= <user>
##$USERA2= <user>
##$USERA3= <user>
##$USERA4= <user>
##$USERA5= <user>
##$V9= 5
##$VALIST= <valist>
##$VCLIST= <CCCCCCCCCCCCCCC>
##$VD= 0
##$VDLIST= <DDDDDDDDDDDDDDD>
##$VPLIST= <PPPPPPPPPPPPPPP>
##$VTLIST= <TTTTTTTTTTTTTTT>
##$WBST= 1024
##$WBSW= 4
##$XGAIN= (0..3)
0 0 0 0 
##$XL= 0
##$YL= 0
##$YMAX_a= 121031
##$YMIN_a= -108872
##$ZGOPTNS= <>
##$ZL1= 120
##$ZL2= 120
##$ZL3= 120
##$ZL4= 120
##$ABSF1= 10
##$ABSF2= 0
##$ABSG= 5
##$ABSL= 3
##$ALPHA= 0
##$AQORDER= 0
##$ASSFAC= 0
##$ASSFACI= 0
##$ASSFACX= 0
##$ASSWID= 0
##$AUNMP= <proc_1d>
##$AZFE= 0.1
##$AZFW= 0.1
##$BCFW= 1
##$BC_mod= 2
##$BYTORDP= 1
##$COROFFS= 0
##$CY= 11.3945322036743
##$DATMOD= 1
##$DC= 2
##$DFILT= <>
##$DTYPP= 0
##$F1P= 20.1537800932815
##$F2P= 0.134698688090026
##$FCOR= 0.5
##$FTSIZE= 0
##$FT_mod= 4
##$GAMMA= 1
##$GB= 0.15
##$INTBC= 1
##$INTSCL= 1
##$ISEN= 128
##$LB= 0.24
##$LEV0= 0
##$LPBIN= 0
##$MAXI= 10000
##$MC2= 0
##$MEAN= 0
##$ME_mod= 0
##$MI= 1.114404
##$NCOEF= 0
##$NC_proc= 0
##$NLEV= 6
##$NOISF1= 3.799351
##$NOISF2= 2.8
##$NSP= 1
##$NTH_PI= 0
##$NZP= 0
##$OFFSET= 15.70392
##$PC= 1
##$PHC0= -9488.729
##$PHC1= 13.60097
##$PH_mod= 1
##$PKNL= yes
##$PPARMOD= 0
##$PSCAL= 0
##$PSIGN= 0
##$REVERSE= no
##$SF= 200.130013532006
##$SI= 16384
##$SIGF1= 3
##$SIGF2= 2
##$SINO= 400
##$SIOLD= 16384
##$SREGLST= <1H.CDCl3>
##$SSB= 0
##$STSI= 0
##$STSR= 0
##$SW_p= 3612.71676300578
##$SYMM= 0
##$S_DEV= 0
##$TDeff= 0
##$TDoff= 0
##$TI= <>
##$TILT= no
##$TM1= 0
##$TM2= 0
##$TOPLEV= 0
##$USERP1= <user>
##$USERP2= <user>
##$USERP3= <user>
##$USERP4= <user>
##$USERP5= <user>
##$WDW= 1
##$XDIM= 8192
##$YMAX_p= 0
##$YMIN_p= 0
$$ End of Bruker specific parameters
$$ ---------------------------------
##NTUPLES= NMR FID
##VAR_NAME=  TIME,          FID/REAL,        FID/IMAG
##SYMBOL=    X,             R,               I
##VAR_TYPE=  INDEPENDENT,   DEPENDENT,       DEPENDENT
##VAR_FORM=  AFFN,          ASDF,            ASDF
##VAR_DIM=   8192,          8192,            8192
##UNITS=     SECONDS,       ARBITRARY UNITS, ARBITRARY UNITS
##FACTOR=    0.0002004,     1,               1
##FIRST=     0,             0,               0
##LAST=      1.6414764,     0,               0
##MIN=       0,             -108872,         0
##MAX=       1.6414764,     121031,          0
$$ Real data points
##PAGE= N=1
##DATA TABLE= (X++(R..R)), XYDATA
0@%%%%%%%%%%%qJ6j6J6j6J8k6L2l2M0m8N4o2P2q5R4j05J20j37J54j71J91k15K40
35A26k68L00l32L65m05M50m98N50o07O74p49Q31r26J038j167J318j499J726k017
54a090K396k915L685m933P271j3072N1249P8440j63682l8023J48120Q587j59566
67h3533Q363J40691k0287j14924N0206R6429o3531q0803O8027N2830p0908k7959
79d5399P9326J4674p5774j0123N8958o591n2595J1321N2474M990l0884r800J6889
92G466J0254k2027l3762J4426N1587m147n4351J3613O5325k4239p8443K8299P8423
105E2424l7312o9401N5702O1952p2889n5257P8456L3480q7993n862J06086p131
117E2255j06000K7054R7741n8795j02530P2987R6450p9606p4822R6268O2014j03095
$$ plain form
0 0 0 0 0 0 0 0 0 0 0 0 0 -8 8 -8 8 -8 10 -16 16 -16 24 -24 30 -32 40 -45 49 -56 64 -73 81 -90 101 -114 126
35 126 -142 158 -174 191 -214 236 -262 288 -319 355 -394 437 -489 549 -618 700 -799 927 -1090
54 -1090 1306 -1609 2076 -2857 4414 -8658 42591 121031 -42651 -80674 67446 76033 -83533
67 -83533 -75170 65521 45234 -69690 -19484 76945 13414 -67389 638 53468 -17440 -45399
79 -45399 33927 48601 -27173 -37296 21662 15071 -37524 -26203 26271 31261 377 -9423 7466
92 7466 17720 -4307 -38069 -23643 27944 23797 -30554 -16941 48384 24145 -54298 -25999 52424
105 52424 15112 -54289 1413 63365 -9524 -64781 13675 47155 -40838 -46700 59386 52255
117 52255 -53745 -26691 71050 12255 -90275 -17288 79162 -444 -75266 21002 83016 -20079
129b0079n0349R6042K8511r0290p630Q4370n985p1340J6667N1786l0502l6335
141c5134M0513K6816l7936j0918L5674m242l8058N492K8735o642j5201J1418J0405
154A0922n432l234o095q902J2899J4684k0885j4553L3458J4970m4312j4847M8922
167A7595Q631n1148K699N5030j0677n2879J8629M2988l2227l5014M3231K6635
179C3493m7691j1159N3685m201n9240J5137N7827k6793n2560L9051M7264m7004
191b191l9909M9924K8091n1314j5067N1480M564m6706N665L7665j7948l0129K6750
204H75K2559l0057j1182L3296M89l6190M983L2998j0331k6616J6831K2675j8011
217B319j7164J4926P681j3510n87J1274k508m136O959k863j1505O379J0964j0316
$$ plain form
129 -20079 -70428 25614 54125 -36165 -43795 40575 34590 -36750 -20083 31703 1201 -35134
141 -35134 5379 32195 -5741 -16659 19015 14773 -23285 -17793 10942 4300 -10901 517 10922
154 10922 5490 2256 -3839 -12741 158 14842 -6043 -20596 12862 27832 -16480 -31327 17595
167 17595 26226 -24922 -22223 32807 22130 -30749 -12120 30868 -1359 -36373 6858 33493
179 33493 -14198 -25357 28328 24127 -35113 -19976 37851 11058 -41502 -2451 44813 -2191
191 -2191 -42100 7824 35915 -15399 -30466 21014 25578 -21128 -15463 22202 4254 -25875 875
204 875 23434 -6623 -17805 15491 15980 -20210 -15227 17771 7440 -19176 -2345 20330 2319
217 2319 -14845 81 7762 -5748 -6335 4939 2431 -1705 5254 2391 -9114 -2735 8229 -2087
231b087p133J6303N259j8451k139J6029n961j5265J3123J4314j5980p267K1430
244A2175o48k8538M628K9354j1117k7612K0978K8618k6539k6944K8797J9272l3829
257a1405j2896L7846Q852l5679q23L2751r424l2900J4278K8941j7712k0628K5161
270F362J6317k9222j3455K7370N670k7850O06K9432j355k4932M144J9552q881
283C758j8328Q481J5526n691q997O508O161o537o658K159M339L86j991Q73M878
298D867P27p785l842P223J653r466J542J4969j059j6280K719J5564q957j8787
312a6912J2051K0509j2913j6903J7916J4998k3023j5468K2787J0935k3555m634
324a4212K7492K695k7112RK3685o859k3738J0690K3647j1021j8530J4519J4814
$$ plain form
231 -2087 -9220 7083 12342 -6109 -8248 7781 1820 -13445 -322 13992 -1988 -9255 12175
244 12175 11527 -17011 -12383 16971 5854 -21758 -780 27838 1299 -25645 3152 22424 -11405
257 -11405 -24301 13545 22397 -13282 -14105 18646 9222 -23678 -9400 19541 1829 -18799 6362
270 6362 22679 -6543 -19998 7372 13042 -14808 -14202 15230 13875 -11057 -6913 12639 3758
283 3758 -14570 -6089 9437 3746 -5251 1257 7418 881 -5777 -3618 721 1107 -884 -11 4867
298 4867 5594 -2191 -6033 1190 2843 -6623 -5081 9888 8829 -7451 -4732 10832 1875 -16912
312 -16912 -4861 15648 2735 -14168 3748 18746 -4277 -19745 3042 13977 -9578 -14212
324 -14212 13280 15975 -11137 -11128 12557 5698 -18040 -7350 16297 5276 -13254 1265 16079
337A6079j8583j4682J7456J1440j6094n888J8589N105j8037n235J3877J217j3390
350h146Q37J4399J425j0983o88Q365k135j0319M21J0238J830p293M62Q299j746
365D966j1485q46J0276K77r157L538J2600l559j3926K439J0994o598j1566R960
379b087J4148q567j1359J0022P837j4927q981J5078Q073j3218k640J6110P03j8010
393g818j445J4714k294j3483O810J5775n938j3736N982R312j0185r555J1157J0052
407I348q373n799R586L287j2053n084R562L707p321J20R640N63r822k554O308
422A115j56o437J891R002P27p415j002N326k245p873J762R205M27o591K015O689
438F440m726r655L159Q610l235n913P088P368p998q338O506N007q503l309J1469
$$ plain form
337 16079 -2504 -17186 270 11710 -4384 -10272 8317 13422 -4615 -9850 4027 5244 -8146
350 -8146 -7309 7090 8515 -2468 -3156 5209 3074 -7245 -6824 3414 5244 -2049 -1587 6712 4966
365 4966 -6519 -7365 2911 3188 -5969 -2431 10169 6610 -7316 -4877 6117 -481 -12047 -2087
379 -2087 12061 3494 -7865 2157 9994 -4933 -13914 1164 9237 -3981 -6621 9489 10192 -7818
393 -7818 -9263 5451 3157 -10326 -3516 12259 6321 -7415 -1433 7879 -2306 -11861 -704 9348
407 9348 975 -4824 4762 8049 -4004 -9088 474 4181 -3140 -3020 6620 7183 -2639 -5193 1115
422 1115 959 -5478 -3587 5415 6142 -1273 -2275 3051 806 -7067 -5305 3900 4327 -2264 -249 6440
438 6440 1714 -7941 -4782 3828 593 -5320 1768 9136 1138 -7200 -694 4313 -4190 -7499 3970
453C970M560j0022k740R017j111j1380J508J1540j061q620M215Q207o527r219
467g663N355O921n735m183Q352M519q078m208O141J171p057K3Q003J154o051k37
483a573M674j891n857J127N648J16l681J151L824j919n285K18M558N5l522J731
499f26N020j781o171P76N127k126m903M221O419m132o199M367M556o622m513Q051
515A464M929p652k983Q320Q76j0035o16R917j78q507K812Q589m483q866M236O861
531D684n354m796P414M788p240l733O132Q21p193J45P566L15n690J084M660k746
547H57n246J969M476r76k464J851K379k111l434k2K399O30j111R06L065n0m088
564i70j730K690k6l437J626N759o30n199J523M171m312n401N360O049n201m120
$$ plain form
453 3970 8530 -1492 -4232 4785 3674 -7706 -6198 5342 4281 -4339 -124 8083 1556 -7663
467 -7663 -2308 4613 -1122 -5305 3047 7566 -512 -4720 1421 2592 -4465 -4442 3561 4715 -1336 -1573
483 -1573 3101 1210 -4647 -3520 2128 2244 -1437 -286 3538 1619 -3666 -3448 1110 1165 -2357 -626
499 -626 4394 2613 -3558 -2782 2345 219 -4684 -463 5956 1824 -4375 -8 4548 -2074 -6587 1464
515 1464 6393 -1259 -4242 4078 4954 -5081 -5697 4220 4042 -4465 -1653 6936 2453 -6413 -2177 4684
531 4684 -670 -5466 1948 6736 -504 -4237 1895 2716 -4477 -4332 3234 3549 -2141 -1057 3603 857
547 857 -4389 -2420 2056 1080 -1384 467 2846 735 -2699 -2721 -322 308 -803 103 3168 3118 -970
564 -970 -2700 -10 -36 -3473 -1847 3912 3282 -1917 -394 3777 -535 -5936 -576 5473 272 -3848
580c848O866K614r465l367R175K390p978J130R876j801j0352J158P199m394o706
595g503O483P411n051m471N824J848p987k038P215J139n656J390N898k502o383
610d383J333M551j456k469L290L568j712l394r04L73n13r67M67L098K852j204
626B530k684P80J138l324k436L798K922l063j047M077o04n767P98N753j457m362
642b948M636N082o202o261N158L450p131k099R522L420p664j143P036j740q618
657e502J245O911j956m545M354M069n027l310M619J372m805P86N718j007n373
672b451Q82L439k871l654L065M190r03j551J461P99j931j993o66O83J652M71j186
689e64O43K371j019l404P00L174j112k445K288K139l274k073K871L18l470J622
$$ plain form
580 -3848 3018 5632 -3833 -7200 1975 4365 -3613 -2483 7393 5592 -4760 -3602 3597 -797 -7503
595 -7503 -1020 6391 1340 -3131 2693 4541 -3446 -5484 1731 2870 -2786 -1396 4502 2000 -4383
610 -4383 -3050 1501 45 -2424 866 4434 2722 -672 -1576 -1203 -1716 -2683 -2216 882 3734 2530
626 2530 -154 626 1764 -1560 -3996 -198 2724 -339 -1386 2691 2087 -3680 -2882 2871 1414 -2948
642 -2948 1688 6770 568 -5693 -535 2915 -4216 -6315 3207 6627 -1037 -2180 4856 3116 -5502
657 -5502 -4257 2654 698 -3847 507 4576 -451 -3761 858 2230 -2575 -1789 3929 2922 -2451
672 -2451 -1569 1870 -1001 -4655 -1590 2600 1697 146 1607 2406 475 -1518 -2184 -1501 151 622 -564
689 -564 79 2450 1431 -1973 -1273 1901 789 -1656 632 2771 -503 -2576 295 613 -2857 -1235
705a235M994j731m309K972L478n329m357N336L732n431k025O612J800o454j216
720c163N412k61m976J319M369j911l204K428J699l300o09L840J05l392J157L402
736B915j964l736J648K837j749k081K106K103j219j488M30O20p4l83p05K47J511
753A018M8j967j01K136k23k250O39K190q37j722J197Q75j896k03K214o22k392
770a896J727K667k602k777L289K537l993k316M385K012m445j457M358Q15l979
785a675k14L495m29k755R53J979j434j104J872M22k165K51K271p85k258J061K147
802A632j089j871J111J602q79j426L57J130J01p68m95N82J008n37j414L85J539
819I68m39j647O00J562o94j320Q84Q09j096k45J382m06j519R87J452j812j517
$$ plain form
705 -1235 3759 2028 -2281 691 4169 -1160 -5517 -181 3551 -1880 -3905 2707 4507 -1947 -3163
720 -3163 2249 1988 -2988 -1669 2700 789 -2415 13 1712 -1588 -2197 1643 1748 -1644 -487 2915
736 2915 951 -2785 -1137 1700 -49 -2130 -24 2079 860 -628 -198 422 348 -35 -740 -493 1018
753 1018 1066 -901 -1002 1134 911 -1339 -700 1490 653 -1069 128 1003 -893 -1096 1118 496 -1896
770 -1896 -169 2498 -104 -2881 408 2945 -1048 -3364 1021 3033 -1412 -2869 1489 2304 -1675
785 -1675 -1889 1606 1177 -1578 -625 1354 -80 -1184 688 1110 -1055 -804 1467 682 -1576 -515 1632
802 1632 543 -1328 -217 1385 506 -920 -563 567 668 -100 -595 -13 995 458 -956 -571 968
819 968 529 -1118 -518 1044 350 -970 -86 723 -373 -618 764 358 -1161 -174 1278 -534 -2051
836b051K452J478k668j163L155R88l321p68L022J91k952J59K682l36j936Q62J522
853A316j062q90J165K31j498J16J371n36j328Q24J388p19j027Q42R90n44j008
870c69l1N51L4p09n60P63J181m86j096R72J440j207j772R78J192j519j119J755
888bR21j613r9K093k90k039Q48J837j651k009J935J489k564j202K972J206k605
905g73l46L080O3l019q7K185r00k204J009J840p29p81J430O93j288l65R13l66
923C55j129L01O85m96n04N76M81r7J01J94K5K32j44j054m30P98j59j326O14K164
943A187k54j668J019J684j603k098J503J353k070j037K505P24k401j4K727l93
959A164k458J143K310j711k375J667J543k363j141K742J231k158k38K435k55k433
$$ plain form
836 -2051 401 1879 -789 -1952 1203 2191 -1130 -1898 1124 1315 -1637 -1478 1204 868 -1068 -206 1316
853 1316 254 -636 529 760 -738 -622 749 213 -1115 -291 1097 378 -649 193 1183 639 -369
870 -369 -400 151 185 -524 -1084 -321 860 374 -722 250 1690 483 -1289 -311 881 -638 -1757 -2
888 -2 919 -694 -793 1300 1010 -1029 -181 1656 5 -2004 -69 1420 -1144 -2346 626 1832 -773
905 -773 -1119 1961 2024 -995 -1082 1103 203 -2001 -992 848 119 -662 768 1461 173 -192 721 355
923 355 -774 -473 212 -284 -788 -212 269 172 273 467 492 724 580 -474 -904 -106 -265 -1591 -977 1187
943 1187 933 -735 284 1968 365 -1733 -230 1123 -947 -1984 521 1245 -1156 -1170 1557 1164
959 1164 -1294 -151 2159 448 -1927 -260 1283 -1080 -2221 521 1752 -406 -644 1791 1536 -897
975h97M3J573p39j380J027J221p95n15R05K41p42N7M93l01l52J93j82m58K12K78
995a18l69L20J033k33q41M82N63j307r37J396N78j494j5K037j20j967M94J886
1013A388j104j791J452J588j780j257J901P16k116k15K352l7j989O66J804j255
1029C23j783J291J210j528p15J840O10j681j32J433l48j425N56J105o60p39P77
1046A34M30q81j38P22q4n07M20L43n43j43L93l05m55N62L99n98OP66k50r05M08
1067b26P52p53n82J079N36j247j44J302k08j465M94J431p28j205J145R69j425
1084b75p43J517L89j541j8J640l46j499O13J274r81j054J194Q20j261m36J328
1101F21L7j377J91J177m36r58O29Q16p91n18P87K35q18k4P38j05n83K71L82l90
$$ plain form
975 -897 -854 719 -20 -1400 -373 848 53 -462 443 684 -58 -1 492 191 -161 32 -150 -608 -396 -118
995 -118 -487 -167 866 633 -208 274 837 -470 -1407 -11 567 -927 -942 1095 975 -992 -498 1388
1013 1388 284 -1507 -55 1533 -247 -1504 397 1113 -1003 -1218 1134 1097 -892 -226 1578 323
1029 323 -1460 -169 1041 -487 -1202 638 1248 -433 -565 868 520 -905 -349 756 96 -643 134
1046 134 564 -317 -455 267 183 -324 96 439 -104 -247 146 -159 -614 -52 347 -251 -245 521 271 -634 -226
1067 -226 526 -227 -809 270 806 -441 -585 717 509 -956 -462 969 241 -964 181 1150 -275
1084 -275 -1018 499 888 -653 -671 969 623 -876 -263 1011 30 -1024 170 990 -271 -707 621
1101 621 658 -719 -528 649 213 -745 -116 700 -91 -609 178 413 -405 -429 309 204 -379 -108 274 -116
1121a16k13L73N3k34J71J45k87L7K53j80l78M39L01n81q3P42n0q75K52Q81m79
1142A71q65P81P65r95o26J168M31j338j86J442q6j433L27J426o99j321R02J125
1160I89j069q76J187O78j331l96J304J25j289J11J181k62j023M05Q32m97o74N33
1178g2N00m89l42M32K20k84j86K03J44m5k40J9K79J21m22j12N60P3o95nQ35q2
1200D12r45K69J016m77j032O79J032r65r31J132P60j275o24J499L43j551j47J599
1218G94j26j580L66J475o02j346P73J134q52r77R92P45r98n58J001L31r09k16
1236e53Q16J48o97q8N66R0m30j19L45K20k58l47K85M86l60n98M19P08n45p34P27
1257H1P28r01o74J048N87j245m41J391K14j444rJ538k99j502M75J469p89j303
$$ plain form
1121 -116 -329 44 97 -137 34 179 -108 -71 182 2 -376 63 364 -217 -300 442 392 -483 -231 650 171
1142 171 -694 87 852 -143 -769 399 830 -508 -694 748 662 -771 -444 982 283 -1038 -136 989
1160 989 -80 -956 231 909 -422 -818 486 611 -678 -567 614 352 -671 -266 566 69 -605 -72
1178 -72 428 -61 -403 29 249 -35 -221 -18 126 81 -159 -140 139 260 -162 -274 286 359 -336 -341 494 412
1200 412 -533 -264 752 275 -757 -78 954 -11 -942 190 950 -325 -949 550 893 -658 -805 794
1218 794 668 -912 -546 929 327 -1019 -246 888 36 -941 51 796 -202 -760 241 572 -337 -553
1236 -553 263 411 -286 -374 192 282 -148 -267 78 298 40 -307 -22 464 104 -494 -75 633 88 -646 81
1257 81 809 -92 -766 282 869 -376 -817 574 788 -656 -665 873 574 -928 -453 1016 227 -1076
1275a076R83J117j138q82J233O00j248m01J249J91j161M4R81k32p98K98O51l56
1293E5m08L38K80k86j38J49L9pK9j02qK93o2m95K10N10l11o03N79N99p86n07R66
1316C34L72j082k56J224K9j289K07J260m63j205O83J067r24p70J044O02j210l36
1334g13J177K5j124K28J068m78q65O48O34p30m55P97J57p30J21O02l23m36M85
1353H8K07n28L7O07l06n40N34L96p39k49Q69K7q89K91Q88n18q14O59O52r01m14
1374f43J055J76j083O9J109l83j034O09Q85q64o08R42L88j000j37R68j07q67M02
1393a23O57n92m99P30J63q18J49Q18l89o02O52M95q83l35R88m2j038L37R85n53
1413A00q63R00O63j036m01J233O6j324K12J232n88j194Q56J051r84o48J236L90
$$ plain form
1275 -1076 -93 1024 -114 -996 237 837 -411 -812 437 628 -533 -489 492 260 -538 -240 411 55
1293 55 -353 -15 265 -21 -159 -10 29 22 51 -51 -59 234 172 -323 -113 397 86 -517 62 661 -125 -632 334
1316 334 706 -376 -632 592 621 -668 -461 799 336 -869 -186 881 -43 -813 231 833 -377 -713
1334 -713 464 489 -635 -407 661 183 -682 -34 600 -130 -585 212 369 -361 -240 362 39 -397 88
1353 88 295 -233 -196 411 105 -435 99 495 -244 -493 376 403 -486 -195 693 175 -639 20 672 -229 -643
1374 -643 412 588 -495 -426 683 300 -734 -125 760 -104 -712 230 618 -382 -519 449 342 -525 -123
1393 -123 534 -58 -557 173 336 -482 -333 485 96 -506 146 641 -242 -577 411 369 -669 -332 653 100
1413 100 -763 137 800 -236 -637 596 662 -662 -450 782 194 -1000 -144 907 -77 -725 511 901
1431I01j271k02J157k57j100M18R22o10n92Q53M13q58o4Q34k36p80L36N07o63
1450b92l28P40J38o68L35P61m99n54O68J67r67j29R76k77r41P06J062q33p36J143
1470D72M98j372l25J384j78j492M21J370o54j083J138R74j153n90J255J81j504
1487f58r8J255l57j163P08J140o95o75R34M63j004k96Q19k32q14K95O26m52k32
1506d36O96J78n51K36N62n84n47N05O4q15J03R32k13o58P41P11q47n61R67J51
1526F34j344j4J214l36j156P57J184p71q38J158O27j352m87J213j8j423K90J234
1544E72m17r03Q63R14r43n55R22J28j118l7R02k58q01N48O89m98l47P49J35p37
1564a92L6N09l88n57M63K88n21K7P77j22n49L85M88o95m86P34R7q72J50Q91k66
$$ plain form
1431 901 -370 -572 585 328 -772 -354 568 -42 -634 219 632 -226 -290 544 308 -472 -136 371 -292
1450 -292 -620 120 258 -410 -75 686 187 -367 301 468 -499 -628 348 71 -870 -164 898 65 -671 472
1470 472 970 -402 -727 657 479 -1013 -592 778 124 -959 179 1153 0 -590 665 846 -658
1487 -658 -756 499 142 -1021 -313 827 132 -543 391 854 -150 -446 373 141 -673 -378 248 -204 -436
1506 -436 260 438 -113 123 685 101 -446 59 123 -692 -589 343 130 -528 213 924 77 -484 483 634
1526 634 -710 -724 490 154 -1002 -245 939 168 -670 488 1115 -237 -724 489 471 -952 -662 572
1544 572 155 -748 115 1029 86 -469 453 581 -537 -574 328 70 -731 -183 506 8 -339 410 545 -192
1564 -192 -156 353 -35 -592 -129 159 -362 -335 442 320 -229 156 644 -51 -537 197 294 -578 -428 463 197
1585A97p92O51P45p78n36Q96K25j078j04J013k26r49N37R13n80o73Q72M09r88
1604b46k91Q95p9r17K66Q96m28o54O69M78p25k58P56k3p67J64O43m06m75N12L67
1625C77n06j72O81j23n51J76M76m53l61N37K21n59N2O15k30n55L63M66n43k97
1645c86O11P9o28O7O49k24n86M31M99o12l46P18J10p35N6P18k62o18M32N19n72
1666h0l74O29K07p39L8O64j62n81L30N02m75l90N71K05o26pO09j39n60K98M64
1687C84m02l27N10J83n58l7M98j38m32K62L71l68k14M57Q3m50J1M72k47l72K86
1708b8L04l81j80M91K0m63J11M49k55l84L47K84m73j34M71K6m59J28M38k05m21
1729c14L50K47m24j79M42Q8m86J21M87k69l85M14K47m39j70M71J0m93J06M61j97
$$ plain form
1585 197 -595 56 801 23 -513 383 608 -470 -574 439 213 -736 -199 714 134 -539 333 742 -246
1604 -246 -537 358 279 -638 -372 524 96 -558 111 589 -136 -394 362 339 -428 -264 379 -27 -502 10 377
1625 377 -129 -301 380 257 -294 -118 358 -95 -456 81 302 -257 -205 410 180 -375 -12 454 -89 -386
1645 -386 225 304 -324 -257 392 168 -418 13 512 -100 -446 272 382 -353 -297 421 159 -459 -27 492 -80
1666 -80 -454 175 382 -357 -319 345 183 -398 -68 434 -41 -431 140 345 -281 -288 321 182 -378 -80 384
1687 384 -18 -345 165 348 -210 -247 251 113 -319 -57 314 -54 -268 189 272 -178 -167 305 58 -314 -28
1708 -28 276 -105 -285 206 226 -237 -126 323 68 -316 31 315 -158 -292 179 205 -254 -126 312 107 -314
1729 -314 36 283 -141 -320 122 210 -276 -155 332 63 -322 92 339 -100 -270 201 211 -282 -176 285 88
1750H8l91L40L16m40j55M46M6m78M1M55j64l83K77K69l00k10L60J09m04M5L34
1771B01j16k81J79K24k78j26L03Nk92J09K31j68j91K77R7l27J0L28j25k67J83
1792b4K56l12j39L21R6l76J1M02p4m26K27L56l29k86L90J89m29p0M23m1m26J47
1814a14M21k59l16K80K49l49j60L88M7l50L8L21j58k41J86J83j96j57K59L0k53
1835a51O7J97q3j80J66J18j98oJ81r4j60J53J51k62m9K84J0k81N4K93j59k66K26
1858A1K09l08j46L77M9l60M4L59j31l27J80K70k92j71L36J18l43j5L20o9l47J90
1880d6K76k33k37L15J12k95j6K63o7k79J36K65j84j76K29M5k31m2L01r5k17J33
1902d3J97k17j13K64M2k87O9K57j07k48J70J90k72m0K30O2k87O6K52j32k16K25
$$ plain form
1750 88 -303 37 353 -87 -242 204 250 -228 -187 268 104 -279 -2 267 -33 -243 117 226 -178 -133 201
1771 201 85 -196 -17 207 -71 -197 106 111 -181 -72 159 -9 -200 77 174 -153 -143 185 60 -207 -24
1792 -24 232 -80 -219 102 198 -178 -167 235 161 -265 -38 318 -11 -297 93 282 -147 -217 206 165 -261 -114
1814 -114 307 48 -268 12 261 -88 -248 140 187 -163 -125 196 38 -203 -17 166 -30 -187 72 102 -151
1835 -151 -84 113 30 -150 16 134 -64 -70 111 17 -143 10 161 -101 -150 134 144 -137 -83 210 51 -215 11
1858 11 220 -88 -234 143 192 -168 -124 235 104 -223 -43 227 -65 -236 100 218 -125 -140 180 111 -236 -46
1880 -46 230 -3 -240 75 187 -108 -124 139 72 -207 -71 194 10 -166 63 108 -123 -165 136 41 -176 -43
1902 -43 154 -63 -176 88 130 -157 -88 169 62 -186 -16 174 -98 -138 92 154 -133 -67 185 53 -163 62
1924F2J18k40p5K67j0k96J15K68k05k32K70J58l01q7L58k3l42J03L23k09k93L00
1946B9J90l01j31L63M8m23N8L97j79l14K48K87l28j77L33R8l61J7L22j00k93J96
1968b1J99k06j62K68O6k55O4K05j38j97K29J45k52k7K31m9k49J56J74k21j29K44
1990G5J32l63L9L37j58l00K17K82l30j85L28J28l75n0M70j03m18K02L60k93l06
2011c11L44K37m25j19M78Rm38Q2M23k00l57K85K46l15j53L70N6l71L2K98r5k51
2033a75J51K61k88r4K73k8k34O7K46j61j05K03P0l02J8K66j21k62K11K03l26q0
2055b07L67Ql83Q1L95j71l66K93K93m20k48M55J04m44M0N15j06m94K46L71l78
2076d9l13L78K51m27j09M82K3m11Q6L65k03l13K36K40k94j52L20K8k89N0L12r9
$$ plain form
1924 62 180 -60 -135 132 122 -174 -59 209 4 -228 42 200 -101 -188 170 147 -195 -92 231 22 -271 29
1946 29 219 -82 -213 150 198 -225 -167 230 51 -263 -15 272 -56 -233 100 198 -163 -146 176 76 -217 -21
1968 -21 178 -28 -190 78 144 -111 -47 158 20 -177 52 197 -55 -82 149 100 -149 7 181 -40 -169 75
1990 75 207 -156 -117 220 62 -238 -21 261 -69 -254 74 202 -173 -223 247 144 -274 -72 288 -5 -311
2011 -311 33 270 -155 -274 204 213 -225 -143 280 80 -277 8 254 -61 -214 156 212 -159 -127 171 76 -175
2033 -175 -24 237 -51 -145 128 100 -134 -67 179 18 -87 116 186 -116 -98 168 47 -215 -4 199 -127 -207
2055 -207 160 168 -215 -134 261 90 -276 17 310 -110 -358 97 201 -243 -203 312 206 -288 -42 329 -49
2076 -49 -362 16 267 -160 -269 213 236 -175 -89 276 73 -240 -4 236 -58 -210 110 138 -151 -101 211 112
2098A12j89J55J08k62n6J79n9j86J70J80j36q9K73l0l19M5K79j43l14K61K45l68
2120a44j24M41L0l89O7M52k13l94K61K53l94k34M77J76m23J6M45m9m76J67L19
2141B64k76k91L44K24l79m5L66l8l62J07L36j54k60K25Q8k67p3K67m7j74J33K28
2163B16j98r2K10l4k62jK71j45j75K40K11l07p0K80K4l46Q5K79j58k87K50J88
2185A79k89j18L78O7l72P0L39j52l15J74K62k93j66L33J16l16L0L00q9l31J70
2206b3K06k00j49K58Q4k63K1K05o4k12J25K03k13j06K12M0k67L5K63j33k03J98
2228A7J66k42p1K39j8k39N9K62j50j86J66J40j88n9K08Nk61J01J90j27j35J45
2250B2J17k03l3J98K9k46N8K18j22j28J29Q7j96j8K03pk35P7K04j23j61J49R6
$$ plain form
2098 112 -77 78 186 -76 -132 47 -12 -198 -28 152 16 -73 200 170 -149 -104 175 32 -282 -21 224 -144
2120 -144 -268 173 203 -186 -119 333 120 -274 -13 240 -154 -388 89 265 -158 -142 303 254 -222 -55 264
2141 264 -12 -303 41 265 -114 -159 207 169 -193 -86 250 96 -164 61 149 -118 -191 76 29 -145 -12 216
2163 216 18 -74 136 102 -160 -161 110 -35 -210 30 241 -66 -136 144 168 -178 -93 186 28 -259 -9 179
2185 179 -110 -228 150 217 -155 -85 254 102 -213 -39 223 -70 -236 97 213 -103 -73 227 138 -193 -23
2206 -23 183 -17 -166 92 176 -87 -66 139 75 -137 -12 191 -22 -128 84 124 -143 -108 155 22 -181 17
2228 17 183 -59 -130 109 91 -148 -89 173 23 -163 3 143 -45 -104 104 109 -152 -51 139 12 -123 22
2250 22 139 -64 -97 101 130 -116 -58 160 38 -90 39 126 -70 -88 115 108 -127 -50 154 31 -130 19 115
2273A15k08nK12j8k08Q8J88j66j45J64J05k03l0K21K4k07L4J17j25j18J96O9j61
2296f1k8J73kj91N7R7n8j00J29Q7j15k8J03j8j38Q2R2q4j3R6k2r3MP4m1o3R6J29
2324A64j74LR5k2k06O0J15m6q1J48J04j60n8J21j4j81N4J30m2j08R4J07j49q3
2348a29J91L5j05L2Q4l1j70oR3o7l3J51N4o7M2K3Pj67LOk4L5Q5J0l6J8L1m2m5
2377b2J14l3l9NK9j20n8O6M6j8N0J68m8j30J2L3j24j47J32J06p1K8J31Qj36qJ16
2404I0o9p0L1Q6r1r0N8jk4K6J51K1m7M5m2q1q5j5K2k5N5J51Km7L4oj17l0O2%o1
2435f7Q2M7n4q3R9Rn1M2Q5j1j37K8Pj25k6J24O3p1J09R7p4j36L0J8j00qJ16L3
2463D6q5M8N8p0p1N7Q6m5q1J20K0j53lR2o7l7J22R9p0n9Q7m3j09k2Q2nk0N3J05
$$ plain form
2273 115 -93 -98 114 96 -112 -24 164 -2 -147 17 122 -81 -111 110 134 -73 -39 78 -47 -165 31 100 -61
2296 -61 -89 84 82 -109 -52 45 -13 -113 16 103 -12 -40 63 45 -93 -11 81 -3 -16 80 58 -35 -31 43 2 -61 35 164
2324 164 -10 -7 88 66 -140 -80 35 -11 -92 56 160 0 -58 63 49 -132 -78 52 10 -98 -4 103 -46 -129
2348 -129 62 97 -8 24 108 77 -93 -99 -6 -73 -106 45 99 32 74 97 104 -63 -60 -54 -78 -43 42 52 16 34 65 23 -22
2377 -22 92 59 20 25 54 -66 -124 -58 -12 -30 20 188 140 10 22 55 -69 -216 -84 22 -49 -21 110 118 -18 -26 90
2404 90 21 -49 -18 68 -23 -113 -55 -56 -80 -54 97 118 71 116 74 -7 -92 -107 -85 -110 -55 96 98 51 85 79 -38 -68 -6 -6 -67
2435 -67 15 62 8 -75 24 33 -18 24 109 98 -39 -11 -4 -129 -155 -31 32 -39 70 167 93 -43 -13 5 -95 -103 13 46
2463 46 -39 9 67 -3 -74 -17 69 24 -57 63 83 -70 -73 19 -48 -85 37 136 66 7 94 51 -58 -80 2 -3 -23 30 135
2492A35r9o3N9J1j09j2J27J3q1L0J3l9k3K5J2MJ6L6l0o8J6K4r1R2N6k9k9LO9j18
2522e0%O6no6L9J01k4r9M9N8j05JQ6Jp9j5J44m3j07K1J41j07n5N8O4r4m1P6M2
2551E7p1n1J14j2j04N7P5l7k1LLj7k7pL0J5mLlLMn4j4N3j6qM3K1qk8J6Nn5nO4
2586B4K7o8KN4oq9MJ08m4n1Q4R3j29q0N0K1m1oJ02N6j02J8L0k8j21L2Q2J3l2K8
2616C1N6q9p4PQ2k8k7P6N5m1o1jj0m6J2N6M1L8m1m1Qp2l1N9P5J6k4NK1k7r6J8
2648e3O2n9J7J36L1j09m7J0J7j00N0J11Pj7k3J1m4p8j3R4M6l0PP5p5q8k9N6jp
2678d3P1O5k3r3k7J9m1j9P4P0J2qj7j5p3p0Q0L4M2LM9k2q1l8j3L0j5L7Q1L5n0
2709E4n6rm6QK2M5P8Qn8n1Mm3k3K4Q7K1l7K3K2p0o5rN5J0L2M1j4o9l5N6l5j3Q
$$ plain form
2492 135 36 -27 32 43 -66 -78 49 62 -19 11 24 -15 -38 -13 -1 3 19 55 25 -43 -27 -3 -94 -2 54 25 -4 -1 68 -50
2522 -50 -50 16 11 -55 -16 85 61 -38 11 69 -36 -35 51 52 -27 -42 102 59 -48 -27 114 7 -48 10 74 -20 -61 15 57
2551 57 -14 -65 49 37 -67 -10 65 28 7 10 13 -4 -31 -38 -8 7 3 6 3 6 10 -44 -58 -5 -21 -29 14 35 27 -1 15 20 -35 -40 24
2586 24 51 -17 -15 39 33 -56 -52 56 12 -39 45 138 9 -71 -21 0 -41 -47 55 111 9 27 57 29 -92 -60 22 35 3 31
2616 31 87 -2 -76 -69 13 -15 -42 34 89 48 -13 -14 -24 -70 -58 -2 39 77 36 -5 3 -69 -100 -41 34 50 26 31 52 25 -71 -53
2648 -53 9 -50 -33 103 134 25 -22 -12 5 -95 -45 66 73 56 33 44 0 -78 -91 3 49 19 26 101 26 -62 -91 -35 -36 -43
2678 -43 28 93 70 -23 -50 -31 -72 -91 -17 53 65 57 40 25 -48 -118 -38 -4 38 41 90 68 -13 -51 -64 -34 -49 -12 69 104 54
2709 54 -2 -11 -57 -49 -27 18 96 104 46 -5 -1 -44 -67 -43 44 65 28 51 73 3 -62 -71 -16 -6 26 67 53 -16 -51 5 -30 -43 -35
2742c5J06Nn9qN5p7r4N3M8MK1M3Ln5m9K1Jj0J3L4L5j9K1o7l4L5K5n7N6O2Lm3j5
2775B2k1k3k8M8N6n8qO6n1p9O7M2o3l4J09M4j02n5J14Kq2j9R0J0j01N0O5o8m8
2804e5L7M3l1l1N6K1n8J3O9o5n5N0N1m0l9O9ok6K8k7m3N6K9m2NK8K3o7p5R7L2
2835D7j04J5J04J3j08J8N7n7n4N9R6j07l8J43kj33K5Q0m5r6M5J27l6j11P0P1j10
2862c1m3P1Q7j07j3P0k5ok6M6q0K7J02m4m6J7N4p9l8L9L8l3J1P7k5l6%K0q5RP9
2893C0rq4Q1N1q6q3J07Q7p7j01J30N9j42m7J17j4p2O0O1j9p2O5K3j15k2J09m5
2920hr5N4J43l3j02P3O1p6j09Q4M4o8J7L1m2PM6k7m1O1Q7n4j01O0N3j50m8J27
2948fN6q9N3J01k3q6LM2j25m7K01k7j34M6J47n4j58P9J56j18q2P0J00j44n4O9
$$ plain form
2742 -35 71 76 17 9 64 -13 -107 -54 -6 -2 19 62 65 10 -39 -18 -17 -27 -14 20 55 36 57 -10 -44 -9 16 -41 15 77 80 37 22
2775 22 1 -22 -50 -2 54 -4 -12 54 3 -76 -9 33 -30 -64 45 89 -13 -68 46 48 -34 -53 37 47 -54 -4 61 -7 -55
2804 -55 -18 25 -6 -37 19 40 -18 -5 64 -1 -56 -6 45 5 -34 35 29 3 31 4 -39 17 46 4 9 37 60 -7 -82 15 47
2835 47 -57 -42 62 75 -33 -15 42 -15 -69 -10 86 -21 -59 84 82 -51 -26 54 9 -87 -42 85 49 -62 8 79 -31
2862 -31 -74 -3 84 -23 -36 34 9 3 -23 23 -57 -30 72 28 -18 -1 53 -26 -64 -25 13 -20 -9 68 43 7 7 27 -58 -49 30
2893 30 21 -63 18 69 -17 -100 7 94 17 -84 46 105 -37 -84 33 19 -53 7 68 49 -23 42 65 -50 -72 37 -8
2920 -8 -103 -49 94 61 -41 32 93 17 -92 -8 36 -32 -15 16 -26 -19 27 0 -41 20 107 53 -48 12 65 -85 -133 -6
2948 -6 50 -39 14 115 92 6 9 51 -74 -121 80 53 -81 -35 112 58 -100 -21 135 17 -65 5 105 -39 -93 -24
2974b4J6p5O1J62n5m5M0J6j74j8J18n7p6Q0J64o3r2P4J8r1j8P1k5r7P9M6r9m3
3002a07J63K0j43P4J64n0j93M0P7j29r2J60J07r8j5J48kj75L7M8o8n9J12O8j45
3027e8K0J16l9j44Q6J29m7j15N4N7j39j0P1Ql4N2J40q9m6N0qj53MJ59o4j18J48
3054C0N4j03l2P2O8j48QJ42n2j22N7J12j47n8J61M5r2nJ32n9j64N6Q6p3r9J21
3080a0J25j18l3Q4J0j29N1Q0n8o0Q7O2j35J5P3k9p0Q7N0o5m7N7qj15L9R6Kq4N4
3109A1O9j04j9Q0M1j50QJ24k3j28R6R0j14p2R4Q6j46QJ30l1j27O9J10r9p7Q2P0
3136G8j39j6J46n2r7M4J40o8r3P7M8r9NP6j6q9O8L6n9l3R1K3j05L1P2m6r2M1J11
3165H3j17m8J02M9j30K3Q6mj12O4O2o6p0J01L7j30PJ34j2j16O5P1o6j00O0M8o8
$$ plain form
2974 -24 -8 -83 -22 140 85 40 80 96 -78 -96 22 -35 -111 -31 133 70 -22 52 70 -21 -39 32 7 -90 -11 35 -64 -107
3002 -107 56 76 -67 7 171 121 -72 -32 45 -84 -176 -16 91 -7 -22 126 124 -51 -14 34 -34 -93 19 87 -58
3027 -58 -38 78 39 -105 -19 110 63 -52 2 59 -80 -90 -19 -11 -45 7 147 58 12 62 54 -99 -95 64 0 -118 30
3054 30 84 -19 -51 21 89 -59 -51 91 39 -83 -26 86 -61 -119 42 87 -5 -10 122 63 -101 -45 41 -32 -131 -10
3080 -10 115 -3 -36 48 58 -71 -20 60 2 -58 29 91 -44 -29 44 15 -55 32 82 17 -30 27 19 -96 -57 39 41 -43 11
3109 11 80 -24 -43 37 78 -72 -64 60 37 -91 5 95 -19 -91 3 89 -57 -49 81 50 -77 -8 102 3 -74 8 78
3136 78 -61 -77 69 17 -80 -36 104 36 -57 20 68 -31 -26 50 34 -55 13 49 -10 -43 48 71 -34 -3 69 23 -69 -28 83
3165 83 -34 -82 20 69 -61 -38 48 44 -68 -4 58 -8 -78 23 60 -70 -63 71 59 -57 8 79 13 -87 -27 21 -47
3192d7oJ24pq5K1R2j19o5P4O1p3pJ15l4r5L3J24j28j3P2Mp5j3J09l8r9L7Q5l7
3221A0o5R3Q6j76jJ11n0q7K9J26j06k3Q2N4j08l8J10l4m3L1P4r2l7K7N3p4J1R6
3249E9k2r2M6O7r7l4J10K8r7K8O6k5j11O5R2j22k1J10j8l7K6O5n3r0N0M5l7o3
3277f2Q0N1p7pP9l3r7P7O2m7p9R9nr7JR0k5o5M9O9p2k3M5L1p2qP3j9o5N1N6n5
3309Eo6J08lo6K3N1j8q6N3O4r8l6J00L3j05L0P1k9q8Q9K4q0l2Q6Lo3J4O1qo9k
3340c4Q5n5m2M2L5o6nQ1l2m8O7K8n7k7L6J2n8PP6k2n8N6lk9RM2j2n4J6N1l7m2
3372c8O0L8n3k5M5J6p1L7L6k8l5L4M4o5o3J13j0p6J0J09p2n5M5O9r2k8P7j2m4
3401c4K4O3m4l3J1L7k3m5Q4l0l1lP2j7p6N5M1p5k7R1kp4J7P1p0m6J13Mq8PM2K0
$$ plain form
3192 -47 -53 71 64 -21 0 92 -27 -92 -18 43 -30 -37 78 44 -51 -18 106 -22 -35 37 41 -34 -47 62 24 -75 -38 47 10
3221 10 -55 38 124 -52 -53 58 8 -79 -50 76 -30 -53 29 83 -25 -63 47 13 -30 1 75 -17 -54 -27 26 -48 -37 59
3249 59 37 -55 -9 58 -39 -73 37 65 -32 -4 62 37 -74 -9 83 -39 -60 50 32 -5 21 86 33 -57 -7 38 1 -62
3277 -62 18 69 -8 -15 64 31 -66 11 73 26 -53 46 41 -56 -55 35 10 -55 -6 63 -9 -32 13 44 -28 -36 37 18 -47 4 60 5
3309 5 -61 47 44 -22 1 52 34 -52 1 65 -33 -69 31 64 -41 -11 60 31 -57 32 56 -24 -56 30 33 -30 -16 45 37 -32 -34
3340 -34 51 -4 -46 -4 31 -35 -40 41 9 -39 28 56 -1 -28 8 20 -38 -31 45 23 -35 21 18 -11 -2 40 28 -26 -10 41 4 -38
3372 -38 22 60 7 -18 27 43 -28 9 45 17 -18 16 60 -5 -68 45 35 -41 -31 78 6 -49 -4 65 -27 -55 22 10 -34
3401 -34 -10 53 9 -24 -13 24 1 -44 40 10 -21 -24 48 31 -45 10 51 -24 -51 40 38 -36 -19 52 -18 -64 49 53 -35 -28 14 34
3433C4q7K7Q3o9k2OQ0p4m6P3K5r4O4L9j6l7L0L8p2k6P9ql2oP3q0m9O6K6n9%O5
3465C1j2p5L5L7j9n5O0L3p5KN7J5p2MN2J9j00R2J9q4j5R3j9p3M0P9l3o3N8L3r9
3496c5k0N2J7l9JJ00l7o0J2J5om2P4Rp5K6N3p3o6R8Lo7KJ18k1q5J4K6J3o7O9Q
3528A7n4K2L6l1l3K6M0j4l2O3J4p4j7Q8j8r1N7M3k6k5K1K7q2QR4J2j23N7N5n3
3558Gn6L5M1o0j6O6L7r7O4K1l4n2O5J6n9j9N1Jm4J0N9l7n1O5Pl2k9O9j9n1J9M6
3590B3k6kM9J6j13J3O8l0m2M0O4p9QM4M7j03oP0nm0LM6k8p0N5K7m1j4N3Jq8Q0
3622B0Km3l1O4Jm3qR6k1q8M0M3m4qN6j9k2k3O7o6o3P6O1n5j9Q1k1p1K4L0mm7q
3655d3P5j8rM9m0l5pP2k8l6L6M1n5m5O1J0l6KO0l9m2L1J7k9lJ9j2n1N2N9l2n1
$$ plain form
3433 34 -53 -26 57 -12 -34 -28 52 -22 -68 5 30 -64 0 39 23 -14 16 54 -18 -44 35 27 -5 -11 62 -18 -67 -1 25 -34 -34 31
3465 31 19 -56 -21 16 -3 -58 2 35 -40 -38 19 34 -38 -34 18 37 -63 29 48 -36 -51 42 23 -50 -10 69 36 -27 31 64 -35
3496 -35 -55 -3 14 -25 -24 76 39 -21 -9 6 0 -42 32 41 -34 -8 45 -28 -94 4 7 -60 -58 60 39 -46 -32 -6 7 -60 9 17
3528 17 -37 -15 21 -10 -43 -17 23 9 -23 40 54 -20 -37 51 33 -58 -1 42 16 -9 12 39 -43 -35 59 71 -52 5 60 7
3558 7 -49 -14 27 -33 -49 17 54 -43 21 42 8 -44 21 37 -22 -41 10 11 -33 -23 36 -1 -52 13 20 -12 -41 28 9 -42 -23 23
3590 23 -3 -5 44 60 -53 -40 28 -2 -44 -4 60 -19 -11 33 80 -23 -29 41 36 -4 -1 45 17 -53 2 29 -12 -26 27 28 -60 20
3622 20 22 -21 -52 12 13 -30 -38 58 37 -51 -11 32 -12 -20 36 17 -5 -28 39 -27 -90 -14 47 -8 -27 54 33 -38 -14 16 12 -35 -43
3655 -43 32 14 5 54 14 -21 -28 44 16 -20 16 57 2 -43 18 28 -8 -6 54 15 -27 4 21 -8 -11 8 -4 -55 -3 56 24 -27
3687b7kQ3q6k1P7%p7L6N4m3m2J0O4m1m9R0ok6l2O2j6m3M8O7o0n0N4%n2K5L7k9
3719EkQkj8K1lJ7n6L3L9o6qN0K3o3KN7k3l2pN2j9l9N1J7o1L8J3k4m1K4R0o5o3
3753e2Q7lo9jN2Ro6RO6m0OqK8n3J6qJ7%K9J4l7k5J7N0o7K0M8pk9jM9m4j3K5Ln1
3789b9L7K6l3qK3jj4o1O8%o6L0O0k6m9N1%j2j3K4mk3j9L4K7l7qN3j4k7L6qk9p
3823a9L2K1p1KO9l1pK2Qm0rN5l4l8M8J9m8j3M8Ql1j1N7J3r7O1j6l3lN1k2J9QP
3857B5l4Rj4J5j2k7O7k5l6K1K9lm6J8K6j8J4J4j3m0J3QK0m5K8J9j4mN8j0o2J1
3889hJ0j9j3P5j8j2l2LM4n0RO3n1l2M9j3j0n6N6J8kJ9L9n6k9Mk2pJ3M9%nrL5p3
3924c1l1O5L3o5L4K1l4j6j1J5lj1M3M1o2J1N9n2n2K3QL6l0pK8k2m1O1j3pOL0j7
$$ plain form
3687 -27 -29 54 -32 -53 24 24 -53 -17 37 -6 -48 -38 26 -15 -64 26 20 -6 -38 24 8 -35 13 80 20 -30 24 24 -28 -3 34 5
3719 5 3 11 9 -9 12 9 26 -30 3 42 -24 -32 18 41 -22 -20 37 14 -18 -25 27 8 -31 20 37 -24 14 27 3 -38 -14 76 11 -52
3753 -52 35 32 -37 -38 14 23 -43 -34 32 -8 -2 -10 18 -35 -19 -27 -10 -10 19 33 -4 -29 -12 38 -29 -9 39 32 3 2 51 7 -6 19 22 -29
3789 -29 8 34 1 -7 16 15 1 -60 8 8 -58 -28 32 6 -43 8 8 -4 -17 7 3 -20 -39 -5 22 -15 -23 30 16 -11 25 17 -12 -19
3823 -19 13 34 -37 -35 34 3 -4 18 26 -14 -23 32 -2 -40 8 27 -21 -34 14 22 -9 -20 37 50 -47 14 -2 -35 -38 13 -9 10 18 25
3857 25 -9 0 -14 1 -11 -38 29 4 -32 -11 18 15 -31 -13 13 -5 9 23 10 -30 -17 -9 11 -34 -6 13 -1 -5 53 43 -19 -8
3889 -8 2 -17 -30 45 27 15 -17 -14 30 -20 -11 52 1 -31 18 5 -5 -61 -5 13 11 30 69 13 -16 -12 -34 -41 -28 21 21 16 7 42 -31
3924 -31 -62 3 36 -29 5 26 -8 -24 -35 -20 -23 -34 9 50 -12 -1 58 6 -46 -23 -15 21 -9 -16 12 -10 -51 10 -3 -10 -4 26 9
3957Ik1J4Pk4RMK8j7J8rj3l1jK5k9K1K5qJ7l4K1l3rL0K6n0J3M0j9k9mK5k6J0K9
3992A4J9k7n4K9J1l2K2L6mqL4m0j2pJ8Rj6K9Nj0Qm0L5k4nj6K5J3k4M2n0m3N7J5
4026Ij6J0J3ol4jM1l0l1L8N7n7lK2pl6J2M0pl8N3j4Jk9L1k7j6M3oJ9k3j4Nj4J4
4061aqpK0l2M9k2j3RJK1j2j1L5j3oLj2jj0MJ8kj1pm0M5j1RJ2L5l2jm6K9j3l5L0
4098b6J5K8j1OJ5n5%K4J1Qj0nJ1nj0Mk3J5j2L4l3J6J4m5RL1poK1j4kj9K5k3l7
4133e6M5J7jK0l0L2m5k6JO2l2K1QRm1J3L0j5l2MM9l2j1JQj2l1N0J7j4j2Lk4Jn
4168b8K9lJ4j4K0Ml1%K5j3qOQK4l2J5k5Lj1j0KO4l0%Nj0j9OL9k2J9k0J9k4K0k8
4204f%K3j0mJ5ol6K4Pnj2RKj5J5kQj5%OK2k7J7k3j6J5oOl4O3j8rK5%j9lJ5k3j1
$$ plain form
3957 9 -12 2 9 -15 -6 -2 26 9 27 18 5 -26 -27 -2 -31 -10 15 7 24 -10 11 -22 -31 -1 25 -25 -12 28 9 -20 -24 1 -25 -15 14
3992 14 33 6 -48 -19 -8 -40 -18 18 14 6 40 0 -12 -19 -1 8 -8 21 26 16 24 -16 19 -5 -10 -26 -1 12 -12 30 -20 -63 -6 9
4026 9 -7 3 16 10 -24 -25 16 -14 -45 -7 50 -7 -10 12 5 -31 -19 21 14 -24 29 15 16 -13 18 -9 -25 18 12 31 8 -6 -1 -15 -1
4061 -1 -9 -16 4 -28 21 -1 -14 -5 -4 17 5 -6 29 16 10 13 1 0 -10 -6 12 10 -1 -8 -48 -3 -14 -5 7 42 10 9 -37 -8 -21 -56 -26
4098 -26 -11 17 6 12 27 -28 -28 -4 7 15 5 0 11 6 -4 0 -23 -8 -20 14 -19 -3 11 -34 -25 6 -1 -7 14 0 -2 -21 4 -19 -56
4133 -56 -11 6 5 25 -5 27 -18 -44 -43 19 -13 8 16 25 -16 -3 27 12 -20 -16 33 1 -10 -9 -1 -13 -44 6 23 9 -3 0 -24 -23 -28
4168 -28 1 -2 12 -2 18 22 -9 -9 16 3 -5 1 9 33 1 16 -9 -6 -17 -27 -25 39 9 9 14 4 -15 -9 30 8 27 7 26 2 22 -6
4204 -6 -6 17 7 3 18 12 -24 0 7 2 -10 -1 1 -14 1 -1 7 -8 -8 -2 20 -7 10 -13 -29 -14 -20 -14 -48 15 -3 -12 13 13 -6 -9 6 -17 -28
4243b8M0J8m1K9qRk7QK0m2J2J2J2j7j9K5j0K8j3%L0o0J9J5%Ml5K4O%Rl4K2j4K2
4278A6k1J0j9K5%k5KJ8qpnJ0L4j7l1PL6k2k6j4L8n4M6J1%ONm4M2l2QOM6k3k1K0
4314A7j6kPrJ0j8J5qJ1j9Mjjj9K6LJ3%k1J2ml2OK2J3kk4L2rK6n1QK3j5kjJ9k1
4352hm4N9rK7j0qK6l1Jk2J5K0k0j4QK7k7M0l3O%j5M3n4K5Mj4mK0k5L6k2M3k4k8
4387a2Nj8K8rjK0k4JJK7k7j6K0jJ1j4j1%NM4o4N6nj5K0Pl4kkL3m8L0lmmj0N6n4
4425a4L6j6j7j9K2MMjL0l5lK4K5l8K1l7jRJ2j8j0L8j2K2l7j7L5KpKRmMl4K9k5
4461a7j5P1j4j1Oj1qKk5RJJ8KK2m8J8j8nJ9L6k9J1JkMmrnK2j8M7k8lm9J2K0lJ9
4499A8K0k9J3l6POlJ2l7J9K0Ok6KKoK4RkJ7k1k9J4rl0PJ9J3L5Rn6J4j8KJ8jj5
$$ plain form
4243 -28 12 30 -11 18 10 19 -8 0 20 -22 -10 2 14 -3 -22 3 -7 21 8 8 38 -22 -3 12 12 16 -19 5 11 11 20 -14 8 -6 16
4278 16 -5 5 -14 11 11 -14 -12 6 -2 -9 -14 -4 30 13 -18 -11 25 3 -23 -37 1 -53 -7 4 4 10 15 -29 13 -19 -11 -5 41 18 -3 17
4314 17 1 -1 6 -3 7 -11 4 -4 7 -12 -8 -9 -10 -29 -3 0 13 13 -8 4 0 -32 -26 -4 9 7 -17 15 6 32 -19 -11 12 -3 -5 -6 13 -8
4352 -8 -52 7 -2 25 15 7 33 2 3 -19 -4 16 -4 -18 -10 17 -10 30 -3 3 3 -12 31 -23 2 6 -8 -12 8 -17 19 -3 40 16 -12
4387 -12 -7 -25 3 -6 -7 13 -11 -10 -9 18 -9 -25 -5 -6 5 -9 -20 -20 -15 29 -35 21 16 1 21 28 -6 -8 -10 23 -25 5 2 -2 -6 -16 40 -14
4425 -14 22 6 -11 -30 -8 -4 0 -1 29 -6 -9 15 40 2 23 -14 -15 -6 6 -12 -22 16 4 26 -11 -28 7 9 2 4 13 9 13 -21 8 -17
4461 -17 -32 39 25 14 20 9 1 3 -22 -13 -12 6 8 30 -18 0 -18 -23 -4 32 3 14 15 13 17 13 4 -1 21 3 50 22 19 -30 -18 2 -1 18
4499 18 38 9 22 -14 -7 -1 -4 8 -29 -10 10 16 -10 -8 -6 -12 12 21 19 36 15 -14 0 -9 -39 -32 -13 0 35 44 -12 2 -16 -14 4 3 -12
4536a2RRk0RrL4J7qj6j4J9j1k8K3j8RNJ1ok8L8k9Pjpj2PL8lNk5l0M0j0l3L4NM
4574Cj1oK8k0j8L2%k6J1K8j5k5kN3l8j5L0jk8nK8K0k1NpKJnLJ0j9kj4LK4J6m2
4611b3lJ9K5pj3%J7l8J6jj2j5M2k5pJ1K6%m5J5K2%k1J2J2l6K4K7j8qqJ8j8J0l
4646eK1m3K5L7n2K2mL1j3Nl3K8J3m6J9kj8K9j5J0j1%kloJ8m0K9K0Rk7RNj0rM3
4682C4j4nl9mJ9ML2n6N0l2J7qqM0m5N3k6j7NRkj6L1lJ5l0lj3%kL1j8rJ3kJ0nQ
4720A4l%Pk2KK1nk1jJ4j6oMJ4Pk1nK9j1j3NK3k2k9K4K0omK2j4rJ0Ql0k1L7Mkj7
4759a3K8m8qK9K5%k0%J5ll2L1kk4J5M6m4rK4j9j0J4j9K2nQJ4l2K3jkl1K0M4l0
4794Fl3M7ol6kLK1j6K3K1Rl4j3J3k6K0rJ9pj5M4k5j2j8M1l5rK0j2K6j4OJ1oJ9
$$ plain form
4536 -12 -3 6 -14 -5 -14 20 37 29 13 -1 18 7 -21 2 -16 -7 -2 9 3 -25 13 -16 -9 -10 -17 -29 -22 16 13 18 -7 -37 3 -7 -40 -6 -1 3
4574 3 -8 -14 14 -6 -24 8 8 -18 -7 21 6 -19 -21 32 -6 -21 9 8 -20 -25 3 23 2 7 0 2 3 -2 1 11 -8 -10 -24 -21 3 19 -23
4611 -23 -26 -7 18 11 -2 -2 15 -23 -7 -8 -20 -35 7 -18 -25 -14 12 12 -33 -18 4 4 -17 -5 7 -29 -5 22 4 -4 -12 6 -12 -2 -5
4646 -5 16 -27 -2 35 -17 5 1 32 19 24 -9 19 32 -14 5 3 -15 14 -1 9 -2 -2 -4 -7 -13 5 -35 -6 14 23 -4 5 10 0 -9 34
4682 34 20 15 -24 -28 -9 -5 27 -29 21 -11 6 -2 -10 30 -15 38 12 -5 0 9 7 -9 22 19 34 4 1 -12 -12 -14 17 -1 -10 3 1 11 6 14
4720 14 11 11 18 -4 -2 19 14 -7 -8 6 -10 -16 -12 2 9 -12 -17 12 1 -12 -7 16 -6 -35 -11 9 3 -1 21 7 -2 8 16 -14 -35 2 6 4 -13
4759 -13 15 -33 -41 -12 13 13 -7 -7 8 5 -27 4 2 -22 -7 39 -5 -14 10 -9 -19 -5 -24 -2 -7 1 15 -17 6 5 3 -28 -8 36 6
4794 6 -27 20 14 -22 -24 -21 0 -16 7 28 37 3 -10 3 -23 -3 -12 7 0 -15 29 4 -8 -26 15 -20 -29 -9 -21 5 -9 -3 8 2 21
4829B1k2J8m2K4LKjJ6l5M1Kl6K3k9J7k8j1M2K7j3l7k6N0m8K6L9Qp4M0k4NK3j6
4862a5J8joK8Nn6K0Nj0J6l3L0J6k0pK7k4ORlJ1Lk5J5qj6Mj3K3L2j3l8Q1o7j0j2
4898b8P7p1J0j6N0j7nNRj3kL6k8k0NRm0K9J1Mk1J9j1J8k0K5j4OMk0JjJ5j7j5K2
4934dlK6j3K1k3J1j6K%k3PJ8Pmj1K3j5k0J4J5l4K5j7K4j8j6M7rl7RM4n8PpL5l9
4970c2RL5J9l7RoJ0k5KN5l6k2NM4m8KPl7L2OM7j1n2K3Rj7QK7j7mMkk2jK2J2k3
5007eK3lMj8K3J9k7j8KlJ0K0j5n4L8Nj6k8K4L6k7j6L8l7K2m3O3%kj8rJ2l9L1K0
5042A2j6k0K1M2n8pM6j4l0K4K6J3m9J8nk7J6J5k8J3pK1K5l3MJ3j0k2L0J1k2k2
5074b0J4j8L6J9k4j3j4K5K0n0L4j0j3J2J6Jl6J3J8J1l3m0P3ll6L3J4n5J4K5j2
$$ plain form
4829 21 -1 17 -25 -1 2 4 3 19 -16 25 27 -9 14 -15 2 -26 -37 5 32 19 -18 -44 6 -42 -16 23 31 -43 -3 -27 -22 1 -15
4862 -15 3 2 -4 24 29 -27 -7 -2 -12 4 -29 1 17 -3 -10 17 -7 -1 8 5 16 19 -6 9 1 -15 -11 -24 -1 31 18 -20 61 -6 -16 -28
4898 -28 49 -22 -12 -28 22 5 0 5 14 1 -1 35 7 -13 -8 1 -39 -10 1 5 -16 3 -8 10 -10 15 1 7 11 -9 -8 -9 6 -11 -26 -4
4934 -4 -7 19 6 27 4 15 -1 1 1 -22 -15 3 10 6 -5 18 3 -17 -3 12 -22 3 -14 10 -8 -24 23 14 -23 -14 30 -28 -21 -28 7 -32
4970 -32 -23 12 31 -6 3 -3 7 -18 -16 39 3 -19 -14 30 -18 -16 -9 -46 -14 -8 39 28 -24 -1 8 -9 -1 26 9 5 9 7 -15 -16 6 18 -5
5007 -5 18 15 19 1 24 43 16 -2 0 -3 7 27 12 -42 -4 1 -15 -43 -19 17 -10 -26 12 -25 -3 -46 17 17 15 -3 -12 0 -39 -8 12
5042 12 -4 -24 -3 39 -19 -26 20 6 -24 0 26 39 -10 8 3 -24 -8 7 -21 -8 -15 6 31 -2 2 15 5 -17 13 24 2 -20
5074 -20 -6 -24 12 31 7 -6 -20 5 25 -25 9 -1 -14 -2 14 15 -21 -8 10 21 -12 -52 21 18 -18 15 29 -26 -12 13 1
5105Al9K3N1m9qL7k9j5J9Rok7L4rk3L2k2QJ0lj7K5k9N0pk9KK5K0o3K5L5m3ok1
5140c9M0k4k3M2M9p9J9pJ2k8QN0l9N2k7Nk3k6Q9n1k0J4K5j3l7L2Kj1oM4l5Qj6
5173a3J0qnM2Jj2n3N1Nn7O7k1k6j2N1k1j9K0L9k8j2J9j0k5j8N6j5m3L2K7j8m8
5205d4N0ok9LK8Qk0jj3L2k9J4M1l4j1nN6o7QL2rl0%N1m8JL7%l5nN4l0l9K2L1j3
5241@pNJ4k4j4M9l4J4k4J3K1n2O5ko8M3j6J8j8K0Lqj1J1j5J0j9M0Kk1j1O5m7k7
5275b5M1lKl8K7j1j7%L6j0k9N2om8K5PJ8m9K0N9o1k3L1Qj5K6K1l7kJ4%j4j6K8
5309A1lm0K3KjOk3MK5nJ8k7Jj3M6k7k8J8QqJ2jj5j1L1k5j9pL2J0nJ1J5J0l5J9
5345IJ7k3j7K4%l4J3M0k2j6j8M9j6j6QJ3l0j7L7k0KjK2Pj9lOk2NnK3%LLJ1l6K1
$$ plain form
5105 1 -38 -15 36 -13 -21 16 -13 -28 -9 0 -6 -33 1 -8 -31 1 -21 -13 -3 -6 -23 2 -27 23 16 -13 -11 14 34 -29 -4 31 -12 -18 -39
5140 -39 1 -23 -46 -4 45 -34 -15 -22 -10 -38 -30 20 -19 33 6 11 -12 -38 51 0 -20 -6 19 6 -31 1 3 -8 -14 30 -5 3 -13
5173 -13 -3 -11 -16 26 27 15 -38 13 18 -39 28 7 -19 -31 20 -1 -20 0 39 11 -1 18 8 -17 -35 21 6 -37 -5 22 4 -44
5205 -44 6 0 -29 -26 2 10 -10 -11 -24 8 -21 -7 34 0 -11 -16 40 -27 -19 13 4 -26 -26 25 -23 -22 15 15 -20 -25 29 -1 -40 -18 13 0
5241 0 -7 -2 12 -12 -26 23 -11 3 -21 -8 13 -39 26 24 -44 -1 -17 1 -17 3 6 -2 -13 -2 -17 -7 -26 14 16 -5 -16 49 2 -25
5275 -25 16 13 15 -23 4 -7 -24 -24 12 2 -27 25 19 -29 -4 3 21 -28 -8 51 -10 -33 -2 6 -9 17 38 1 -1 13 13 -1 -17 11
5309 11 8 -32 -9 -7 -8 -2 -25 -21 4 -1 17 -10 -9 -22 24 -3 -31 -13 -5 -13 -1 -2 -17 -28 3 -22 -41 -48 -16 -6 -11 0 15 25 -10 9
5345 9 26 3 -14 10 10 -24 -11 29 7 -9 -27 22 6 -10 -2 11 -19 -36 1 -19 -17 -18 4 11 -8 -11 -5 -27 -22 -27 -4 -4 -1 2 13 -23 -2
5382bNoj0L5l6Pj2J8J2m7O3l3J9k5M1j5k9kL6k2nj2L3j3j7L9l3J0QJ2Kl0K8j3
5416Fl2J7PL9l9KJ3k6k9J0K2rLqK7k6%N7n5K0k0K0k7j4L5Lj2j9K6JLJ0J0m7L7
5451EL1k4j3K3j3k1j8L1Lk2J2J2J4k7K3k0k1RK6J0J4n8J0J9krJ3rj2J0K7l5mk
5485a8K9j5J0j0L7n0K7K8m7L3k4k7%K0k0%M3l5J2jQpK1l1J5oK0k1J4Km0K2J6K
5519GOj0Mkk4L7k9j3J6N6l1l7j3L7mpJ2Ml9M3j4j0nRJ7mk7J3Rj1Mj4K3j4J3J3
5555A5Nn1N2k2Qj3K6j8J0j5Pn3M6J0j8rJ4MJk6L2rk5L8J1k7rLL8jo8L1O6n1k4
5590b2jJ4JkL9l5j2K0PJ2k7MK7m2J8J2j2nJ2Mj0JNmk2J6k1QmK9k2rJ2K0l5L5k7
5627a6L9k7lK4J3rm6K9njj3LL2lj2K7l5jlK2qKJ3qk1K0j2rj2K8j8J7j9j1L0k6
$$ plain form
5382 -2 3 -3 -13 22 -14 -7 -19 -1 11 -36 27 -6 13 -12 29 14 -15 -17 19 -3 -8 -20 13 0 -17 22 -11 -1 7 19 21 -9 19 6
5416 6 -26 -9 -2 37 -2 0 13 -13 -42 -32 -10 -19 -16 -24 3 -23 -23 34 -21 -1 -21 -1 -28 -42 -7 -4 -16 -35 -9 -8 -5 5 15 -32 5
5451 5 36 12 -1 22 9 -12 -30 1 4 -18 -6 6 20 -7 16 -4 -25 -16 10 20 34 -24 -14 5 3 -6 7 -2 -14 -4 23 -12 -16 -18
5485 -18 11 -4 6 -4 33 -17 10 38 -9 24 0 -27 -27 -7 -27 -27 16 -19 -7 -8 0 -7 14 -17 -2 -8 12 -9 5 7 -33 -11 5 7
5519 7 13 3 7 5 -19 18 -11 -24 -8 48 17 -20 -33 4 0 -7 5 9 -30 13 -1 -11 -16 -7 10 6 -21 -8 1 -10 -6 -20 3 -11 2 15
5555 15 20 -31 21 -1 7 -6 20 2 12 -3 4 -49 -3 7 -11 -20 -6 -2 -1 -27 5 -4 -29 9 20 -7 -16 -13 25 24 -44 -13 53 2 -22
5590 -22 -23 -9 -8 -10 29 -6 -18 2 9 21 -6 -2 25 -17 1 13 1 -4 8 12 2 3 8 4 -18 -2 -23 -15 -19 10 -12 -21 -9 11 -24 11 -16
5627 -16 23 -4 -7 17 30 21 -25 4 -1 -2 -15 -12 20 17 5 32 -3 -4 -7 15 7 9 22 14 -7 13 1 -8 -20 8 -10 7 -12 -23 7 -19
5663a9K5j1kj3jK9K3j2m5JN5m0J4kj6J9%k1K5j8L5l3OK4j4j2RJ6%j5Oj3ok9N4
5698A9k8kJ5J9mNRn0J0M0j9Lk8RQKpJK1lpj4J6k2QK7m1J9K2m8K6k7JOj3K5K9k7
5736@J4mk9mJ4J6j6kQK1j0j6JJ5lqJ1kl7L1OLj5J4j2k3J9k3N3l0K0pLK2j9jjR
5774A8jqlJ6nnk2M8o7K9j1OOl7K3Oj1K5J4nm1L1Km8L0L1j2l1L6k8J0j5O2n5M2
5809C0m1J8K0k9jPNk4K0pMm0K0K4nqJ5l4Qj1L9jj2L4j3k0J7l2L5l9L3Oj4nM5m2
5845BlnJ1j3j5K3nK5m9K1J5kJ5J6k3o2K7PN2j9n0J3kLJ5J1RLj3j9lmLK4j4L2j9
5882GrOj0jrK9J3j7NnJ6j3j5L7k4l5K1J5MnKqJ4k0J6kl4L2j2%J0J9l7j6K3nPq
5920i%MjLKml3N1m3M0Ok2nkK1mJ3Ql2L3l1L1m9L0J0r%k5J9njrK0j5JNJ0MJ4m9
$$ plain form
5663 -19 6 -5 -7 -20 -21 8 31 19 -26 -25 30 -10 4 2 -14 5 5 -16 9 -9 26 -7 -1 23 9 -3 6 22 22 7 13 0 -6 -35 19
5698 19 -9 -11 4 23 19 24 33 -17 -7 33 14 17 -11 -2 6 8 1 2 23 20 13 -1 15 -7 1 28 -13 6 28 -20 6 -21 -20 -14 -27 -2 27 0
5736 0 14 10 -19 -23 -9 7 -9 -11 -3 18 8 -8 -7 8 5 -3 8 6 -31 0 6 9 -6 8 -4 -27 -8 -31 22 -8 12 5 8 30 11 10 9 18
5774 18 17 9 6 22 17 12 -10 38 -29 0 -11 -5 1 -36 -13 -7 -18 7 21 16 -25 6 8 -40 -10 21 9 -22 14 -14 -4 -19 43 -12 30
5809 30 -11 7 27 -2 -3 4 9 -15 5 -2 2 -38 -18 6 1 -7 8 -26 -18 -29 10 9 -3 31 18 -2 15 -17 18 -21 12 18 4 -1 44 2
5845 2 -1 -6 5 -8 -23 0 -5 20 -29 -8 7 5 20 36 13 -49 -22 -15 37 18 -32 -19 -21 -18 -3 8 17 20 7 -12 -15 -19 -16 8 -6 26 7
5882 7 -2 4 -6 -7 -16 13 26 9 14 9 25 12 -3 34 10 -25 -4 11 15 10 12 4 18 -2 14 12 -22 10 -2 -2 8 27 -10 -26 -3 -8 -1 -9
5920 -9 -9 -5 -6 -3 -1 -5 -38 13 -30 10 16 -6 -11 -13 8 4 17 25 -7 26 -5 26 -23 7 17 8 8 -17 2 -3 -4 -13 7 -8 -7 -2 8 12 26 -23
5960b3K5ll4O0j1J6j7rJj2L3j9nJPk1KkPJ5l4K0j9K2k3J6QJ2j6J4Jj7J6l0K2l
5996@J8rmQMjj4mROmK5j8j3Kn7O0K3j7k0orK0J5mk2mKJ2NNnk1Qj5RNQk3J5j2J7
6038fljL3k4J7j6koJ1plLl9L4Mj6K6KJ3k2jLJ7k2J4lll2K6K2l8K6Ql4J7K2Ql9
6076a1J1j2J7j5K3k7K7j0k2j0J8J7Om0N3k1k6K4nJ3j3Nj4QPl6J1J8j8M4o2O2l3
6109a1J3LLk2J6J3j8%Nj0m1L5J7Nk0J7j4J0j0K3lj3LRmpNK2l9J2l4M7k4J3%j4
6145a3K4j3K3m1K5k4K2pL1lk2K5m1L3k4rK1Qn6L6J9j9nL6ok8M7n3KOL1l0KL2k1
6180HlnnmJ4j2J1qJ4pJ2j1lNj0k0J5pnJ4jkPJ4l4J6j2J8LOj7pM2j7LqnJ6J5l2
6220bqJ5j1kNrM3l1rKJ0k7L6nj8K5j0K9l3Rkl0QJ2J3J2Om3K9nl0L2j5RL0m9K0
$$ plain form
5960 -23 2 -1 -35 25 14 30 13 4 5 -7 26 7 2 3 10 -11 -9 -11 -4 11 -23 -3 -22 0 -23 -7 1 13 -3 11 12 -5 11 -19 3 0
5996 0 18 9 5 13 17 16 2 -2 7 13 9 34 16 3 5 -52 8 31 14 -6 -12 -21 -1 14 10 -12 -16 -14 -2 3 8 3 -18 -10 -25 -16 -11 -3 -26 -11 -23 -6
6038 -6 -9 -10 23 -1 16 0 -2 -8 3 -4 -7 -4 -43 -9 -5 -21 5 7 20 -2 -3 0 17 -5 9 6 3 -29 -3 19 -19 7 15 -19 -2 20 28 -11
6076 -11 0 -12 5 -10 13 -14 13 3 -19 -29 -11 6 12 -28 25 4 -22 2 -3 10 -3 2 -12 -4 3 -33 -22 -4 -22 22 -40 22 -11
6109 -11 2 5 8 -14 2 15 -3 -3 2 -8 -49 -14 3 8 -12 5 -9 1 -9 14 11 -2 1 10 6 -1 4 26 -13 -1 -35 12 -12 1 1 -13
6145 -13 11 -2 21 -20 5 -19 3 -4 27 24 2 27 -14 19 -5 -14 7 15 -41 -5 14 -5 -10 26 20 -8 39 -14 -12 -6 25 -5 -3 29 8
6180 8 5 0 -5 -9 5 -7 4 -4 10 3 15 4 1 6 -4 -24 -9 -16 -21 -7 -8 -10 -3 11 -23 -7 -19 -1 2 8 -9 -16 26 9 12 4 -1 15 30 -2
6220 -2 -10 5 -6 -8 -3 -12 31 0 -9 -7 3 -24 12 7 -11 14 4 33 0 9 7 -23 -15 -3 10 22 28 -15 14 9 -21 11 -4 5 35 -14 6
6257Fpk4M7l1J0j4PL3n0j2L0%j4kMkK8k0mJ7moj2jJ6K8l0jj7M6k8NRk2J3MPqj1
6296a0jMJ0L1k4rnpPKRJ2pj3nlO%J8j9mJ2J4j0rQj5jjlRJ9j2rJ1Oj7J7l2K0K2
6337B1l2M2m6kL1k4K6m8K3j3QK3JKj9L1m4M4k8mPL9o3K8K6l6Lj7J6j8NK9k4Pm
6372a0oK3j4L0l9J0j7L5Oj7k2J3pnKPPkk0K9l1M1MJ0qk5J9j3k3K2oJPMk2K2J0
6409A5J6l8j2L6jk3%J1qj6QRk2J2kj7K4Jl4NJ6j5L2j3J3Pl1N3m0qJ1j1L6j1j1
6444hJ5l8J2K6n1L9lk4PK4K5l0j4K5Ppj5j2K8nj2J7mJ2pKl4K3qKJ2M0o1L1n1n
6480d2K7L9j4ll6K2PK7j3MLK0n2J9l0L0j6j9M6l8N2n7L4Pj2ppK0j0L1k5J1pK3
6514C4k0k6K4k1MJ9Lj1JMk4J1jK1mmpj6L2nNj1J5l6K8qj5LlJ4onM0k8mk8K6mn0
$$ plain form
6257 6 -1 -25 22 -9 1 -13 -6 27 -23 -35 -5 -5 -19 -21 -17 -19 9 -11 -15 2 -2 -8 -20 -21 -5 23 -7 -8 -25 21 -7 -2 7 -15 -2 2 9 1 -10
6296 -10 -11 -7 3 34 10 1 -4 -11 -4 -2 7 19 12 -1 -6 -9 -3 -3 15 -4 -8 4 18 8 -1 7 -8 -9 -10 -13 -4 15 3 -6 5 11 -6 11 -21 -1 21
6337 21 -11 31 -15 -17 14 -10 16 -32 -9 -22 -14 9 10 12 -7 24 -20 24 -4 -8 -1 38 -25 3 29 -7 -4 -21 -5 -23 -18 11 -13 -6 -10
6372 -10 -16 7 -7 23 -16 -6 -23 12 18 1 -21 -8 -15 -20 -18 -11 -4 -6 -26 3 -28 13 17 27 19 -6 13 0 -23 -1 -7 -6 1 5 -17 5 15
6409 15 31 -7 -19 17 16 -7 -7 4 -4 -20 -12 -3 -25 -13 -15 -32 -8 -7 -41 -36 -20 -35 -3 -16 -3 4 -27 26 -14 -22 -11 -22 14 3 -8
6444 -8 7 -31 -19 7 -44 -5 -8 -32 -25 -1 24 -6 -20 5 12 5 -10 -22 6 1 -11 6 2 14 7 9 -25 -2 -10 -8 4 44 -17 14 -37 -42
6480 -42 -15 24 10 7 -29 -7 0 27 14 18 21 41 -11 8 -22 8 -8 -27 19 -19 33 -24 10 17 5 -2 -9 11 1 32 7 18 11 34
6514 34 14 -12 12 -9 -5 14 17 6 7 11 -13 -2 -3 18 14 10 3 -13 19 14 19 8 23 -13 15 7 -8 -5 -8 6 0 -5 35 7 3 -25 1 -3 -53
6553e3K1L2rJ7Kjl5K8jk0L4j7KoPl0OM9j8OmJk9L2pJmJ3k1PRNk6J9J8j4nkk8L1
6593A0j0l1L4J5k3NKnj1L2j9K2k5Pj6J3lJ0j1m4L7oJ7n2Q1k7Lk9K1K7j2Nj4j1
6627hJ6kk7N1j9J0l7j2L1Nj9jKLKK9j1lj0qK0ojJ5k0j9L7nj9J4rj1%J9J1m3rM8
6665A4Ql6rJ9l7K4qLK4J2J2k2K6l8L8m0PK5mj9j4J0nLJ9KK5m1%mlrM0nm1L6k3
6702a1M1j9pj0kpJ8NKnj0J3j6k2M8m5L7l1JL7J4l2j2k9J5N5j2Om1K6k8J5Rj2k4
6737c3N3m8K5mK4pj1j5LJ7j6J4k7M7j8JNj2LJRk3K5m0J8PmJ9K5l0J0Rk0mk3k0
6773d0O2Rk4j2j6K8%K4k8J3jkjl2K5k3J2lL5rj2k0RL2p8N6ml1M5J2l7ORj2K3j7
6809bJ2j3lJ0j0QjMk1J5j9K8Ql0K1m8L1K5LqoqJ1nqK9l4k1J6J5j1LkNk7K0OJ1
$$ plain form
6553 -53 -32 0 -9 8 10 9 -26 2 1 -19 15 -2 0 -6 1 -29 -23 26 8 14 10 11 -18 14 7 8 4 17 -4 3 12 17 -9 10 28 14 9 7 -21 10
6593 10 0 -31 3 18 -5 0 2 -3 -14 18 -1 21 -4 3 -13 0 -3 7 -4 -48 -11 -17 0 -52 29 2 5 -24 -3 24 12 17 3 -8
6627 -8 8 6 -21 30 11 21 -16 -28 3 8 -11 -12 -10 -7 -5 24 13 10 0 -8 12 6 5 20 0 -19 18 13 -6 8 -1 -12 -12 7 18 -25 -34 14
6665 14 22 -14 -23 -4 -41 -17 -25 -22 2 14 26 4 30 -8 30 -10 -3 22 18 -1 -15 -5 -10 -7 12 14 39 -2 -2 -6 -9 -18 22 17 -24 12 -11
6702 -11 30 11 4 -6 -8 -15 3 8 10 5 -5 8 -8 -30 18 -27 10 -21 -20 17 31 -1 -13 -42 -27 28 16 22 -19 7 -21 -6 3 -9 -33
6737 -33 20 -28 -3 -7 17 10 -1 -16 -13 4 -12 2 -25 22 4 5 10 -2 1 2 11 -12 13 -27 -9 -2 -6 13 38 8 18 27 7 3 -20 -40
6773 -40 22 31 7 -5 -21 7 7 31 3 16 15 13 12 -20 5 -18 -6 -9 26 17 5 -15 -6 26 -52 4 0 -31 14 26 -11 -5 4 -8 15 -2
6809 -2 10 -3 -6 4 -6 2 1 5 -16 -1 -20 8 16 -14 7 -41 -10 15 18 10 4 -4 7 2 -6 23 -11 -32 -16 -1 -12 -9 -11 -6 -33 -13 -7 4
6847Dj7K2l8J6k5L2OMlj5K9j6K6j8lj4JJ4j1OK8l2Kk0J4L0k1Ojk9K2k0K1Ojj9
6883a4oK5lL6n4L4Mk0NRmj6Om2M5j5K5l5KjoK8j0LK6rk1m%rOJ2J7j3K3l0j0J3
6921cj2K%R%O5r2M0J0m5L8k1j0K1k9M3K4o3L9m1J0J8J1k7J9Mj2nkK0okj9rL1p
6957aqK4k6Nnj4J5l5M5Pk7mJ9pOJ3mlj8nK7n0L2K2J6k5K2j6J9l0J8jJ1j8P%j9
6994hJ0Oj1K0k6K3j7K6LJ0k5j6K2l0OK0j2j1PQm1K9Ok2J4J9l0K5n0PK5J5olMk2
7030b5J5J8l0J1oJJ5Mok2J4%LnJ2lNJOj1j6L4j7%J3j1K1j8%j8J5Lnj8K6j0K2k7
7068iK5n6K7k0J9J7KJ1k0rj1RmJ0j5L0J5%k3POMm2J8j7J2Rj2L4mJ0o0O4j9k7J5
7104dJ9K0m3j3M0Pl6L7ol7lJ7L1o5J2K3%Kj4J3ooK9k9RpK7Ll9J4jJ5j7OQl3Pl
$$ plain form
6847 4 -13 9 -29 -13 -38 -6 0 4 1 -14 15 -1 25 7 4 -10 -9 5 -6 0 28 -4 -2 -22 -8 22 1 7 6 -23 -1 -21 0 6 5 -14
6883 -14 -20 5 2 38 -16 18 22 2 7 16 12 -4 2 -40 5 -10 15 -20 -18 -19 -25 3 -7 -4 22 13 -8 -12 -12 -21 -15 -3 14 1 24 -6 -16 -3
6921 -3 -15 -13 -13 -4 -4 61 -31 9 19 -26 12 -9 -19 2 -27 16 40 -23 16 -25 -15 3 14 -13 6 10 -2 -7 -9 11 5 3 -16 -25 6 -1
6957 -1 -9 15 -11 -6 -11 -25 -10 -45 0 7 -20 -24 -5 -12 -6 7 3 0 -18 -23 4 -46 -14 8 24 -1 21 5 24 -6 12 11 22 4 11 11 -8
6994 -8 2 8 -3 17 -9 14 -3 23 26 36 11 -5 17 -13 -7 13 1 -10 -3 5 -36 -7 -1 -23 -9 10 -20 5 -45 -38 -13 2 -4 -7 -3 -25
7030 -25 -10 8 -22 -11 -17 -16 -1 3 -3 -25 -11 -11 -8 -13 -1 -4 1 2 8 -3 -19 15 -2 -2 11 0 21 3 3 -15 0 3 -2 -20 6 -4 18 -9
7068 -9 16 -40 -13 -33 -14 3 5 16 -4 -13 -24 -15 -19 -9 -24 6 21 21 -2 5 11 15 -27 -9 -26 -14 -5 -17 17 13 23 -37 27 8 -19 -4
7104 -4 15 35 -8 -21 19 26 -10 27 21 -16 -19 -2 29 -36 -24 -1 -1 1 -13 0 -6 -12 17 -12 -3 -10 17 20 -19 -5 -6 9 -8 -2 6 -27 -20 -23
7142b3K4j3J5K0j9J2k1j0l0M6nK0l7MmrOML8oKqMl8K6Nk2K5Ql0J3j0JK7jl6J0
7179a2Pj6K6j1k5M4j5Nk0L2NOl2Jk1NL0k4M0m2K9Rk7j5J1rj4rL6J0rJ8l3K9k5
7214a6J8MJk0J7Jj8NJ3q%J3j6Pj5MJ8j3K6k3J3j2k4M0Nk3J4Kj4j2J3Mj0j2J4K
7250bJ4k8MnPmOk2M2m0RL6m6M8l4J9Nj7L0k1Nj8J3k3N0Qn5L4l1K2J6Jk2jK3mj5
7287Dj0oK3j2J9l4J4Oj4Kj5PK7j1kJ2k9O9m9k2K3k8L2j9J1J7n2M5j2NJ4j5J7k2
7321eQj5NlJ5Olk0j3J7K3j1j4J9J7j9m1K2Pok3L7J7k6jJ0l8J6L9j8j1%JK4m3K9
7357Bpk6QNrJ1NlrJ7j6K7j9Jj5K8j0lJ8m1LK8Jk3J7PK3J4l3Qoj4l9O6j2Lj9J5
7395Cl1L6qj4J6J1oQk8K2qK3l1K2l6L4j2Mljj4K2j6pJ5j6J8j0qj6j4ML4j2QJ0
$$ plain form
7142 -23 1 -12 3 23 4 16 -5 -15 -45 1 -4 16 -21 -17 -21 -30 -24 -20 18 12 14 6 10 -28 -2 3 -19 6 14 -16 -3 -13 -12 15 14 -22 -12
7179 -12 -5 -21 5 -6 -31 13 -2 3 -17 15 20 26 -6 -5 -26 -21 9 -15 25 -17 12 21 -6 -21 -10 -19 -33 -42 -6 4 -5 13 -20 9 -16
7214 -16 2 6 7 -13 4 5 -13 -8 5 -3 -3 10 -6 1 -14 -10 8 -5 21 -2 11 -1 -25 15 20 -3 11 13 -1 -13 0 4 -6 -18 -4 -2
7250 -2 12 -16 -12 -17 -10 -14 -8 -30 12 -28 -19 17 -29 19 -15 4 9 -8 22 1 6 -12 1 -22 28 36 -19 15 -16 6 22 23 1 0 23 19 4
7287 4 -6 -12 11 -1 18 -16 -2 4 -10 -8 -23 -16 11 0 -2 10 -19 50 1 -21 2 -26 6 -13 -2 15 -37 8 -4 1 15 0 17 -5
7321 -5 3 -12 -7 -10 5 11 8 -12 -25 -8 15 4 -10 9 26 7 -34 -12 -5 -11 -34 3 20 -6 -7 3 -35 -19 20 2 -9 -9 -8 16 -27 2
7357 2 -5 -31 -23 -18 -27 -16 -11 -14 -23 -6 -22 5 -14 -13 -28 0 -10 -13 5 -36 -33 -5 -4 -27 -10 -3 20 34 1 9 3 -11 -50 16 4 7 -12 3
7395 3 -28 8 0 -14 2 13 7 15 -13 9 1 24 -7 15 -21 13 1 5 2 1 -13 9 -7 -14 1 -15 3 -7 -15 -31 -45 -41 -7 -19 -11 -1
7431ajRj7J5Qj4nlL7k0k6J4J0k5jL1ml0K2%oojmJ8J9Ll0K3k3K6rk5M0l6J4NK5
7469C2n5K3mMk5J5J0k0K2j6J5Ol5%L6MJk7K6J5j0j1j2mNrkJ3J6nQL2n1j5J1RK3
7506B5j8k2J6K9l6l3O8l9L5j2kj6O0l6j5Ol1K3Pk4K3KK3m3QJ5l6K2oJ3j5M8n0
7539a1j8N0m4J5qJ0J0K6k6Kk3RL2oj9Lj8j1kN1j9m0K7J0K5l6J6lJ5k1k6M2k0K6
7573A8j5K3j3j3QK0k9J0k8K1J7k0qJ2K2mj8Pp%oJ6j8Nnj0K2l2LK8j2Oj5%L0lk1
7610iM4l2j4%Kj5KK9J5nJ9l8nJL6j8j3RK5l4Pj5J7L2l3k1J0MJ2pJ8j8Lj2j1RK0
7647A4Lk5J7RnpJJ3k5mJ9qJ6k1mK6k6l5N0j3J0nlNj1k1L6jk2K1omj6J9k7K5PJ6
7685A8Mj0nRl7L1j7K1KrLp%NNm2M8j8Oj1J5k1L6m3J9Mkj4K1lj0K6rrJ6m2K7m9
$$ plain form
7431 -1 -2 7 -10 5 13 -1 -6 -9 28 8 -18 -4 6 -19 -20 11 7 -23 -1 -1 -7 -13 -14 -18 0 19 22 -8 15 -8 18 9 -16 24 -12 2 7 32
7469 32 -23 0 -4 0 -25 -10 0 -20 2 -14 1 7 -28 -28 8 12 13 -14 12 27 17 6 -6 -10 -5 -14 -16 -3 13 8 16 48 -3 -18 -7 2 25
7506 25 7 -15 1 30 -6 -39 29 -10 25 13 11 -5 55 19 4 10 -21 2 9 -15 8 10 33 -10 -2 13 -23 -1 -7 6 -9 39 -11
7539 -11 -29 21 -23 -8 -16 -6 4 30 4 6 -17 -8 24 18 -1 2 -16 -27 -29 22 3 -37 -10 0 25 -11 5 2 17 -4 -30 12 -8 18
7573 18 3 26 13 0 8 28 -1 9 -19 2 19 -1 -9 3 25 21 3 10 3 3 -3 13 -5 0 -5 -15 7 -25 -22 6 -6 0 -15 -15 15 12 -9
7610 -9 35 3 -11 -11 -9 -24 -22 7 22 17 36 -2 -7 -6 30 12 -1 8 33 -1 6 -9 8 40 7 -14 -4 0 12 5 23 5 8 -4 -15 -6 14
7647 14 17 -8 9 18 13 6 7 20 -5 -9 10 2 18 -3 -7 19 -7 -42 8 -5 5 0 -3 2 -9 -30 6 5 -17 4 -2 -6 -22 -3 -30 -5 2 18
7685 18 22 12 7 16 -21 10 -7 14 16 7 10 3 3 8 13 -29 19 1 7 -4 11 -10 26 -17 2 6 4 -10 11 8 -2 24 15 6 22 -20 7 -42
7723d2K6RLL6k5k8K7k0J7ml3K3RK2k4m1N5J5l3M4j0k3j5K0k5L0Lpj6j9K3qL0n6
7757c7N3l3kMkk7K6L8rl9j2L4lPoJ2qrL3k9nj3NK0Jk1K4kj0nRj7K1K3k9K0lln
7796Aj9J9j1nJ5j1RJ4olNj1ok2J9j3K5K8m9L1k2J9Jl2J8Jj4kJ6K4k3J9l3L6Mn2
7832c0L5Ok0llK6Om2J7QkJL4m2PqQ%l7K1j4MK4Ml6L5K6l3qK4j2k4PL2k8J1OJ5
7870A5k8J0qJ2kj8L0Mk6k6J5J8Qj8%jqJ6J3jk0PJ2j6Nj5PpK5j3j7M4l0j2J2J4
7906AK2m7M5m8K5J4J8j8ppJ0qMOk1mkPL8n0L4qj5J0J5j2pJ7k8jJ7Rj9J7rj2PK2
7944A5k5oL0l6J8J0ml7L6J8k8J7j4MK7l7KPj8J6KMj7K2m8M4nJ6j2j3K6m9O0k3
7978BkQQkrJKO%j4L2j1l6OJ3J2K6m3kpKj8K3J4l5J8QmK3K8m8poL1m8J5J4OMqJ2
$$ plain form
7723 -42 -16 -7 -4 32 7 -21 6 -14 3 -1 -34 -11 -2 20 -4 -45 10 25 -8 36 26 3 -12 8 -17 13 16 9 -7 -26 -3 -11 19 -37
7757 -37 16 -17 -19 -15 -17 -44 -18 20 11 -28 -40 -6 -9 -2 -8 4 -4 -13 20 -9 -14 -27 -22 -2 -1 -22 2 0 -10 -15 -6 -23 -2 21 -8 12 9 6 1
7796 1 -18 1 -10 -15 0 -11 -2 12 6 3 8 -3 -9 -31 -12 -25 0 28 -21 10 -12 7 8 -24 -6 -5 -19 -21 -5 19 -4 15 -18 18 22 -30
7832 -30 5 11 -9 -12 -15 11 17 -25 -8 0 -2 -1 33 -9 -2 -10 -2 -2 -39 -18 -32 -28 -4 0 -36 -1 25 -8 -16 8 -4 -28 -21 11 -17 -6 0 15
7870 15 -13 -3 -11 1 -1 -19 11 15 -11 -37 -22 -4 4 -14 -14 -15 -23 -7 6 5 -15 -8 4 -12 -7 -22 -15 -22 3 -10 -27 17 -13 -25 -13 1
7906 1 23 -24 21 -27 -2 12 30 12 5 -2 8 0 4 10 -11 -15 -17 -10 28 -22 12 4 -11 -1 14 2 -5 12 -16 -17 0 9 -10 7 -2 -14 -7 15
7944 15 -10 -16 14 -22 -4 6 2 -35 1 19 -9 8 -6 -2 25 -12 -10 -3 -21 -5 -3 1 -16 6 -42 2 -3 13 1 -12 14 -35 25 2
7978 2 0 8 16 14 5 6 8 14 14 0 32 21 -15 -9 4 16 42 -1 -3 -10 -8 -26 -3 11 -24 -6 2 -2 21 49 1 -6 -12 19 -29 -14 0 6 10 2 14
8019A4nk1pJ6J0jOk2K1j6Nj0J1k0J4%oJK2qpjL5k1j2K6ppl0L7l5J6J5rMj1Ml4
8057c3K9J3l8L0lK0l1K6r%jMj1J0rlj2L4l7Nj2j3M7Lj1k5K2j2J4j3j3K5j1K3l
8092Ej7K0l0L9mL4m2J3jk4J7j6J5m0L5L5l9OJ%k4J0jJjJ0KPk8KJ8j4k6lL6kkN4
8130D6o4J4k7L3l1M0oJ1mOj9J2j6mK2j3k8K0K0Qj8N%l0K5K8pk7K5m3K2K4J0m1
8164gLOJopK3j7J2kOk3J6%Pm5L5J7Pj5Kl2J7j3M0j3j7Q
$$ plain form
8019 14 9 -12 -19 -3 7 6 12 -10 11 -5 0 -10 1 -19 -5 -5 -11 -10 12 4 -3 -4 31 10 -2 24 17 10 -20 17 -18 -2 13 4 8 -3 1 -33
8057 -33 -4 9 -29 1 -2 18 -13 13 4 4 3 7 -4 6 -3 -6 -18 16 -21 -16 -28 -41 6 9 -2 -27 -5 -17 -3 -16 -29 -4 -15 8 5
8092 5 -12 8 -22 17 13 47 5 18 17 -7 10 -6 9 -31 4 39 0 6 7 7 -17 -7 -8 -7 -8 2 4 11 -17 -15 3 -11 -37 -40 -4 -6 -8 46
8130 46 -18 -4 -31 2 -29 11 5 16 12 18 -1 11 -5 -9 13 0 -28 -8 12 20 2 7 7 -23 2 30 23 -4 21 -22 0 24 34 -7
8164 -7 -4 2 3 -3 -10 13 -4 8 6 12 -11 5 5 12 -33 2 19 26 11 13 -19 -2 -15 25 12 -5 3
8191C
$$ Imaginary data points
##PAGE= N=2
##DATA TABLE= (X++(I..I)), XYDATA
0@%%%%%%%%Mj2J6j6J6k4L2l2M0m8N6o5P4r0J06j22J39j61J84k08K36k67L03l41
32a80L82m28M79n35N95o62P35q15R04j001J107j223J354j503J668j854K066k311
50a222K599k940L352l861M510n369O571q383J1457j7994N4183p2560p9215J65270
64E6398J2757j47609l165J58427j5791j23680L2345J06981o1562q7819O4504O9195
76F0981p0407l8031P3912K0353q0993j2188O6996L492n3891J3079N3818l464m4085
89a0428r766K0125Q059j9361j9758K0515M5632p326n3090O943N8424k0130p2914
102e3075K6322Q0260l1629p4282M5628O5027o5517n9452P6703M6684q1313j8380
114d3024R7624j949j09087J4520J00558m3470r9298O8714J02492p5184q5778Q7438
$$ plain form
0 0 0 0 0 0 0 0 0 0 4 -8 8 -8 8 -16 16 -16 24 -24 32 -33 41 -49 57 -65 74 -87 97 -111 125 -142 161 -180
32 -180 202 -226 253 -282 313 -349 386 -429 475 -526 581 -642 712 -791 877 -977 1089 -1222
50 -1222 1377 -1563 1789 -2072 2438 -2931 3640 -4743 6714 -11280 42903 -29657 -108872 56398
64 56398 69155 -78454 -81619 76808 61017 -62663 -30318 76663 15101 -72718 -8214 60981
76 60981 -9426 -47457 26455 46808 -34185 -46373 20623 24115 -29776 -16697 37121 33657 -10428
89 -10428 -20194 -69 7990 -11371 -31129 -10614 35018 27692 -25398 -18455 39969 19839 -53075
102 -53075 -26753 53507 21878 -52404 -6776 58251 -7266 -66718 9985 56669 -24644 -43024
114 -43024 54600 52651 -56436 -41916 58642 15172 -84126 -15412 87080 11896 -73882 13556
126A3556O6899j02174n7369J00153M0246r2697j7231Q7855L3p8969J1149O1894
138C3345k3243m2882L6909L1633m0417j9954L5733J813l7354O248L5163m996k1081
151i083R623J2084j0066p862o63k950R989J2976j6251j4820K6913J4558l9554
164a5106j5294M7356J2742m9811l042N3211p325n5223J4015M8268k4987l8510
176c3706L8717L1567m5793j9572N0193K852n7124R949N9372k0697n5236L3102
188f376M9945m3790m4127M8901L4471n0662k1397N1779R440m9894L15M2313j1780
201I138l3551K3157K6695k8741j7231L1395N256l5171K716L5498p314k9674J3859
214c968K4423j8295k0521J6564J2668j3946l498J2973j115q175M441K29r595M844
$$ plain form
126 13556 80455 -21719 -79088 21065 61311 -31386 -48617 39238 39271 -39698 -28549 33345
138 33345 10102 -32780 4129 35762 -4655 -24609 11124 12937 -24417 -18169 16994 11998 -9083
151 -9083 540 12624 2558 -5304 -5967 -8917 1072 14048 -2203 -17023 9890 24448 -15106
164 -15106 -30400 16956 29698 -20113 -23155 30056 22731 -32492 -18477 29791 4804 -33706
176 -33706 5011 36578 -9215 -28787 21406 24258 -32866 -22917 36455 15758 -39478 -6376
188 -6376 43569 -221 -44348 4553 39024 -11638 -33035 18744 28184 -21710 -21395 20918 9138
201 9138 -24413 -1256 25439 -3302 -20533 10862 16118 -19053 -16337 19161 11847 -17827 -3968
214 -3968 20455 2160 -18361 -1797 10871 -3075 -6573 6400 5285 -2890 1551 1780 -7815 -2971
228b971J1993p954r051J3346N959j8208m323J7389j527j5185J0124J5350j4739
241B03j1539J8103K726k5393K855K9824p174k8282J6166K7865k4561k8559K7566
254b00K3483l0947j5560L6483J0985l7391n536L3749m608l2716J2569L1852j5498
267F665k4761K1220J7749k8131j5288K8483J0083k6969j754K9158j266k7944K167
280a0588K1775o769j8644R492J7567o875j2271N708O835p186o484M650N970k35
294B945k647J19K856o75o856k641P612L419p607L03J2309j598j6342J126J5622
309G945n689j6780J1160K0353j2159j9039J4786J5390k1070j5454K3358J4007
321A6808k2510p446K5620L248k8172j897K5215l273k3169R570K4286j0877k1439
$$ plain form
228 -2971 9022 1068 -7983 5363 11322 -6886 -11209 6180 4653 -10532 -408 14942 203
241 203 -11336 6767 9493 -15900 -13045 16779 9605 -18677 -2511 25354 793 -27766 -200
254 -200 23283 -7664 -23224 13259 24244 -13147 -18683 15066 10458 -22258 -9689 22163 6665
267 6665 -18096 3124 20873 -7258 -22546 5937 16020 -10949 -12703 16455 15189 -12755 -10588
280 -10588 11187 4418 -14226 -4734 12833 5958 -6313 -605 6230 -956 -7440 -2790 3180 2945
294 2945 298 417 3273 2598 -4258 -6899 713 4132 -3475 -3172 9137 7539 -8803 -7677 7945
309 7945 2256 -14524 -3364 16989 4830 -14209 577 15967 -5103 -20557 2801 16808
321 16808 -5702 -13148 12472 15720 -12452 -14349 10866 7593 -15576 -6006 18280 7403 -14036
334a4036J2222J6028j7020j4720J8656J3774j6284q437J7210M857j9117n626J5883
347C390L526j2968N19J4279J88j3209j729Q993r67r102J856J0904J171q652j107
362b908P056j718j0172N50J1421J304r159J721J0534m174j3998K515J2527l924
376A575j0502Q940J3246r480j3483Q546R049j2604p974J5749R366j3772n428J4144
390G372R37j7782j293J6677K29j3340N075J4658o906j5536N325J1243p941q825
404a0107J1401J0424r764q281Q268L808j1246m096J1359N088p878j535Q156m94
418E103j0419j968Q107J612n694J663P950q14q729j557N823o59o142K701R145
433F122l61q038K93N945l882q292M315R804k549o941N113O180q198q381P129O960
$$ plain form
334 -14036 -1814 14214 -2806 -17526 1130 14904 -1380 -9817 7393 12250 -6867 -12493 3390
347 3390 6916 -6052 -5533 8746 8934 -4275 -6004 2989 2022 -7080 -5224 5680 6851 -1801 -2908
362 -2908 4148 2430 -7742 -7192 4229 5533 -3626 -1905 8629 4455 -9543 -7028 5499 1575
376 1575 -8927 13 13259 3779 -9704 -1158 7891 -4713 -12687 3062 12428 -1344 -6772 7372
390 7372 8309 -9473 -10766 5911 6140 -7200 -2125 12533 5627 -9909 -4584 6659 -1282 -10107
404 -10107 1294 11718 1954 -6327 1941 5749 -5497 -9593 1766 6854 -1024 -2559 5597 5103
418 5103 -5316 -7284 823 2435 -3259 -1596 6354 5540 -3189 -4746 1077 418 -5724 -3023 6122
433 6122 5761 -2277 -1984 3961 79 -8213 -3898 5906 3357 -3584 1529 7709 -489 -8870 -1741 5219
449E219p000l531J0414L893j1214m249R080N87j0036J830J1993q88j0113K314
463a701P826n818q974O116Q546n158n169P077M039q671m829O881K830o239j06
478c350P856O25p365j097N021j066n086J877O148k46m613L09L330j858m640J160
494b995N233L39l782Q80M001k102n873J151N821j141m680L378N636m379o682L980
510a215N342n382m279P655M889p908m193P680J659r202n83J0265M83r149J371
525b567Q253l937q943M412Q128m499n610O525M639p718m621O517K341o498L9P712
541D173J97o770J11M943k200m894K599N221j304l396J277K124k369l023J258L234
557A181P48j449J83J854r16m121j102L462J255k593J193M749j226n821O14M476
$$ plain form
449 5219 -1781 -5312 5102 8995 -2219 -6468 2612 3199 -6837 -5007 6986 6098 -4015 -1701
463 -1701 6125 307 -8667 -2551 5995 837 -4332 2745 6784 -1887 -6716 165 2995 -3244 -3350
478 -3350 4506 5131 -2234 -3331 1690 624 -4462 -2585 3563 3317 -1296 -987 2343 485 -4155 -2995
494 -2995 2238 2577 -1205 -325 3676 1574 -4299 -3148 2673 1532 -3148 230 5866 1487 -5195 -1215
510 -1215 4127 -1255 -5534 2121 7010 -898 -5091 2589 4248 -4954 -5537 4728 5211 -3938 -2567
525 -2567 5686 1749 -7194 -2782 5346 847 -4763 1762 6401 -1317 -5938 579 2920 -3578 -3539 4173
541 4173 4370 -2400 -2289 2654 454 -4440 -1841 3380 2076 -1320 -43 2081 -288 -3311 -2053 1181
557 1181 1929 480 663 2517 1601 -2520 -3622 -160 1095 -1498 -305 4444 3218 -2603 -1989 2487
573B487k928m646N153N986n216n261N657L097q326k884R750L347q312o40Q667
588E931k034j0765J198Q841k383o357N981P362n814o358M964K689p080j739P904
603B340J944o265J40N544k263o328K065N826j045l132K426K731l035m071O7J826
619a230N54n3J216K344J230k405l392M21J627k052j572L968L020l326k145L363
635A568J9n016Q35O058q32n031K884M292n918o085N639N237n656k189Q847K853
651G505q948k827O796o93q011J725Q212j224n435L233M195m935l828M825K457
666C047m582j25N179j132n883P02M405j735l175L509M248j860l102P96O48k101
682a161j536P72J617J594K13j287l8J611r92l130Q29L377q44k764J628K150k929
$$ plain form
573 2487 -441 -5087 66 6052 836 -4425 1232 4329 -3997 -6881 2869 6216 -2096 -2736 5931
588 5931 3897 -6868 -5670 3171 788 -5569 412 7774 1960 -4398 566 3255 -3825 -5564 2340
603 2340 4284 -1981 -1841 3703 1440 -4888 -2823 3003 1958 -1174 1252 3983 948 -3123 -3056 -1230
619 -1230 -676 -729 487 2831 4061 1656 -1736 -1315 312 -1740 -3312 656 3676 350 -1795 1568
635 1568 1587 -3429 -2594 3464 2632 -2399 485 4777 -1141 -7226 -1587 3650 -2006 -4195 4652 7505
651 7505 -1443 -4270 2526 1833 -6178 -4453 3759 2535 -2900 333 4528 -407 -4235 590 3047
666 3047 -1535 -1660 3519 2387 -3496 -2794 1611 -124 -3299 210 4458 2598 -504 292 940 -1161
682 -1161 -2697 -1925 -308 1286 1499 212 174 1785 793 -2337 -1508 1869 1025 -1739 -111 2039 -890
699h90k191L162J398k899R01M312j759m960J975L691m335l857N587M396n132k768
715c369O049J797o781j727N945N22n147R09M684j616l850K156K477k813j043L676
731A869M59l665L89L269j775l671J902L439j583k364K034K083j787j915P57R41
747C82k29m77k39L60J093r0j799j05K053l1k198M24K277p58k034R62J287j481
765f03n69K119j37k335J187K548k199k783K944K710l701k360M225K196m458j719
781b935M438J136m192n24L759p2l127O88K358j178j517J658P06k028p7K224n72
798G45k234R69K213j120k044J105J739j029j530O28J259r6r07l24O58P08n85j218
816a063M56J496m04j599N35J639o42j457P92J068r88n63J250q1j484P33J467j360
$$ plain form
699 -890 -3081 81 1479 -1420 -519 3793 2034 -2926 -951 2740 -1595 -5452 135 4531 -601 -3369
715 -3369 2680 4477 -2304 -4031 1914 2436 -2711 -1802 2882 1266 -2584 -428 2049 -764 -1807 1869
731 1869 2328 -1337 -948 2321 546 -3125 -1223 2216 633 -1731 303 2386 599 -1316 -559 382
747 382 153 -324 -563 -203 890 800 -999 -1104 949 918 -1280 -856 1421 663 -1371 -409 878 -603
765 -603 -1172 947 810 -1525 -338 2210 11 -2772 172 2882 -819 -3179 1046 3242 -1216 -2935
781 -2935 1503 2639 -1553 -2077 1682 1610 -1517 -829 1529 351 -1166 492 1198 -830 -907 1317 745
798 745 -1489 -520 1693 573 -1471 -366 1373 344 -1186 -558 701 605 -302 -626 32 740 155 -1063
816 -1063 -607 889 485 -1114 -579 1060 418 -1039 -247 821 -167 -730 520 439 -1045 -312 1155 -205
834b05j481K210J566k518j402K969R70l328q95L172N24k978M6K907k01k287N92
851c39J688j064j259J109M77j334o2J488l08j274P38J372p89j212P47R36q04j097
869i87K80P20L8n20k07Q48R51n57j193O49J134j194j666R78J517j127j097J794
887C61J125j612m77J827j83k142M35J880j314j905J808J807k125j252K887J306
903B426k759q37K782j0l218k02K553l72k071J097K230p39j293J074O57j545p17
920i44R83n3j025L51R93l07n23O72N70l09j77J11j80j77k16p23k29J014K74q58
940g53O28J816l63j980M79J514j473k031J584J747j683j074K413R94k439l31K535
957A583k20k616O47K292j525k442J690K024j875j198K701J291k456q01K111j59
$$ plain form
834 -205 -1686 524 2090 -428 -1830 1139 2109 -1219 -2114 1058 1582 -1396 -1350 1557 1356 -931 -339
851 -339 1349 285 -974 135 612 -722 -784 704 396 -878 -140 1232 443 -769 -22 914 110 -987
869 -987 -707 13 51 -469 -676 172 1123 566 -627 22 1156 -38 -1704 -726 791 -336 -1433 361
887 361 1486 -126 -603 1224 1041 -1101 -666 1214 -100 -2005 -197 1610 -515 -1767 1120 2426
903 2426 -333 -1170 1612 1602 -1616 -1818 735 363 -1708 -611 1619 880 -413 661 1318 -227 -944
920 -944 39 -14 -1039 -688 305 -2 -525 147 717 408 231 342 162 -15 -231 -954 -1183 -169 105 -753
940 -753 -125 1691 1328 -652 -173 1341 -132 -2163 -579 1168 -515 -1589 824 1818 -621 -952 1583
957 1583 1363 -1253 -606 1686 161 -2281 -591 1433 -442 -1640 1061 2352 -104 -905 1206 1047
973A047k630N9K036l49j347J005J416q56q88P80L65q74j47N76k49m82K69O8l20
992e21L14N37k72J04P10l22j039J92O30r54p19J457Q66j329k56J810p7k060K39
1011f90J895q22j831J264J693j601j434J887R77j986l71K289M9k230K97J831j003
1028B14j878J261J605j334r33J731O69j806m41J525j65j446M96J302o06r57P61
1045bN71q56k61P93R3o32K76L77m70k99M41n5l93M78M61n30k19O47j10q93L19
1066b64Q40n55o47R77N65j211l74J285l4j419M04J474o48j309R11J086j287q90
1084a096J473N97j563j86J601j92j579M63J376p82j187J130R74j260o56J269K26
1101F08j351O8J318l00j083N54R09p75o48P84M13q03j59Q19m2o53J83M91l50k78
$$ plain form
973 1047 -1583 -1524 512 163 -1184 -179 1237 381 -507 273 638 -236 -383 193 -56 -538 -269 -201 -521
992 -521 -207 330 58 162 872 550 -489 -297 333 -621 -1340 117 983 -346 -602 1208 1131 -929 -690
1011 -690 1205 383 -1448 -184 1509 -92 -1526 361 1338 -648 -1019 1270 1319 -911 -614 1217 214
1028 214 -1664 -403 1202 -132 -1065 666 1335 -471 -912 613 448 -998 -502 800 194 -763 -2
1045 -2 569 -287 -548 245 338 -294 -18 359 -111 -410 31 -24 -417 61 522 -8 -227 420 310 -583 -264
1066 -264 576 21 -626 351 916 -295 -669 616 582 -837 -433 1041 393 -916 -5 1081 -206 -1096
1084 -1096 377 974 -589 -775 826 634 -945 -482 894 112 -1075 55 1029 -231 -887 382 608
1101 608 -743 -675 643 343 -740 -186 723 -52 -700 84 497 -306 -465 354 312 -341 -158 333 -17 -295
1121b95L86J93l44R2K03k40j30K98q0l58L51L29m75k04O44J7q27J48Q40l58r16
1142g26O89Q16q74p27J080N74j333l16J419O7j473J69J482n11j366Q05J207r88
1160fr79J125P57j254n55J314L01j293lJ207j73j058L02R12m44p43N37N96n03
1179D0m16M62K74l46k10K31J89j33j78rL08K8l70j07M78J26o62p2P87l2r22J95
1201c39J001l85j053N78R89p85r77J053Q61j233p14J410M89j579k01J585l1j566
1219h97K53J548m99j411O80J286q60j064R80Q53r93o50R94M55r06l06Q50J92p11
1238b06j47O29R4m73j50L84J90l26l00L31L74l03n40L73O60m84p12O10P26q26
1258i6o94R37O36j158n11J356L34j458j01J476j32j532L95J456o17j364Q88J182
$$ plain form
1121 -295 91 284 -60 32 235 -5 -135 163 83 -275 76 405 -70 -274 370 387 -440 -292 548 190 -726
1142 -726 -37 779 -95 -822 258 832 -501 -817 602 669 -804 -635 847 336 -1030 -225 982 -6
1160 -6 -985 140 897 -357 -912 402 703 -590 -593 614 441 -617 -315 597 153 -590 -53 543 40
1179 40 -376 86 360 14 -196 35 224 91 -87 -96 212 240 -130 -237 241 367 -295 -367 420 388 -534 -339
1201 -339 662 277 -776 -198 791 6 -971 82 943 -290 -1004 406 895 -684 -885 700 669 -897
1219 -897 -644 904 405 -1006 -326 960 100 -964 16 869 -124 -774 220 675 -231 -537 313 505 -206
1238 -206 -353 276 370 -103 -253 131 321 -5 -305 26 400 97 -443 -70 590 106 -606 4 730 -96
1258 -96 -790 147 783 -375 -886 470 804 -654 -755 721 589 -943 -548 908 291 -1073 -185 997
1276I97j048r72J168P87j252n32J275K83j195n7J050q2r25K49P87l10n95L56L47
1295C31k94j97K31L3l9k0k9m4J82ol76J07M90k54n72M56O13p02n68Q47M85j046
1317c72l16J164J17j237Q5J264l27j262O24J120p66r77R67P20j158m40J187J87
1335E80j170J12J097l01j005N95P47p17n29P79K84p71oP02k26n02M16L18n15r5
1355b07N56j71n81M11M75o38l18Q10J66r15R4R20m10q71O18P14q12n21J019K75
1375F14j102n1J122k49j076M69R85p18p71R11N01r72k58J028Kr30K41P83n53n56
1395e80O84L50p61k7Q62k76p18N16N49p86m42R66J47r99J55J077m52r11P21P53
1415H28r80n45J147J96j312P5J305l79j213P32J124q80q57J059N32j325l12J209
$$ plain form
1276 997 -51 -1023 145 932 -320 -852 423 706 -489 -546 504 422 -503 -254 533 223 -372 -16 331
1295 331 37 -160 71 104 65 45 16 -28 154 148 -228 -121 369 115 -457 -1 612 -90 -658 189 674 -372
1317 -372 -688 476 593 -644 -559 705 378 -884 -260 860 94 -883 84 804 -354 -794 393 580
1335 580 -590 -478 619 318 -687 -92 655 -62 -591 188 472 -299 -305 397 171 -331 85 403 -112 -207
1355 -207 349 178 -403 8 483 -155 -473 337 503 -412 -318 602 192 -679 -61 653 -159 -680 339 614
1375 614 -488 -539 583 334 -742 -273 712 -6 -777 134 635 -337 -595 433 435 -495 -254 529 -24 -580
1395 -580 104 454 -307 -334 528 252 -466 50 599 -187 -629 337 484 -515 -360 717 265 -646 75 828
1415 828 -152 -697 450 646 -666 -591 714 335 -878 -146 978 98 -759 300 832 -493 -805 404
1433D04j9j165M04J062n15p60P74M91q93k31P99j44p94K78O64n15l78P57K92o90
1453a79J01O97m58o76M94L66q67j08J058p6q95N20J039p94q96R61N54j311m51
1472i21J363J01j416L21J464n02j186R17J047j194q82J191L47j477j12J410n9
1489D12j195O01J238p34r52Q09N26j064m10R08J2p90K80P99l21l60O04K23o68
1508h2j8M87m87n71N27L40o23M7R81q4p93M45O73p95p60Q28L43j142p5J303q6
1529D58j105N63J180p81j001R29P19j373o24J277J82j275K53J406k76j110P01
1546A23Q66r43q53R03L22j059j16J098m9q12M53P74n22n31N99K13p93j21O32k44
1566f0n35M75N05m44o7O67j19p15K21N04o12m85O94L12p28K0R39j33q31M12P60
$$ plain form
1433 404 385 -780 -376 686 171 -589 185 676 -217 -448 351 207 -587 -309 355 -160 -538 219 511 -179
1453 -179 -78 619 161 -515 -21 345 -522 -630 428 352 -543 -23 1016 222 -674 287 841 -470 -921
1472 -921 442 543 -873 -552 912 410 -776 141 1188 -6 -888 303 650 -827 -939 471 412
1489 412 -783 -182 1056 322 -630 179 705 -359 -769 139 151 -639 -359 440 119 -241 363 586 -82
1508 -82 -100 387 -100 -671 -144 196 -427 -380 601 517 -276 169 842 47 -713 115 458 -684 -759 544 458
1529 458 -647 -84 1096 315 -686 243 962 -411 -1035 242 424 -851 -598 808 532 -578 123
1546 123 989 46 -807 96 418 -641 -757 341 292 -520 -67 707 185 -346 253 466 -327 -448 184 -60
1566 -60 -595 -120 385 -59 -126 541 422 -293 -72 432 -180 -665 29 341 -387 -367 572 439 -392 20 780
1587G80p63o74Q07L66r95j59J045j5r64M14R88o31p90P06N30r65l76R33J06q92
1607e49K06R46l26p69N48N54p13l91P12J15p84J08O95k36n50M81M30n22k79O34
1627C10j4o32J05N44l25m01N23K87n42q1O04j60n82K90M69m54l72O14K29o82l9
1648c09P16k22n91L56N41n44m10O04K70p08k0O80j29o94L55N80n02m63O12K79
1668D01o90q5P47j07o66K59N66m31m30N15K66n36j28O13l8n57K00N32l74m11M48
1689I4K24n09j16N39n8m59K28M19l27l19L97J91m96n7M78j42l85K35L93l55k54
1710b79M40J13m72j0M63j60m30L01L43m16k15M99J13n12Q0M41k13m30K99L28l85
1731a02k49M86J19m67L2M91j98m04L02K77l66j96M24R8m75K6N03j64m22L00L33
$$ plain form
1587 780 17 -657 150 516 -479 -638 407 392 -572 -158 830 199 -591 115 645 -320 -696 237 343 -549
1607 -549 -343 603 277 -492 56 610 -103 -494 218 333 -451 -343 352 116 -434 47 477 -45 -324 310
1627 310 296 -336 -231 313 -12 -413 110 397 -145 -226 378 218 -364 -74 395 -59 -431 183 412 -270 -309
1648 -309 407 185 -406 -50 491 -53 -463 141 411 -297 -317 363 234 -460 -105 475 -27 -490 122 401
1668 401 -289 -374 373 266 -400 -141 425 -6 -436 79 345 -191 -319 294 256 -301 -101 431 57 -354 94
1689 94 318 -191 -307 232 174 -285 -57 362 35 -284 113 304 -192 -249 229 87 -298 -63 330 -25 -279
1710 -279 161 274 -198 -208 255 95 -335 -34 309 -107 -322 177 290 -222 -142 299 86 -344 -45 283 -102
1731 -102 -351 135 254 -213 -181 310 112 -292 10 287 -79 -275 149 247 -228 -202 301 137 -285 15 348
1752C48l93k33M33J07m72lM65j38l90K29L46k69k97L56J18l60j3L56q2l10J45
1773e7K59k49j47L06L8k98N6K64j33k35K07J47k57l7L04m8l09J13K90k51k17L49
1795I5J12l53k4M00r4l84J82L73k91l01L49K09l84j24M66nm54Q6M30k27l34K66
1817gL24l89j56L47R8l90J7L49o9l34J57K41j95j71K13R1k31M2J87o7j91J81Q6
1840A33k04n9K34m7k15J58J63k01j14K52N6k94M2K79j06l04J98K80k96j30K88
1861A13J03l82J1L59p9l47J53K82k24k53L21J84l72o4L55k8l27J26K52j67k02
1882a86K22J59k72j27L27k6k72J27K54j68k28K26J21k54m1K78l0k48J14K26k16
1903a4j87K77R0k74JK92j17k45J75J91k20j24K53N6k87L6K77j32k34J90J87k25
$$ plain form
1752 348 -45 -278 155 262 -210 -213 252 114 -276 -47 299 30 -267 89 207 -153 -166 190 108 -202 -57
1773 -57 202 -47 -194 112 150 -148 -92 172 39 -196 11 158 -99 -136 168 120 -189 -76 214 -37 -254 95
1795 95 207 -146 -170 230 136 -248 -66 307 16 -285 64 273 -111 -235 231 226 -228 -142 288 61 -273 -7
1817 -7 317 -72 -228 119 217 -173 -156 193 124 -210 -53 188 -7 -178 35 126 -105 -63 124 57 -134 47 133
1840 133 -71 -130 104 57 -158 0 163 -38 -152 100 156 -138 -96 183 77 -227 -29 251 -45 -175 113
1861 113 216 -166 -155 204 125 -222 -69 213 -11 -264 57 241 -131 -195 160 132 -195 -69 183 16 -186
1882 -186 36 195 -77 -204 123 97 -175 -48 206 38 -190 36 157 -97 -138 140 110 -138 -24 202 -14
1903 -14 -201 76 166 -108 -107 185 68 -177 -2 189 -31 -155 98 154 -133 -97 180 48 -186 4 191 -34
1925c4j09K70K9l31R0K88j61k35K13K15k76j92L63J7l51J00L21j52k97K39K83
1946B90l19j84L52O6m06L4L91j17l29J57L11k47k51L48J28l47o8L64n8k74J29
1967c0K41k24j47K23J14k83k8K76p1k27J66J55k10j06K48jk72J38J88j32k07K52
1989F3J10l06j5L45o4l60J54L47k84k51L40J66l79q7M21l2m21J57L80k60l25L26
2011B5L00m14j47M33N0m69N1M30j60l61K44K91k94k05L10J17l06p4L65p6k77J67
2033@J91k28j66K77M2k77Q0K53q5k01J81R9k59m5K29l2k88K20K26k56j62L47N9
2056B05l91L8L82j23l95K26L27l07k89M33K01m33p8M92n7n12J44M10l03l20M11
2077F1K84m03j73M38O8m65rM10j12l94K46K83k99j85L25J09l48N3L51j56k61J68
$$ plain form
1925 -34 -143 127 156 -175 -85 203 42 -193 20 235 -41 -233 130 147 -204 -104 217 65 -232 7 290
1946 290 -29 -213 139 205 -201 -167 224 107 -222 -65 246 -1 -252 96 224 -123 -191 173 115 -159 -30
1967 -30 211 -13 -160 63 177 -106 -134 142 71 -156 10 165 -45 -151 97 96 -176 -38 150 18 -189 63
1989 63 173 -133 -148 197 133 -227 -73 274 -10 -261 79 245 -134 -221 200 168 -253 -96 284 24 -301 25
2011 25 325 -89 -236 197 247 -222 -171 259 99 -262 -18 273 -21 -226 84 201 -105 -179 186 110 -167 0
2033 0 191 -37 -203 74 116 -161 -81 172 87 -114 67 166 -93 -138 91 59 -229 -9 217 -39 -201 146 205
2056 205 -186 -148 234 111 -284 -58 269 -38 -327 106 307 -126 -204 288 231 -281 -137 273 -30 -350 61
2077 61 345 -58 -231 207 275 -190 -199 211 99 -295 -49 234 -65 -250 75 184 -164 -111 240 84 -177 -9
2099iJ36k28j16K67mj76J29K40k04j52J99O1l20PL15r6k91K38K51l00j43L73Q9
2122B66m17J1M27j50m94K68L64l08k93M72J95m33n7M31o3n14J28M04k21l47L34
2143CK69l26j21L40M4l64K7L44j43l01K26J30k48o3K34P3k12J10K08j73k17K02
2165D2K0k64P1K48l6k10J70J81k53j25K86J0l00L3L33j01l33K03K67k47j80L49
2187A64P9l63PL17j04l52J47K88j86k11L30J47l21r1L34o1l31J18K78j90j75K36
2209F0P1k39k3K20Kk33J06K00j62j78K26O3k46PK44l6k44J90J23j87r1J98N7k29
2233a01J6K49r0k25J47J86j91j06J90R0k78M4K03p7j73J11J74j86r3J83Pk01K3
2256i8K42p1k06J29J30j72r4K28Qk17P2J73j28j67K08L5j75k4J94K9k13J9K24
$$ plain form
2099 -9 127 -101 -217 50 46 -130 -1 239 35 -117 82 143 -177 -170 145 49 -242 -4 247 -53 -196 177 266
2122 266 -151 -140 287 137 -357 -89 275 -33 -326 146 341 -92 -149 282 219 -295 -167 237 16 -331 3
2143 3 272 -54 -175 165 209 -155 -128 216 73 -228 -2 128 -120 -183 51 124 -88 22 230 57 -160 42
2165 42 62 -202 -131 117 81 -129 41 222 -31 -156 130 140 -160 -127 206 105 -228 -25 242 -5 -185 164
2187 164 243 -120 -113 204 100 -252 -105 183 -3 -214 116 263 -58 -149 185 124 -207 -89 189 -1 -176 60
2209 60 131 -108 -131 89 91 -142 -36 164 2 -176 50 113 -133 -126 118 82 -162 28 151 -36 -127 71 128 -101
2233 -101 -85 164 74 -151 -4 182 -9 -115 75 165 -113 -69 134 57 -116 -5 169 -17 -110 73 80 -121 -98
2256 -98 144 73 -133 -4 126 -46 -140 88 96 -121 -49 124 -4 -171 37 72 -103 -127 67 96 -117 -98 126
2279A26j20j59J50J35j49j31K34J0j82RJ55m4j68J15J87j47j05J84lj84QJ59n7
2302B3p4Q0Q9j02p3R7oq8L1R3o5n5Q2j1q5QR4ko3P8O6j19p2Q4j3j44N3J69o2n1
2332c8J19O1j39j23J44j2j42M5J89m1j60R5J10j60rJ50N7j27n3R7k5j89M8J09
2356Fkk3J28P8j01p2M8q4j08M0N7j4L8R4qq3K3K5l7qK4k0p6%O3o4m5J23Q9n5J
2387C7J18o3j74m2Q1q1m8J57J46o5m5R4K7j66m3J26n1j22Q6J02q6j07J19P0o2
2412HNJ59l2r9l2K0j23q7J26O0j8R3P4oq9n9k5p7J0P9L5n4J7Q9r2l3N2Q3r7j1
2442b4Q0o4q6l4R8r9L7R2R1k1J6ln3j22LP1o2J7J00N6q9ON5n4m6L1P8o1l6N1j4
2473A4j11J5J29k2n1R0P1p6r7K3Nj09K5J27k3k5N0N1r9l5L7J7n6QR7m2p5L5N3
$$ plain form
2279 126 6 -153 -3 132 -17 -148 86 96 -86 -77 78 34 -134 -19 168 21 -84 100 97 -87 -79 80 23
2302 23 -51 29 118 16 -57 40 34 -54 -23 70 5 -50 32 21 -64 -56 38 36 -27 51 117 -2 -74 10 -3 -147 -94 75 13 -38
2332 -38 81 142 3 -120 24 12 -130 -85 104 63 -97 -2 108 -52 -61 89 146 19 -34 63 38 -151 -103 6
2356 6 4 -19 109 187 86 14 62 -22 -130 -90 -33 -47 -9 85 77 -6 17 42 5 -3 21 1 -75 -75 -12 -76 -121 2 91 36 37
2387 37 155 92 -82 -124 -43 -124 -172 -15 131 66 21 115 142 -24 -67 59 8 -114 -28 74 -12 -119 0 70 8
2412 8 13 172 140 41 9 29 -94 -181 -55 5 -13 80 154 148 59 0 -25 -102 -92 -13 22 -32 -15 74 -18 -51 1 84 -13 -24
2442 -24 56 -8 -94 -128 -30 -129 -92 0 91 70 86 83 30 -92 -89 -18 -80 -63 37 93 4 10 65 11 -35 -4 74 13 -23 28 14
2473 14 -97 -82 47 25 -26 64 135 59 -38 -15 -10 -119 -94 33 10 -15 35 86 -13 -48 -11 6 -50 -42 55 13 -62 -27 26
2502B6l5n0Q7j3Lj8L8l3n5nRL3j1R6np5M0J8o2m3O8Pl9N2O6q5m6L4O0o6o7J29
2534E8Rq6j8Q9nj19N1Q0k3p4Q1K5q0p2J15K6j01j2R0j3n4qO5l2n0L0K3k3l9N7
2564a0K8k1K9%k2Nm9j5L7L0rJ0M6K0o0j9j4N9o7k4Q1M8j27J7R4m3p8K1Q9Np2L9
2596B8L1p3r2P7O7p8L6O7Rr4m4P0l3n0K5J22k9o4K8J5l4o9L6M5K3j4K3L7r4n0
2626g9NM6J9J1K9P6k6n8l6oj1ML1P5J0q0L9n5m2l2K2Q2J3oO7l7q8o9P0J1k0M5
2658A0Q2l3j9o7%K7j27Q2R0K8m0J8k5o5o7J6N8N5L1%K6r2k6k2k4N8kO7O9m2q6
2689b0J1l4k6K5K3J15l8J0J9q8m8oM1P3k3M7j4rn9p0O6k6k0N9P0k5j0n0k2n6J1
2720g4J0P8L9%n6J4k4n2j9N3O1%j7L5j5o0m6O7l3mP8K2Mo8l8K8Mm9P2L6rj4K1
$$ plain form
2502 26 -9 -59 28 15 18 0 38 5 -50 -55 -46 -13 -24 72 67 -8 32 50 -12 -55 13 20 -19 33 99 14 -32 2 62 -4 -71 58
2534 58 67 -19 -37 52 47 -72 -21 59 36 -38 43 68 -12 -84 31 57 -44 -56 34 21 -33 -41 24 -8 -58 -28 -5 -28 -67 -10
2564 -10 18 -3 26 26 4 9 -40 -55 -18 12 3 13 59 79 19 0 -14 45 -22 -46 35 83 -44 -27 67 24 -54 -33 56 61 -11 28
2596 28 59 -14 -106 -29 38 -40 -4 63 72 -22 -66 4 -29 -79 -54 68 39 -25 3 18 -16 -85 -49 -4 19 5 28 65 -29 -79
2626 -79 -74 -28 -9 2 31 107 81 23 -13 -19 -30 -26 5 80 90 10 49 -6 -48 -80 -58 24 37 31 98 61 -27 -96 -26 -15 -35 10
2658 10 92 59 40 -27 -27 0 -127 -45 45 73 33 51 26 -39 -106 -90 -32 23 54 54 80 -12 -38 -60 -84 -26 -28 39 108 66 -20
2689 -20 -9 -43 -69 -44 -21 94 56 66 85 -3 -51 -57 -16 57 34 81 67 58 -1 -71 -5 -31 -51 8 78 53 43 -7 -29 -85 -74
2720 -74 -64 14 53 53 -3 11 -13 -65 -84 -31 30 30 13 48 33 -27 -73 -6 -39 -43 35 57 61 -7 -45 -17 -13 -62 10 46 37 23 44
2753D4lr1j3K5M8j6M3L8n0k3J6p5M5MMj3N8J6l0q4PM1jm1Q0J4p5J5L1j1q8N1Q1
2786D7m4n9J06J9j01l4N9O6j04k0J24j6o7K4PQo0N9MJk9N9K0j05M8J5k2n6N4M9
2816E2j9n4K6N4n5Qj6j4L0j2J4k0L7K1p0l5P0N5j08j1R8Kq0l5R7m6n6P8P4r0p0
2847g5J15kj29L1J09l9j05O6J26o4j13Q6P5j15n5R9M5q1J8L0J7k3qK2l0l8Q8O
2875E6q7QP1n2n6M9P6j8m2O3n8m7M3l3o4J2J20k0p6P9Q0q8j31J07J06j32o9J11
2903HR0j44q7J59mj18Q3J45p6r4O9J3j03l9J12K8j11O5J16k8j13L3N0p8q2J10
2929DN8q4J2N2j2o2N2J3p3N8P5m4j42M7O6q7l0J22R5j17K0J00o5j60M2O5p1l4
2957a00J40O8j37j7J54l4j58O2J39j01j44J01J08j11r8J12Q8r9M3J15n1j04L0
$$ plain form
2753 44 41 -50 -63 -38 10 -6 37 75 25 2 18 -57 -12 -8 -4 -17 41 57 27 -57 -50 -9 -10 -51 29 43 -32 -17 14 3 -85 -34 47
2786 47 3 -56 50 69 -32 -66 -7 59 -45 -65 59 43 -24 0 7 15 -45 14 18 19 -10 49 69 -36 12 27 5 -51 3 52
2816 52 33 -21 5 59 4 12 -4 -18 12 0 14 -6 31 52 -18 -53 17 72 -36 -47 51 53 -27 -62 35 -11 -67 11 85 -5 -75
2847 -75 40 38 -91 -60 49 10 -95 -29 97 33 -80 6 81 -34 -89 10 55 -26 -8 22 39 16 8 30 0 -38 50 56
2875 56 -31 -23 48 -4 -60 -11 65 47 5 68 10 -37 6 -27 -91 -79 41 21 -55 24 104 16 -115 -8 98 -34 -103 8
2903 8 98 -46 -133 26 22 -96 -13 132 56 -38 31 44 -59 -98 14 42 -69 -4 112 84 -29 4 54 -24 -106 4
2929 4 62 -22 -10 42 30 -32 20 33 -40 18 93 49 -93 -46 20 -67 -97 25 120 3 23 123 58 -102 -60 5 -66 -100
2957 -100 40 108 -29 -46 108 74 -84 -22 117 16 -128 -27 81 -30 -128 -16 72 -27 16 131 80 -24 6
2980Fk3o7l4J09L9n8Q9Q8q2r1L1L6r8m8J28j7p7J7Q3p9j3J29P1j81L0J38j15j34
3008a23M1J01o7p1J72J14j18n6Q8j1j46nJ16m2p7P5J09j42J5R2Nj08J3J39m4j80
3034a10R5O6j32k8Q7R1o1RP9o7p4O8j4j13M5J23Oj23P3J16j25j07J10N6j13o3
3060a06J41mj22N0O6o8r5K00O8j42m7J28l9j25k1J77m1j14P7J44j37p8R8K8r2
3085e4kJ08l7p9Q0M6j21MQ8j1j09R3P2p9q6J22Qq9J3R8Lq7K3R7j11o4J24J5j38
3114g3L4J66q2j20L5J20m9j25J10P4j15r8J72K3j54N4J19n5j37J08R2j22n2J36
3138F1kj12jJ56j00o2O7N7j00l7J02k3n6KJ14p0m4R2J3r2j5J20m4j07L6J11k7
3165C9r0Q5L9j09mO0J2j16P0J02j29m1Q3N9q2l4J29kj29K5R6q6p8R8N2j00j2J29
$$ plain form
2980 6 -17 -84 -118 -9 30 -28 61 149 67 -24 7 43 -55 -103 25 8 -69 -52 31 -48 -61 68 139 -42 -12 126 11 -123
3008 -123 -82 19 -48 -119 53 167 49 -7 81 70 -76 -81 35 -7 -84 -9 100 -42 -27 65 70 -38 -25 114 70 -110
3034 -110 -15 51 -81 -109 -22 69 8 17 96 29 -45 23 9 -104 -59 64 70 -53 20 136 11 -96 14 70 -43 -106
3060 -106 35 31 -91 -41 25 -43 -138 62 130 -12 -59 69 30 -95 -116 61 20 -94 -17 127 -10 -88 10 38 -54
3085 -54 -56 52 15 -64 16 62 -59 -55 33 22 -87 6 78 -1 -87 35 43 -46 -33 65 68 -19 4 101 -10 -74 50 65 -73
3114 -73 -39 127 45 -75 -40 80 31 -94 16 90 -25 -123 49 72 -82 -28 91 36 -101 7 99 -23 -75 61
3138 61 59 -53 -54 102 2 -60 7 64 -36 -73 29 6 -50 -48 66 -4 -48 44 57 -35 -50 70 26 -81 -45 66 39
3165 39 -51 34 73 -36 -40 20 32 -84 -14 88 -41 -82 1 60 -22 -56 73 71 -58 -33 63 -23 -101 -3 49 -51 -63 66
3193F6pj12K2P8m2n6N4J8p3J2Q9Mj29N0J13j19l9J11Q5j48k6Q0pq3M3J01m2r7
3221e4Q9M4j04k0J15l0r1K3J32p9j18R0L2p3J0P1Op9N8K4o7l0L1L0l4JR1oj08
3250d6L7N8r1l7R7M9j05L0P2n0p7K6J07r3k2N1O9q6m2R2k7r1O1R0m3j02J08N4
3278H9j32j2J11j7r2N8Q1n1p8P4%o9l0J30j3q1J8Q2n8l6j1R2q0K2P3k6n9k1J11
3307G5r8mQ5j7o3K1M3j6o2L7N7p7pR4j5j04K9N2k4q1N8P4o1o1R4L3j01J2R8k0
3337E1r0M4M9n8k3M4L3n8k3Q9k1o3mQ5n5m1N6M1q9oP6Pp4K5N4o6qM5L3m9k9O2
3369C7Nj02N8M8n0l6J07j4p0l5J25m4p6O8L0q7qO4J7q8M4M9j8p0K6R0r3j3O5K3
3399E2o8lO8k6p0M0O1n1l2P4np6L1N3jq9M8N1k7m5M5mn5j3Q1jo7L4M5n4n5Q5q
$$ plain form
3193 66 59 -53 -31 47 5 -51 3 21 -52 -40 49 53 -76 -26 87 -32 -71 40 125 -23 -49 31 24 -59 -16 85 43 -54
3221 -54 35 79 -25 -45 70 40 -51 -28 104 25 -93 -3 29 -44 -34 37 43 -36 22 46 -21 -51 -20 10 -24 -23 68 62 -46
3250 -46 -9 49 -42 -79 18 67 -38 -8 64 14 -63 -37 70 -23 -45 6 75 -11 -53 39 12 -79 -18 72 29 -73 35 89
3278 89 -43 -55 56 39 -53 5 86 35 -43 31 31 -38 -68 62 49 -32 -14 68 10 -26 -37 55 -25 -3 70 44 -15 -36 75
3307 75 -23 -27 58 41 -22 -1 42 26 -36 1 58 -19 -26 68 53 -51 -22 30 6 -75 -17 57 -4 -65 29 62 -39 -27 71 51
3337 51 -39 5 54 -4 -27 17 50 -8 -31 58 37 -26 -30 55 0 -41 15 56 -33 -39 37 44 -30 -5 49 -17 -25 20 53 4 -25 37
3369 37 42 -60 -2 46 -4 -40 67 53 -17 -52 73 29 -47 21 51 -36 -44 20 37 -51 -7 42 24 -46 -20 70 -23 -36 29 52
3399 52 -16 -19 49 23 -47 -7 54 3 -29 45 40 -36 -5 48 47 -42 6 57 30 -15 30 26 -29 -42 39 38 -29 5 50 -4 -59 26 18
3432A8l1k1P9l5n6P1K6l9n4P2j4l7l4Q8np2M1J9l7l1P5K1n8kN2j1q0N5K4m9qN5
3464B2Jn7J4N9pr3N9N3n3k5O1j2p4N2L6j8p3M6O4q1l9R6j9o1K5R4o4p0O5M2o1
3495a8m1N6L5n4l3J32o6m2MN9k5o3Q7j1ml7L6ln3L9P5o7pM5lq8M1K7k0k8P6K7
3527G6q6rL3K8j19M9Q2o0j9L8L7r0j9J02jo9j3Q4n4n2L9M7n9nQ3j2n1L5L7l7m8
3558c3J7P3q3j8P1L1q0NN0l2k8KP0l2m9N5kl6K0P2o1l7N9J9o2rP5m2l9k5J15m4
3590B2k6N2or5M1O0m8m0M7P3p4k7M2L0q8k0J09k1o4N1Pn5m5M9N5o6LR0k1q3L3
3621a5K6j8m1O3Nl7k5M9L3o8RP3m0l8O8J1p5J1K8jm9L5N8o2mK2K7r8J8M5L2p0
3653b8lO4qn1qN9q5M1N8np9M8Oj1o7O3L6q0J2M1j5m6O0J6l4k4P9k5l1RO3n3m3
$$ plain form
3432 18 -13 -34 45 10 -46 25 51 12 -42 30 16 -21 -55 33 28 -44 -3 16 -21 -52 23 44 -14 -16 36 25 -55 0 24 -25 -33 22
3464 22 23 -34 -20 39 32 -61 -2 51 -2 -27 34 22 -52 0 36 18 -55 -9 55 -26 -65 31 12 -49 -24 70 6 -64 1 43 -18
3495 -18 -59 -3 32 -22 -55 77 11 -31 -27 32 7 -56 31 20 16 -21 15 12 -41 -2 73 6 -1 44 41 -47 -6 21 1 -27 49 76
3527 76 -10 -19 14 42 -77 -28 54 -6 -25 13 50 -40 -59 43 42 -27 -40 44 -10 -62 -23 24 -35 -40 43 31 -20 15 52 15 -33
3558 -33 -16 57 -26 -44 27 58 -22 -17 33 1 -27 -25 45 13 -36 19 17 -19 1 73 12 -25 34 53 -9 -18 57 15 -24 -49 66 22
3590 22 -4 48 42 -53 -12 48 0 -40 7 80 6 -21 21 51 -37 -57 52 31 -33 18 25 -30 -75 -26 29 -37 -34 56 35 -48 -15
3621 -15 11 -7 -48 15 20 -17 -42 7 40 -28 -19 54 14 -24 44 55 -20 -9 19 18 -31 4 62 0 -4 18 45 -53 -35 10 42 -28
3653 -28 -31 33 25 -26 -34 25 -60 -19 39 34 -45 3 9 -2 -69 -6 30 -50 -38 3 -12 -58 2 18 -16 -40 39 14 -17 -8 55 2 -41
3686d1M6K0n0%N6K0r9L1N5k1m5M9L3n4j4M0L0q9L5M0k4n9M6L6o3k6R4j8n1kM3
3717A8j1l4L0j3K3m3N1lm8PL0Oo5O9K7q1K4M0lp7J9P3l8m3N7j1k4NN6n4j4L0J8
3750B1qo7O2L5n8k3M6K3l9pM3ln9M3L9p9MO3Pn6nM5Nq3L7L8m6k0O7j6m5L6J7j
3784A6m1OK3n4J3N3k1m2L8K5k8l1N4Ll8J4M0k1m2N7Qoo2N3Mm0QN7l5m7M9M9k5
3817C7o8N4L8n8m0O6l3JJ1K6ko6L8J5k4J4J1j9l5J6M1l7k8M9J4k8KK9j3n2%L1
3849a0j0j3N7Pk2J4K2l7j0j1K5j0j0RJ8l5J4J9j5k1J1M5k7l0N8nl5n3O2j1j2L2
3881A6K9o1mK1K8m9J8J5j7k2L2Mn3J2M0j4k4K1O0j4p3K5L1k0o4M8L9k4K3Rqn8
3913c4J5r%J0N6Pq2P2pKj3pJ3k7J7OJ3l9kJ8j4QOM5m6k6K2j9J5k6N9j6k3lNkk3
$$ plain form
3686 -41 5 25 -25 -25 31 51 -48 -17 38 17 -28 21 54 0 -14 26 56 -33 2 42 18 -41 5 41 -22 -48 46 28 -23 -25 18
3717 18 7 -27 3 -10 13 -30 21 18 -30 -23 7 13 -52 17 44 -37 -13 27 24 -53 -34 39 1 -42 15 4 -20 -15 41 -13 -27 3 21
3750 21 13 -54 8 43 -15 -38 8 31 -8 -15 28 25 -34 9 48 -31 -27 36 43 -13 -18 27 32 -51 -14 24 -22 -42 25 9 -36 0 17 16
3784 16 -25 -19 4 -50 -37 16 -5 -47 -9 16 -12 -43 11 14 -24 -10 30 9 -33 24 32 26 -36 17 21 -19 -11 46 11 -36 13 62 37
3817 37 -31 23 61 3 -37 29 -4 -3 8 34 32 -34 4 19 -5 9 20 1 -34 -18 23 -14 -42 7 21 -7 -5 24 11 -41 -41 -10
3849 -10 -20 -33 24 31 9 23 45 8 -2 -13 12 2 -8 1 19 -16 -2 17 2 -19 -8 37 10 -20 38 33 -2 -55 7 -4 -16 16
3881 16 45 -16 -20 1 29 -20 -2 13 -4 -26 6 10 -43 -31 9 -5 -29 -8 52 38 -35 -10 21 1 -63 -15 24 0 23 32 24 -34
3913 -34 -19 -28 -28 -18 38 45 -37 35 28 30 17 10 23 -4 13 19 32 -7 -9 9 -5 3 9 54 8 -18 4 -15 0 -26 33 17 -6 -9 -4 -6 -29
3950b9%M0Nj7J5j2k4J7K0o4J7N4kj7J7k4rl7M8K9m6K6L0K2n7pJ7j8l0M1K1j3L
3983A6LK0o9K4NMK8j5Ql1jJ0J8oJ0Ql2k6L5mmJ4k8K0oJ7Qm0j6L2l4NJ1J7J3k3
4019iK2oj5K5k6Rk0OL7j0k2J0J6j1j0L2Pk5j0L4l7j0K7j1OLJ1J4j2n2K5J0K1l6
4053gM3k8%NJ4l1J7j6Mj2N0l9k3K2J2k7k3P1k6PqJ9j9%k1J9K9l4oJ2m2K3J1nn
4088a4KJ1Pm2lL7mk0J1O7m4k7L1k4J8p%K6j4J1j5M7o7KM0k7J9j0L3l4l9L3l4j
4122c1L7mPJ1ok3qJ0Lk4J0M7J3p0N1om7J7L2J7m3J4Opj6qK5J3l4L3K8k1m3mK2
4157Aj4l3O1K9j9k6k1J5J4l7O0l9PK3m0J6Pl5J8M6n4OJ7J7m5J5qJOj8L7J6rl1
4191a7jK0l4RL8mj8J4k1lJjjK3m3N0J5Km6RK3ppK4L0m5r%Qk8KK7Jj4J5j0MmL6
$$ plain form
3950 -29 -29 11 16 -1 14 2 -22 -5 15 -49 -32 22 20 3 20 -4 -13 -50 -2 27 -19 7 37 59 2 -5 12 -6 -36 5 26 13 16
3983 16 19 39 -30 -6 -1 3 31 16 24 -7 -8 2 20 14 24 32 0 -26 9 5 1 15 -13 7 1 18 26 -14 -30 2 -32 -27 -16 1 14 -9
4019 -9 13 7 -8 17 -9 0 -20 -14 23 13 -9 1 17 6 -4 28 35 10 0 34 -3 -13 14 3 9 12 23 37 25 -27 -2 8 29 -7
4053 -7 36 8 8 13 27 -4 13 -3 1 -11 39 0 -23 -1 11 -16 -39 32 6 13 5 24 5 5 -16 3 32 -2 -8 4 -38 -15 -4 -9 -14
4088 -14 -12 -1 6 -36 -39 -2 -6 -26 -15 52 8 -19 12 -12 6 -1 -1 25 11 22 7 54 -13 -11 29 2 21 11 44 10 -29 4 -30 -31
4122 -31 6 2 9 20 14 -9 -17 -7 -4 -28 -18 29 42 -28 23 17 -30 -13 19 36 -7 7 13 6 -10 -18 7 20 -14 19 47 26 -17 -21 1
4157 1 -13 -46 15 44 25 -1 -22 -7 7 -30 30 -9 -2 21 -19 -3 4 -31 -13 33 -21 -15 2 19 -26 -11 -19 -18 -12 -30 7 23 14 -17
4191 -17 -18 2 -32 -23 15 11 -7 7 -14 -17 -16 -17 -18 5 -38 12 27 29 -17 -8 15 8 1 25 55 10 1 1 9 -19 -17 10 11 -3 12 2 6 2 38
4230C8n3L4j0k1KK7j5pmj9M6j8J6j4k6M0Jk7J3l4J0j1L5k4QJ3QJroqJ2Rj0JJ6
4266A4j8m1N5J4k9%%lK3j8j3lmK4j1J7rK9j5K0l0k9NM7j1J0j7J5Pl2Nj0J5l1j4
4301c8M6oJ2n0L0L9l5k2K1%rK8j7k6OjJ3rJ4L0l4Nj6L6J5okkj0kk1J5K8k2k1J7
4337FJ5J1o0K6j5J9J8k2K5k2k3L7k8mK5LOl0RL9pn5K4J6mpl2O4rl3Oj9LKJ3J4
4373A1qOj8J6oj6M9k6RqK2j9j0j0KK5%k8L0J8n7K4J2l2OnO2k3Rk6NK1k5K3j4j5
4409DJ7pk0KORoNK4pn0J3j4MJ4J2j6J7mpj2L5m0K5J1rK6k7J5Lm1J6j2J7L7%m2
4446bpJ7kj7J0j6L3mJj7J7Mj7KJ6Mj0L3l5Opj1K5j3KJ0J1j4m7L3j2OoMR%mj3l
4485a4MRJ7k4J0kk6L4%k4%pO3qk1oj1qlj8K9K1j8K5K2rk2k0jJ6nqM5n1L5l2j3
$$ plain form
4230 38 -15 19 9 -12 -10 17 2 -5 -9 -28 18 0 16 2 -24 16 17 -10 3 -31 -21 -32 3 -21 -13 0 8 9 0 -6 -14 -2 7 -3 -2 14
4266 14 -4 -45 10 24 -5 -5 -5 -8 15 -3 -16 -19 -23 1 -10 7 -2 27 12 32 2 -27 -22 25 14 24 7 22 29 -3 2 -8 7 -24 -38
4301 -38 8 2 14 -36 -6 33 -2 -24 -3 -3 -12 16 -1 -27 -21 -22 -9 -18 -4 26 -8 -3 -19 17 32 26 24 22 12 10 -11 4 32 10 -11 6
4337 6 21 32 -28 -2 -17 2 20 -2 23 1 -22 15 -13 -17 8 11 17 -13 -4 35 28 -27 -3 13 9 2 -30 34 25 -8 -2 -21 -18 -16 -3 11
4373 11 3 9 -9 7 1 -15 34 8 17 9 31 12 2 -8 -6 19 19 -9 21 39 -18 6 18 -14 -8 -13 49 26 35 9 14 35 10 33 19 4
4409 4 21 14 -6 -4 2 11 5 10 34 27 -23 -10 -24 -20 -6 6 -10 7 3 -4 -16 19 -21 4 15 6 32 5 20 23 -18 -2 -14 3 40 40 -2
4446 -2 -9 8 6 -11 -1 -17 16 12 13 -4 13 17 0 2 18 22 12 45 10 16 9 -2 23 10 12 22 33 19 -28 5 -7 -1 -7 -3 6 6 2 -11 -14
4485 -14 -10 -1 16 -8 2 0 -26 8 8 -16 -16 -23 40 32 11 5 -6 -14 -17 -35 -6 15 -3 22 44 35 13 -7 -8 8 3 -5 40 -11 24 -8 -21
4522b1J9L5k2J9j1nj2j4J5j8M3oLJl0K2Ml8OmK7J6j7Rk4nj7J1pJPN0jl7l2L2l8
4559c9K2O6m1%J8Km2J2nJ7j5j5R5n6j7MJ1j4j2L0K5m4kJ6ppj0K2j2J0pL7n6L6
4593B2k0K0j5j3J0LOjk2m2M4kJK9j0J8k2l8L3j2j2RM2m6QPK2K2n2K9kj7rL1j9
4628Brk2JL8l3M0L1k5l7L9J0k6RnLm5K8PJ3l0M0l0jJ3k2J8rj4J3qrL4j2Qnk8j4
4665c7K0K5l1j4N3kk1j1jK9j0j2K4K3j7k4K8m5L2J8Km1k1O3qkk6lOoLJ6J3j7J3
4700A9JNl3J6Mj8mj1J8Lj4K6k2KjJ0k8K3L7j5m8L2J7k5KRj9PRl9L0M%j8%K7k9
4737b3RKk4P5m1LK3j3LpJ5j5jrJ4j5J1j3nJ1qK3j1PqPk9M4m2J6LJ4kk3l9M7K7
4774B6j5k1J2L8o7L3%k2Oj8J1J0j1L0Ll0qM1J3n3L0NoqJ0qj3J7K0j9k2L4kk9K6
$$ plain form
4522 -21 -2 33 11 30 19 14 2 -12 3 -15 28 22 25 26 -4 18 22 -16 -10 -14 13 29 12 21 -3 -8 -25 -14 -21 -20 -13 37 36 -1 -33 -1 -39
4559 -39 -17 49 8 8 26 28 -14 -2 -7 10 -5 -20 75 19 2 6 17 3 -9 21 46 2 0 16 9 2 -8 14 2 12 5 42 -14 22
4593 22 2 22 7 -6 4 7 13 12 -10 -52 -8 -10 -9 20 10 28 6 -32 1 -11 -23 -14 28 -18 -10 -3 19 41 -11 18 16 -1 -10 21 2
4628 2 -7 -29 -28 10 -23 17 48 23 -14 25 35 9 18 13 16 -29 -1 6 19 -11 29 -1 -2 11 -11 7 -2 -16 -3 -11 -20 14 2 10 5 -23 -37
4665 -37 -17 8 -23 -37 16 14 -7 -18 -19 10 0 -12 12 35 18 -6 22 -23 9 27 29 -12 -33 30 22 20 -6 -9 -3 -9 -6 10 23 6 19
4700 19 20 25 -8 8 12 -6 -10 -21 -3 0 -14 12 -10 -8 -9 1 -27 -4 33 18 -30 2 19 -6 -4 5 -14 -7 2 -37 -7 -3 -3 -21 -21 6 -23
4737 -23 -14 -12 -36 39 -2 1 24 11 14 7 22 7 6 -3 11 -4 7 -6 -11 0 -8 15 4 11 3 10 -19 25 -17 -1 2 16 14 -9 -48 -1 26
4774 26 11 -10 2 40 -27 6 6 -16 -10 -28 -17 -7 -18 12 15 -15 -23 18 31 -22 8 13 7 -1 9 1 -12 5 25 6 -16 18 16 -13 13
4809A3OKl9oJ9K4k5K7j5qk3M9k7PrK6j4k2J5K9l9J3j0MJ0k9K4L0p3N0j8J3k7K3
4843@O%K0k5lm6O6l1L9k6OK3m7K1K2k7MJ7Rj8k8L2k5j8K3RPJ6nOj2J6l3J0j8k6
4879c6L5mlRj0k1NK7k1%K9Km8QPK8nk8M0L2n4l4P1k6k1J6J2nRplK3o2K9K0j9R
4916Dj7L8rrj3k3L7K6l1lK4j4j8jK9j7K2l8N6n0kJ1j0QMK0k0lKJ5j4j7jK1n6L2
4952a7N7j5m2J2K2k4k1K8Qm3J2M6k4j7RK8l9PK7j0l3mM3J1rJ1Mk4j3K1j1k2J7
4985eKK5j2K9nj9k4J5Mj7L5oQj0J3j2l1jK9J6m1K6qj5mj1M7m9PL0Nn9N4pj3rL
5022a0J9j8J3J8K2o7OJ6J6k3j1L1KLpLk5nkL3k5M3Jk2k4J5Oj4J2OJ2l0lK6k3l2
5058c8K7J8Pqj2j9mJO6r9L2PLL3k8J2j1l4M4L0n0L8Jk1Q%J3j1oK9%l0RPJ4j2k0
$$ plain form
4809 13 19 21 -18 -24 -5 19 -6 21 6 -2 -25 24 -3 4 -5 21 7 -15 0 29 -10 3 -7 -3 7 -22 2 32 -41 9 -9 4 -23 0
4843 0 6 6 26 1 -2 -48 18 -13 26 0 6 29 -18 3 25 -2 2 19 28 10 -18 14 -11 -29 -6 3 10 26 21 27 15 31 -2 8 -10 -36
4879 -36 -1 -5 -8 1 -9 -30 -25 2 -19 -19 10 12 -36 -28 -21 7 2 -26 14 46 -8 -42 29 3 -18 -2 10 5 14 7 4 27 -35 -6 14 -5 4
4916 4 -13 25 16 7 -6 -29 8 34 3 0 24 10 -8 -9 20 3 25 -13 43 -7 -9 2 -8 0 4 24 4 1 3 18 4 -13 -14 7 -49 -17
4952 -17 40 25 -17 -5 17 -7 -28 0 8 -35 -23 23 -1 -18 -9 19 -20 -13 14 4 -29 -33 10 21 12 23 27 3 -10 11 0 -22 -5
4985 -5 -3 22 10 39 34 15 -9 6 10 -7 28 22 30 20 33 21 -10 -11 18 34 -7 19 11 -4 -8 -19 28 -21 -14 16 21 -38 16 9 -4 -13 -10
5022 -10 9 -9 4 22 44 -23 -17 -1 15 -8 -19 12 14 17 10 13 -12 -17 -19 14 -11 32 33 11 -13 2 8 -6 6 12 24 -6 -9 17 -6 -38
5058 -38 -11 7 14 6 -6 -25 -29 -28 38 -61 -29 -22 -19 14 -14 -2 -13 -47 -3 27 -23 15 16 -5 3 3 16 5 -1 28 28 -2 7 14 28 16 -4
5095dM2j0k4OL3m2M3k4j0oM3k0j9j9OJ9%kqMk6OL5m5K3QJ3n3O2j9%l8J6K2pm5
5131d0N4J1m7J4L3k3j5LN3o8KN4Lm0l6P7k4j9LN5n6J7OJnk0K8Jlj4J5l1J5l%l0
5167b9L7k5K6k8K1K6j5%k8K9Lm1OK0j5QnqlM3J0k1l7J8pK2k3L0j0J8k4J6l5QL8
5202B5Ln1J0J1J2k1K7J7l6K9qQn0L3K2j7l2K5jj3qJ9qoOJ0j1K4%kl4j8O1j5m4
5237c3K6K1l4J0J2l4K9l5M3kk5QJ8pMj5L8j9kJ7k5j4K2L5m7MJ0L2m6j6LJ2J2j4
5271a2L4j9j5K0J0rk5K7pk9K0K1k6K2K4m4J8k1OJ8n7L3J2J4j6J4K6k1l1oL4l5
5303b0J0J7J5j6l4L2jj5K6J3m8K5Pjk7OkJ4jnL8m9N0j2lk3L6k1k3kL0J4m8L0K2
5338C4l1kROk6rK1lm3M8J1m1J0K1nj4j0L4j4l7L9moOj2kK2l2J1J3j3l7M8Oj8j1
$$ plain form
5095 -4 38 28 4 10 43 1 44 20 10 4 47 27 8 -11 -5 14 14 12 4 8 -18 -12 23 -22 1 9 22 -31 31 12 12 -26 -10 12 5 -40
5131 -40 14 25 -22 -8 25 2 -13 -10 43 -25 -23 31 34 -6 -42 35 11 -8 -5 50 -6 11 17 18 13 -7 21 22 19 5 20 -11 4 1 1 -29
5167 -29 8 -17 9 -19 2 28 13 13 -15 14 17 -24 -18 2 -13 -5 -10 -18 -21 22 32 11 -26 -8 -15 7 -16 14 4 22 -2 14 -21 -13 25
5202 25 28 -23 -13 -2 10 -11 16 33 -3 26 18 26 -24 9 31 14 -18 7 6 -7 -15 4 -4 -10 -4 6 -5 19 19 17 -17 -35 26 11 -33
5237 -33 -7 14 -20 -10 2 -32 -3 -38 5 3 -22 -14 4 -3 1 -14 24 5 3 20 -5 -19 3 38 -9 -5 5 37 -9 -25 -22 -10 2 -12
5271 -12 22 3 -12 8 18 9 -16 11 4 -25 -5 16 -10 12 36 -8 10 -11 -5 13 -44 -11 1 15 -1 13 39 18 -13 -19 15 -20
5303 -20 -10 7 22 6 -28 4 3 -12 14 27 -21 4 11 10 -17 -11 -13 1 0 -5 33 -16 34 22 19 -4 32 11 -12 -14 16 30 -18 12 34
5338 34 3 1 10 16 -10 -19 2 -1 -44 4 15 -26 -16 5 0 -14 -24 10 -4 -41 -2 -6 -12 -6 -18 -20 2 -30 -19 -6 -19 -56 -8 -2 -20 -31
5374c1K8mNQk6K6m7N6l1L0m0J9rK5Jk4MK8J1n6j6O6l1j3J5NJ7%lL9l8n1M8jj1
5409aqK0k6J0j0L4j7jK0mm5j0O8l3j4J3J0pk0jOj1K2K6k5Lj7NK1lj3K6k6pK2N
5445A2k0j8M2k1qK3J7k2LLjj1Qmk0NK4J9m5%L8pl4J4K7l4nL6k6JJ1Mj4oK0j2j8
5482a9j7K2J0j3pRN1m1J9Jj0K1m3J9J3Qj9j9J3j4PNKL8k7qPj2oL7j6Kj9L5qJ0
5518C1l0%%J9k8RJ4k3jKNj6L2Ok2j5k4K4J4NJ2j3jj8L2j3kk2K8j6jpJ6J7k9QK5
5555A8j3k7J3JM%jRl9L0L7l8K4j7j3K0K0k2J4k9N2j7m6jK2k6L4%Ooj4k4J0oqM8
5591A5j3k3J2J3jJ6nj6J9J8l2j0J3Kj1QmK1j8Jk1K3prJ3j7J1pL1j2k2K2oj9L5
5626B0k5K9Jl2M1n5K8K3j5Kl5L3J0l7J8j2oJ8k3J1J7k9lK5j3PK9k3j3Rj5J1mK7
$$ plain form
5374 -31 -3 -7 -2 6 -20 6 -41 15 -16 14 -26 -7 -16 9 10 -14 -10 18 29 -27 -43 23 -8 -21 -6 -1 16 16 13 52 14 -37 11 10 -1
5409 -1 -9 11 -15 -5 -15 19 2 1 21 17 -28 -38 30 -3 -17 -4 6 -1 -21 -22 -16 -27 -5 21 -4 -1 -18 -13 8 5 -8 18 -8 -15 7 12
5445 12 -8 -26 16 -5 -13 10 27 5 8 11 10 -1 7 3 -17 -12 12 31 -14 -14 24 17 -17 -3 24 -10 -15 21 -5 -4 7 11 -3 -9 11 -1 -19
5482 -19 -36 -14 -4 -17 -24 -15 36 -5 14 15 5 26 -17 2 15 23 4 -15 -2 -16 -9 -4 -2 36 9 1 8 -4 -10 27 11 13 -6 29 21 31
5518 31 1 1 1 20 -8 1 15 -8 -9 -7 -2 -18 14 20 -2 -17 -41 -17 -3 2 14 1 0 -18 14 1 -1 -23 5 -11 -12 -19 -3 14 -15 -7 18
5555 18 5 -22 -9 -8 -4 -4 -5 4 -35 -5 32 -6 18 1 -12 8 28 6 20 -9 43 26 -20 -21 1 -25 9 9 15 9 -5 -29 -19 -25 -33 15
5591 15 2 -21 -9 4 3 19 14 -2 17 35 3 -7 6 8 -3 5 1 22 4 5 -16 7 0 -9 4 -13 -2 -9 22 10 -12 10 4 -15 20
5626 20 -5 24 25 -7 34 -21 7 30 15 17 -18 15 25 -12 6 -6 -12 6 -17 -6 11 -18 -21 4 -9 -2 27 4 -9 0 -15 -4 -8 19
5660A9Rm2J0J3J3m4LK0j1J8oK2j9j2LKPj4L1j0k1L5ll6OK5k9K6j2j0JrM3j7m5
5695c4J9L0ml3J5L1m9J2J9Qk2onK8k7J0J2j5RoK1l8K4J9l3PjQl2K0j3J8j1K2J
5730Dj4PjjK6n1N8k7rj0K7nl2M1nQj3%J2l1K4j7Nk1ML3mlJ2l9pK9j8J8j0jPnj3
5769b2J2KlpK0k5J5J4jk2L7k0Oj9K5j3k0K3K4k6J0K6k3k6oK5JRl6J2RjjK3j2k8
5805a8K2L4l8J1pJ3j6nJ1lnJ2lLpKLk1nOj3J7%NrrK5J7l8J3K4l2k2L6K4m3QL5
5843B7m0K6k1%j6J6J1KJ0j4j0K6l1K0j1Jk7L5J5l4QL5j1oj4J2jj4J1j2RoJ7k6
5877a3K6jj0k1L3j2mj1K5j5jK9k8J1MmMRo2L9j0NK1m1M2j0k2M3J4m2j5J0Jk2J2
5912a6K6j8K6j9J1mL1j8lj4Q%J7Ml0J3K0k5J2j9L6n1K2k2Rj2K0j7K5l5PRMJj8
$$ plain form
5660 19 28 -14 -4 9 22 -22 -19 1 -10 8 2 24 5 -7 -4 -2 5 -9 22 12 -9 26 23 -13 -7 18 -11 15 3 -7 -6 -15 28 11 -34
5695 -34 -15 15 11 -22 -7 24 -25 -13 6 14 -8 -14 -19 9 -18 -8 4 -11 -2 -8 13 -25 -1 18 -15 -8 -9 -1 -33 -13 -26 -8 -19 3 4
5730 4 -10 -3 -4 -5 21 -30 28 1 -8 -18 9 4 -28 13 8 16 3 3 15 -16 8 -9 -4 -25 -21 12 8 5 17 -22 -29 0 -18 0 -10 -11 -4 -9 -22
5769 -22 -10 -8 -11 -18 2 -23 -8 6 5 -17 20 0 6 -13 12 -1 -21 2 26 0 10 36 13 -13 -19 6 7 16 -20 -8 1 0 -1 22 10 -18
5805 -18 4 38 0 11 4 17 1 -4 7 4 -1 11 8 11 4 6 9 -12 -17 -11 -24 -7 -7 -2 -11 -20 5 22 -16 -3 21 -11 -33 3 27 -16 -8 27
5843 27 -13 13 -8 -8 -24 -8 3 5 15 1 -9 17 -14 6 -5 -4 -31 4 19 -15 -7 28 17 11 -3 9 8 -6 5 -7 2 -4 13 -13
5877 -13 13 12 2 -19 14 2 -2 -13 12 -3 -4 25 -3 8 12 8 12 21 -41 -2 -12 -7 14 -27 15 5 -17 26 40 -2 -17 -7 -6 -28 -16
5912 -16 10 -8 18 -1 10 6 37 19 16 2 10 10 27 31 1 14 34 9 21 2 38 -13 9 -13 -4 -16 4 -13 12 -23 -16 -7 -3 -2 -20
5947b0K8m1K0k3O3m9J0LK9l7J7m2M5Om4L0K0k0NPk3K7mKKJj2K0k5J1j4K3j7jN
5982BL0l4KnN1j6k7K8mk5L1o1K4%J1m6K8J1J0Qm7J3OJ0kRl0M2m0J9oPJ3J2l8J2
$$ plain form
5947 -20 8 -33 -13 -36 27 -22 -12 -9 20 -17 0 -42 3 9 -35 -5 15 -5 0 7 -16 11 7 9 11 12 0 20 -5 6 -8 15 -2 -3 2
5982 2 32 -2 0 -5 46 30 3 31 27 2 33 -28 -4 -4 7 -39 -11 0 10 18 -29 -16 -10 0 -2 7 -23 19 -21 -2 -8 -1 12 24 -14 -2
$$ [...]
8191A6
##END NTUPLES=NMR FID
##END=
