##TITLE=1H_AM A510.IPS-1
 CDCl3, 8 sc, 
 29.7.2019
##JCAMPDX= 6.0         $$ Bruker NMR JCAMP-DX V2.0
##DATA TYPE= NMR FID
##DATA CLASS= NTUPLES
##ORIGIN= UXNMR, Bruker Analytische Messtechnik GmbH
##OWNER= root
$$ XWIN-NMR		Version 3.5
$$ Mon Jul 29 15:35:51 2019 Russian Standard Time (UT+4h)  she@DPX200
##.OBSERVE FREQUENCY= 200.13155
##.OBSERVE NUCLEUS= ^1H
##.DELAY= (6, 6)
##.ACQUISITION MODE= SIMULTANEOUS
##.ACQUISITION SCHEME= undefined
##.AVERAGES= 8
##.DIGITISER RES= 18
##SPECTROMETER/DATA SYSTEM= spect
##.PULSE SEQUENCE= zg30
##.SOLVENT NAME= CDCl3
##.SHIFT REFERENCE= (INTERNAL, CDCl3, 0, 15.7039)
##AUDIT TRAIL= $$ (NUMBER, WHEN, WHO, WHERE, WHAT)
$$ ##TITLE= Audit trail, XWIN-NMR		Version 3.5
$$ ##JCAMPDX= 5.01
$$ ##ORIGIN= Bruker BioSpin GmbH
$$ ##OWNER= she
$$ F:/spectra/data/she/nmr/H-F/1/audita.txt
$$ ##AUDIT TRAIL=  $$ (NUMBER, WHEN, WHO, WHERE, WHAT)
(   1,<2019-07-29 15:34:13.23 +0400>,<she>,<DPX200>,
      <created by zg, POWCHK disabled, PULCHK disabled
       configuration hash MD5:
       00 E9 B6 7A A2 85 ED C7 34 08 36 98 17 FE 4E 26
       data hash MD5: 16K
       71 34 7A 34 4E 65 BB 35 D1 3C FA 37 55 4F EE 8A>)
$$ ##END=
$$ 
$$ hash MD5
$$ 25 69 94 0A C3 9A B6 E4 38 BC D6 EB C7 D1 56 89
##$RELAX= 
##$RELAX= 
##$RELAX= 
##$RELAX= 
##$RELAX= 
##$RELAX= 
$$ Bruker specific parameters
$$ --------------------------
##$DU= <F:/spectra>
##$EXPNO= 1
##$NAME= <H-F>
##$PROCNO= 1
##$TYPE= <nmr>
##$USER= <she>
##$AMP= (0..31)
100 100 100 100 100 100 100 100 100 100 100 100 100 100 100 100 100 100 
100 100 100 100 100 100 100 100 100 100 100 100 100 100 
##$AQSEQ= 0
##$AQ_mod= 1
##$AUNM= <au_zg>
##$AUTOPOS= <>
##$BF1= 200.13
##$BF2= 200.13
##$BF3= 200.13
##$BF4= 200.13
##$BF5= 200.13
##$BF6= 200.13
##$BF7= 200.13
##$BF8= 200.13
##$BYTORDA= 1
##$CFDGTYP= 0
##$CFRGTYP= 5
##$CHEMSTR= <none>
##$CNST= (0..31)
1 1 145 1 1 1 1 1 1 1 1 1 1 1 1 1 1 1 1 1 1 1 1 1 1 1 1 1 1 1 1 1 
##$CPDPRG= <>
##$CPDPRG1= <>
##$CPDPRG2= <>
##$CPDPRG3= <>
##$CPDPRG4= <mlev>
##$CPDPRG5= <mlev>
##$CPDPRG6= <mlev>
##$CPDPRG7= <mlev>
##$CPDPRG8= <mlev>
##$CPDPRGB= <>
##$CPDPRGT= <>
##$D= (0..31)
0 1.2 0 0 0 0 0 0 0 0 0 0.03 0 0 0 0 0 0 0 0 0 0 0 0 0 0 0 0 0 0 0 0 
##$DATE= 1564400052
##$DBL= (0..7)
120 120 120 120 120 120 120 120 
##$DBP= (0..7)
150 150 150 150 150 150 150 150 
##$DBP07= 0
##$DBPNAM0= <>
##$DBPNAM1= <>
##$DBPNAM2= <>
##$DBPNAM3= <>
##$DBPNAM4= <>
##$DBPNAM5= <>
##$DBPNAM6= <>
##$DBPNAM7= <>
##$DBPOAL= (0..7)
0.5 0.5 0.5 0.5 0.5 0.5 0.5 0.5 
##$DBPOFFS= (0..7)
0 0 0 0 0 0 0 0 
##$DE= 6
##$DECBNUC= <off>
##$DECIM= 24
##$DECNUC= <off>
##$DECSTAT= 4
##$DIGMOD= 1
##$DIGTYP= 9
##$DL= (0..7)
0 120 120 120 120 120 120 120 
##$DP= (0..7)
150 150 150 150 150 150 150 150 
##$DP07= 0
##$DPNAME0= <>
##$DPNAME1= <>
##$DPNAME2= <>
##$DPNAME3= <>
##$DPNAME4= <>
##$DPNAME5= <>
##$DPNAME6= <>
##$DPNAME7= <>
##$DPOAL= (0..7)
0.5 0.5 0.5 0.5 0.5 0.5 0.5 0.5 
##$DPOFFS= (0..7)
0 0 0 0 0 0 0 0 
##$DQDMODE= 0
##$DR= 18
##$DS= 0
##$DSLIST= <SSSSSSSSSSSSSSS>
$$ [...]
##$SUBNAM2= <"">
##$SUBNAM3= <"">
##$SUBNAM4= <"">
##$SUBNAM5= <"">
##$SUBNAM6= <"">
##$SUBNAM7= <"">
##$SUBNAM8= <"">
##$SUBNAM9= <"">
##$SW= 24.9336996594482
##$SWIBOX= (0..15)
0 0 2 0 0 0 0 0 0 0 0 0 0 0 0 0 
##$SW_h= 4990.01996007984
##$TD= 16384
##$TD0= 1
##$TE= 0
##$TE2= 300
##$TE3= 300
##$TEG= 300
##$TL= (0..7)
0 120 120 120 120 120 120 120 
##$TP= (0..7)
150 150 150 150 150 150 150 150 
##$TP07= 0
##$TPNAME0= <>
##$TPNAME1= <>
##$TPNAME2= <>
##$TPNAME3= <>
##$TPNAME4= <>
##$TPNAME5= <>
##$TPNAME6= <>
##$TPNAME7= <>
##$TPOAL= (0..7)
0.5 0.5 0.5 0.5 0.5 0.5 0.5 0.5 
##$TPOFFS= (0..7)
0 0 0 0 0 0 0 0 
##$TUNHIN= 0
##$TUNHOUT= 0
##$TUNXOUT= 0
##$USERA1= <user>
##$USERA2= <user>
##$USERA3= <user>
##$USERA4= <user>
##$USERA5= <user>
##$V9= 5
##$VALIST= <valist>
##$VCLIST= <CCCCCCCCCCCCCCC>
##$VD= 0
##$VDLIST= <DDDDDDDDDDDDDDD>
##$VPLIST= <PPPPPPPPPPPPPPP>
##$VTLIST= <TTTTTTTTTTTTTTT>
##$WBST= 1024
##$WBSW= 4
##$XGAIN= (0..3)
0 0 0 0 
##$XL= 0
##$YL= 0
##$YMAX_a= 154481
##$YMIN_a= -135810
##$ZGOPTNS= <>
##$ZL1= 120
##$ZL2= 120
##$ZL3= 120
##$ZL4= 120
##$ABSF1= 10
##$ABSF2= 0
##$ABSG= 5
##$ABSL= 3
##$ALPHA= 0
##$AQORDER= 0
##$ASSFAC= 0
##$ASSFACI= 0
##$ASSFACX= 0
##$ASSWID= 0
##$AUNMP= <proc_1d>
##$AZFE= 0.1
##$AZFW= 0.1
##$BCFW= 1
##$BC_mod= 2
##$BYTORDP= 1
##$COROFFS= 0
##$CY= 11.3945322036743
##$DATMOD= 1
##$DC= 2
##$DFILT= <>
##$DTYPP= 0
##$F1P= 20.1537800932815
##$F2P= 0.134698688090026
##$FCOR= 0.5
##$FTSIZE= 0
##$FT_mod= 4
##$GAMMA= 1
##$GB= 0.15
##$INTBC= 1
##$INTSCL= 1
##$ISEN= 128
##$LB= 0.24
##$LEV0= 0
##$LPBIN= 0
##$MAXI= 10000
##$MC2= 0
##$MEAN= 0
##$ME_mod= 0
##$MI= 1.114404
##$NCOEF= 0
##$NC_proc= 0
##$NLEV= 6
##$NOISF1= 3.799351
##$NOISF2= 2.8
##$NSP= 1
##$NTH_PI= 0
##$NZP= 0
##$OFFSET= 15.70392
##$PC= 1
##$PHC0= -9130.98
##$PHC1= 14.60097
##$PH_mod= 1
##$PKNL= yes
##$PPARMOD= 0
##$PSCAL= 0
##$PSIGN= 0
##$REVERSE= no
##$SF= 200.130013532006
##$SI= 16384
##$SIGF1= 3
##$SIGF2= 2
##$SINO= 400
##$SIOLD= 16384
##$SREGLST= <1H.CDCl3>
##$SSB= 0
##$STSI= 0
##$STSR= 0
##$SW_p= 3612.71676300578
##$SYMM= 0
##$S_DEV= 0
##$TDeff= 0
##$TDoff= 0
##$TI= <>
##$TILT= no
##$TM1= 0
##$TM2= 0
##$TOPLEV= 0
##$USERP1= <user>
##$USERP2= <user>
##$USERP3= <user>
##$USERP4= <user>
##$USERP5= <user>
##$WDW= 1
##$XDIM= 8192
##$YMAX_p= 0
##$YMIN_p= 0
$$ End of Bruker specific parameters
$$ ---------------------------------
##NTUPLES= NMR FID
##VAR_NAME=  TIME,          FID/REAL,        FID/IMAG
##SYMBOL=    X,             R,               I
##VAR_TYPE=  INDEPENDENT,   DEPENDENT,       DEPENDENT
##VAR_FORM=  AFFN,          ASDF,            ASDF
##VAR_DIM=   8192,          8192,            8192
##UNITS=     SECONDS,       ARBITRARY UNITS, ARBITRARY UNITS
##FACTOR=    0.0002004,     1,               1
##FIRST=     0,             0,               0
##LAST=      1.6414764,     0,               0
##MIN=       0,             -135810,         0
##MAX=       1.6414764,     154481,          0
$$ Real data points
##PAGE= N=1
##DATA TABLE= (X++(R..R)), XYDATA
$$ [...]
$$ plain form
655 3696 7491 -4159 -9527 7 3478 -3680 -2552 5649 3099 -4613 -1768 3298 -1337 -3891 3638
670 3638 6371 -1253 -3742 1718 290 -6793 -4963 2979 3871 458 1994 4575 1751 -2339 -3205 -2730
686 -2730 -1512 544 652 -252 1873 3501 -407 -3480 138 2927 -406 -1576 2548 2407 -2539 -2758
702 -2758 177 -1519 -2785 2316 4671 -185 -834 4352 1653 -6709 -4447 3792 1020 -5724 -196
717 -196 7491 1703 -5582 -372 4630 -1351 -4764 1474 3743 -1835 -2414 1970 146 -3717 -88 3614
733 3614 -315 -2224 3000 3771 -2857 -4062 1732 2064 -3155 -2255 3247 3003 -1190 -1166 1275 877 -831
750 -831 -894 -337 453 1306 246 -1547 -286 1841 188 -2085 6 2409 375 -1647 39 859 -813
767 -813 -768 569 -405 -903 1455 1437 -2072 -1618 2614 1384 -3607 -1767 3695 1517 -3877 -1343 3748
$$ packed form
655C696L795j1650n368R534L471p158J128Q201k550p712K845N066m635k554P529
670C638K733p624k489N460j428p083J830P942Q92l413J536K581k824m090q66M75
686b730J218K056J08r04K125J628l908l073L618K789l333j170M124j41m946k19
702b758K935j696j266N101K355m856o49N186k699q362K262Q239k772o744N528
717a96P687n788p285N210N002n981l413O238K269n578n79M384j824l863L629L702
733C614l929j909N224P71o628j205N794L32n219R00N502k44m193K4K441l98j708
750h31o3N57P90Q53j060j793J261K127j653k273K091K403k034k022J686Q20j672
767h13M5J337r74m98K358j8l509M54M232j230m991J840N462k178n394K534N091
$$ plain form
784 3748 958 -3533 -646 2959 90 -2394 289 1586 -823 -746 1426 223 -1670 552 2082 -1041
800 -1041 -2317 1423 2554 -1367 -2239 1721 2481 -1434 -2278 1059 1932 -708 -1431 583 1418 93 -855
817 -855 -399 430 434 -295 -752 -48 693 184 -638 -372 280 325 42 -226 -414 71 566 -396 -1625 -432 1493
838 1493 318 -1729 -72 2519 805 -2211 -753 1835 91 -2499 -788 1755 582 -1160 196
853 196 1579 435 -435 276 292 -677 -413 407 -425 -1118 354 1334 16 -816 998 2019 40 -1531
871 -1531 -83 1079 -727 -2331 -641 1414 465 -962 481 2285 932 -1100 -521 485 -774 -1901
887 -1901 -653 380 -458 -392 1195 1127 -441 96 1545 191 -1847 -596 1071 -848 -2672 -376 1916
904 1916 240 -1077 1403 2976 485 -1377 -9 580 -1532 -2311 -435 689 95 277 1438 1453 470
$$ packed form
784C748k790m491K887L605k869k484K683J297k409P7K172j203j893K222J530l123
800a041j276L740J131l921q72L960P60l915q44L337Q73k640p23K014Q35j325r48
817h55M56Q29Mp29m57P04P41n09q22K66O52M5k83k68j88M85M95r62j229J193J925
838A493j175k047J657K591j714l016J458K588j744k590J711K543j173j742J356
853A96J383j144q70P11J6r69K64Q20q32o93J472R80j318q32J814J021j979j571
871a531J448J162j806j604J690K055r49j427J443J804j353k032N79J006j259j127
887a901J248J033q38O6J587o8j568N37J449j354k038J251J667j919j824K296K292
904A916j676j317K480J573k491j862J368N89k112p79J876J124n94J82J161J5r83
$$ plain form
921 470 181 334 -211 -796 -683 -342 -484 -787 -448 546 925 350 367 1590 1465 -627 -1539 -180 -235 -2397
941 -2397 -2095 1074 1699 -454 27 2565 1558 -1649 -1185 998 -463 -2553 -599 1478 -414 -1610
957 -1610 886 1918 -386 -648 2004 1592 -1436 -1292 831 -488 -2686 -869 1691 724 -416 1350
973 1350 2414 317 -1167 -207 25 -1164 -1122 136 439 29 260 536 364 304 377 151 46 223 -320
992 -320 -987 -576 -211 -805 -572 982 1260 41 228 1277 -39 -1901 -888 656 -682 -1614 690
1009 690 1829 -424 -1124 1150 1268 -1350 -1028 1468 751 -1619 -585 1354 -247 -1780 263 1761
1025 1761 -80 -703 1260 1277 -1050 -1091 635 101 -1323 -170 1388 418 -577 440 818 -464 -715
1042 -715 299 287 -398 -42 414 -155 -412 107 33 -389 127 641 -67 -344 292 90 -900 -521 510 31
$$ packed form
921D70k89J53n45n85J13L41j42l03L39R94L79n75J7J223j25k092r12J359n5k162
941b397L02L169O25k153M81K538j007l207M64K183j461k090J954K077j892j196
957a610K496J032k304k62K652m12l028J44K123j319k198J817K560r67j140J766
973A350J064k097j484R60K32j189M2J258L03m10K31K76j72o0P3k26j05J77n43
992c20o67M11L65n94K33J554K78j219J87J049j316j862J013J544j338r32K304
1009F90J139k253p00K274J18k618L22K496p17k370J034J939j601j533K043J498
1025A761j841o23J963J7k327m1J726n34j424J153J558r70r95J017L78j282k51
1042g15J014j2o85L56M56n69k57N19p4m22N16N14p08k77O36k02r90L79J031m79
$$ plain form
1062 31 -551 370 885 -340 -798 401 309 -949 -423 987 309 -852 138 994 -439 -1101 492 885
1080 885 -625 -511 1085 533 -1046 -254 1049 -48 -997 414 1130 -371 -784 720 568 -953 -494
1097 -494 984 325 -821 157 948 -288 -907 296 591 -594 -535 644 362 -595 -139 541 -132 -623
1115 -623 103 395 -253 -280 257 57 -418 -95 184 -145 -117 291 114 -200 126 203 -310 -280 375 113 -460
1136 -460 118 682 -122 -608 395 631 -533 -520 753 511 -810 -253 1035 148 -1019 118 1090 -275
1154 -275 -1014 527 962 -708 -875 777 658 -926 -479 990 321 -1008 -168 922 -47 -946 100
1171 100 758 -283 -669 306 501 -422 -499 280 348 -285 -267 166 231 -93 -211 16 265 25 -377 -74 462
1192 462 126 -496 -32 702 -4 -749 101 903 -196 -878 431 988 -482 -853 749 873 -903 -744
$$ packed form
1062C1n82R21N15j225m58J199r2j258N26J410o78j161R90Q56j433o62J593L93
1080H85j510J14J596n52j579P92J303j097r49J411P16j501m13J504j52j521M59
1097d94J478o59j146R78P91j236o19J203K95j185N9J179k82r57M56O80o73m91
1115f23P26K92o48k7N37k00m75L23K79l29K8M08j77l14L26P7n13L0O55k62n73
1136d60N78N64q04m86J003K36j164J3J273k42j321N57J288q87j167J137R72j365
1154b75p39J541M35j670j67J652j19j584M47J469o69j329Q40J090r69q99J046
1171A00O58j041l86R75J95r23p7P79O8o33J8M33O5l24j18K27K49k40m02L03N36
1192D62l36o22M64P34p06p45Q50Q02j099o82J309N57j470l71J602J24j776J59
$$ plain form
1210 -744 1084 642 -1116 -432 1254 286 -1269 -67 1243 -107 -1245 254 1128 -390 -1053 434
1226 434 839 -563 -799 571 636 -574 -555 489 367 -498 -408 350 321 -322 -364 243 445 -186 -507 152
1246 152 607 -124 -637 260 809 -321 -869 471 895 -539 -861 793 907 -811 -708 1066 666 -1186
1264 -1186 -478 1311 309 -1303 -45 1349 -135 -1290 357 1218 -537 -1110 606 919 -782 -819
1280 -819 785 559 -828 -499 734 310 -672 -185 534 81 -477 -125 262 101 -176 -114 76 179 -46
1299 -46 -336 -43 412 -2 -533 119 698 -186 -734 340 774 -554 -766 721 807 -831 -611 1094 562
1318 562 -1192 -355 1274 186 -1256 82 1235 -258 -1214 459 982 -608 -792 801 637 -828
1334 -828 -411 792 141 -827 -23 669 -180 -531 303 372 -325 -226 283 14 -253 127 120 -284 -18 329 -236
$$ packed form
1210g44J828m42j758O84J686r68j555J202J310j350j138J499Q74j518o63J487
1226D34M05j402k36J370O5j210J9J044j22q65R0P58k9o43m2O07K02o31l21O59
1246A52M55p31n13Q97N49j130n48J340M24j434l22J654J14j718J03J774m00j852
1264a186P08J789j002j612J258J394j484j155J647Q61j755n73J716L13j701l7
1280h19J604k26j387L29J233m24r82M87P19m53n58L52L87j61k77O2J90J03k25
1299d6k90K93M55m14n31O52N79q84n48J074M34j328k12J487Q6j638K20J705n32
1318E62j754Q37J629j088j442J338J153j493r56J673N23j590j84J593j64j465
1334h28M17J203o51r68Q04O92q49l51Q34O9o97R9N09k69k67L80pm04K66L47n65
$$ plain form
1355 -236 -394 432 412 -540 -255 721 168 -883 -54 906 -190 -902 461 947 -608 -740 784 600 -964
1374 -964 -380 1047 222 -1047 134 1069 -298 -969 460 814 -634 -646 729 411 -761 -205 766 26
1392 26 -626 248 521 -374 -373 367 -2 -611 50 502 -314 -322 658 364 -633 -115 677 -236 -868 304 661
1413 661 -587 -608 833 490 -823 -131 1153 41 -1077 270 972 -693 -1116 634 785 -815 -429
1430 -429 1202 562 -858 -72 925 -262 -1072 124 581 -576 -512 696 460 -510 94 764 -59 -566
1448 -566 246 261 -713 -491 315 -45 -482 369 776 -85 -124 726 203 -912 -282 490 -526 -990 438 873
1468 873 -475 -396 1143 689 -895 -242 1033 -150 -1396 -85 847 -607 -955 837 1101 -510 -212
1485 -212 1273 454 -1145 -387 676 -517 -1209 225 825 -314 -324 928 706 -454 -110 501 -240 -805
$$ packed form
1355b36j58Q26k0r52K85R76n53j051Q29R60j096p12J363M86j555j32J524j84j564
1374i64N84J427q25j269J181R35j367o71J429L54j448j2J375l18j172N56R71p40
1392B6o52Q74K73q95JP40l69o09O61M52q16qR80k94r97N18P92r13o32J172L57
1413F61j248k1J441l43j313O92J284j112j118J347P02j665m23J750J51j600L86
1430d29J631o40j420P86R97j187q10J196M57j157O4J208k36r70O04O70q23n07
1448e66Q12J5r74K22Q06l60m37Q51M07q61l9Q50n23j115O30P72j016m64J428M35
1468H73j348P9J539m54j584O53J275j183j246J311R32j454l48J792K64j611K98
1485b12J485q19j599P58J063j193o92J434O00j139j0J252k22j160L44O11p41n65
$$ plain form
1503 -805 -143 60 -561 -298 565 227 -135 610 747 -204 -346 341 -188 -1084 -368 468 -275 -568 748 983
1523 983 -297 -249 917 277 -1134 -378 702 -367 -1229 237 1009 -306 -550 1071 1016 -636 -434 828
1541 828 -32 -1327 -407 641 -324 -758 587 1034 -175 -220 776 339 -811 -361 358 -353 -792 94 425
1560 425 -233 -101 640 391 -241 162 355 -395 -603 62 -75 -652 -57 660 80 -249 571 656 -421 -435
1580 -435 433 38 -925 -277 658 -83 -661 454 868 -287 -384 712 471 -768 -394 568 -143 -910 86
1599 86 803 -148 -454 618 618 -485 -377 498 25 -781 -132 533 -156 -481 378 485 -295 -196 516 110 -510
1620 -510 -41 333 -261 -449 252 254 -313 -33 529 113 -366 128 328 -330 -359 318 199 -416 -16 528 -34
1641 -34 -406 227 403 -312 -327 425 233 -511 -100 525 -42 -495 213 485 -297 -365 418 241 -542 -181 492
$$ packed form
1503h05O62K03o21K63Q63l38l62P45J37r51j42O87n29q96P16Q36p43k93J316K35
1523I83j280M8J166o40j411P56J080j069q62J466P72j315k44J621n5j652K02J262
1541H28q60j295R20J048r65m34J345M47j209m5R96m37j150M50P19p11m39Q86L31
1560D25o58J32P41k49o32M03J93p50k08O65j37n77N95P17n80l29Q20Q5j077j4
1580d35Q68l95r63O48R35p41n78J115M14j155r7J096k41j239L74R62p11p67R96
1599H6P17r51l06J072%j103J08Q75m73q06O49O65o89l25Q59J07p80R9P12m06o20
1620e10M69L74n94j88P01Kn67K80N62m16m79M94K00o58k9O77j19o15M00N44n62
1641c4l72O33J76p15j5P52j92p44M11O25n67m53P08K72p82o8P83j77p83L61O73
$$ plain form
1662 492 -1 -468 143 471 -231 -421 299 244 -463 -189 399 50 -432 75 425 -180 -327 245 199 -340 -163
1683 -163 346 53 -401 97 370 -168 -225 306 230 -307 -63 330 -66 -352 123 332 -183 -180 340 206 -300
1704 -300 -40 355 -47 -388 116 261 -245 -244 299 170 -297 -26 372 -40 -320 95 243 -264 -276 246 133
1725 133 -336 -27 368 -2 -309 138 251 -212 -263 235 129 -330 -36 312 -51 -253 177 305 -175 -206 270
1746 270 97 -312 -31 300 -82 -260 134 295 -185 -165 276 92 -285 -87 293 -40 -315 119 283 -160
1766 -160 -185 193 138 -262 -70 214 -14 -234 57 205 -156 -156 135 54 -210 -10 197 -63 -165 101 119 -182
1788 -182 -81 193 -1 -229 64 202 -110 -204 166 140 -226 -103 277 37 -262 67 288 -98 -245 225 227
1809 227 -233 -162 353 134 -264 -21 276 -37 -247 113 198 -133 -160 174 105 -234 -40 218 -17 -174 59
$$ packed form
1662D92m93m67O11L28p02j90P20n5p07K74N88l49m82N07L50o05j47N72m6n39J77
1683a63N09k93m54M98K73n38n7N31p6n37K44L93l96k86M75K09n15LN20j34n06
1704c00K60L95m02l41N04J45n06JN43j29m67K71L98m12k80M15J48n07j2N22j13
1725A33m69L09L95l70l07M47J13m63n1M98j06m59K94L48l63k02M30J28m80l1M76
1746B70j73m09K81L31l82j78L94J61m80K0M41j84l77J98L80l33k75M34J64m43
1766a60k5L78n5m00J92K84k28k20K91J48l61%K91q1k64K00K07k60j02K66J8l01
1788a82J01K74j94k28K93J38l12r4L70k6l66J23L80k40k99L29K21l86j47M70K
1809B27m60P1N15k19l98K43K97l13k10L60Q5l31k7L34o9l39J94K58k35j57K33
$$ plain form
1830 59 153 -115 -139 72 13 -168 -16 129 -95 -103 115 85 -156 -59 140 -20 -164 45 155 -132 -107 197 111
1853 111 -205 -24 253 -42 -232 107 221 -114 -172 209 143 -253 -26 273 42 -232 74 279 -104 -229 158
1874 158 189 -179 -85 210 22 -213 14 194 -86 -154 147 111 -167 -82 153 12 -225 37 156 -134 -139 119
1896 119 97 -191 -34 210 -30 -193 72 159 -137 -122 173 67 -207 -31 191 -22 -195 78 178 -117 -128
1917 -128 176 100 -188 -3 204 -26 -183 107 158 -129 -109 175 94 -215 -25 163 -46 -213 101 169 -151 -97
1939 -97 199 85 -228 -15 195 -70 -228 143 213 -190 -139 217 38 -249 -59 239 -94 -266 78 215 -136
1960 -136 -163 181 100 -250 -44 230 -5 -199 73 209 -141 -132 175 99 -165 -17 196 -66 -132 140 157 -155
1982 -155 -94 189 29 -190 2 202 -82 -172 189 144 -193 -89 239 9 -277 60 285 -137 -234 183 192 -280
$$ packed form
1830E9R4k68k4K11n9j81J52J45k24qK18l0k41R7J99j60j44K09J10k87K5L04q6
1853A11l16J81K77k95j90L39J14l35n8L81o6l96K27K99k31k74L06K05l83j25L87
1874A58L1l68R4K95j88k35K27J80k80o8L01l6k78Q5K35j41k37K62J19k90nK58
1896A19k2k88J57K44k40j63K65Q7k96J5K95j06k74J76K22k13j73K73J00k95j1
1917a28L04p6k88J85K07k30j57K90N1k87K0K84q1l09J90J88k09j67L14O8l20N4
1939i7K96j14l13K13K10k65j58L71P0m03N1L56j79k87J90K98l33j72L44J37l51
1960a36k7L44q1l50K06K74k35j94K72J36l50RL07p6k64J48K13k62o6K72J7l12
1982a55O1K83j60k19J92K00k84r0L61m5l37J04L28k30k86L37K25m22r7M17Rm72
$$ plain form
2004 -280 -128 304 38 -333 42 310 -108 -299 147 188 -226 -181 281 166 -272 -14 295 -10 -281 77 241
2025 241 -172 -184 228 142 -212 -36 246 7 -208 132 182 -127 -125 174 57 -219 -33 187 -55 -103 204 179
2047 179 -151 -61 206 -54 -272 50 230 -145 -159 237 155 -279 -40 344 -27 -341 107 284 -239 -334 206
2068 206 187 -312 -115 431 162 -334 27 327 -175 -394 103 262 -241 -201 323 229 -253 -38 333 -1 -277
2089 -277 109 242 -155 -193 148 98 -214 -23 289 44 -76 160 173 -171 -126 97 -81 -250 82 217 -56
2110 -56 -43 265 120 -266 -34 216 -113 -343 80 255 -242 -228 280 174 -269 -47 434 34 -385 23 276
2131 276 -241 -443 219 310 -235 -114 421 196 -297 -11 257 -113 -426 86 247 -139 -157 290 194 -189 -18
2152 -18 259 17 -162 95 155 -175 -186 113 3 -173 65 278 -1 -63 189 87 -239 -121 144 -74 -233
$$ packed form
2004b80J52M32k66l71L75K68m18j91M46M1m14M5M62j15m38K58L09l05k71L58J64
2025B41m13j2M12q6l54J76K82k39k15L40N0l09KK99j17k76J86K20k42m8L07k5
2047A79l30R0K67k60k18L22J80l75j4L96q2m34K39L84l71l14M48J77n23r5N40
2068B06j9m99J97N46k69m96L61L00n02k19M97J59n03M0N24r4m82K15L71l34k76
2089b77L86J33l97l8L41n0l12J91L12k45j20K36J3l44M5K23j78j69L32J35k73
2110e6J3L08j45l86K32K50l29k30M23J75m97J4N08j06m43K22M81m00m19M08K53
2131B76n17k02O62R1n45J21N35k25m93K86K68l70l13N12J61l86j8M47r6l83J71
2152a8K77k42j79K57O0l30j1K99j10j76K38K13k79o2K52j02l26J18K65k18j59
$$ plain form
2173 -233 120 255 -109 -122 244 136 -266 -61 256 -41 -320 54 248 -238 -295 233 252 -212 -97 348 92
2194 92 -327 -33 235 -170 -294 126 270 -141 -87 273 125 -231 -41 203 -88 -210 105 184 -153 -112 183
2215 183 64 -161 37 223 -22 -142 107 101 -168 -57 154 0 -181 65 208 -78 -162 158 111 -203 -83
2236 -83 205 2 -221 41 200 -106 -173 152 146 -205 -109 191 42 -208 21 209 -26 -187 118 134 -155 -81
2258 -81 198 84 -152 35 191 -31 -157 113 125 -139 -74 192 31 -150 41 147 -105 -144 116 136 -153 -21
2280 -21 182 22 -189 16 132 -72 -105 112 127 -93 -63 141 16 -181 -6 140 -4 -75 131 133 -102 -93 71
2303 71 -31 -155 -7 136 10 -44 118 96 -114 -49 87 31 -74 16 102 -80 -99 33 21 -105 16 170 63
2326 63 -22 49 28 -142 -161 24 11 -69 81 206 78 -65 46 74 -148 -137 84 41 -125 -54 108 -2 -155 18
$$ packed form
2173b33L53J35l64j3L66j08m02K05L17k97k79L74J94m86n7N28J9m64J15M45k56
2194I2m19K94K68m05j24M20J44m11N4L60j48l56J90K44k91j22L15P9l37M1K95
2215A83j19k25J98J86k45j20K49ok69J11K11j54j81K46J43k86q4L20m7l14J20
2236h3K88k03k23K62J59l06o7L25ol51R6L00j49k50K29J88k35j61L05J6k89P4
2258h1K79j14k36J87J56k22j26K70J2k64O5K66j61j81J91J06k52l9K60K0k89J32
2280b1K03j60k11K05J16k04l3K17J5k20L0K04j25j97J75J46j44p1K06Kk35RJ64
2303G1j02j24J48J43j26n4J62k2k10O5J36n6j05R0Q6j82j9J32j2j26J21J54j07
2326F3q5P1k1j70j9J85j3q0J50J25j28j43J11K8k22J1K21m3j66P1J62j10j53J73
$$ plain form
2350 18 160 15 -10 123 102 -120 -203 -78 -93 -138 28 170 142 64 128 86 -111 -141 -93 -47 -55 -8 62 45 14 59 68
2377 68 12 10 44 8 -5 -21 -80 -168 -112 -8 7 15 199 236 104 -9 16 -107 -272 -196 -21 7 19 106 177 55 -41
2404 -41 14 43 -61 -67 6 9 -64 -130 -22 -49 -73 74 192 171 113 95 -23 -141 -174 -148 -115 -49 79 159 173 168 61 -12
2432 -12 -100 -91 -41 -84 -33 61 -10 -33 10 16 26 42 115 104 11 -33 -51 -151 -191 -86 15 36 88 173 141 38 -44 -50 -113 -150
2462 -150 -53 21 16 10 49 20 -22 9 32 40 58 48 39 -15 -90 -91 -60 -68 -7 117 93 95 89 5 -87 -133 -60 -53 -29 32 105 78 9 11
2496 11 11 -40 -56 22 55 -4 -23 30 -16 -79 -45 30 31 18 68 90 12 -63 -85 -25 -21 -23 29 37 73 31 -11 -4 -19 -2 -27 -8 60
2529 60 10 -29 30 40 -20 -44 8 47 -4 -25 58 32 -51 -32 59 35 -27 -28 63 58 -44 18 39 -8 -38 7 64 -17 -38 10 62
2560 62 0 -57 30 38 -24 -95 22 33 -34 -16 63 48 -13 -45 -32 -42 -44 -3 68 83 38 2 10 32 -80 -38 16 68 -19 16 51
$$ packed form
2350A8J42j45k5J33k1k22q3J25j5m5J66J42k8p8O4m2j97l0M8M6qM7P0j7l1M5R
2377F8n6kL4l6j3j6n9q8N6J04J5QJ84L7j32j13K5j23j65P6J75K8J2Q7P1j22r6
2404d1N5K9j04oP3Lp3o6J08k7k4J47J18k1n8j8j18j18l3K6L3O6J28Q0J4nj07p3
2432a2q8RN0m3N1R4p1k3M3OJ0J6P3j1r3m4j8j00m0J05J01K1N2Q5l2j03q2oo3l7
2462a50R7P4noL9k9m2L1K3QJ8j0rn4p5jL1qO1J24k4Koq4r2m6P3PK4O1P3k7o9K
2496A1%n1j6P8L3n9j9N3m6o3L4P5Jj3N0K2p8p5k2O0MkN2QL6m2m2Pj5J7k5J9O8
2529F0n0l9N9J0o0k4N2L9n1k1Q3k6q3J9R1k4o2jR1nj02O2K1m7l0M5N7q1k1M8N2
2560F2o2n7Q7Qo2p1J17J1o7J8P9j5o1l2J3j0kM1P1J5m5l6QK2j12M2N4N2q7L5L5
$$ plain form
2591 51 25 -52 -80 14 5 -8 3 103 49 -67 -78 -13 -58 -103 -11 114 91 -6 25 46 -88 -162 -105 68 2 -28 91 59
2619 59 -97 -131 -32 -6 -74 7 125 128 -38 -53 6 -82 -129 -39 86 122 41 81 46 -78 -137 -76 7 32 51 160 146 40
2647 40 -72 -98 -51 -31 43 67 163 92 -6 -72 -74 -96 -147 -38 136 127 34 27 20 -114 -242 -97 57 60 9 84 134 -89 -184
2676 -184 -72 -18 -103 -24 174 168 -11 -39 10 -79 -184 -77 157 105 58 106 105 -90 -195 -40 -6 -7 90 166 134 11
2702 11 -23 -81 -86 -63 16 81 134 97 28 -18 -88 -85 -111 -59 74 138 46 7 16 -40 -180 -119 39 52 2 68 137 12 -177
2731 -177 -90 8 -44 -43 135 156 1 -55 33 -22 -167 -78 99 47 0 82 135 -38 -128 -34 37 -32 18 122 119 21 17 -13
2759 -13 -80 -48 7 30 13 73 78 -26 -58 16 -29 -81 10 81 69 -2 46 39 -96 -118 16 40 -70 -2 144 54 -108 -37
2787 -37 82 -66 -149 51 154 -44 -95 59 80 -111 -117 40 38 -52 11 100 14 -46 26 31 -48 -32 107 79 -18 18 101
$$ packed form
2591E1k6p7k8R4rj3J1J00n4j16j1O5m5m5R2J25k3r7L1K1j34p4N7J73o6l0J19l2
2619E9j56l4R9K6o8Q1J18Lj66j5N9q8m7R0J25L6q1M0l5j24n9O1Q3K5J9J09j4j06
2647D0j12k6M7K0P4K4R6p1r8o6kk2n1J09J74rr3ppj34j28J45J54Ln1P5N0k23r5
2676a84J12N4q5P9J98oj79k8M9q9j05J07K34n2m7M8jj95j05J55L4jR7P6l2j23
2702A1l4n8nK3P9O5N3l7o9m6p0Lk6N2J33O4r2l9Rn6j40O1J58J3n0O6O9j25j89
2731a77Q7R8n2JJ78K1j55n6Q8n5j45Q9J77n2m7Q2N3j73r0R4P1o9N0J04lr8ml0
2759a3o7L2N5K3j7O0Nj04l2P4m5n2R1P1j2p1M8pj35k2J34K4j10O8J46r0j62P1
2787c7J19j48q3K00J03j98n1J54K1j91oJ57kr0O3Q9q6o0P2Np9J6J39k8r7L6Q3
$$ plain form
2814 101 17 -50 8 42 -11 -2 65 6 15 17 9 -86 -53 71 -1 -100 11 160 -28 -129 45 80 -83 -107 96 141 -83
2841 -83 -80 100 -5 -154 -28 58 -53 -90 82 96 -95 -51 133 12 -164 -60 141 52 -74 23 152 9 -91
2864 -91 -7 46 -33 -11 71 34 15 63 21 -68 -15 98 54 -44 77 96 -17 -124 -9 21 -76 -27 110 58 -11 96 90
2891 90 -111 -145 65 15 -169 -50 167 76 -178 -41 172 -20 -183 6 146 -62 -153 35 40 -100 -83 101 25
2914 25 -39 106 162 -15 -125 15 -16 -192 -78 119 131 7 68 158 33 -87 -9 -14 -74 -15 48 -30 -56 108 46
2939 46 -78 39 170 71 -88 35 128 -86 -247 -72 29 -79 -54 173 196 8 33 115 -67 -236 -54 53
2961 53 -122 -143 145 179 -100 -63 145 107 -121 -47 184 4 -159 -68 11 -79 -51 88 111 73 150 190 -4 -121 -29
2986 -29 -78 -190 -93 155 144 18 98 156 -24 -89 21 25 -99 -22 120 -62 -190 28 121 -91 -45 244 224 -77
$$ packed form
2814A01q4o7N8L4n3RO7n9RKqr5L3J24p2r9J11J49j88j01J74L5j63k4K03M5k24
2841h3LJ80j05j49J26Q6j11l7J72J4j91M4J84j21j76J04K01q9j26R7J29j43j00
2864i1Q4N3p9K2Q2l7j9M8m2q9N3J13m4r8J21J9j13j07J15L0r7M9J37n2o9J07o
2891I0k01l4K10n0j84J19K17r1k54J37K13j92j63J89J40k08r1J88Nj40J7J84p6
2914B5o4J45N6j77j10J40l1j76J14J97J2j24O1R0j25j20P8no0N9O3p8k6J64o2
2939D6j24J17J31r9j59J23R3k14j61J75J01j08K5K27K3j88K5Q2j82j69J82J07
2961E3j75k1K88L4k79L7K08l8k28P4K31j80j63R1P9r0K8J39K3l8P7M0j94j17R2
2986b9m9j12R7K48j1j26Q0N8j80o5J10Mj24P7J42j82j28K18R3k12M6K89k0l01
$$ plain form
3010 -77 -60 114 -50 -323 -155 66 4 -70 136 212 -39 -92 40 -11 -178 -29 94 -33 -102 62 118 -86 -86 148
3034 148 134 -11 66 134 -9 -144 -81 -40 -87 6 147 128 47 136 133 -51 -165 19 7 -159 -12 187 94 -99 21
3059 21 133 -26 -108 69 133 -56 -50 30 -32 -184 -68 149 -15 -71 111 160 -92 -135 17 23 -166 -74 106 39 -65
3084 -65 34 100 -58 -63 43 26 -66 9 100 -37 -110 43 31 -77 -56 147 71 -65 21 51 -35 -95 66 71 -44 -42 109
3111 109 36 -114 39 113 -63 -134 65 127 -79 -57 144 46 -175 -34 104 -13 -129 6 84 -66 -86 45 52
3134 52 -89 -29 100 8 -119 15 60 -71 -63 57 52 -70 6 104 15 -106 4 45 -66 -61 60 26 -90 12 122
3159 122 9 -43 86 104 -65 -86 73 37 -104 -12 124 21 -57 61 118 -44 -76 68 25 -99 -32 99 -22
3182 -22 -125 27 92 -60 -43 74 45 -64 -17 63 -40 -129 -5 62 -29 -31 104 45 -67 -28 62 -22 -69 55 78 -12
$$ packed form
3010g7J7J74j64k73J68K21o2p4K06P6k51n3J32n1j67J49J23j27o9J64N6k04%K34
3034A48j4j45P7O8j43j35O3M1m7R3J41j9q1Q9lj84j14J84j2j66J47J99r3j93J20
3059B1J12j59q2J77O4j89OQ0o2j52J16K17j64n6J82M9k52m3J52Oj89R2J80o7j04
3084f5R9O6j58nJ06j7r2P5R1j37p3J53j2j08K1K03p6j36Q6L0q6o0J61Nj15KJ51
3111A09p3j50J53P4j76p1J99O2k06K2K01r8k21J41J38j17j16J35P8j50k0J31P
3134E2j41O0J29r2j27J34M5j31QJ20nj22P6R8q9j21J10M1j11NJ21l4j16J02J10
3159A22j13n2J29J8j69k1J59l6j41R2J36j03p8J18N7j62l2J44m3j24O7J31j21
3182b2j03J52O5j52J7J17k9j09M7Q0j03q9J24O7r1kJ35n9j12L9R0q4m7J24K3r0
$$ plain form
3208 -12 -40 53 53 -72 -15 116 47 -65 42 88 -62 -100 44 50 -101 10 118 38 -48 47 56 -77 -60 42 79 -31
3234 -31 10 62 -11 -96 -7 19 -51 -6 51 50 -56 -32 54 -46 -130 8 50 -16 -35 69 53 -79 -58 57 -27 -64 15 46
3262 46 -34 -52 50 29 -116 -19 98 33 -43 53 77 -18 -76 39 44 -49 -9 98 31 -73 53 65 -56 -33 49 70 -37
3289 -37 14 59 -20 -83 -12 35 -5 -17 44 37 -66 -21 33 -23 -72 -26 37 -28 3 64 16 -57 -41 34 0 -68 21 58 -44 -31
3319 -31 19 6 -47 -22 89 -5 -35 61 79 -7 -39 38 42 -58 -16 79 21 -67 -28 57 -19 -45 39 52 -38 -3 48 -14 -42 7
3349 7 38 -21 -22 47 37 -44 5 58 4 -69 23 46 -42 -35 36 7 -20 11 45 12 -28 3 54 -6 -22 66 34 -65 -36 61 -16 -36
3381 -36 11 10 -31 -41 42 40 -79 -6 66 -30 -62 33 38 -47 -36 56 19 -47 -14 76 0 -42 26 67 -20 -16 11 26 -9 -8 45 -1
3413 -1 -47 7 39 -71 -20 35 -7 -58 3 41 -3 -65 33 17 -32 -16 52 10 -37 7 56 -28 -32 45 21 -32 -15 41 7 -70 -3
$$ packed form
3208a2k8R3%j25N7J31o9j12J07M6j50l8J44Oj51J11J08q0q6R5Rj33J7J02L7j10
3234c1M1N2p3q5Q9K6p0M5N7jj06K4Q6j00q4J38M2o6j9J04j6j32K1J15q4l7P9L1
3262D6q0j8J02k1j45R7J17o5p6R6K4r5n8J15Nr3M0J07o7j04J26J2j21K3Q2K1j07
3289c7N1M5p9o3P1M7m0j2O1pj03M5N4n6m9M6O3o5L1O1m8p3J6P5l4o8Q9L7j02J3
3319c1N0j3n3K5J11r4l0R6J8q6l2P7Mj00M2R5n8q8L9Q5p6k6Q4J3r0L5N1o2k8M9
3349GL1n9jO9j0q1M9N3n4p3R2K3q8PP1k9k7L1L4l3m0L1N1o0j6Q8l2r9K9R7p7k0
3381c6M7jm1j0Q3kj19P3P2r6l2R5Nq5J1R2l7o6L3R0p6m2O8M1q7MK7J5l5JN3m6
3413am6N4L2j10N1N5m2n1O1L8m4o2R8j6m9J6O8m2m7M4M9q4mP7k4n3J7N6l4p7O7
$$ plain form
3444 -3 38 -1 -55 24 57 -18 -41 33 10 -46 1 53 4 -57 41 61 -4 -37 31 15 -44 28 60 -2 -29 35 0 -8 -43 31 68
3475 68 -46 3 58 -26 -50 10 63 -17 -17 31 12 -33 -19 62 -22 -40 36 42 -26 -5 52 8 -71 -34 59 -14 -37 37 39 -8 -23
3506 -23 43 -1 -62 -2 28 18 -10 32 30 -28 -11 19 -2 -27 17 74 14 -38 27 1 -34 -37 49 42 -11 47 46 -32 -80 23 26 -43
3538 -43 -26 74 19 -50 32 49 -32 -44 42 32 -28 -29 29 -27 -68 27 45 -23 -30 53 70 -35 -37 51 12 -80 0 60 17 -35 24
3569 24 24 -35 -16 41 21 -2 20 59 -25 -14 36 27 -18 -12 73 26 4 37 43 -25 -70 37 37 -19 32 71 35 -6 9 37 -40 -51
3601 -51 78 13 -38 -24 53 0 -62 -5 71 -10 -11 52 56 -54 -11 28 -35 -52 40 89 -28 14 30 29 -36 -35 23 41 -53 14 57
3632 57 2 -34 46 -7 -14 0 51 3 -20 44 18 -39 -23 63 40 -36 23 90 24 -34 -21 34 -26 -30 47 36 -25 12 26 12 -6
3663 -6 17 48 -30 -39 50 6 -67 -39 49 -3 -44 11 52 -6 5 62 8 -40 -41 39 -16 0 41 58 -54 -26 67 24 -49 25 74
$$ packed form
3444cM1l9n4P9L3p5k3P4k3n6M7N2m9o1R8K0o5l3O8j6n9P2L2o2k7O4l5ql5P4L7
3475F8j14M9N5q4k4O0N3q0%M8j9m5J4Q1q4j8P6Oo8K1N7m4p9L7R3p3k3P4Km7j5
3506b3O6m4o1O0L0j0k8M2kn8J7L0k1k5M4N7o0n2O5k6l5lQ6pn3N8jp8m8J03Lo9
3538d3J7J00n5o9Q2J7q1j2Q6j0o0jN8n6m1R5J8o8pQ3J7j05kQ8l9r2Q0O0m3n2N9
3569B4%n9J9N7k0k3K2L9q4J1N0rm5OQ5m7k2L3Oo8m5J07%n6N1L9l6m1J5K8p7j1
3601e1J29o5n1J4P7n3o2N7P6q1jO3Mj10M3L9o3j7R2M9j17M2J6jo5JN8J8r4O7M3
3632E7n5l6Q0n3pJ4N1m8k3O4k6n7J6Q6k3p6N9O7o6n8J3N5o0mP7j1o1L7J4j4j8
3663fK3L1p8rQ9m4p3K8Q8n2m1N5M1n8J1N7n4m8jQ0n5J6M1J7j12K8R3m3p3P4M9
$$ plain form
3694 74 -2 -70 14 44 -15 -18 50 34 -39 0 62 22 -14 53 12 4 -9 55 19 -28 20 23 8 -20 25 19 -55 -12 33 1 -66 7
3726 7 32 -26 -28 35 12 -57 -20 57 6 -70 2 45 -19 -62 2 11 -57 -4 73 -5 -19 20 53 -22 -54 41 32 -39 -34 68 37 -52
3758 -52 20 73 18 -34 45 59 -8 -25 48 -20 -42 -17 62 0 -40 43 28 -58 -24 11 -14 -72 32 14 -30 -25 17 23 -24 -16 4
3789 4 -41 -50 16 6 3 -47 18 9 -59 -39 29 2 -80 -5 17 -21 -45 29 18 -9 -6 47 20 -49 -4 60 -24 -34 51 69 -16 5 87
3822 87 34 -46 10 39 -37 -38 25 52 -33 -45 50 28 -16 -20 31 -3 -34 2 5 -45 -59 22 4 -35 33 42 -6 -28 -4 -11 -43 -47 12
3855 12 -3 -20 15 36 12 -36 37 23 -46 -3 78 -5 -6 2 31 3 -20 38 49 31 22 89 39 -30 -19 -5 -52 -18 40 78 31 31
3887 31 84 29 -56 -22 28 -19 -25 27 41 -50 -44 -3 6 -24 -12 54 27 -10 -6 0 -63 -20 -5 5 -15 36 80 13 -21 32 -40 -81 -50
3920 -50 65 28 -25 33 19 -52 -40 17 35 9 3 52 29 -17 -12 37 -58 -22 27 66 38 40 59 -11 -42 -44 3 -9 -28 66 76 -3
$$ packed form
3694G4p6o8Q4L0n9lO8j6p3L9O2m0l6O7m1qj3O4l6m7M8Lj5k8M5op4M3M5l2o7P3
3726GK5n8kO3k3o9L7P7n1p6P2M3o4m3O4Ro8N3P7p8j4L9L3p5l2R5rp1NJ02l1q9
3758e2P2N3n5n2P9J4o7j7P3o8k2K5P9o2m0Q3j5q6L4L5k5n8J04j8m4NM2Om7QK0
3789Dm5rO6j0ln0O5ro8K0O8k7q2P5K2l8k4P4j1k7LN3k7o9M5O4q4j0Q5J8q5K1Q2
3822H7n3q0N6K9p6jO3K7q5j2R5k2m4mN1l4l1L6Ln0j4Q1j8l9O8Rm8k2K4pl2mN9
3855A2j5j7L5K1k4m8P3j4o9M3Q1q3jQK9k8k3N8J1j8rO7n0o9J1J4m7L4N8L8m7%
3887C1N3n5q5L4N0m7oN2J4r1OM1Rl0J2O6k7l7MOo3M3J5J0k0N1M4o7l4N3p2m1L1
3920e0J15l7n3N8j4p1J2N7J8k6oM9k3m6NM9r5L6M9L9k8KJ9p0l1kM7j2j9R4J0p9
$$ plain form
3952 -3 -21 -18 -4 -38 -1 52 16 15 18 -7 -47 -49 7 -12 -5 22 30 -11 -54 -36 -21 -23 -10 37 51 21 29 26 -41 -35 27 28 2 20 75 16
3988 16 -18 16 12 -10 -32 48 66 24 9 4 -4 -46 6 -4 39 41 38 23 -30 -27 -26 -7 -43 17 21 9 -19 15 -9 -44 -28 2 6 -24 5
4023 5 -4 -30 -55 -33 -25 -31 -29 35 8 -45 8 6 -17 -33 21 40 14 36 33 35 -22 -9 27 24 -10 57 70 19 -14 12 20 -15 5 81 20
4058 20 -20 -6 21 -30 -8 12 29 1 8 20 12 -5 -28 -16 -43 13 24 29 -12 40 -2 -57 -45 14 30 -3 7 25 -11 -37 -25 27
4090 27 -15 3 25 32 -30 -16 4 -5 -25 -10 29 36 2 28 39 3 -28 10 41 -10 2 56 20 -4 -15 -3 -40 7 30 27 12 14 17
4123 17 4 13 -12 -23 -9 48 18 6 4 -6 -26 -69 -37 25 59 -1 25 43 -24 -45 -13 17 -11 0 29 45 -25 -37 -12 -29 -80
4154 -80 -3 53 42 -23 -5 6 -11 -57 -4 22 -8 7 14 49 -19 -15 14 -9 -3 24 32 37 45 0 6 -18 18 -22 37 44 38 15 2 -32 -4
4189 -4 -9 -30 21 -16 -23 4 22 -42 -73 -16 -4 -36 -10 11 7 -17 -34 -6 5 -45 11 66 38 -11 6 60 -34 -51 -11 46 15 3
$$ packed form
3952cj8LJ4l4L7N3l6jLk5m0kN6j9PK7Qm1m3J8J5kJ3M7J4l0Qlo7OO2Jk6J8N5n9
3988A6l4L4mk2k2Q0J8m2j5nqm2N2j0M3Klj5n3LJJ9l6O0Mj2k8L4k4l5J6L0Ml0K9
4023Erk6k5K2QoKO4k7n3N3kk3j6N4J9k6K2lKn7J3L6ll4O7J3n1l3K6Ql5K0P6o1
4058B0m0J4K7n1K2K0J7k8PJ2qj7k3J2k7N6J1Nm1N2m2n5J2N9J6l3J0J8l6k6J2N2
4090B7m2J8K2Po2J4K0rk0J5L9Pl4K6J1l6l1L8L1n1J2N4l6k4j1J2l7M7K3lj5KL
4123A7j3Rk5j1J4N7l0j2kj0k0m3L2O2L4o0K6J8o7k1L2L0k8J1K9J6p0j2K5j7n1
4154h0P7N6j1o5J8J1j7m6N3K6l0J5PL5o8MK9k3OK7QNQm5Ok4L6m0N9Pok3j3l4K8
4189dnk1N1l7pK7J8o4l1N7J2l2K6K1mk4j7K8J1n0N6N5k8m9J7N4r4j7M0N7l1j2
$$ plain form
4221 3 25 15 14 0 22 56 0 17 25 48 21 12 15 22 9 -16 6 40 23 -22 3 48 8 -29 -1 16 -4 -19 -24 28 -39 -28 16 6
4255 6 -34 -53 3 41 5 -26 31 -20 -28 -21 21 -8 -43 -13 55 0 -10 8 -13 -22 -35 13 37 -5 -13 -1 28 -28 -16 26 4 -7 32
4288 32 26 3 24 27 -8 14 0 0 -8 22 11 -37 -1 -3 -1 0 41 28 6 -36 -17 21 -49 -35 16 19 -1 -17 46 -8 -31 -32 1 0 -12
4323 -12 8 47 5 -54 -32 -1 12 -38 -1 14 15 -28 -17 10 -40 -36 -14 37 8 -1 21 32 22 7 -19 4 18 -9 20 26 17 -28 -6
4356 -6 33 -15 24 33 47 19 1 2 -27 -70 8 33 18 -14 -1 11 7 -39 -20 22 -4 7 14 5 10 -32 4 27 42 42 21 17 3 -43 0
4391 0 -10 -34 -29 16 37 0 6 10 -15 -13 -9 -16 17 2 9 11 -1 -15 4 -14 33 25 16 32 28 -37 -19 -47 -1 -4 27 38 30 2 -31 -17 -4
4428 -4 -32 -1 5 -34 2 -1 -26 -31 -6 2 41 6 21 18 -9 -69 -29 -36 -16 -13 13 20 37 0 -20 -32 -27 -16 4 -16 -6 15 -13 10 -15
4463 -15 -8 -7 21 14 44 37 -2 -4 -19 -32 2 18 25 21 31 10 29 -29 -26 -32 12 4 52 31 -23 -5 3 -25 -10 1 6 46 -13 -19 -18 -24 -57 -10
$$ packed form
4221CK2j0jj4K2L4n6J7QK3k7rLPj3k5K2L4j7m5K5M5m0l7K8J7k0j5nN2o7J1M4j0
4255Fm0j9N6L8l6l1N7n1qPM2k9l5L0O8n5j0J8k1rj3M8K4m2qJ2K9n6J2M2k2j1L9
4288C2ok3K1Ll5K2j4%qL0j1m8L6kKJM1j3k2m2J9L8p0J4N1Lk0j6O3n4k3jL3jj2
4323a2K0L9m2n9K2L1J3n0L7J5Jm3J1K7n0MK2N1k9rK2J1j0j5k6K3J4k7K9Orm5K2
4356fL9m8L9RJ4k8j8Jk9m3P8K5j5l2J3J2mm6J9M2k6J1PrNm2L6K3J5%k1mj4m6M3
4391@j0k4NM5K1l7OMk5KMpL3j5PKj2j4J9j8M7qrJ6mo5J8k8M6lL1J1qk8l3J4J3
4428dk8L1Ol9L6lk5nK5QL9l5J5lk7o0M0pK0LK6PJ7l7k0j2NJ1K0k0J0K1k8K3k5
4463a5PJK8pL0pl9kj5j3L4J6PmJ0k1J9n8LoM4qM8k1n4J8Qk8J5J1NM0n9oJol3M7
$$ plain form
4501 -10 40 10 41 55 9 -16 -36 -15 -38 -19 -6 19 35 -2 27 42 4 1 7 32 -6 22 1 -43 -31 -35 10 -4 11 27 48 24
4533 24 1 8 -18 -19 -26 13 63 26 28 -2 -3 -26 -13 -7 -12 19 10 -17 -13 -23 -24 -17 -3 13 9 -28 22 -14 -46 -32 -15 -7 -3 34 26 26 -19 -1
4571 -1 -3 -24 -16 24 23 40 2 36 7 -10 12 41 26 7 30 43 -31 -9 -7 -16 8 9 37 55 11 -28 -3 2 0 9 22 8 33 8 -17
4606 -17 -34 -36 -37 -9 6 6 -23 -18 15 -5 -46 -26 14 -26 -35 22 4 -42 -30 -26 15 -13 8 21 47 4 -4 -21 -36 -55 -11 -1 -11 -4
4640 -4 33 14 22 -7 47 9 -23 20 5 0 -11 3 -22 19 28 17 6 3 -12 1 -2 9 -14 -1 -30 5 44 -6 6 8 -7 0 -65 5
4674 5 36 -34 13 11 8 -22 -2 33 -19 -7 7 7 -4 -12 -8 -27 -35 22 -5 -8 -17 12 16 -6 -21 21 31 18 -18 13 25 -9 -3 15 -4 35
4710 35 2 14 -4 28 -18 -44 -9 9 -4 -15 -11 18 -15 -24 0 21 -25 2 -5 -29 -16 -17 13 -34 -5 -2 -12 -17 -29 0 -3 -3 -15 12
4744 12 1 6 -18 -10 -1 -14 18 4 0 -11 4 8 12 7 4 25 7 3 13 -12 11 33 5 21 7 24 3 17 12 51 -21 11 34 5 -18
$$ packed form
4501a0N0l0L1J4m6k5k0K1k3J9J3K5J6l7K9J5l8lOK5l8K8k1m4J2mM5j4J5J6K1k4
4533B4k3Pk6jpL9N0l7Kl0jk3J3OnL1rk7Mj0jPJ4J6ml7N0l6l2J4J7QML7q%m5J8
4571akk1QM0jJ7l8L4k9j7K2K9j5j9K3J3p4K2KrK4JK8J8m4l9K5NkRJ3j4K5k5k5
4606a7j7kjK8J5%k9NL3k0m1K0M0m0rN7j8m6J2MM1k8K1J3K6m3qj7j5j9M4J0j0P
4640dL7j9Qk9N4l8l2M3j5nj1J4k5M1Rj1j1lj5J3lJ1k3J3k9L5L9n0J2Kj5Po5P0
4674EL1p0M7kll0K0L5n2J2J4%j1qMj9qN7k7lrK9Mk2j5M2J0j3l6L1J2l4OJ8j9L9
4710C5l3J2j8L2m6k6L5J8j3j1MK9l3rK4K1m6K7pk4J3jL0m7K9Lj0nj2K9l%j2K7
4744A2j1Nk4QRj3L2j4mj1J5MMnlK1j8mJ0k5K3K2k8J6j4J7k1J4nL9p2L2K3k9k3
$$ plain form
4779 -18 -6 21 -27 -3 23 7 -2 1 -2 -36 -8 2 -5 -21 -25 10 0 -26 -40 22 -12 -36 -27 8 -19 4 30 12 17 -4 9 -18 -12 4
4813 4 20 -20 12 9 15 -36 -3 19 13 -5 26 20 -14 -2 11 -5 -27 -9 11 38 3 18 3 -22 6 -1 15 -12 13 52 25 -5 -16
4846 -16 7 -5 -11 41 21 1 -6 -13 -9 -56 -6 -18 -37 -39 0 6 -33 -30 -7 -22 4 12 52 36 -20 21 21 -1 20 31 -3 9 11 45 3
4881 3 -14 30 12 -6 21 46 56 -5 14 22 -5 -3 -17 26 28 8 17 15 -16 -33 11 1 -10 7 41 3 -33 -22 -29 -26 9 11 32 -26 5
4916 5 9 -31 -35 -16 -8 7 23 12 -14 -6 -12 -9 -28 -15 13 13 2 4 6 4 -27 0 3 -24 -3 27 -5 -17 36 0 -32 -26 17 11 -8 32 34 6
4954 6 -32 -2 28 7 -24 -1 49 -17 -6 -33 -7 -14 11 22 -24 -49 1 -37 -58 -29 -15 15 12 -2 -23 1 -38 0 -10 -12 -2 14
4986 14 -1 -1 18 -6 -3 -34 1 -7 2 26 12 -13 -29 7 32 2 -19 6 15 6 17 6 -36 -40 -6 38 29 5 44 23 -33 -10 11 16 -35
5021 -35 -12 14 0 -33 -9 -16 -8 0 -4 -1 7 -48 -7 -7 -43 -5 -5 -19 -15 46 6 -10 -17 8 -5 -23 -1 33 -23 23 43 10 -21 13 -2
$$ packed form
4779a8J2K7m8K4K6j6rLll4K8J0pj6mL5j0k6j4O2l4k4RL5k7K3K6j8Nk1J3k7OJ6
4813DJ6m0L2lOn1L3K2oj8L1ol4J2J3j6k2J8K0K7l5J5j5k5K8pJ6k7K5L9k7l0j1
4846a6K3j2oN2k0k0ppMm7N0j2j9kL9Ol9LK3j5K6QM0j6n6M1%k2K1J1l4J2KL4m2
4881Cj7M4j8j8K7K5J0o1J9Qk7Kj4M3Kk0Rkl1j7M4j0j1J7L4l8l6J1pLL5KK1n8L1
4916EMm0mJ9QJ5J6j1k6QoLj9J3K8%j1KKkl1K7Lk7K1L0l2j2N3l6l2OM3oj9M0Kk8
4954Fl8L0L0k1l1K3N0o6J1k7K6pK5J1m6k5N0l8k1K9J4L0lj4k1K4l9L8j0kJ0J6
4986A4j5%J9k4Ll1L5qRK4j4k5j6L6K5l0k1K5RrJ1j1m2mL4M4rk4L9k1n6K3K1Nn1
5021c5K3K6j4l3K4pQQmLQn5M1%l6L8%j4MO1m0j6pK5j3j8K2L4n6M6K0l3l1L4j5
$$ plain form
5056 -2 19 12 18 42 -7 20 27 6 -20 18 17 3 1 16 19 -38 -14 33 -14 -22 -4 19 -22 -37 -4 0 -35 -7 17 -5 8 -36 -10 -44 -18
5091 -18 -36 -12 -3 4 42 2 -15 -11 7 -14 -27 17 30 -2 8 35 12 20 -4 27 3 4 48 21 -35 -27 27 5 -11 27 21 -4 3 8 -6
5126 -6 23 13 15 31 -38 11 32 16 -21 22 28 -29 -21 6 -9 -24 1 -8 -12 0 6 24 -20 -23 39 -3 -26 -5 14 -31 -22 8 27 -6 -7
5161 -7 -10 9 -30 4 4 -4 -15 27 35 -39 -11 18 17 -2 15 33 6 7 26 26 14 -17 14 27 -16 5 58 -27 -11 28 4 -8 -9 11 26
5196 26 -15 -27 26 -36 -31 12 3 -10 -16 20 7 -38 1 19 0 -13 -27 15 -29 10 2 4 -8 12 2 -14 -17 22 30 -1 -4 24 27 -36 -27
5231 -27 17 18 0 -4 -1 1 4 17 3 -40 11 16 9 15 21 19 3 1 -1 -2 9 -10 9 -11 4 5 2 -3 -15 17 -4 -39 -17 30 -23 -24 20 18 -17
5270 -17 24 -6 -22 -13 -4 -14 0 -5 11 8 0 -38 4 27 -50 -19 24 4 -7 18 11 -9 0 16 0 -1 48 27 9 -14 19 1 -8 32 47
5305 47 32 -8 -6 17 19 -8 23 0 -23 -32 20 25 -22 1 33 -1 -20 -12 20 -5 -29 -21 -33 -39 -20 36 -29 -31 12 8 2 16 16 2 -13 -16
$$ packed form
5056bK1pOK4m9K7Pk1k6L8jj4kJ5Ln7K4M7m7qJ8K3m1j5L3Ml5K8K4k2J3m4K6l4K6
5091a8j8K4RPL8m0j7MJ8k1j3M4J3l2J0K7k3Qk4L1k4JM4k7n6QN4k2j6L8ok5PNj4
5126fK9j0KJ6o9M9K1j6l7M3On7QK7j5j5K5rmJ2OJ8m4lO2m2k3K1J9m5RL0J9l3j
5161glJ9l9L4%qj1M2Qp4K8K9jj9J7J8k7JJ9%j2l1L1J3m3K1N3q5J6L9k4j2jK0J5
5196B6m1j2N3o2NM3rj3oL6j3m5L9J8j9j3j4M2m4L9qKj2K0j0j6lL9Ql1lK8Lo3R
5231b7M4Jj8mLKLJ3j4m3N1NpOOkj6kkjJ1j9J9k0J5Jlnj2L2k1l5K2M7n3jM4kl5
5270a7M1l0j6RRj0J4nJ6lql8M2K3p7L1M3k0j1K5pk0RJ6j6jM9k1j8k3L3j8rM0J5
5305D7j5m0KK3Kk7L1k3k3rN2Nm7K3L2l4j9QL2k5k4Qj2oJ9N6o5kM3moJ4%j4j5l
$$ plain form
5341 -16 22 7 32 29 14 19 13 51 51 19 2 15 -24 -34 -16 22 10 25 31 35 13 28 1 7 -24 7 5 -23 -25 21 3 -25 -5 47 9
5376 9 5 -4 28 -8 -33 8 35 -8 1 10 2 -6 3 -5 -3 -34 -1 0 -23 23 -4 13 -12 17 17 0 2 31 14 -20 -8 25 14 -28 0 58 -33
5413 -33 -28 31 58 -2 11 28 22 -27 -2 8 16 14 11 23 -2 1 24 21 -31 17 -1 33 -35 22 6 -4 -4 28 -49 -44 -5 -19 -30 -19 -2
5448 -2 10 -38 3 28 17 -21 22 17 -22 -21 17 -5 -9 -18 32 25 -7 -4 -2 1 -25 38 36 26 -7 7 13 -2 15 32 -1 -15 26 19 -37 -5
5484 -5 37 -10 -9 -9 -10 1 -1 -40 10 -23 -8 18 12 -29 -26 11 2 -10 -2 -2 -19 -8 3 17 -41 2 -2 -2 -17 31 -18 -40 -1 9 -21 -32
5520 -32 -3 4 20 -10 2 30 16 -4 18 -2 -47 12 49 -11 -17 21 -5 -11 -16 27 27 -11 8 2 -14 -15 5 -17 -1 29 -4 8 -12 -8
5554 -8 13 20 -20 -1 -4 -24 -12 -17 -12 -5 1 22 11 6 30 1 -40 -23 -3 -21 -3 -10 14 -31 -26 21 22 2 16 31 -14 -39 18 15 -12 -27
5590 -27 25 23 -7 -7 3 3 -7 3 18 16 34 5 -22 -23 -4 26 -23 -1 -4 9 -3 -22 11 -16 -37 -38 24 -5 -7 9 24 -4 -15 33
$$ packed form
5341a6L8j5K5lj5NoL8%l2j7J3l9j0J8L8j2J5OMk2J5k7Ol1L1kk8kM6j8k8K0N2l8
5376ImrL2l6k5M1K7m3RRqqRqKl1L3Jk3M6k7J7k5K9%j7KK9j7l4J2L3j1m2K8N8r1
5413c3NN9K7o0J3J7om9K5J0QklJ2k5LK3ln2M8j8L4o8N7j6j0%L2p7NL9j4j1J1J7
5448bJ2m8M1K5j1l8M3nl9JL8k2mrN0pl2LKLk6O3kj0l3J4Oj5J7J7l3j4M1pn6L2
5484eM2m7J%jJ1kl9N0l3J5K6om1LL7rj2Q%j7J1J1J4n8M3m%j5M8m9k2L9J0l0j1
5520c2K9PJ6l0J2K8j4k0K2k0m5N9L7o0oL8k6onM3%l8J9oj6jK0k2J6L0l3J2k0M
5554hK1Pm0J9lk0J2nNPOK1j1nK4k9m1J7K0j8J8pK4m5NM7Jk0J4J5m5k5N7lk7j5
5590b7N2kl0%J0%j0J0J5kJ8k9k7jJ9L0m9K2lJ3j2j9L3k7k1jO2k9kJ6J5k8j1M8
$$ plain form
5624 33 -9 -33 21 27 -5 -13 20 49 -8 6 27 -18 -25 11 37 6 -25 -39 11 -8 -29 6 -6 -10 -23 15 -11 -23 -2 -3 12 -19 19
5657 19 17 -22 1 20 17 6 5 14 6 -27 -10 -9 -2 -22 5 -28 -42 13 -17 3 -20 -1 -5 -29 13 6 -10 -19 8 -2 -20 -46 -24 11 -27
5692 -27 -23 27 37 -27 -13 8 -7 26 18 9 10 -15 33 4 -40 1 25 -1 15 -5 22 -4 8 47 27 -2 18 29 -3 -6 42 10 3
5725 3 -13 31 -10 -10 -2 0 -2 -24 -10 3 -51 -5 37 -28 6 -35 -20 -50 12 14 -20 0 -41 28 -8 -20 15 42 -5 -4 18 5 -58 8
5759 8 33 2 0 1 34 2 25 12 20 -7 -8 15 6 -3 30 -6 4 31 20 7 -6 9 17 25 6 9 9 -14 -30 7 26 -21 16 -9 10 -20
5795 -20 3 -16 -20 -22 13 16 5 7 11 -32 -26 -14 2 2 -24 25 -22 -27 -8 15 16 9 1 24 4 -11 15 -8 21 -33 -9 -19 -8 22 18 -2
5831 -2 -7 44 1 2 10 -15 -15 16 1 7 -4 9 -9 -19 -6 -9 -4 15 -12 31 13 13 3 3 -16 -33 9 4 7 3 -9 -3 -16 -7 -30 -13 -18 5
5869 5 40 -10 -14 -3 -13 -1 -20 25 20 0 23 -11 12 -8 26 13 26 23 17 16 22 -20 -6 8 6 16 -4 22 -3 22 -7 29 0 4 9
$$ packed form
5624C3m2k4N4Ol2qL3K9n7J4K1m5pL6K6l1l1j4N0j9k1L5j2mj3L8k6j2K1jJ5l1L8
5657A9kl9K3J9lj1jRql3J7JPk0K7l3j4N5l0K0k3J9mk4M2pj6rK7j0j8k6K2L5l8
5692b7MN0J0o4J4K1j5L3qrJk5M8k9m4M1K4k6J6k0K7k6J2L9k0k9K0J1l2lM8l2p
5725Cj6M4m1%QKkk2J4J3n4M6M2o5L4m1J5l0O2Kl4K0m1O9l6j2L5K7m7JK2j3o3O6
5759HK5l1kJL3l2K3j3Qk7jK3rrL3l6J0K7j1j3j3J5QQj9L%k3j6L7J9m7L7k5J9l0
5795b0K3j9mkL5Lj1KMm3OJ2J6%k6M9m7nJ9K3JpqK3k0j5K6k3K9n4K4j0J1L0mk0
5831bnN1m3JQk5%L1j5Oj1J3j8j0J3lNJ9k7M3j8%j0%j9j7M2nLmj2Oj3Rk3J7nK3
5869EL5n0mJ1j0J2j9M5nk0K3l4K3k0L4j3J3lojOm2J4J4kJ0k0K6k5K5k9L6k9MN
$$ plain form
5904 9 -36 12 11 3 5 4 -12 -23 7 4 21 2 -3 -22 -27 -27 -11 13 -17 8 47 -2 -3 -5 20 -17 -23 -10 16 -5 -27 23 26 -3 0 -16 8
5941 8 11 24 20 2 -13 -11 25 11 5 -6 14 -5 24 -11 8 -17 10 0 21 21 22 8 2 1 15 -9 -6 12 -32 2 -9 24 4 -4 -6 -31
5977 -31 2 6 -4 19 -23 -1 -12 -23 8 -26 -7 15 -27 -9 12 32 -18 11 19 6 5 -8 -5 -6 -15 -2 19 34 6 23 -4 18 -10
6010 -10 18 25 3 10 -9 21 4 -1 30 -2 -9 1 14 6 -23 -7 -25 17 -18 -17 49 2 -25 14 0 15 -16 25 5 6 -5 3 5 -19 -18
6045 -18 2 -5 23 8 -29 0 -3 -5 3 1 13 -2 -6 31 -13 29 3 44 5 -8 23 25 36 15 6 -7 -2 -6 16 20 30 6 -23 26 3 13
6081 13 -2 -3 -23 24 3 -7 24 -22 15 -4 23 5 -6 -13 -25 -46 5 -3 -24 -23 23 13 1 31 5 2 4 -5 -6 16 19 0 20 8 -15
6116 -15 -6 -8 -4 35 32 28 21 -4 -12 -14 12 2 30 16 35 15 42 14 7 3 -9 9 -6 0 4 19 4 7 -12 -8 -36 0 -2 39 13 6 -3 -33 -13
6155 -13 -8 -36 35 -15 2 2 4 -25 -48 -27 -28 9 8 0 5 -11 -8 6 -6 -4 34 38 21 22 15 13 -9 -1 -4 31 32 33 18 17 11 -37 -7 22 2 12
$$ packed form
5904Im5M8jqKjj6j1L0lJ7j9nj9n%J6K4l0K5L9m9jkK5l7oJ3K6k1k2N0Lk9Lj6K4
5941HLJ3mj8j5KL6j4oj1K0j9K9l5J9k5K7j0K1%Jj4ojJ4k4LJ8m4L4j1L3k0qkk5
5977c1L3Mj0K3m2K2j1j1L1l4J9K2m2J8K1K0n0K9Qj3jj3LjrJ3K1J5k8J7k7K2k8
6010a0K8Pk2Pj9L0j7nL1l2pJ0J3qk9J6j8M2l5JO6m7k7L9j4J5l1M1k0Jj1QKk4J
6045a8K0pK8j5l7K9lkQkJ2j5mL7m4M2k6M1l9j3L1KJ1k1rj3NmK2MJ0k4k9M9k3J0
6081A3j5jk0M7k1j0L1m6L7j9K7j8j1pj2k1N1qk1JM6j0j2L0k6lKrjK2Lj9K0j2k3
6116a5RkML9lmpk5qkK6j0K8j4J9k0K7k8pmj2J8j5OMJ5j5Lj9Mk8L6kM1k6prl0K0
6155a3Nk8P1n0J7%Kk9k3K1jL7jqNj6LJ4j2KL8Mj7Jpkk2QlL5JJj5jom8L0K9k0J0
$$ plain form
6195 12 -2 22 25 -34 0 -8 3 -15 -12 11 55 5 -2 16 3 -28 5 -2 4 8 1 -18 -21 4 1 12 -3 -2 18 10 -1 -8 -25 -16 -16 18 9 36
6233 36 28 3 15 26 19 -18 -11 50 19 38 25 10 21 -11 21 45 -12 25 28 12 -14 -2 11 -29 37 -17 0 -21 -5 -7 -9 -51 -15
6266 -15 -12 13 -8 -5 -2 16 -11 -18 -2 -24 13 38 26 -3 31 24 -5 -54 -29 10 -7 19 23 1 1 10 16 -24 13 15 32 -4 31 13 14 8
6302 8 -12 33 -29 40 49 31 -15 -13 25 32 -21 -1 -5 -25 -8 18 7 28 -20 6 -6 6 2 -14 -26 9 -16 1 -6 12 2 -28 -23 -26 43
6337 43 1 1 20 -9 -33 12 16 2 -16 5 33 0 -16 7 -16 -8 -31 15 46 -2 34 2 -14 8 2 3 29 22 35 73 11 2 -13 -7
6371 -7 -31 -9 11 6 4 25 9 7 -61 -25 -2 -11 5 24 2 -30 -37 -42 -30 -21 5 35 -5 12 12 -18 -44 2 -36 -10 23 13 -2 -1 40
6406 40 3 -17 -20 -3 -27 52 1 45 -8 -40 -5 17 -5 -17 33 25 12 -29 3 7 -48 -5 -4 28 31 22 13 -19 3 -3 -10 3 12 3 19 -6
6442 -6 31 -43 -11 -6 3 2 11 -9 -12 -1 -1 -12 -22 -11 2 31 0 25 17 20 -23 -52 20 16 26 26 33 -7 21 -20 10 -15 -5 44 51 22 -5
$$ packed form
6195A2j4K4Ln9L4qJ1j8LK3M4n0pJ8j3l1L3pOMpj9lK5lJ1j5JK0qj1pj7R%L4rK7
6233C6qk5J2J1pl7PO1l1J9j3j5J1l2L2K4n7L7Lj6k6J2J3m0O6n4J7k1J6kkm2L6
6266a5LK5k1LLJ8k7pJ6k2L7K5j2k9L4pk9m9K5L9j7K6Mk2%ROm0L7KJ7l6L5j8Jo
6302Hk0M5o2O9Rj8m6KL8Pn3K0mk0J7K6j1K1m8K6j2J2mj6j2L5k5J7pJ8j0l0NlO9
6337D3m2%J9k9k4M5Mj4j8K1K8l3j6K3k3Qk3M6L1m8L6l2j6K2oJK6pJ3L8o2rj5O
6371gk4K2K0nkK1j6ko8L6K3rJ6J9k2l2pnJ2RK6L0m0J7%l0k6M6l8K6L3j0j5JM1
6406D0l7k0lJ7k4P9n1M4n3l2L5K2k2j2N0qj3m1L2Mn5M3JL2Lrrl2K2opJ3RrJ6k5
6442fL7p4L2NRjRk0lJ1%j1j0J1J3K9l1K5qLm3k9P2mJ0%Pm0K8m1L0k5J0M9Pk9k7
$$ plain form
6479 -5 65 -3 -43 -15 19 29 17 20 36 0 -2 -4 -15 -34 -14 29 13 8 -23 4 24 -29 -15 36 -23 7 3 -10 -25 15 -16 -13 -46 20
6513 20 -13 -7 -3 2 -26 -68 -2 2 7 9 51 -6 14 -12 -8 -14 -23 27 49 -8 4 27 -26 -17 1 20 30 24 29 54 0 1 -20 1 -6 -40 28
6550 28 28 16 10 13 4 -30 10 -37 1 4 1 18 -29 -33 -31 -11 -21 -18 16 -13 -3 19 11 -35 5 7 -23 33 -1 27 -10 7 -2 -28 -6 10
6586 10 21 19 -3 12 -17 -4 -10 34 -4 -17 27 20 15 -33 26 38 29 2 1 39 -8 10 3 -6 -6 14 22 5 6 35 -1 -7 38 -10 10 -34
6622 -34 12 7 -17 -27 7 -2 -25 -5 -5 -47 -67 -14 2 -20 -29 11 -1 -41 -36 53 -15 -35 31 35 -8 -26 27 13 -20 0 -1 -16 -14 41
6656 41 41 -3 8 34 -11 -30 -15 42 -6 7 29 41 19 -19 -14 28 -3 -5 35 18 -11 -10 23 -32 -61 -18 -2 -38 10 0 -11 -55
6688 -55 -5 14 -11 -32 42 35 -7 -20 0 -2 -24 -18 8 -22 -4 26 13 -27 -17 -38 -19 -19 -12 45 14 -4 39 -4 -32 -24 32 23 2 37
6722 37 48 -16 -20 6 -20 -9 7 8 0 54 24 -1 -27 -23 -27 23 -4 33 62 -1 -32 -9 -29 -41 -51 8 18 -1 35 12 -28 -51 -13
$$ packed form
6479eP0o8m0K8L4J0j2LJ6l6kkj1j9K0M3j6nl1K7K0n3J4N1n9L0mj3j5M0l1Ll3O6
6513B0l3OMNk8m2O6MNKM2n7K0k6MorN0K2n7J2K3n3RJ8J9J0oNK5n4Jk1K1pl4O8
6550B8%j2oLrl4M0m7L8LlJ7m7mKK0j0LL4k9J0K2qm6M0Kl0N6l4K8l7J7rk6K2J6
6586A0J1kk2J5k9J3oM4l8j3M4pnm8N9J2rk7jL8m7J8pr%K0Qj7JK9l6oM5m8K0m4
6622c4M6nk4j0L4rk3K0%m2k0N3J6k2rM0j2m0NQ9o8k0O6Mm3j8N3j4l3K0jj5KN5
6656D1%m4J1K6m5j9J5N7m8J3K2J2k2l8NM2l1kM0j7k9JL3n5k9M3J6l6M8j0j1m4
6688e5N0J9k5k1P4pm2j3K0kk2OK6l0J8L0j3m0J0k1J9%PN7l1j8M3m3k8QN6rk1L5
6722C7J1o4mK6k6J1J6JqN4l0k5k6MmN0k7L7K9o3l1K3k0j2j0N9J0j9L6k3m0k3L8
$$ plain form
6755 -13 1 -7 -8 50 35 -13 -2 6 -10 -35 9 24 -12 27 23 9 -42 -4 24 0 19 66 55 -2 27 43 11 -11 -4 -4 38 11 20 26
6789 26 -50 -45 10 3 -41 26 57 30 -13 12 -31 -28 -22 2 -11 -31 27 10 -23 -36 -7 15 -17 10 35 44 -3 12 7 -14 -27 -5 45
6822 45 32 11 14 -23 -28 19 -27 20 -1 13 42 -3 7 36 -18 -12 11 25 10 -24 29 47 3 -31 20 17 -7 52 52 12 -47 -12 -12
6855 -12 -10 -19 -6 21 -5 -2 34 -34 -23 5 -25 -28 -47 -22 -22 -34 7 3 1 3 -27 1 -7 5 16 -5 -18 9 12 9 -12 25 8 -7 0 0 23
6892 23 -2 21 29 6 -11 1 20 4 18 29 -22 6 -9 27 -11 5 20 21 15 -17 26 -18 -29 -16 17 -5 -41 -7 36 -14 -25 8
6924 8 -20 -23 8 5 6 -18 5 2 15 -16 4 6 4 16 52 -16 -21 8 11 -2 -1 18 20 0 17 6 5 -3 8 16 7 33 36 41 16 11 10 -19 -6 5
6964 5 37 -26 4 3 -8 -9 8 22 -11 -18 39 18 -47 -3 7 -29 3 -5 -10 -4 -24 17 -16 -26 -32 25 -20 -19 0 0 -23 -2 -5 -1 -12 -9 19
7001 19 2 -11 -6 29 -6 -34 19 3 10 25 94 6 21 -7 9 2 -6 35 14 -16 9 20 28 -30 6 -2 3 -14 19 -9 9 -6 -19 -45
$$ packed form
6755a3J4qjN8j5m8J1Qj6k5M4J5l6L9mj4n1L8K8k4J9M7j1n7K9J6l2k2P%M2k7RO
6789B6p6NN5pm4O7L1k7m3K5m3LOK4j3k0N8j7l3j3K9K2l2K7K5Rm7J5nk1j3K2N0
6822D5j3k1Ll7nM7m6M7k1J4K9m5J0K9n4OK3J4j5l4N3J8m4l4N1lk4N9%m0n9L5%
6855a2KrJ3K7k6LL6o8J1K8l0lj9K5%j2M1mkKl0K8qJ2J1k1j3K7Llk1L7j7j5P%K3
6892B3k5K3Qk3j7J2J9j6J4J1n1K8j5L6l8J6J5Jol2M3m4j1J3L3k2l6L4M3n0j1L3
6924Hk8lL1lJk4K3lJ3l1K0KkJ2L6o8nK9Lj3JJ9Kk0J7j1jqJ1QrK6LNk5njk9J3J1
6964EL2o3L0jj1jJ7J4l3pN7k1o5M4J0l6L2qnOk0M1l3j0oN7m5JJ9%k3K1lMj1LK8
7001A9j7j3NL5l5k8N3j6PJ5O9q8J5k8J6pqM1k1l0K5J1Qn8L6qNj7L3k8J8j5j3k6
$$ plain form
7035 -45 -36 8 24 6 14 29 -36 -28 27 1 2 -9 8 14 -2 -6 9 4 -30 8 -20 -16 9 33 50 -2 -8 19 8 -29 -1 38 3 -14 2
7070 2 18 -1 17 23 3 10 17 52 11 -4 -16 0 6 -13 19 3 -33 1 10 6 1 34 5 8 -13 22 -12 7 -8 -9 -10 -21 -12 15 16 1 4
7107 4 26 27 -31 -13 26 3 -2 31 -15 3 19 19 -3 -3 28 34 -4 24 39 -2 11 25 28 -23 7 9 49 -27 31 19 -2 -2 2 24 27 18
7143 18 20 12 14 -19 -7 -4 6 21 28 -17 -2 -7 -15 -9 -12 -2 -13 15 7 -6 -36 -39 -1 -15 -16 2 6 -18 -5 28 17 -29 -1 27 23 13 28
7180 28 22 -12 14 52 6 5 17 73 22 17 25 38 -2 -11 6 17 -22 -11 12 12 7 9 13 32 -1 -1 8 -14 -22 2 0 -30 43 5 -21 -29 -7
7217 -7 14 -20 -1 -12 6 -3 -36 -16 10 -14 13 34 1 -21 8 -1 7 -28 66 18 -2 -11 24 -5 11 1 50 26 11 32 50 -7 -2
7250 -2 38 18 15 13 4 14 22 39 18 26 14 21 -2 -11 39 -7 -20 -12 7 -2 6 -11 -4 -22 35 12 31 -12 -22 -1 -20 5 15 13 9 -31 -10
7287 -10 18 15 20 40 -15 2 50 27 3 -5 4 14 -3 10 19 22 -11 4 9 13 17 -12 25 34 7 22 39 6 18 1 -18 9 12 5 -8 19
$$ packed form
7035d5RM4J6j8QJ5o5QN5k6Jj1J7Oj6mJ5nl4L8k8MK5K4J7n2oK7j1l7K8L9l5j7J6
7070BJ6j9J8Ok0PPL5m1j5j2J6Oj9L2j6l6L4RmnL3k9Lk1L5l4J9j5jjj1RK7Jj5L
7107DK2Jn8J8L9k3nL3m6J8J6%k2%L1Ol8K8J5m1J3J4Ln1L0KM0p6N8j2k1%MK2Lr
7143A8KqKl3J2LJ0J5Pm5J5nqOlJ0j1K8qj3l0lL8j4jJ8Mk4J3L3j1m6K8K8mj0J5
7180B8ol4K6L8m6jJ2N6n1nQJ3m0rJ7J1l9J1K3%nKMJ9l3%Rk2qK4kl0P3l8k6qK2
7217gK1l4J9j1J8rl3K0K6k4K7K1l3k2K9rQl5R4m8k0rL5k9J6j0M9k4j5K1J8n7N
7250bM0k0lkrJ0QJ7k1Qj2Pk3rN0m6j3QJ9rQj7Pj8N7k3J9m3j0K1j9K5J0kmm0K1
7287a0K8lNK0n5J7M8k3k4qRJ0j7J3RLl3J5NMMk9L7Rk7J5J7l3J2j7j9K7Lpj3K7
$$ plain form
7323 19 17 -2 2 2 -13 4 2 4 0 -22 -13 -9 -20 0 20 27 -13 -16 -15 -17 -9 -40 15 -13 -13 15 -8 -3 -19 -12 -16 20 15 14 6 16 14 32 8 -11 10
7364 10 25 -15 -14 11 35 10 9 43 22 3 26 6 14 25 24 23 -19 28 0 14 -3 20 35 -9 -2 -5 -16 -46 4 0 9 -22 2 -3 -2 -24
7400 -24 20 18 -3 -18 -4 -8 -33 22 25 -5 -2 37 -20 -19 -4 28 7 18 -12 29 29 -22 22 46 -2 4 12 8 -7 34 -12 -12 11 4 3 -2 43
7437 43 10 6 -6 -36 -9 -13 6 6 -4 -23 -6 -2 -37 -3 5 -3 -28 10 5 -29 -13 -20 -7 -18 -29 6 22 17 -29 6 -1 -33 2 -15 -15 14
7473 14 15 43 7 -13 24 -11 6 22 17 11 21 20 25 6 12 1 11 49 24 27 -8 6 -8 -1 10 19 -27 -9 -22 21 6 12 5 15 -14 -13
7509 -13 -19 -30 -19 -35 -20 6 20 8 15 -3 -12 -29 25 -22 -35 -4 17 -5 -19 12 1 16 -21 5 25 9 21 11 21 42 26 -25
7541 -25 -10 35 15 22 17 25 18 16 -17 12 34 18 32 19 -10 -1 -3 12 -12 -7 -10 -4 -16 -5 31 12 -18 -27 -9 -19 -13 -28 -6 -44 -8 -3 -10
7578 -10 -15 -5 20 9 -11 -20 5 0 -28 -32 -8 -14 27 2 -3 34 11 5 1 -22 14 3 29 23 6 2 10 4 13 15 12 17 -31 -20 6 8 -31 6 20
$$ packed form
7323A9kj9M%j5J7kKmk2RMj1K0K0Pm0lJkQl1N5k8%K8k3Nj6PmL6njqJ0kJ8k4j9K1
7364A0J5m0JK5K4k5jL4k1j9K3k0QJ1jjm2M7k8J4j7K3J5m4Plj1l0N0mRl1K4nJk2
7400b4M4kk1j5J4mk5N5Ll0LL9n7JJ5L2k1J1l0M1%n1M4K4m8OQmj5M1m6%K3pjnM5
7437D3l3mj2l0K7mJ9%j0j9J7Ml5L4Qqk5L8nl4J6pJ3j1j1L5J6nm6L5pl2L5j7%K9
7473A4JK8l6k0L7l5J7J6noJ0jNj9Oj1J0L8k5Ll5J4j4PJ1Rm6J8j3M3j5OpJ0k9J
7509a3oj1J1j6J5K6J4j2Pj8rj7N4m7j3L1K1k2j4L1j1J5l7K6K0j6J2j0J0K1j6n1
7541b5J5M5k0PnQpkl3K9K2j6J4j3k9RkJ5k4NlOj2J1L6j9l0rJ8j0Oj5K2l8L6Np
7578a0nJ0K5j1k0rK5nk8mK4oM1k5nL7k3omk3L6j1K6oj7mQoRKlNm8J1K6Kl9L7J4
$$ plain form
7617 20 19 0 -4 2 13 11 -22 -22 -11 -8 -27 -19 -34 -3 -4 -23 -11 11 -1 -32 4 -27 -26 -5 -11 -18 -1 1 -8 13 -1 -9 -27 4 2 -15 6 16
7655 16 2 17 14 7 11 10 1 -18 20 19 44 23 -11 -4 12 4 18 11 4 13 -1 13 7 -15 35 7 4 -3 3 -8 -10 9 -20 -16 17 -3 -35 -23 8
7694 8 -15 17 -1 -14 3 3 -8 -37 -49 -12 -6 -16 -30 24 -10 -9 28 -10 19 1 -1 1 29 -8 25 17 10 13 10 6 -4 -6 -3 27 -6 12 5
7731 5 4 25 1 -3 12 11 -9 -1 -17 4 0 20 11 -12 -22 7 4 21 6 -40 -8 -8 -2 -11 -7 -19 8 -11 -4 1 -13 32 -11 -2 -5 19 2 -21
7769 -21 10 2 4 6 -22 14 36 -8 -4 7 11 46 -35 28 10 4 -21 38 -23 18 26 5 3 -14 4 14 -5 -15 -5 -21 11 1 -8 -6 -7 -5
7805 -5 1 -22 -18 -1 -48 17 6 -20 -13 -37 6 -10 -1 -3 0 -9 -26 -13 -7 -19 0 -23 -20 -12 19 -16 4 27 -14 -3 25 -2 27 12 21 14 -1
7842 -1 25 39 10 13 3 2 42 -18 11 23 13 18 20 12 -8 20 -3 32 0 -2 13 -25 6 -10 -18 -4 -3 22 -15 -1 -28 9 -17 -10 -7 -54
7878 -54 -8 -15 -11 16 -17 3 -5 18 -12 4 -23 4 0 7 -10 1 14 -21 -4 14 3 21 12 -8 29 40 19 2 -12 -23 -4 13 -6
$$ packed form
7617B0jj9mOJ1kl3%J1Lj9Qj5L1jj9J2K2j2l1L6l1JK1opJ7KrK1j4qj8L1kj7K1J0
7655A6j4J5lpMjrj9L8jK5k1l4PJ6qJ4ppRj4J4ok2N0k8lpOj1kJ9k9ML3k0l2J2L1
7694Hk3L2j8j3J7%j1k9j2L7Oj0j4N4l4JL7l8K9j8kKK8l7L3qpLlmj0kLL0l3J8p
7731EjK1k4mJ5jk0Qj6K1mK0rk3j0K9lJ7j5m6L2%OrMj2K7j9PNj4M5m3RlK4j7k3
7769b1L1qKKk8L6K2m4MJ1ML5q1O3j8ok5N9o1M1Qk1kj7J8J0j9j0J0j6L2j0rKjK
7805eOk3MJ7m7O5j1k6Pk4M3j6RkLrj7J3Oj2J9k3LQL1l5K0K3m1J1K8k7K9j5Rpj5
7842aK6J4k9Lj0jM0o0K9J2j0NKqk0K8k3L5l2kJ5l8L1j6qJ4JK5l7J4k7L7k6PLm7
7878e4M6pMK7l3K0qK3l0J6k7K7mPj7J1J3l5J7J8j1J8rk0L7J1k1j7j4j1J9J7j9
$$ plain form
7911 -6 12 14 0 -20 -17 6 -2 14 -9 -13 -20 -20 -6 9 -22 31 3 -3 -23 -20 -3 -8 9 3 8 -16 -17 -24 8 -9 -4 16 -17 -21 18 -2 4 -12 -8
7950 -8 15 -10 -11 -13 8 45 16 -5 9 7 23 -10 0 0 19 28 -18 -17 -14 19 -5 21 27 -4 31 -14 5 22 24 -7 -5 1 -15 -12 -8 -1 7 -9
7988 -9 -6 -20 -42 -15 -9 2 -8 -55 -1 6 -9 -16 -6 -5 27 6 22 3 -11 8 17 -18 30 24 7 -32 -9 -4 14 7 5 2 9 0 -8 37 6 -37
8026 -37 42 26 -13 10 3 -10 -8 1 36 -22 -1 -4 -20 -25 -21 16 3 -19 7 -26 -27 2 -15 -41 -32 14 -17 -8 -3 -10 5 -37 -4 22 -30 -12
8062 -12 8 -12 -6 11 21 27 30 -18 -3 -5 8 13 10 -24 12 2 17 -22 2 29 -4 -10 7 11 27 16 2 2 -4 -11 20 -7 -7 20 9 -40
8098 -40 -11 8 -4 -20 -23 -18 -13 -9 -29 -30 -18 -17 -2 4 -12 18 3 10 -9 -26 9 2 30 7 -3 -21 -6 21 -19 -11 25 -16 9 -9 36
8133 36 14 11 14 16 -15 6 12 14 -15 28 -10 -16 -4 -3 11 -9 7 -31 16 -7 -10 9 14 -18 -24 5 0 -12 -9 -9 -8 -18 -16 -20 -12 -41 6 4 -5 -18
8173 -18 -38 3 -21 -8 0 -17 0 -32 -27 -49 -34 -7 5 -18 7 -8 -17 23
$$ packed form
7911fJ8Kj4k0LK3qJ6k3mp%J4J5l1N3k8ok0LJ7nJ7oNk4jpL2j7NK0l3mL9k0Oj6M
7950hK3k5jkK1L7k9k1J4kJ6l3J0%J9Rm6JLL3k4K6Ol1L5m5J9J7Kl1KOj6LMPQj6
7988iLj4k2K7OJ1j0m7N4Pj5pJ0JL2k1J6j9j4J9Rl5M8oj7l9K3NJ8pklPrqM5l1m3
8026c7P9j6l9K3pj3KRL5n8K1lj6nML7j3k2K6l3jK9j7k6RM6l1RNpJ5m2L3K6n2J8
8062a2K0k0OJ7J0OLm8J5kJ3Nll4L6j0J5l9K4K7l3oJ7MJ6j1j4%opL1k7%K7j1m9
8098d0K9J9j2j6lNNMk0jJ2JJ5Oj6L0j5Pj9j7L5pK8k3j0j8J5K7m0QL6m1K5j8M5
8133C6k2lLKl1K1OKk9M3l8oJ2JJ4k0J6l8M7k3lJ9Nl2oK9nj2L%Jj0KmQk9M7krj3
8173a8k0M1k4J3Qj7J7l2Nk2J5K7J2k3K5j5rM0
8191B3
$$ Imaginary data points
##PAGE= N=2
##DATA TABLE= (X++(I..I)), XYDATA
$$ plain form
0 0 0 0 0 0 0 0 0 0 8 -8 8 -8 14 -16 16 -24 25 -32 40 -42 50 -59 73 -81 92 -106 123 -139 156 -179 201 -225
32 -225 252 -282 315 -352 391 -436 482 -535 593 -656 725 -803 891 -988 1096 -1221 1362
49 1362 -1527 1721 -1952 2234 -2588 3044 -3662 4545 -5923 8377 -14066 53373 -37319 -135810
63 -135810 66698 80868 -99640 -103143 92768 78565 -69754 -35589 89953 17728 -85861
74 -85861 -11552 69493 -10609 -51226 34949 53470 -44878 -57133 23105 25852 -36968 -16902
86 -16902 50716 46387 -10189 -26827 -4126 7765 -16089 -43540 -16202 48588 42217 -30987 -27001
99 -27001 51412 29702 -69515 -42299 67352 36780 -64225 -16721 72137 -1488 -85440 1468
111 1468 70730 -20407 -51774 63134 69656 -63365 -57584 64044 20249 -102866 -25797 107485
$$ packed form
0@%%%%%%%%Qj6J6j6K2l0L2m0M9n7P2q2R2j09J32j54J73j98K29k62K95l35L80m26
32b25M77n34N97o67P43q27R18j017J128j249J381j528J694j879K084k317K583
49A362k889L248l673M186m822N632o706Q207j0468J4300k2443O7439r0692r8491
63a35810K02508J4170j80508l503J95911j4203j48319L4165J25542p2225j03589
74h5861P4309Q1045q0102m0617Q6175J8521r8348j2255Q0238K747o2820K0066
86a6902O7618m329n6576j6638K2701J1891k3854k7451K7338O4790o371p3204L986
99b7001P8413k1710r9217K7216J09651l0572j01005M7504Q8858p3625q3952Q6908
111A468O9262r1137l1367J14908O522j33021N781J21628m3795j23115P7069J33282
$$ plain form
123 107485 25547 -87940 9274 100122 -17863 -101555 13148 77558 -26604 -61812 37814
134 37814 52019 -38242 -39592 29159 14794 -29992 4498 37749 -2238 -22682 11293 7877
146 7877 -31428 -19133 19723 11859 -8023 6388 15481 51 -5124 -5431 -15811 -3192 22067
159 22067 2356 -26274 7849 37778 -13840 -47625 14475 47386 -18104 -39409 32143 41012
171 41012 -35583 -37337 31280 18405 -38949 -6151 45272 2050 -35867 15042 32081 -31660
183 -31660 -33991 36415 26645 -41305 -15537 49037 9110 -51820 -5427 45736 -3462 -39093
195 -39093 13407 35152 -16801 -27189 16051 11101 -22480 -1594 25709 -3119 -19553 13785
207 13785 15307 -25290 -17881 24773 12627 -22956 -1983 27874 543 -25387 -740 14443
$$ packed form
123A07485q1938j13487R7214R0848j17985q3692J14703O4410j04162l5208R9626
134C7814J4205r0261j350O8751j4365m4786L4490L3251l9987k0444L3975l416
146G877l9305J2295L8856p864j9882J4411R093j5430n175l07j0380J2619K5259
159B2067j9711k8630L4123K9929n1618l3785O2100L2911o5490k1305P1552Q869
171D1012p6595j754O8617j2875n7354L2798N1423m3222l7917N0909J7039o3741
183c1660k331P0406r770o7950K5768O4574l9927o0930M6393N1163m9198l5631
195c9093N2500K1745n1953j0388M3240m950l3581K0886K7303k8828j6434L3338
207A3785J522m0597P409M2654j2146l5583K0973K9857k7331k5930K4647J5183
$$ plain form
219 14443 -7165 -9104 12562 7876 -7899 2169 7273 -12155 -10974 13684 8907 -12944 84
232 84 19443 -1458 -20847 -481 11733 -7086 -7231 14575 9000 -9682 765 8795 -13744
245 -13744 -16754 13703 13348 -16352 -4447 27553 4965 -31259 -6048 25174 -4687 -26877 11936
258 11936 30583 -10101 -23194 13205 12690 -24539 -13751 24622 10682 -18963 3505 25146
270 25146 -8272 -29061 5117 19612 -13111 -16215 21576 21556 -15527 -14986 13570 5556 -19572
283 -19572 -7149 17383 8725 -7662 292 8312 -3081 -10835 -2776 3373 1726 2125 4365 3539
297 3539 599 -3970 -7117 -2826 2254 -1184 -1428 9275 9618 -7010 -9901 5325 2538 -15634 -6202
312 -6202 18959 10028 -13997 -2058 17925 -3129 -25730 -2023 20182 -2200 -15788 12302
$$ packed form
219A4443k1608j939K1666m686j5775J0068N104j9428J181K4658m777k1851J3028
232H4J9359k0901j9389K0366J2214j8819j45K1806n575j8682J0447Q030k2539
245a3744l010L0457l55k9700J1905L2000k2588l6224K5211L1222k9861k2190L8813
258A1936J8647m0684j3093L6399n15l7229J0788L8373j3940k9645K2468K1641
270B5146l3418k0789L4178J4495l2723l104L7791k0l7083N41K8556q014k5128
283a9572J2423K4532q658j6387P954Q020j1393p754Q059O149j647L99K240q26
297C539k940m569l147M291N080l438k44J0703L43j6628k891J5226k787j8172R432
312f202K5161q931k4025J1939J9983k1054k2601K3707K2205k2382j3588K8090
$$ plain form
324 12302 21665 -11100 -20323 8687 10608 -17073 -10156 21265 13459 -14858 -4951 16486 -1491
337 -1491 -22875 -2462 18759 1681 -11800 7915 16959 -6606 -17775 1005 8665 -6481 -7622
350 -7622 10726 13519 -3109 -8126 1848 1864 -8945 -7750 5949 9948 544 -2857 3988 3027 -9033
365 -9033 -10989 2341 7838 -1494 -2234 9935 8057 -9998 -12112 3349 3500 -9541 -2478 16303
379 16303 9784 -9851 -5320 8075 -3277 -17029 -1056 16115 3745 -7759 6196 11916 -8657
392 -8657 -16704 2292 9060 -5654 -4165 14297 11082 -9511 -9264 4982 -89 -12087 -1503 14353
406 14353 6997 -5688 123 6264 -5276 -13187 -1563 8194 2011 -1822 6120 7341 -4615 -10353
420 -10353 -2618 2084 -2394 -1754 7302 8908 -1024 -6516 -1622 -234 -6417 -5311 6074 9586 644
$$ packed form
324A2302R363l2765r223K9010J921k7681O917L1421p806k8317R907K1437j7977
337a491k1384K0413K1221j7078j3481J9715R044k3565j1169J8780P660j5146j141
350g622J8348K793j6628n017R974J6j0809J195J3699L999r404l401O845r61j2060
365i033j956J3330N497r332p40J2169j878j8055k114J5461J51j3041P063J8781
379A6303o519j9635M531J3395j1352j3752J5973J7171j2370j1504J3955N720k0573
392h657q047J8996O768j4714J489J8462l215k0593K47J4246n071j1998J0584J5856
406A4353p356j2685N811O141j1540p911J1624R757o183l833P942J221j1956n738
420a0353P735M702m478O40R056J606r932n492M894J388o183J106J1385L512q942
$$ plain form
435 644 -2835 3190 1002 -9802 -8156 5005 6653 -1993 797 9622 2385 -10935 -6310 4774
449 4774 -8 -6525 4257 12936 1285 -8618 -139 4158 -7040 -8681 6322 10370 -1676 -3336
463 -3336 6191 2306 -10342 -6759 5594 3558 -3883 2029 8839 381 -8476 -2900 2739 -2547 -4288
478 -4288 4261 7575 -14 -4036 35 398 -4769 -4181 2811 5110 977 -862 1530 727 -4163 -4981
494 -4981 469 3788 979 -329 3329 3116 -3704 -5754 551 2864 -2022 -899 6402 4453 -4879
509 -4879 -4163 3333 251 -6638 73 9051 2364 -6090 496 5726 -4113 -8760 3099 8324 -2083
524 -2083 -4539 5701 4440 -8051 -6633 5075 3293 -5123 562 8846 1092 -7876 -1804 3548
538 3548 -3451 -5794 4110 7411 -1065 -3625 2495 1426 -5792 -4084 3622 3946 -607 -94 2562 -7
$$ packed form
435F44l479O025k188j0804J646J3161J648q646K790Q825p237j3320M625J1084
449D774m782o517J0782Q679j1651r903Q479M297j1198j641J5003M048j2046j660
463c336R527l885j2648L583J2353k036p441N912O810q458q857N576N639n286j741
478d288Q549L314p589m022M071L63n167N88O992K299m133j839K392q03m890q18
494d981N450L319k809j308L658k13o820k050O305K313m886J123P301j949r332
509d879P16P496l082o889O711Q978o687q454O586N230r839m647J1859N225j0407
524b083k456J0240j261j2491J418J1708j782q416N685Q284p754q968O072N352
538C548o999k343R904L301q476k560O120j069p218J708P706L24m553N13K656k569
$$ plain form
554 -7 -4288 -3828 67 2519 2189 1670 2836 2761 -1692 -5682 -3216 903 -305 -972 4453 6440 -525
571 -525 -4153 746 784 -5749 -2978 6854 4917 -4363 -1447 5484 -2100 -10507 -868 9219 1582 -4368
587 -4368 5429 8331 -5826 -11117 245 2915 -5935 -2545 9825 7051 -4068 -1776 4169 -3110
601 -3110 -9001 210 6743 -332 -3272 4202 3790 -6101 -6303 2860 3958 -1189 1213 6493 2947 -4312
617 -4312 -5265 -2714 -2173 -1641 920 4113 5920 4280 -631 -3205 -1417 -1634 -4450 -1856 4393 3574
633 3574 -1471 -166 2488 -2330 -5130 1741 5407 -446 -1105 5442 1916 -9103 -6833 3436 654
648 654 -6168 2460 12413 3711 -6710 -471 4441 -5575 -9991 1322 6540 -1272 -2223 5371 3088
663 3088 -5220 -2616 3935 442 -3141 3024 5299 -2823 -5911 452 1151 -4545 -2072 6203 6083 128
$$ packed form
554gm281M60L895K452l30n19J166p5m453l990K466M119j208o67N425J987o965
571e25l628M899L8o533K771R832j937r280K916O931p584q407R639J0087p637n950
587d368R797K902j4157n291J1362K670q850L390J2370k774j1119K292N945p279
601c110n891R211O533p075k940P474m12r891k02R163J098n147K402N280l546p259
617d312r53K551N41N32K561L193J807j640m911k574J788k17k816K594O249q19
633C574n045J305K654m818k800O871L666n853o59O547l526j1019K270J0269k782
648F54o822Q628R953q702j0421O239M912j0016m416J1313N218p812r51P594k283
663C088q308K604O551l493l583O165K275q122l088O363O99n696K473Q275j20n955
$$ plain form
679 128 -172 1980 -1068 -4756 -3650 -927 834 2238 2011 494 1179 2082 -1295 -3818 48 3230
695 3230 -223 -2306 1246 1541 -3169 -3192 1117 833 -864 2803 4535 -886 -2987 1532 236 -6599
711 -6599 -3799 5082 3107 -4094 108 7177 1122 -6742 -1365 4807 -701 -4820 1413 4319 -1655
726 -1655 -3163 1774 1296 -2690 233 4115 327 -2655 1704 2783 -3400 -4357 2057 3043 -2255 -1682
742 -1682 3726 3012 -2117 -2170 1039 768 -1287 -975 282 709 872 -101 -1508 -378 1640 183 -2002
759 -2002 -27 2278 96 -2181 -406 1054 -587 -914 677 216 -685 984 1166 -1832 -1637 2270
775 2270 1413 -3151 -1528 3731 1719 -3760 -1403 3878 1185 -3582 -709 3322 448 -2616 189
790 189 2071 -445 -1073 1177 570 -1521 176 1910 -796 -2165 1309 2523 -1343 -2394 1544 2306
$$ packed form
679A28l00K152l048l688J106K723J761J404k27j517O85R03l377k523L866L182
695C230l453k083L552K95m710k3M309k84j697L667J732n421k101M519j296o835
711f599K800Q881j975p201M202P069o055p864N377O172n508m119O233K906n974
726a655j508M937m78l986K923L882l788k982M359J079o183r57O414R86n298N73
742a682N408p14n129n3L209k71k055L12J257M27J63r73j407J130K018j457k185
759b002J975K305k182k277J775J460j641l27J591m61r01J669J82k998J95L907
775B270q57m564J623N259k012n479K357N281k693m767K873M031k874l064K805
790A89J882k516o28K250o07k091J697J734k706j369L474J214l866j051L938P62
$$ plain form
806 2306 -1682 -2405 1183 2092 -872 -1662 648 1361 -350 -1246 -373 506 316 -434 -643 116 726 88
824 88 -728 -355 395 346 -161 -334 -300 50 402 -311 -1111 46 1721 589 -1423 -46 2219 398 -2471
843 -2471 -951 1872 344 -2142 -280 2384 985 -1147 32 1499 152 -1113 -274 172 -686 -480
859 -480 454 8 -582 587 1477 43 -919 558 1301 -780 -2153 -460 964 -591 -1815 117 2182
876 2182 911 -799 215 1650 33 -2066 -1246 319 -490 -1376 126 1360 479 46 1209 1032 -680
893 -680 -568 779 -241 -2062 -705 1287 -209 -1801 547 2823 879 -977 968 2175 -619 -2603
909 -2603 -837 453 -1128 -1531 727 1985 857 364 1113 771 -596 -957 -566 -690 -1011 -594 32 57
927 57 -84 331 1013 1073 226 -103 528 180 -1667 -2179 -394 212 -1214 -669 2274 2557 -167 -462 1604
$$ packed form
806B306l988p23L588R09k964p90K310P13j711q96Q73Q79j90p50k09P59O10o38
824H8q16L73P50m9n07j73L4L50L52p13q00J157J675j132k012J377K265j821k869
843b471J520K823j528k486J862K664j399k132J179J467j347j265Q39M46q58K06
859d80R34m46n90J169Q90j434r62J477P43k081j373J693J424j555j224J932K065
876B182j271j710J014J435j617k099Q20J565q09q86J502J234q81m33J163j77j712
893f80J12J347j020j821J357J992j496j592K348K276j944j856J945J207k794j984
909b603J766J290j581m03K258J258j128m93P49l42j367l61L91j24l21M17O26K5
927E7j41M15O82O0q47l29O31l48j847n12J785O06j426N45K943K83k724k95K066
$$ plain form
946 1604 545 -2551 -1877 911 37 -1920 -21 2281 429 -1175 1015 2115 -423 -1174 1202 897
962 897 -2120 -1850 754 181 -1720 86 2702 1408 -560 642 1442 -823 -2223 -759 138 -739 -635
979 -635 808 1028 224 173 430 114 -116 -77 -295 -421 -234 -513 -911 -361 394 99 116 1269 1209 -350 -601
1000 -601 350 -491 -1948 -673 1202 178 -866 1018 2031 -312 -1371 812 1175 -1290 -1166 1372
1016 1372 869 -1600 -699 1494 265 -1431 454 2003 48 -1127 653 857 -1385 -1469 651 585 -930
1033 -930 -1 1537 410 -906 -59 554 -600 -910 303 437 -432 -209 403 -98 -479 119 242 -202
1051 -202 92 556 -116 -554 68 106 -668 -304 744 404 -422 254 793 -380 -901 318 547 -642 -283
1070 -283 1077 475 -873 -62 933 -310 -1022 511 1065 -485 -637 923 553 -1103 -439 1039 129
$$ packed form
946A604j059l096O74K788q74j957J899K302j852j604K190J100k538p51K376l05
962H97l017K70K604n73j901J806K616j294j968J202Q00k265j400J464Q97q77J04
979f35J443K20q04n1K57l16k30L9k18j26J87k79l98N50P55k95J7J153o0j559k51
1000f01R51q41j457J275J875j024j044J884J013k343j059K183L63k465J24K538
1016A372n03k469R01K193j229j696J885J549j955j175J780K04k242q4K120o6j515
1033i30R29J538j127j316Q47O13j154l10J213J34q69K23O12n01l81N98J23m44
1051b02K94M64o72m38O22L8p74L64J048l40q26O76N39j173n21J219K29j189L59
1070b83J360o02j348Q11R95j243p12J533N54j550j52J560l70j656O64J478r10
$$ plain form
1087 129 -1012 250 1100 -426 -994 471 608 -900 -570 960 399 -900 -107 826 -324 -1035 187
1104 187 680 -468 -552 665 431 -663 -286 566 -10 -609 111 529 -161 -306 277 159 -355 -74 365
1123 365 33 -87 276 165 -207 22 224 -213 -222 387 258 -377 66 628 -90 -675 229 637 -451 -578
1143 -578 675 503 -830 -414 907 191 -1047 -67 1046 -176 -1074 316 932 -676 -968 704 727
1160 727 -873 -598 951 383 -1022 -267 940 17 -970 79 871 -197 -713 308 639 -346 -456 367
1178 367 414 -243 -270 290 293 -113 -193 133 300 28 -265 -8 413 119 -458 -62 600 50 -690 58 837 -164
1200 -164 -904 273 945 -482 -934 600 843 -867 -859 978 684 -1118 -608 1154 319 -1295 -224 1271
1218 1271 -60 -1311 109 1159 -364 -1104 395 930 -508 -817 578 749 -550 -586 537 498 -472
$$ packed form
1087A29j141J262Q50j526n68J465J37j508L30J530n61j299P93R33j150p11J222
1104A87M93j148q4J217k34j094L77Q52n76n99P20M18o90j45N83j18n14K81M39
1123C65l32j20L63j11l72K29K02m37rO09j29o35M43N62p18n85R04M08j088j27
1143e78J253j72j333M16J321p16j238R80J113j222q98J390O16j608k92J672K3
1160G27j600K75J549n68j405P55J207r23r87J049P92j068n16J021L31r85j10Q23
1178C67M7o57k7N60Lm06q0L26J67k72k93K57M21k94n77L96O62n50p40P48P79j001
1200a64p40J177O72j427m52J534K43j710QJ837k94j802N10J762q35j614J071J495
1218A271j331j251J420J050j523p40J499N35j438l09J395J71j299l6J123l9r70
$$ plain form
1235 -472 -423 446 405 -288 -317 328 452 -146 -417 224 582 -130 -609 216 718 -289 -837 391 869 -482
1255 -482 -888 648 868 -834 -823 940 648 -1166 -590 1215 394 -1319 -192 1308 -69 -1383 184
1272 184 1261 -461 -1229 564 1003 -708 -898 741 671 -798 -542 778 398 -725 -255 593 117 -473
1290 -473 -61 387 96 -163 -44 116 183 -9 -240 19 413 55 -465 99 647 -129 -700 234 792 -420
1310 -420 -785 658 795 -814 -739 964 545 -1162 -454 1207 241 -1308 -96 1213 -200 -1258 325
1327 325 1082 -518 -957 679 707 -832 -579 764 252 -855 -103 782 -61 -623 253 482 -336 -337 344
1346 344 140 -271 96 227 -178 -52 358 -60 -337 351 424 -473 -341 661 235 -820 -100 897 -52 -885
1366 -885 336 907 -524 -911 678 676 -871 -512 1002 268 -1061 -64 1030 -203 -1074 295 870 -591
$$ packed form
1235d72M9Q69m1o93k9O45J24n98k71O41L58p12m79Q25N02j007n48J228M78j351
1255d82m06J536K20j702J1J763k92j814N76J805q21j713J127J500j377j314J567
1272A84J077j722p68J793M39j711j90J639p0j469K56J320l80j123M70Q48m76n90
1290d73M12M48k91k59J19J60O7j92k31K59L94l58n20N64N48p76n71R34N58j212
1310d20l65J443J37j609P5J703m19j707P08J661r66j549J212J309j413j058J583
1327C25P57j600m39J636K8j539K53J343n12j107P52Q85q43n62Q76K29q18jO81
1346C44k04m11L67J31m05J26M10m18k77O88P3q97J32J002m26j055P20R97r49q33
1366h85J221N71j431l87J589kj547L59J514p34j329R97J094j233q71J369N75j461
$$ plain form
1384 -591 -769 659 520 -788 -343 752 146 -673 103 571 -367 -483 348 127 -502 82 604 -140 -378
1403 -378 521 355 -714 -270 648 -73 -771 250 820 -396 -556 775 619 -799 -303 1014 11 -1186
1421 -1186 43 952 -511 -1047 726 1007 -624 -500 1048 494 -1077 -423 777 -218 -1111 147 825
1438 825 -322 -496 742 559 -574 -181 609 -154 -812 18 298 -541 -396 568 303 -291 366 757 -187
1457 -187 -448 329 3 -975 -353 625 -100 -664 661 1128 -303 -529 880 566 -1092 -605 808 -113
1475 -113 -1327 -1 1171 -175 -752 932 1188 -578 -657 786 177 -1429 -622 733 -146 -916 462
1492 462 1180 -96 -448 698 490 -787 -594 277 -267 -833 0 461 -149 -64 721 447 -208 230 374
1511 374 -523 -744 60 -62 -816 -108 884 228 -303 707 897 -475 -681 456 64 -1222 -536 815
$$ packed form
1384e91j78J428j39j308M45J095o06q19P76M68r38j16Q31k21o29N84N22p44k38
1403c78Q99j66j069M44R18p21o98J021N70j216j60J331j56j418M96J317j003j197
1421a186J229R09j463n36J773K81j631J24J548n54j571O54J200r95q93J258O78
1438H25j147j74J238j83j133L93P90p63o58Q30K80q39J45R64k65n94O57L91r44
1457a87k61P77l26r78O22R78p25n64J325M67j431k26J409l14j658M87J413r21
1475a13j214J326J172j346n77J684K56j766p9J443o09j606Q07J355q79p70J378
1492D62P18j276l52J146k08j277J93Q71n44n66Q33M61o10Q5P85k74o55M38J44
1511C74q97k21Q04j22p54P08R92o56n31J010J90j372k06J137l92j286O86J351
$$ plain form
1529 815 12 -903 458 1308 -58 -645 776 794 -930 -889 533 32 -1226 -269 1042 163 -558 653
1547 653 1054 -317 -680 374 159 -973 -519 412 -28 -587 325 764 -1 -145 551 276 -510 -242 152
1566 152 -417 -599 162 284 -275 108 831 239 -375 275 467 -594 -684 281 148 -735 -106 832 176 -539
1586 -539 407 824 -316 -670 418 315 -884 -531 621 84 -731 143 956 -31 -546 421 522 -605
1604 -605 -599 370 109 -685 -84 681 5 -457 342 541 -309 -370 388 69 -584 -159 375 -164 -412 275 395
1625 395 -221 -139 451 97 -461 -10 311 -264 -380 345 330 -351 -64 511 60 -476 108 425 -288 -397 368
1646 368 279 -486 -187 532 57 -504 117 488 -269 -459 330 273 -487 -206 508 97 -491 70 472 -213 -443
1667 -443 277 316 -404 -222 449 143 -417 57 428 -140 -384 213 267 -337 -198 375 98 -384 51 389 -107
$$ packed form
1529H15q03r15J361Q50j366n87J421J8j724M1J422n01j258R57J311q79p21J211
1547F53M01j371l63J054k15j132M54R31m40n59R12M39p65j44O96k75p86K68L94
1566A52n69j82P61J22n59L83P23n92o14O50J92j061r0R65j33q83O29R38o56p15
1586e39R46M17j140l54J088j03j199L53J152n37q15Q74Q13r87n15R67J01j127
1604f05OR69k61p94O01P65o76m62P99J99q50o1P58l19o53M25N34n39k48O87J20
1625C95o16Q2N90l54n58M51L21n75j16P25j5o81K87N75m51n36N84L17p13j09P65
1646C68q9p65K99P19m75n61O21L71p57j90P89n7p60K81P14m11n88N61M02o85k30
1667d43P20L9p20J82O71l06n60M74L71n68k44N97N4o04J39N73k77m82M35L38m96
$$ plain form
1688 -107 -336 252 211 -316 -159 300 6 -363 90 350 -121 -232 285 197 -361 -150 285 -53 -376 107 331
1709 331 -168 -251 291 197 -330 -101 329 -31 -406 54 287 -206 -283 253 200 -297 -91 348 14 -353 52
1730 52 259 -192 -260 225 182 -277 -88 340 21 -308 106 277 -183 -230 227 137 -269 -72 281 -1 -286 125
1752 125 311 -150 -242 170 114 -273 -99 285 7 -279 82 302 -151 -228 177 140 -235 -119 244 24 -241
1773 -241 75 224 -124 -171 146 114 -157 -34 173 -11 -186 98 166 -140 -102 185 42 -230 23 201 -91
1794 -91 -201 157 184 -193 -122 233 48 -277 13 265 -104 -263 150 238 -201 -165 264 115 -275 -54 279 -12
1816 -12 -279 97 232 -119 -209 171 133 -216 -59 187 0 -193 32 129 -117 -154 105 54 -167 13 148 3
1838 3 -122 112 126 -157 -63 142 -16 -161 71 179 -83 -136 185 142 -224 -61 196 24 -258 59 215 -138
$$ packed form
1688a07k29N88m1n27J57M59k94l69M53K60m71j11N17q8n58K11M35l38l23M83K24
1709C31m99q3N42r4n27K29M30l60l75M60K33m93p7N36n3m97K06M39l34l67M05
1730E2K07m51o8M85m3m59J89M28l19l29M14J71m60m7M57r0m06J97L53k82k85M11
1752A25J86m61r2M12n6l87J74L84k78k86L61K20m53p7M05l7l75J16L63k20k65
1773b41L16J49l48m7L17l2k71J23K07j84j75K84O8l06L8K87j43k72K53J78k92
1794i1j10L58K7l77P1L55j85l25K90K52l69j59M13Q8m39L6M29j49l90K21L33k91
1816a2k67L76J35l51r0L80l8l49J57K46j87j93K25R7k46l7K59n1k21J80J35j45
1838Cj25K34J4k83R4K05j58j45K32J08k62n3L21m3l66J63K57j72k82L17J56l53
$$ plain form
1860 -138 -207 171 173 -213 -103 268 45 -295 -1 227 -84 -238 162 178 -189 -105 199 45 -220 -24 221 -61
1882 -61 -179 107 118 -169 -118 176 29 -228 43 196 -87 -151 142 92 -192 -76 159 5 -184 82 209 -91
1904 -91 -153 155 95 -178 -47 207 10 -188 76 221 -121 -162 162 113 -173 -74 201 -38 -215 60 177 -117
1926 -117 -161 155 89 -214 -43 203 -51 -230 101 192 -151 -137 175 82 -239 -54 219 -35 -226 129 232 -133
1948 -133 -208 203 108 -261 -71 260 -15 -280 103 246 -153 -182 181 188 -219 -71 236 21 -241 15 229 -113
1970 -113 -185 142 114 -194 -75 178 -20 -204 31 157 -132 -138 146 21 -240 -30 213 -84 -185 137 146 -200
1992 -200 -132 215 36 -267 13 257 -133 -255 177 223 -236 -165 287 104 -284 -26 302 -68 -307 118 293
2013 293 -171 -198 299 186 -305 -104 289 -39 -308 61 261 -138 -221 209 156 -239 -104 273 20 -248 65
$$ packed form
1860a38o9L78Kl86J10L71k23l40K94K28l11j54M00J6l67Q4L04j54k65J96K45k82
1882f1j18K86J1k87N1K94j47k57K71J53k83o4K93n0k84J16K35j54j89K66J27l00
1904i1o2L08o0k73J31K54j97j98K64J45l42m1L24m9k86R9K75k39j77K75J17k94
1926a17m4L16o6l03J71K46k54j79L31R1l43J4L12r3l21J85K73k54j91L55J03l65
1948a33p5M11r5l69J90L31k75k65L83J43l99k9L63Pm07J48L07k15k62K56K14l42
1970a13p2L27k8l08J19K53j98j84K35J26k89oK84j25k61K10K43k97j01L22Rl46
1992b00O8L47j79l03K80K44l90j22M32M6m59P1M52j83l88K58L28l70k39M25J75
2013B93m64k7M97j13m91K01L93l28k69L69K00l99q3M30n3l95J35L77k53k68L13
$$ plain form
2034 65 164 -133 -196 106 35 -170 -17 230 -41 -142 122 129 -209 -152 170 -35 -271 46 274 -122 -194 217 171
2057 171 -267 -103 296 -11 -363 25 284 -146 -290 251 299 -240 -135 401 136 -408 -60 345 -119 -396
2077 -396 161 375 -184 -174 335 219 -268 -96 267 3 -320 39 252 -143 -253 155 160 -165 -28 265 49
2098 49 -174 49 100 -209 -213 102 22 -125 85 271 -5 -140 198 95 -298 -116 226 -41 -298 122 316 -156
2120 -156 -201 297 241 -268 -103 375 -8 -479 -57 300 -191 -336 239 399 -155 -136 368 141 -410 -155 265
2141 265 -94 -373 130 346 -80 -158 250 183 -259 -101 218 10 -257 -25 140 -181 -178 133 105 -102 82 218
2163 218 -39 -164 35 39 -286 -130 194 17 -177 132 290 -85 -165 180 121 -286 -126 254 23 -318 70
2184 70 287 -77 -233 274 273 -199 -135 291 54 -413 -112 262 -43 -274 140 292 -135 -175 218 103 -267 -85
$$ packed form
2034F5R9k97o3L02p1k05J53K47k71j01K64Pl38N7L22k05k36L17K28l96p2M11m6
2057A71m38J64L99l07l52L88K59m30j44N41M8n39J05N36k65n44L48M05m64k77
2077c96N57K14n59J0N09j16m87J72L63k64l23L59K13l95j10M08Nl25J37K93k16
2098D9k23K23N1l09mL15q0j47K10J86k76j35L38j03l93J82L42k67k57M20J94m72
2120a56m5M98n6n09J65M78l83m71M22L57m91j45N75J60n54J9N04k27n51K55M20
2141B65l59k79N03K16m26p8M08o7m42J58L19k08k67K32J65l21LL11k8k07J84J36
2163B18k57j25J99Ml25J56L24j77j94L09J58l75q0L45n9m07J60L80k31l41L88
2184G0K17l64j56N07jm72O4M26k37m67L01L74l05k31M14J52m27m0L93j15l70J82
$$ plain form
2206 -85 223 5 -229 54 177 -127 -130 170 42 -169 -51 156 -33 -175 61 121 -172 -108 144 48 -168 37
2228 37 208 -102 -168 129 155 -162 -101 211 46 -202 36 245 -61 -182 138 150 -137 -104 199 72 -199 26
2250 26 216 -55 -147 79 126 -120 -102 192 95 -185 -11 156 -33 -184 78 142 -120 -84 159 60 -145 -9 107
2273 107 -86 -163 109 140 -141 -96 140 17 -199 -65 166 -46 -119 113 151 -113 -106 72 -1 -154 23 178 41
2296 41 -97 98 115 -158 -107 59 36 -117 25 147 44 -88 34 69 -105 -97 96 43 -100 11 53 -81 -124
2319 -124 42 71 -57 5 147 22 -125 -80 -42 -170 -137 59 95 -3 81 153 -10 -153 -25 30 -97 -117 83 117
2343 117 -87 -18 121 4 -89 18 166 15 -91 43 12 -168 -204 9 31 12 137 223 135 6 37 -69 -168
2366 -168 -152 -26 15 19 89 133 64 -2 26 17 -27 -41 -3 -40 -76 -64 -69 -98 -36 114 102 74 145 111 -101 -181 -141 -144 -193 -78
$$ packed form
2206h5L08k18k34K83J23l04lL00j28k11J18K07j89j42K36O0k93O4K52r6k16K05
2228C7J71l10o6K97K6l17O1L12j65k48K38K09l06j21L20J2k87L3L03j27k71K25
2250B6J90k71r2K26M7k46J8K94r7k80J74J67j89j51K62O4k62L6K43r9k05J36J16
2273A07j93p7K72L1k81M5K36j23k16J34K31k12p3K32L8k64PJ78p3j53J77J55j37
2296D1j38J95J7k73N1J66k3j53J42J22j03j32J22L5j74QJ93n3j43J11M2j34m3
2319a24J66K9j28O2J42j25j47M5L8j28L3J96L6r8Q4P2j63j43J28N5j27k0K00L4
2343A17k04O9J39j17r3J07J48j51j06J34l1j80l6K13K2j9J25Q6q8j29L1j06r9
2366a68J6J26M1MP0M4o9o6K8rm4j4L8l7l6J2nk9O2J50j2k8P1l4k12q0M0lm9J15
$$ plain form
2396 -78 130 164 91 116 134 1 -133 -32 25 -72 -75 36 17 -89 -67 55 81 34 153 184 76 -57 -97 -143 -193 -152
2422 -152 -21 82 118 159 159 101 -30 -45 -144 -147 -67 -21 -17 43 50 8 2 5 51 54 15 74 3 -71 -141 -120 -133 -97 16 125 139
2453 139 94 84 29 -123 -151 -118 -72 -43 15 114 114 50 73 14 -44 -25 3 25 -13 25 -37 -51 -66 -7 10 47 110 110 67 -16
2483 -16 -34 -73 -129 -100 -40 51 12 52 96 4 -39 -44 -21 -71 -63 30 67 18 -32 -15 1 -48 -24 39 55 27 -15 -10 -22 -39 -65 -45
2515 -45 20 10 45 62 64 -18 -57 -69 -32 -11 -13 7 64 27 -54 -7 17 -11 -43 11 31 -16 -31 39 32 -19 -60 52 31 -40 -40 50
2547 50 13 -59 2 44 5 -30 8 41 -15 -52 3 50 -25 -69 22 23 -31 -44 5 30 -11 -2 77 46 -30 -82 -13 -10 -29 23 79 103
2579 103 -19 2 24 -31 -69 -35 44 68 -30 9 24 -7 -69 -59 56 51 13 24 85 15 -116 -104 13 -1 -9 42 114 79 -47
2608 -47 -80 -29 -72 -102 42 125 33 -46 58 -5 -127 -157 16 31 29 55 109 60 -113 -107 -45 -23 -71 46 156 96 7 -29
$$ packed form
2396g8K08L4p3K5J8j33j34J01N7r7lJ11j9j06K2J22K6m7J19L1j08j33m0m6n0M1
2422a52J31J03L6M1%n8j31j5r9lQ0M6MO0Pm2oLM6Ll9N9p1p4p0K1j3L6J13J09J4
2453A39m5j0n5j52k8L3M6K9N8R9%o4K3n9n8J9K8K2l8L8o2j4j5N9J7L7O3%m3q3
2483a6j8l9n6K9O0R1l9M0M4r2m3nK3n0QR3L7m9n0J7J6m9K4O3J6k8m2Nj2j7k6K0
2515d5O5j0L5J7Kq2l9j2L7K1kK0N7l7q1M7K4k8l2N4K0m7j5P0pn1m1J12k1p1%R0
2547E0l7p2O1M2l9l5L8L3n6l7N5M7p5m4R1Jn4j3M9K5m1RP9l1p6n2O9Lj9N2N6K4
2579A03j22K1K2n5l8L4P9K4r8L9J5l1o2J0J15nl8J1O1p0j31J2J17j4qN1P2l5j26
2608d7l3N1m3l0J44Q3r2p9J04o3j22l0J73J5kK6N4m9j73OO2K2m8J17J10o0q9l6
$$ plain form
2636 -29 -12 -114 -122 -16 92 128 66 70 25 -44 -105 -80 18 32 36 93 101 22 -102 -130 -74 -44 -35 95 146 73 -61 -55 -50 -115 -151
2667 -151 -4 152 132 15 47 14 -155 -207 -30 90 16 15 148 135 -124 -145 -31 -48 -101 44 187 121 -21 -24 19
2692 19 -128 -160 -34 103 74 38 116 39 -77 -159 -82 -49 28 64 130 94 9 -35 -115 -95 -3 5 39 109 125 -3 -104 -83
2720 -83 -48 -123 -46 107 141 -1 5 93 -66 -208 -98 78 -13 1 120 110 -64 -133 -2 -35 -112 -7 175 101 -20
2745 -20 -7 51 -114 -148 -3 58 50 23 79 49 -84 -111 -53 -28 -16 50 75 22 30 41 -66 -131 -5 40 -41 -3 115 51
2773 51 -49 -68 18 -68 -85 67 102 -12 -25 107 23 -174 -54 100 7 -95 53 177 -25 -108 36 77 -93 -111
2797 -111 69 34 -24 -20 100 0 -89 27 34 -14 -26 72 41 -42 -32 53 -52 -83 7 56 -39 -15 34 5 -54 12 5 -76 -43
2826 -43 87 -13 -77 32 117 -49 -152 44 102 -92 -99 108 133 -77 -58 79 32 -111 -34 118 -26 -62 108 97
$$ packed form
2636b9J7j02qJ06J08L6o2Mm5o9o1K5R8J4MN7Qp9j24k8N6L0RJ30N1p3j34ONo5l6
2667a51J47J56k0j17L2l3j69n2J77J20p4jJ33j3k59k1J14j7n3J45J43o6j42lM3
2692A9j47l2J26J37k9l6P8p7j16q2P7L3P7L6O6l6q5m4q0K0R2QL4P0J6j28j01K1
2720h3L5p5P7J53L4j42OQ8j59j42J10J76r1J4J19j0j74o9J31l3p7J05J82p4j21
2745b0J3N8j65l4J45O1qk7N6l0j33k7N8K5J2O6K5n3QJ1j07o5J26M5q1L8J18o4
2773E1j00j9Q6q6j7J52L5j14j3J32q4j97J20J54r3j02J48J24k02q3J44M1j70j8
2797a11J80l5n8MJ20j00q9J16Pm8j2R8l1q3J0Q5j05l1R0M9r5K4M9k9n9O6pq1L3
2826d3J30j00o4J09Q5j66j03J96N8j94pK07K5k10J9J37m7j43P7J52j44l6J70j1
$$ plain form
2850 97 -75 -102 106 73 -137 -33 149 54 -106 13 86 -23 -145 -11 86 -4 -23 62 50 -15 17 14 -51 -20 82
2875 82 4 -80 41 77 -62 -133 3 58 -23 23 121 79 -65 9 35 -127 -148 47 99 -93 -32 213 73 -149 -49
2900 -49 147 -15 -157 15 158 -31 -152 35 88 -55 -39 107 81 -49 34 70 -116 -166 -15 17 -76 -2 211
2923 211 151 -30 8 80 -58 -147 -53 -20 -54 -25 44 -25 -60 62 37 -67 -38 168 42 -131 -69 17 -71 -226 6
2948 6 158 25 -2 201 147 -124 -123 4 -120 -218 -21 144 -13 -62 213 193 -74 -95 160 68 -133 -51 129 -9
2972 -9 -208 -67 76 -20 -3 165 169 18 38 43 -129 -236 -17 -11 -117 35 217 130 0 10 65 -71 -130 -4 -19
2997 -19 -95 -33 96 0 -115 47 147 -12 5 167 145 -205 -192 33 -52 -268 -53 229 149 -21 150 177 -112
3020 -112 -186 -20 -31 -172 -25 150 41 -105 49 108 -74 -78 112 87 -66 -113 22 -56 -162 -18 56 6 65 173
$$ packed form
2850I7j72k7K08l3k10J04J82r5j60J19P3j09j22J34R7r0j9Q5j2o5L2lo5L1J02
2875H2p8q4J21L6j39p1J36N5q1M6R8m2j44P4K6j62k1J95N2j92O1K45j40k22J00
2900d9J96j62j42J72J43j89j21J87N3j43J6J46k6j30Q3L6j86n0J51L2r3P4K13
2923B11o0j81L8P2j38q9R4L3l4K9O9o9l5J22k5j04K9K06j26j73O2Q6q8j55K32
2948FJ52j33k7K03n4k71JJ27j24r8J97J65j57m9K75k0k67k1K55r2k01Q2J80j38
2972ij99J41J43r6J7J68Mj51K0Nj72j07K19Oj06J52J82q7j30J0N5j36n9J26j5
2997a9p6O2J29r6j15J62J00j59J7J62k2l50J3K25q5k16K15K82q0j70J71K7k89
3020a12p4J66j1j41J47J75j09j46J54N9j82mJ90k5j53m7J35p8j06J44P4n0N9J08
$$ plain form
3044 173 105 -33 -9 -31 -176 -182 21 91 -80 -25 173 63 -128 -34 113 -48 -138 31 114 -94 -118 65 6 -132
3068 -132 7 189 90 -70 102 128 -90 -177 29 19 -97 -17 174 103 -89 8 79 -50 -118 57 43 -42 -7 67
3092 67 -38 -112 1 69 -60 -31 90 61 -104 -69 64 -94 -106 41 112 -60 -27 76 5 -149 -56 79 -55 -112
3116 -112 42 126 -90 -92 100 53 -144 -58 121 11 -165 16 123 -34 -99 71 40 -88 -42 94 6 -74 -17 92
3140 92 1 -61 99 72 -63 -21 78 10 -63 -31 44 -44 -85 70 39 -64 -19 105 -27 -85 3 70 -89 -95 46 39 -108
3167 -108 -29 144 25 -84 4 65 -55 -104 44 67 -77 -19 94 -7 -101 4 109 -2 -52 88 57 -84 -67
3190 -67 59 4 -104 19 110 -11 -40 80 38 -86 -35 35 1 -85 38 80 -47 -79 40 54 -86 -50 62 26 -66
3215 -66 -2 50 -67 -58 51 34 -44 -17 99 2 -82 -29 27 -52 -94 41 74 -48 -41 49 15 -96 -25 44 -6 -7 32 32 -50
$$ packed form
3044A73o8j38K4k2j45oK03P0j71N5J98j10j91R4J47j61r0J69Q3k08k4J83n9j38
3068a32J39J82r9j60J72K6k18q7K06j0j16Q0J91p1j92R7P1j29o8J75j4q5L5P4
3092F7j05p4J13O8j29K9J21k9j65L5J33j58j2J47P1j72L3J03p1j54R3J35j34n7
3116a12J54Q4k16kJ92m7j97Q6J79j10j76J81J07j57o5J70l1j28M6J36q8q0N7J09
3140I2r1o2J60k7j35M2R9o8p3L2P5q8m1J55l1j03M5J24j32n8Q8O7j59oJ41pj47
3167a08P9J73j19j09Q8O1j20m9J48K3j44N8J13j01r4J05J05j11n0J40l1j41J7
3190f7J26n5j08J23R1j21k9J20m2j24N1P0l4q6J23M2j27l2J19J4j40L6J12l6r2
3215f6O4N2j17RJ09j7p8K7J16r7q4N3N6p9m2J35L3j22PR0l4j11P1O9n0jL9%q2
$$ plain form
3244 -50 -19 14 -5 -60 35 97 -11 -50 50 45 -89 -64 73 -4 -67 46 72 -38 -35 30 12 -81 -21 76 38 -55 6 53
3272 53 -60 -78 17 38 -37 -36 100 22 -77 -2 50 -44 -49 38 35 -56 -15 52 9 -63 -44 59 -3 -55 41 38 -57 -18 38 1 -50
3303 -50 34 56 -25 -13 40 46 -46 -11 56 -7 -58 61 61 -36 -55 5 39 -79 -4 96 18 -65 13 70 -58 -50 49 33 -67
3332 -67 -19 59 23 -59 -6 66 -27 -59 25 49 -43 -31 9 14 -60 -7 66 -58 -41 22 6 -56 -41 45 -1 -70 10 44 -31 -11
3362 -11 33 49 -33 6 68 -8 -26 37 35 -19 -16 39 27 -38 -23 61 18 -76 8 43 -31 -14 52 -14 -52 -23 52 -21 -58 16 29
3393 29 -9 -59 26 43 -43 -15 52 -2 -56 18 59 -44 -38 43 36 -10 -18 63 14 -35 12 42 -16 -28 35 29 -40 16 62 8 -44 20
3425 20 39 -11 -40 57 8 -32 8 46 1 -31 13 51 -35 -9 50 25 -39 -11 72 -14 -60 26 41 -27 -38 28 14 -68 -25 49
3455 49 -10 -89 19 15 -33 -46 30 21 -24 -15 57 14 -36 10 9 -44 -12 47 32 -29 24 35 -25 -60 22 63 -36 -25 26 30 -51 -19
$$ packed form
3244e0L1L3j9n5R5O2j08l9J00nj34K5J37p7o3J13K6j10LO5j8r3O0R7l8r3O1M7
3272E3j13j8R5K1p5JJ36p8r9P5N2r4nQ7lr1M1O7m3p2J9J03o2n2R6lr5L9N6l7n1
3303e0Q4K2q1J2N3Or2L5O7o3n1J19%r7j9O0L4j18P5J00p8q3P8N7j28QR9j6j00
3332f7M8P8l6q2N3P2r3l2Q4K4r2J2M0Np4N3P3j24J7O3j6o2J5Q6m6o9Q0L4p5K0
3362a1M4J6q2L9O2p6j8O3kn4LN5j2o5J5Q4m3r4Q4L5p4J7O6o6l8K9P5p3l7P4J3
3393B9l8n0Q5J7q6K8O7n4n4P4M1j03OQ1pm6qQ1m9m9M7L0n8j2O3oo9N6M6n4n2O4
3425B0J9n0k9R7m9m0M0L8m5l2M4L8q6K6N9k5o4K8Q3q6m6Q6J5o8j1O6j4q2M3P4
3455D9n9p9J08mm8j3P6rm5RP2m3n0M6jn3L2N9j5o1N3J1o0l5Q2M1r9J1N1Mq1L2
$$ plain form
3487 -19 37 -1 -59 28 32 -34 -28 34 -15 -86 -1 49 -28 -49 70 52 -41 -39 25 8 -42 -9 55 -4 -69 29 8 -44 -21 30 16
3518 16 -46 23 47 10 -47 5 -22 -23 -1 51 -5 -25 12 40 -57 -48 47 45 -40 12 63 38 -67 -18 47 21 -46 10 52 -49 -4
3549 -4 46 3 -72 2 65 -14 -24 12 37 -36 -23 28 27 -63 27 87 36 -46 10 30 -49 -19 34 32 -21 11 28 -34 -30 29 3 -26
3581 -26 -13 54 -9 -62 -28 28 -17 -80 43 46 -2 4 38 -13 -75 1 16 -66 -40 37 44 -55 -6 28 -2 -53 15 63 -28 -22 17 17
3613 17 -57 -49 30 -1 -51 31 93 -10 -37 15 32 -77 12 46 41 -36 5 64 -8 -29 9 25 -43 -4 47 -7 -43 34 8 -53
3643 -53 -39 57 47 -55 -18 58 -13 -72 -11 82 -42 -31 37 64 -34 3 40 -20 -39 42 37 -33 -36 58 32 -66 -13 66 6 -25
3673 -25 26 71 -28 -51 13 39 -47 -11 49 16 -39 30 56 -47 -37 53 19 -35 9 50 -8 -47 -1 17 -15 -26 11 34 -28 -30
3703 -30 37 19 -37 20 37 -25 -6 47 6 -40 -40 79 22 -58 -25 30 -4 -8 40 15 -48 -10 40 -12 -59 22 7 -55 -16 35 0
$$ packed form
3487a9N6l8n8Q7Mo6OO2m9p1Q5N0p7k1J19j8r3KO4j7n0L3O4n9o5R8k1n2K3N1j4
3518A6o2O9K4l7n7N2k7jK2N2n6k0L7K8r7RR5kq5N2N1k5j05M9O5k6o7N6M2j01M5
3549dN0m3p5P4O3p9j0L6K5p3J3N1jr0R0O0n1q2N6K0p9L0N3kn3L2J7o2MN9k6k9
3581b6J3O7o3n3L4N6m5o3J23Lm8OL4n1o2P6J5q2K6P7Pr9M9L4l0n1O8M8r1OL9%
3613A7p4QP9l1n0Q2O2j03k7N2J7j09Q9L4np7M1N9p2k1L8J6o8L9N1n4l6P7k6o1
3643e3J4R6j0j02L7P6p1n9O1R3j24J1O8K7r8L7L7o0j9Q1np0lR4k6r8N3P9o0l1
3673b5N1M5r9k3O4K6q6L6O0l3n5O9K6j03J0R0l4n4M4M1n8l9M6J8l2j1L7K3o2k
3703c0O7j8n6N7J7o2J9N3m1m6%J19n7q0L3N5l4mM8k5o3L8N0n2m7Q1j5o2L9N1l5
$$ plain form
3734 0 -61 5 72 -10 -45 11 32 -23 -34 51 21 -18 -17 24 -5 -61 15 41 -23 5 55 19 -49 1 52 -30 -50 14 82 -40 -21
3765 -21 7 30 -19 15 34 5 -49 30 14 -30 -33 25 -3 -33 20 56 29 -36 13 15 -57 -38 38 44 -29 26 50 -14 -29 14 7 -38
3797 -38 -18 34 14 -49 -3 41 -15 -31 52 60 -9 -11 12 -22 -49 -30 18 -24 -71 29 33 -16 -16 13 21 -49 -27 22 22 -21 19 37 -3
3830 -3 -8 37 3 -43 17 47 -2 -36 23 33 -25 -16 67 30 -9 36 76 -14 -29 21 4 -45 -14 35 20 -25 14 73 3 -42 21 26
3862 26 -10 -29 68 -1 -75 28 44 -2 -16 41 46 10 -3 15 1 -51 -26 13 -4 -25 61 65 13 14 11 -35 -49 -36 31 -3 -12 4
3894 4 20 -32 -15 23 30 -31 9 53 4 -34 -4 0 -21 -9 24 32 37 17 55 -16 -35 -16 -6 -60 -6 54 59 -30 18 21 -22 -17 -11 55 -12
3929 -12 -32 36 -14 -82 -40 -19 -6 20 35 70 -19 -39 4 -12 -62 -46 68 17 -4 45 20 -21 -45 -5 -9 3 6 43 -8 -28 -8
3960 -8 -16 -58 14 23 35 16 48 22 -32 -58 5 28 -22 1 67 37 -13 -19 9 -72 -26 40 23 -2 27 64 -35 -56 -30 -14 -12 -19 32
$$ packed form
3734@o1O6O7q2l5N6K1n5j1Q5l0l9JM1k9n6P6K6o4K8N0l6o8N0N1q2k0O4O8j22J9
3765b1K8K3m9L4J9k9n4P9j6m4lN8k8l0N3L6k7o5M9Kp2J9P6Op3N5K4o4j5M3pm5
3797c8K0N2k0o3M6M4n6j6Q3Qo9kK3l4k7J9M8m2m7J00Mm9%K9Qp0K2M9%m3M0J8m0
3830cnM5l4m6O0L0m9l4N9J0n8RQ3l7l9M5M0r0j5N0j7m9L1M9j5m5L9N9p0m5O3N
3862B6l6j9R7o9p4J03J6m6j4N7Nl6j3J8j4n2K5L9j7k1Q6Mn2Jlm6j4J3O7l4rJ6
3894DJ6n2J7L8Po1M0M4m9l8L0Mk1J2L3QNk0L8p1j9J9J0n4N4O0Nq9M8Lm3NOO6o7
3929a2k0O8n0o8M2K1J3K6J5L5q9k0M3j6n0J6J14n1k1M9k5m1k4M0mJ2LL7n1k0K0
3960hqm2P2RJ2j9L2k6n4k6O3K3n0K3O6l0n0oK8q1M6O6j7k5K9L7r9k1K6J6KpN1
$$ plain form
3993 32 25 -43 -54 -5 -16 -33 6 45 25 -9 -28 18 -22 -56 -19 -27 3 31 11 -28 -23 -2 -30 -48 -25 11 22 7 20 2 -21 -41
4025 -41 25 34 -3 23 52 -4 0 -20 5 -33 -38 37 49 -3 -7 0 -40 -33 -31 14 15 -3 35 21 -45 -26 4 18 -9 -6 31 -13 -50 -37 -18
4060 -18 -3 -6 16 37 13 -10 31 -29 -31 1 13 8 11 46 15 -17 -27 -16 -23 10 32 35 1 10 6 -34 -17 -2 58 18 13 53 17 -64 -37
4095 -37 3 -12 -32 32 80 39 -7 6 2 -32 -65 13 33 -5 3 23 14 -55 -42 6 8 -15 20 48 30 -24 -27 -16 -58 5 27 -5 43
4128 43 11 -23 -61 -24 4 -17 -2 61 51 -1 11 16 -39 -38 21 47 26 -5 29 32 -15 -32 29 17 -31 10 89 38 -32 -15 -15 -13 -52
4161 -52 30 54 -11 -2 16 0 -59 -49 7 9 2 3 18 -10 -24 -38 -1 5 -19 26 22 31 8 0 0 -16 20 -14 61 46 35 -6 -25 18 -21
4196 -21 -40 -5 42 32 -3 31 1 -8 -14 30 19 -6 12 53 15 -30 20 9 -48 -34 10 45 -14 -9 -1 35 -42 -51 18 20 26 -20 -12 -12 -12
4231 -12 -39 -29 0 8 -30 21 19 7 -41 -21 12 0 -10 6 16 -4 -19 13 9 30 -25 9 43 -10 -37 23 18 -11 -18 12 20 -44 3
$$ packed form
3993C2po8j1M9j1j7L9L9k0l4j9M6m0l4L7qL0K8k0l9NK1k8j8K3L6J1j5J3j8k3k0
4025d1O6Rl7K6K9n6Mk0K5l8nP5J2n2mPm0PKM5Jj8L8j4o6J9L0J4k7LL7m4l7J3J9
4060a8J5lK2K1k4k3M1o0kL2J2nLL5l1l2j0J1pL3K2Ll4Rmm0J7J5O0m0nM0l6q1K7
4095c7M0j5k0O4M8m1m6J3ml4l3P8K0l8QK0ro9J3M8Kk3L5K8j8n4lJ1m2O3K2l2M8
4128D3l2l4l8L7K8k1J5O3j0n2J2Nn5JN9K6k1l1L4Lm7j7O1j2m8M1P9n1p0J7%Kl9
4161e2Q2K4o5RJ8j6n9J0N6KpJJ5k8j4j4L7Ok4M5mRk3q%j6L6l4P5j5j1m1j9M3l9
4196b1j9L5M7j0l5L4l0roM4j1k5J8M1l8m5N0j1n7J4M4L5n9NQL6p7rO9KOm6Q%%
4231a2k7J0K9Ql8N1kj2m8K0L3j2j0J6J0k0j5L2mK1n5L4L4n3k7O0nk9pL0Qo4M7
$$ plain form
4264 3 46 -2 -21 -15 -1 14 -26 -13 32 -11 -17 9 18 10 -31 12 30 -4 -32 14 37 0 -7 -1 -8 -50 -9 6 36 -2 5 -1 23 5 -56
4299 -56 -14 15 -4 -8 -3 29 3 -21 -7 18 -13 -1 41 53 -5 -4 -31 12 -42 -21 23 13 -18 17 24 15 -35 -16 15 -7 -25 13 18
4332 18 16 -38 1 12 -16 -7 21 33 12 4 6 -6 -11 -5 -18 -3 19 14 -44 -11 -27 -34 -5 2 23 27 17 15 -14 -31 4 5 0 16 51 45 -4
4369 -4 -4 18 -21 -23 9 21 25 -30 14 20 -9 -41 9 19 16 25 15 31 -18 -13 14 18 -1 28 25 43 2 -32 -4 15 -13 -1 -3 32 -31 2
4405 2 16 -8 -17 0 24 44 47 6 -34 -19 -47 -52 -13 -9 22 44 32 29 -13 -19 3 -28 4 -10 28 17 -16 13 8 5 25 9 54 11 10
4440 10 4 -10 -5 -12 -34 24 56 35 62 22 10 -22 -3 -28 -1 -2 27 -2 -5 11 2 11 43 12 10 18 -4 -36 -47 -19 -22 0 -2 40 24 13
4476 13 19 9 -6 -38 -46 11 -33 13 20 12 7 0 9 20 -19 -6 24 23 -15 19 -36 -16 -16 3 63 54 30 7 -18 -56 -58 -15 22 7 55 49
4512 49 -12 -25 -28 -20 -24 -13 27 0 -13 -17 -33 -27 -46 -32 32 9 16 38 -23 -36 -69 -29 -23 -9 36 33 13 25 8 -8 -3 -3 -16 45 40 10
$$ packed form
4264CM3m8j9OJ4J5m0J3M5m3oK6Rqm1M3J8l4k8M6K3l7pOpm2M1J5L0l8PoK4j8o1
4299e6M2K9j9mNL2k6k4J4K5l1J2M2J2n8Jk7M3n4K1M4j0l1L5Prn0J9L1k2j8L8N
4332A8kn4L9J1k8RK8J2k1qKj2nOj3J5K2nn8L3j6pK9PK1Mj0kk9j7L5JnJ6L5om9
4369d%K2l9kL2J2Mn5M4Ok9l2N0J0lRj0J6m9NK7Mj9K9lJ8m1l4K8J9k8J2kL5o3L3
4405BJ4k4rJ7K4K0Lm1m0J5k8nL9ML1K2j2lm2oK2l1L2j4L8j1l3K9nlK0j6M5m3j
4440A0oj4Npk2N8L2k1K7m0j2l2J9k5K7jK9k9lJ6rRL2l1kQk2l2j1K8lK2kM2j6j1
4476A3Oj0j5l2qN7m4M6PqnpRJ1l9J3L0jl8L4n5K0%J9O0rk4k3k5l8kM3L7j5M8o
4512D9o1j3lQmJ1M0k7j3mj6Oj9J4O4k3PK2o1j3l3M0OJ4M5lk0J2j7j6N%j3O1nl0
$$ plain form
4548 10 30 -11 -32 -20 -7 14 29 -10 0 13 -3 -28 -3 -30 10 19 28 -2 20 31 -41 -21 6 -26 4 8 5 -12 -3 17 -19 -12 -28
4581 -28 20 23 -15 -12 5 -18 -44 -42 18 24 45 25 -17 -30 -11 -7 4 18 19 5 8 3 -4 -29 -16 -22 -3 2 65 28 -19 -20 -12 3 -15 -25 36
4618 36 48 -17 7 7 -15 -41 18 28 -32 9 8 8 -10 -28 12 -20 1 21 20 12 -23 3 15 -12 -20 -5 31 4 -23 10 -30 -41 -3
4651 -3 -14 12 11 2 2 7 -3 -14 -13 -27 12 12 4 28 39 13 10 30 4 -19 9 41 0 -4 8 12 -4 -37 17 51 2 26 17 42 3 -62
4687 -62 5 -21 -14 -3 29 8 -40 25 8 -8 -27 -1 0 22 -7 -10 1 -23 55 5 -3 -26 18 5 -22 -36 -20 -2 1 -3 -12 -8 7 -10
4721 -10 -37 -9 23 28 -39 -27 20 8 -17 21 16 -2 -13 7 -4 32 9 -7 35 3 -31 19 31 3 -7 14 3 -29 -9 9 21
4752 21 -25 0 -15 -31 1 35 -2 -7 -33 -9 10 -14 14 21 -12 -16 1 -13 1 -7 -24 -39 7 -13 -16 13 19 -8 -23 4 25 4 -23
4785 -23 -4 22 19 -18 2 -1 -21 -13 53 25 14 11 3 11 -5 -4 -5 0 -3 -20 12 -23 -19 12 11 -13 -11 9 -3 -30 0 -12 -49 -18 21 6 -14
$$ packed form
4548A0K0m1k1J2J3K1J5l9J0J3j6k5K5k7M0RRl0K2J1p2K0K7l2L0Mlj7RK0l6Pj6
4581b8M8Ll8LJ7k3k6KO0OK1k0m2j3J9MJ1J4Jj4Lnpk5J3oJ9NO3l7m7jQJ5j8j0O1
4618C6J2o5K4%k2k6N9J0o0M1j%j8j8M0l2K1K0jql5K6J2k7qJ5L6k7k7L3m0j1L8
4651cj1K6jr%Nj0j1Jj4L9%qK4J1k6lK0k6k3K8L2m1mJ2Mj6l3N4L4m9K4rK5l9o5
4687f2O7k6PJ1L2k1m8O5j7j6j9K6JK2k9lJ1k4P8n0qk3M4j3k7j4J6J8LmrMJ5j7
4721a0k7K8L2No7J2M7j2k5L8nj8j1K0j1L6k3j6M2l2l4N0J2k8j0K1j1l2K0J8J2
4752B1m6K5j5j6L2L4l7nk6K4J9k4K8Pl3mJ7j4J4qj7j5M6k0lK9Ok7j5K7K1k1k7
4785b3J9K6ll7K0lk0QO6k8j1lqQj6JjNlj7L2l5ML1jk4KK0j2k7L0j2l7L1L9j5k0
$$ plain form
4822 -14 7 13 -32 -26 -2 -12 -11 24 11 9 -24 -9 -17 -25 -18 -10 5 4 -14 25 16 -20 9 41 5 -7 28 51 18 -29 -17 10 -24 -11 21
4857 21 -9 14 -10 23 -30 -15 -7 -20 -26 2 12 -2 -7 -25 -11 -3 -24 21 50 -5 4 28 -14 -6 -12 -23 -41 5 29 6 -51 -20 -16 4
4891 4 1 11 -8 2 -7 -15 -9 -27 -11 16 -28 -2 -6 37 -27 1 3 -21 -9 -1 10 3 18 -15 -12 -18 -38 0 -4 -36 14 -16 -2 -27 -34 -18 25
4928 25 0 -9 -8 -2 -8 -5 -26 -22 14 6 -6 -16 3 16 -48 1 9 -6 -9 1 24 -21 -46 -8 -23 -45 -19 -2 -21 -6 26 14 -32 -20 25
4963 25 31 14 5 35 -20 -22 0 22 -8 2 26 4 -7 17 20 2 -38 -10 31 -6 -17 26 -11 -22 23 4 10 -8 -15 2 -17 -5 11
4996 11 -3 -46 19 20 -18 5 29 21 -42 -62 -15 1 -19 20 7 23 -3 8 -8 -31 -19 14 16 -6 4 17 3 -33 -11 -8 -18 -1
5028 -1 19 5 -13 -6 -1 -27 -56 1 23 -4 13 14 10 5 -2 0 -15 -19 -10 23 -19 -18 -13 -19 -43 -40 39 -1 -32 21 12 -32 -18 0 9 -12 3 32
5066 32 18 -37 -19 -5 -34 -15 9 13 -2 11 5 -4 2 3 14 -2 10 -3 31 -10 -19 -1 12 -36 18 0 -17 -12 9 18 9 -4 41 44 -2
$$ packed form
4822a4K1Om5OK4j0JL5j3kl3J5qqPQJ5jj8L9rl6K9L2l6j2L5K3l3m7J2K7l4J3L2
4857B1l0K3k4L3n3J5Qj3oK8J0j4nj8J4Qk1M5K9n5RK4m2Qoj1j8M6K4k3n7L1MK0
4891DlJ0j9J0rqOj8J6K7m4K6mM3o4K8Kk4J2QJ1pJ5l3Lok0L8ml2N0l0J4k5pJ6M3
4928B5k5rJOoLk1ML6qj2j0J9J3o4M9Qj5lJ0K3m5k5L8j5k2K6J7j9J5L2j2m6J2M5
4963B5Oj7rL0n5kK2K2l0J0K4k2j1K4Lj8m0K8M1l7j1M3l7j1M5j9Oj8pJ7j9J2J6
4996A1j4m3O5Jl8K3K4qo3k0M7J6k0L9j3J6k6J1j6k3J2L3Kk2J0J3j4l6K2Lj0J7
5028aK0j4j8PNk6k9N7K2k7J7JmnpKj5mRL3m2JNok4LP9m0l1N3rm4J4J8Rk1J5K9
5066C2j4n5J8J4k9J9K4Mj5J3orOJJ1j6J2j3L4m1rJ8J3m8N4j8j7NK1Rrj3M5Lm6
$$ plain form
5101 -2 25 21 2 -5 -7 -12 9 21 11 -17 -29 -2 7 -32 -26 14 5 -1 2 20 -20 -30 -1 -5 -22 -11 15 24 -35 -2 7 -28 -13 5 16 7 20
5138 20 11 12 -15 13 10 11 -20 -9 1 21 -5 11 6 -5 2 25 33 -27 25 -5 7 -22 31 19 -23 16 7 -12 9 22 12 -12 -32 15
5172 15 7 -38 -7 26 4 -6 20 13 -18 -16 -20 14 -48 -6 29 -18 -7 -23 6 -34 -18 6 1 -12 18 26 -35 -17 -2 21 -18 16 4
5205 4 28 -18 -15 44 13 1 0 8 -2 1 14 17 -4 -2 7 8 -14 5 6 -7 -10 -12 15 -55 -35 12 11 -7 4 4 -9 -5 20 23 -40 1 20 -5
5243 -5 -10 -5 -8 -21 -17 -13 0 -8 17 18 21 -29 -3 26 2 11 22 9 15 22 27 -15 -3 8 47 -4 -2 12 13 -14 -10 24 -24 -12 15 -32 -7 -2 38
5282 38 19 -56 -24 5 -17 -14 26 12 9 -10 11 27 -20 20 13 -3 -53 -22 22 14 3 24 24 -12 3 7 8 -15 -26 15 1 -14 29 -14
5316 -14 2 -41 12 6 -37 -15 18 -12 -9 0 2 -19 10 2 10 9 8 18 -18 -31 5 16 -11 -5 32 0 15 18 14 -36 -21 25 -6 -22 -18 -5
5352 -5 -26 -18 10 10 -6 -16 14 -2 -3 -27 6 -10 -50 -27 5 -10 -14 13 39 -6 -7 24 21 -2 -39 1 -2 -19 -20 26 22 10 27 -3 -4 -20
$$ packed form
5101bK7mj9pknK1J2j0k8j2K7Rl9OM0roLJ8m0j0K9mj7J1K6Rn9L3Rl5J5J8J1rJ3
5138B0rJk7K8lJl1J1J0K0k6J6nj1PK3Qo0N2l0J2k9N3j2m2L9rj9K1J3j0k4k0M7
5172A5qm5L1L3k2j0K6pl1KmL4o2M2L5m7J1j6K9m0J6K4nj3L0Qo1J8J5K3l9L4j2
5205DK4m6LN9l1j2jQj0LJ3Lk1KRJk2J9Jj3lkK7p0K0M7jj8J1%j3MK5Lo3M1J9k5
5243enNlj3MMJ3qK5JLn0K6K9k4RJ1j3OPNm2J2J1L9n1KJ4Jk7ML4m8J2K7m7K5NM0
5282C8j9p5L2K9k2LM0j4lj9K1J6m7M0pj6n0L1M4qj1K1%l6J5MJk3j1M1j4j5M3m3
5316a4J6m3N3om3K2L3l0LRKk1K9qQjjJ0l6j3L6J1k7OL7l2J5Lmn0J5M6l1j6MJ3
5352ek1QK8%j6j0L0j6jk4L3j6m0K3L2j5mK7K6m5jL1lk3l7M0lj7jM6mj2J7l0jj6
$$ plain form
5388 -20 24 -7 6 10 10 -14 4 -4 6 -31 5 9 -14 3 12 30 -16 -30 17 5 -4 2 -3 -12 -26 2 1 -21 -22 11 12 -46 2 30 -10 -18 -21
5425 -21 -6 -26 -22 20 -1 -17 -10 25 19 -14 9 11 29 -12 30 17 16 -3 -4 9 19 10 4 -17 -1 1 0 -16 13 70 -29 -30 32 21 -15 12
5461 12 6 -3 -62 -17 30 -16 1 12 -8 -20 -25 4 4 -5 -18 18 -5 -29 -5 -6 -41 -32 -12 2 -29 -9 30 -19 -44 -14 4 0 15 40
5495 40 6 0 -6 9 18 -32 10 -11 -14 6 44 6 -35 -5 19 -8 -4 -4 29 17 -47 0 -11 -22 -7 -4 -37 -42 10 2 -40 -19 -13 -8 -15 8
5531 8 23 9 -22 1 19 16 -8 7 9 -52 13 8 1 -57 0 18 -17 -56 -18 12 -14 3 -23 -31 15 -24 8 -7 -11 34 -7 -26 7 29
5565 29 19 -16 -10 6 -59 10 47 -13 -26 25 45 -14 -23 21 11 -21 -13 -10 12 -46 9 29 -34 -26 -10 7 -39 9 -11 -8 -35 14 44
5598 44 0 8 19 34 -30 14 6 -8 -25 -3 -2 -33 -13 -9 -18 -29 12 19 4 -19 11 3 -1 0 -4 11 -37 27 23 27 -42 24 28 -29 -29 39 20
5635 20 -40 -13 2 -19 -34 2 24 -5 -27 4 -20 -25 -10 -5 11 -42 -20 20 2 -10 -9 -5 -5 0 -10 -12 -20 9 18 -20 -2 1 33 -32 2
$$ packed form
5388b0M4l1J3M%k4J8qJ0l7L6Mk3J7RJ8m6j4M7j2rOnrj4K8jk2jL3Jn8M8K8m0ql
5425b1J5k0MM2k1j6PL5ol3K3KJ8m1M2j3jj9jJ3J0rok1J6Kjj6K9N7r9jO2j1l6K7
5461A2orn9M5M7m6J7J1k0j2nK9%rj3L6k3k4K4jl5RK0J4l1K0L9m9k5L0J8mJ5K5
5495D0l4ooJ5Rn0M2k1lK0L8l8m1L0K4k7M%L3j2o4M7j1j1J5Ll3nN2qm2K1ONpK3
5531HJ5j4l1K3J8lk4J5Ko1O5npn8N7J8l5l9L8L0k6J7k6qM6l9L2j5mM5m1j9L3K2
5565B9j0l5OJ6o5O9L7o0j3N1K0n9rM4j0l2QLK2n8N5K0o3QJ6J7m6M8k0Lk7M9L0
5598D4m4QJ1J5o4M4qj4j7K2Jl1K0Mrj1M1Pj5k3L0qmJmJ5m8O4mMo9O6Mn7%O8j9
5635B0o0K7J5k1j5L6K2k9k2L1k4nJ5NJ6n3K2M0j8j2JM%Nj0kqK9Rl8J8LL2o5L4
$$ plain form
5670 2 3 -21 -16 -9 19 -1 11 -6 11 0 -12 0 14 -26 9 12 -15 -5 4 -6 -34 -4 9 17 -54 35 13 -11 -8 3 1 -40 -10 19 -4
5705 -4 -29 10 -9 -14 -24 0 -22 -23 -34 21 -8 0 -3 7 -16 -32 -16 7 -14 -14 -2 -6 -36 19 2 4 0 17 0 -8 3 14 5 -6 9 28
5741 28 -39 -19 11 -2 -8 1 -3 0 -47 20 17 -1 -35 11 10 -21 -13 -4 -23 -21 -13 13 -35 -21 5 -4 16 -36 0 7 -27 8 10 -23 -14 -3 -25
5778 -25 -7 16 12 -19 0 -10 -8 -15 0 0 -6 -29 21 9 -15 -20 -9 17 -32 -7 -3 44 29 -2 22 -8 -12 -5 5 -52 6 5 -11 -27 -11
5813 -11 16 -12 -34 -32 -2 -15 -42 11 22 -6 -45 -10 -8 -28 9 16 20 -14 6 8 -31 -23 8 -9 4 0 -7 -25 -14 12 -24 -6 -7 5 -3
5848 -3 -13 11 -6 -30 -28 -1 -18 -15 24 25 -12 -7 -1 -9 -6 -21 31 -3 -25 18 11 -26 -8 -33 4 -4 -7 -4 5 -17 -11 1 -1 -34 11 -8 -4 -19
5886 -19 -5 -30 -48 4 -44 2 -2 -14 9 10 5 -24 -42 -40 1 0 -20 14 14 7 -16 20 32 9 -6 1 -5 -9 -7 16 -13 -39 6 3 23 -6
5922 -6 -1 10 2 -30 -35 7 25 -5 5 10 15 27 -1 -33 -35 -28 14 -21 17 -13 -2 2 -27 -19 -36 20 -11 30 -6 -15 -34 -7 -42 24 21 -35
$$ packed form
5670BJk4NPK8k0J2j7J7j1j2J2J4m0L5Lk7J0Rj0k8L0J3Qp1Q9k2k4LJ1km1L0K9k3
5705dk5L9j9nj0K4k2jj1N5k9QlJ0k3j6J6K3k1%J2ml0N5j7KmJ7j7qJ1J1rj1J5J9
5741B8o7K0L0j3oRmLm7O7lj8l4M6jl1QRj9KQK6m8J4K6rK0n2L6Pl4L5Kl3RJ1k2
5778b5J8K3ml1J9j0KpJ5%ok3N0j2k4nJ1K6m9K5MM7j5l1K4l0mPJ0n7N8jj6j6J6
5813a1K7k8k2KL0j3k7N3J1k8l9L5Kk0L7PMl4K0Kl9QL1j7J3mpj8J1K6l6J8jJ2q
5848cj0K4j7k4KK7j7LL9Jl7NOqLj5N2l4k2M3pl7J8k5L7qlLRk2OJ2kl3M5j9Mj5
5886a9J4k5j8N2m8M6mj2K3Jnk9j8KM1jk0L4%pk3L6J2k3j5PomKK3k9k6M5lK0k9
5922fNJ1ql2nM2J8l0J0NNJ2k8l2kPM2l5L8l0J1Mk9Qj7N6l1M1l6rj9K7l5O6ln6
$$ plain form
5958 -35 -23 15 -6 13 4 -15 18 1 8 8 2 -6 -16 -19 -24 -17 -8 19 3 -9 -9 4 -3 -23 -8 15 -24 -18 29 -24 -43 7 -34 -7 -6 -35 21
5995 21 -24 -16 -4 -28 -30 -4 9 5 -31 15 -1 -10 1 -3 -23 -35 -13 -36 -4 -14 -17 -17 -12 6 -12 -23 -3 20 24 -11 -28 -8 36 -3 -9
6030 -9 -5 -34 -8 24 22 28 -12 -8 -9 7 4 1 -1 -19 14 30 5 -9 -17 -3 13 -37 -10 10 -20 -36 -20 -19 4 -19 9 14 -4 -9 -3 13 -30
6067 -30 -16 -33 -5 -24 3 2 9 -3 16 -18 -36 -12 14 -27 -24 -14 27 -18 -9 3 -12 0 18 -29 -14 21 30 -26 -21 -3 7 -12 -17 -17
6101 -17 26 -4 -28 -35 -14 -30 -1 22 5 0 6 0 -5 -33 -50 -9 -22 -3 -3 9 -5 -34 -9 -30 -14 -26 1 18 7 -18 -11 -10 -16 -7 5
6136 5 -2 2 32 15 -12 -17 -19 -25 -4 -6 -10 -27 11 -28 -32 -13 18 48 -6 -2 18 22 9 4 -4 -35 -11 18 40 24 -17 25 12 -2 -28 -37 -12
6173 -12 23 6 5 15 -21 -53 -56 -38 15 6 -8 14 20 -33 -36 -37 1 -46 16 16 4 1 7 14 -36 -50 4 32 -37 21 7 26 -5 -4 -33 -21
6209 -21 -28 -5 25 -16 3 -4 -15 -29 -11 15 11 2 40 0 15 -8 -21 -8 26 -13 8 28 30 -7 22 5 -8 -14 -10 -12 6 32 -17 -25 3
$$ packed form
5958c5J2L8k1J9rj9L3j7P%oqj0lnPRK7j6j2%J3pk0J5K3l9OM7n3j9N0m1K7Jk9N6
5995B1m5QJ2k4kK6J3ml6M6j6rJ1mk0j2K2k3L2j0l%NJ8j8j1K0K3Ml5j7K0M4l9o
6030iMk9K6L2kOm0MjJ6llkj8L3J6k5j4qJ4J6n0K7K0l0j6J6JK3k3K8Nj8nOJ6m3
6067c0J4j7K8j9K7jPj2J9l4j8K4K6m1LJ0M1m5RJ2j5J2J8m7J5L5Rn6NJ8J0j9n%
6101a7M3l0k4pK1j6K9K3j7nOonk8j7M1j3J9%J2j4k9K5k1J6j2K7J7j1k5PJoRJ2
6136EpML0j7k7nkoK1kmj7L8l9mJ9L1L0n4MK0Mj3nql1K4K9K2j6m1M2j3j4k6rK5
6173a2L5j7jJ0l6l2lJ8N3rj4K2On3ljL8m7O2%j2lOPn0j4N4K8o9N8j4J9l1Jk9J2
6209b1pK3L0m1J9pj1j4J8K6mrL8m0J5k3j3J3L4l9K1K0Kl7K9j7j3oMkJ8K6m9qK8
$$ plain form
6244 3 -19 -50 -4 12 15 3 15 3 -25 -30 -4 -12 -24 27 -4 27 16 -14 -5 -17 -5 4 40 -12 3 13 15 -7 -2 -9 11 13 -10 7 -8
6279 -8 -8 -23 -21 -28 17 17 -26 3 -5 -33 -13 3 -9 -31 2 13 6 -11 4 25 -25 -29 -11 -26 -6 -7 14 -3 -25 -41 -47 -22 -38 -8 0 2
6315 2 -11 -24 -10 14 4 -25 0 -11 -1 -2 6 20 26 14 20 3 4 -31 12 5 2 1 -12 35 20 -4 -1 18 -2 -22 3 -11 -1 -9 -24 13
6351 13 -24 -18 53 47 22 -11 11 9 -35 -14 11 4 -15 2 29 -29 -19 0 -18 -16 5 11 13 13 21 -17 -35 16 -13 -7 14 20 15 19 -24 -32 -1
6388 -1 -12 29 20 -1 34 14 11 -4 -10 -2 22 -23 38 18 -25 1 -10 7 -29 3 16 -5 -4 -15 -19 -18 -36 -28 32 -13 10 23 36 -23 -39
6423 -39 -25 1 -41 -9 53 18 17 3 -1 -18 -29 9 39 43 33 43 24 -20 -17 -39 -28 -11 30 2 -5 0 -5 -28 -10 3 -4 16 25 28 -4
6458 -4 -9 11 -1 -36 5 11 -4 11 13 -12 -29 -34 -55 -1 -11 29 22 20 8 -10 -8 -24 -3 -62 31 27 -5 9 -1 -36 -45 1 -21 3 -22
6493 -22 31 16 -3 -28 -35 -28 5 1 20 34 -21 16 -18 -27 -31 35 1 -9 24 24 -20 -19 -20 -47 -34 16 7 18 15 26 -4 -26 -11 4 3 -27
$$ packed form
6244Ck2l1M6J6Lj2J2j2k8nK6qj2N1l1L1j1l0Rj2J2RL6n2J5J0Kk2NpK0Kk3J7j5
6279h%j5KpM5%m3K9qk8K0J6j2k2L3J1pj7J5K1n0mJ8j5K0jK1j7k2j6oK5j6L0QK
6315Bj3j3J4K4j0k9K5j1J0jQJ4Oj2Oj7Jl5M3pljj3M7j5k4LJ9k0k0K5j4J0qj5L7
6351A3l7OP1ok5l3K2km4K1K5pj9J7K7n8J0J9j8KK1OK%Ql8j8N1k9OK1OnMm3qL1
6388aj1M1rk1L5k0lj5oQK4m5O1k0m3K6j1J7l6L2J3k1Jj1mJj8QO0m5K3J3J3n9j6
6423c9J4K6m2L2O2l5jj4mj7j1L8L0Mj0J0j9m4Lk2J1J7M1k8pNnk3J8J3pK0RLl2
6458dnK0j2l5M1Oj5J5Kk5j7nk1N4j0M0pkj2j8Kj6K1n9R3ml2J4j0l5rM6k2K4k5
6493b2N3j5j9k5pPL3mJ9J4n5L7l4rmO6l4j0L3%m4Jjk7J3N0rJ1lJ1l0k2J5J5jl0
$$ plain form
6529 -27 47 52 17 -27 -28 -15 -38 -13 6 -15 -16 15 20 -45 -40 -21 -7 -37 -26 -4 5 -3 -15 -4 -25 -16 9 0 4 -12 26 8 -34 -22 3
6564 3 -14 -19 35 23 -9 22 -9 -19 -1 14 -5 -12 -1 26 11 -34 -23 -8 -12 -29 22 6 -13 15 -26 -36 -28 -44 1 31 -29 10 51
6597 51 -13 -28 5 1 -9 -30 -3 -8 3 -4 14 1 -44 -6 -21 -38 -4 -8 3 -17 -17 -15 24 -27 7 24 -22 -21 1 33 -16 -11 47 1
6631 1 -24 4 -2 7 2 14 21 -4 -14 22 -24 -32 -19 -9 -21 -4 -22 -26 -15 -13 10 -11 -9 12 19 -32 -19 16 12 -49 -18 28 3 -22 -9 0
6667 0 -33 0 -9 3 4 -9 77 16 -34 -19 7 -39 -21 38 38 10 11 26 -18 -20 -15 33 -1 -6 34 28 -32 -30 7 -45 0 23 40 -11 -2 10
6703 10 -13 -35 -17 -2 -3 6 -1 17 -49 -33 -4 -32 -40 -41 15 -4 12 7 25 -36 -34 -13 20 -33 37 14 -12 -22 -5 16 -32 -14 7 43
6737 43 2 20 20 -10 -9 -29 -13 18 -2 44 40 -6 -18 16 -12 -17 10 51 5 -6 7 6 -38 -28 14 4 29 24 13 3 -17 1 -4 -33
6771 -33 12 2 -13 -35 9 23 -8 -52 -17 3 -20 -22 15 0 -51 -12 -15 -29 -38 -6 28 -5 5 25 -8 -48 -40 -9 -27 -11 23 19 -10
$$ packed form
6529b7P4Nl5m4jJ3k3K5J9k1jL1No5NJ9J4l0J1K2Rqj2J1k1RK5rMj6L8j8m2J2K5
6564Cj7nN4j2l2L1l1j0J8J5j9pJ1K7j5m5J1J5mj7N1j6j9K8m1j0Qj6M5L0o0L9M1
6597E1o4j5L3mj0k1K7nJ1pJ8j3m5L8j5j7L4mJ1k0%KL9n1L4J7m6JK2L2m9NN8m6
6631Ak5K8oRnJ2Pk5j0L6m6qJ3J0j2J7j8mJ1KK3k1KK1Pn1J3L5mo1L1M6k5k5J3R
6667@l3L3rJ2Jj3Q6o1n0J5K6m6J8N9%k8JJ5m4kNM8l4nM0oo0KL7n2M5K3J7n1RJ2
6703A0k3k2J8J5jRpJ8o6J6K9k8qjN6j9J6nJ8o1KK1L3n3P0k3k6j0J7K1m8J8K1L6
6737D3m1J8%l0Jk0J6L1k0M6mm6j2L4k8nK7M1m6j1J3jm4J0M2j0K5nj1j0k0J8nk9
6771c3M5j0j5k2M4J4l1m4L5K0k3kL7j5n1L9lj4rL2L4l3J0K0l3m0QL1j8J6L4mk9
$$ plain form
6804 -10 25 -37 -40 -14 -15 -10 -2 -4 40 6 -23 -52 0 -30 -17 2 15 -13 -4 -2 -29 -41 -7 0 -2 -2 18 29 -18 -4 8 -11 -16 -12 18 -5
6840 -5 -2 -13 26 -21 -8 6 -10 -27 28 28 0 -44 -16 -8 9 14 16 4 -24 23 28 -20 -26 -2 2 -19 -12 48 36 -12 11 12 -18 -30 23 -8
6876 -8 -25 -4 60 -36 -23 -1 8 14 -29 10 1 6 -14 16 -13 -35 -24 20 -26 -24 6 53 -9 -43 -6 -5 -1 -17 10 7 -16 -22 -9 9 -11
$$ packed form
6804a0L5o2lK6jNQkM4l4k9k9N2l0J3J9J3k8RKk7j2L4Pk%K0J1m7J4J2j9nML0k3
6840eLj1L9m7J3J4j6j7N5%k8m4K8QJ7NKj2k8M7Nm8oK4Mk1PO0j2m8K3Jl0j2N3l1
6876hj7K1O4r6J3K2ROm3L9rNk0L0k9k2J1M4m6KL0M7o2l4L7JMj6K7lk3oJ3J8k0
$$ [...]
8189hQm
8191d
##END NTUPLES=NMR FID
##END=
