##TITLE=1H_AM A510.CO2
 CDCl3, 8 sc, 
 29.7.2019
##JCAMPDX= 6.0         $$ Bruker NMR JCAMP-DX V2.0
##DATA TYPE= NMR FID
##DATA CLASS= NTUPLES
##ORIGIN= UXNMR, Bruker Analytische Messtechnik GmbH
##OWNER= root
$$ XWIN-NMR		Version 3.5
$$ Mon Jul 29 14:56:13 2019 Russian Standard Time (UT+4h)  she@DPX200
##.OBSERVE FREQUENCY= 200.13155
##.OBSERVE NUCLEUS= ^1H
##.DELAY= (6, 6)
##.ACQUISITION MODE= SIMULTANEOUS
##.ACQUISITION SCHEME= undefined
##.AVERAGES= 8
##.DIGITISER RES= 18
##SPECTROMETER/DATA SYSTEM= spect
##.PULSE SEQUENCE= zg30
##.SOLVENT NAME= D2O
##.SHIFT REFERENCE= (INTERNAL, D2O, 0, 15.7039)
##AUDIT TRAIL= $$ (NUMBER, WHEN, WHO, WHERE, WHAT)
$$ ##TITLE= Audit trail, XWIN-NMR		Version 3.5
$$ ##JCAMPDX= 5.01
$$ ##ORIGIN= Bruker BioSpin GmbH
$$ ##OWNER= she
$$ F:/spectra/data/she/nmr/H-F/1/audita.txt
$$ ##AUDIT TRAIL=  $$ (NUMBER, WHEN, WHO, WHERE, WHAT)
(   1,<2019-07-29 14:54:56.50 +0400>,<she>,<DPX200>,
      <created by zg, POWCHK disabled, PULCHK disabled
       configuration hash MD5:
       00 E9 B6 7A A2 85 ED C7 34 08 36 98 17 FE 4E 26
       data hash MD5: 16K
       C9 03 CD 30 CC 1F 3B A6 16 8F A8 78 C2 21 9C 2D>)
$$ ##END=
$$ 
$$ hash MD5
$$ 22 86 0F 92 67 E7 77 59 45 B3 2A AE 19 60 2A 71
##$RELAX= 
##$RELAX= 
##$RELAX= 
##$RELAX= 
##$RELAX= 
##$RELAX= 
$$ Bruker specific parameters
$$ --------------------------
##$DU= <F:/spectra>
##$EXPNO= 1
##$NAME= <H-F>
##$PROCNO= 1
##$TYPE= <nmr>
##$USER= <she>
##$AMP= (0..31)
100 100 100 100 100 100 100 100 100 100 100 100 100 100 100 100 100 100 
100 100 100 100 100 100 100 100 100 100 100 100 100 100 
##$AQSEQ= 0
##$AQ_mod= 1
##$AUNM= <au_zg>
##$AUTOPOS= <>
##$BF1= 200.13
##$BF2= 200.13
##$BF3= 200.13
##$BF4= 200.13
##$BF5= 200.13
##$BF6= 200.13
##$BF7= 200.13
##$BF8= 200.13
##$BYTORDA= 1
##$CFDGTYP= 0
##$CFRGTYP= 5
##$CHEMSTR= <none>
##$CNST= (0..31)
1 1 145 1 1 1 1 1 1 1 1 1 1 1 1 1 1 1 1 1 1 1 1 1 1 1 1 1 1 1 1 1 
##$CPDPRG= <>
##$CPDPRG1= <>
##$CPDPRG2= <>
##$CPDPRG3= <>
##$CPDPRG4= <mlev>
##$CPDPRG5= <mlev>
##$CPDPRG6= <mlev>
##$CPDPRG7= <mlev>
##$CPDPRG8= <mlev>
##$CPDPRGB= <>
##$CPDPRGT= <>
##$D= (0..31)
0 1.2 0 0 0 0 0 0 0 0 0 0.03 0 0 0 0 0 0 0 0 0 0 0 0 0 0 0 0 0 0 0 0 
##$DATE= 1564397695
##$DBL= (0..7)
120 120 120 120 120 120 120 120 
##$DBP= (0..7)
150 150 150 150 150 150 150 150 
##$DBP07= 0
##$DBPNAM0= <>
##$DBPNAM1= <>
##$DBPNAM2= <>
##$DBPNAM3= <>
##$DBPNAM4= <>
##$DBPNAM5= <>
##$DBPNAM6= <>
##$DBPNAM7= <>
##$DBPOAL= (0..7)
0.5 0.5 0.5 0.5 0.5 0.5 0.5 0.5 
##$DBPOFFS= (0..7)
0 0 0 0 0 0 0 0 
##$DE= 6
##$DECBNUC= <off>
##$DECIM= 24
##$DECNUC= <off>
##$DECSTAT= 4
##$DIGMOD= 1
##$DIGTYP= 9
##$DL= (0..7)
0 120 120 120 120 120 120 120 
##$DP= (0..7)
150 150 150 150 150 150 150 150 
##$DP07= 0
##$DPNAME0= <>
##$DPNAME1= <>
##$DPNAME2= <>
##$DPNAME3= <>
##$DPNAME4= <>
##$DPNAME5= <>
##$DPNAME6= <>
##$DPNAME7= <>
##$DPOAL= (0..7)
0.5 0.5 0.5 0.5 0.5 0.5 0.5 0.5 
##$DPOFFS= (0..7)
0 0 0 0 0 0 0 0 
##$DQDMODE= 0
##$DR= 18
##$DS= 0
##$DSLIST= <SSSSSSSSSSSSSSS>
##$DSPFIRM= 0
$$ [...]
##$SUBNAM2= <"">
##$SUBNAM3= <"">
##$SUBNAM4= <"">
##$SUBNAM5= <"">
##$SUBNAM6= <"">
##$SUBNAM7= <"">
##$SUBNAM8= <"">
##$SUBNAM9= <"">
##$SW= 24.9336996594482
##$SWIBOX= (0..15)
0 0 2 0 0 0 0 0 0 0 0 0 0 0 0 0 
##$SW_h= 4990.01996007984
##$TD= 16384
##$TD0= 1
##$TE= 0
##$TE2= 300
##$TE3= 300
##$TEG= 300
##$TL= (0..7)
0 120 120 120 120 120 120 120 
##$TP= (0..7)
150 150 150 150 150 150 150 150 
##$TP07= 0
##$TPNAME0= <>
##$TPNAME1= <>
##$TPNAME2= <>
##$TPNAME3= <>
##$TPNAME4= <>
##$TPNAME5= <>
##$TPNAME6= <>
##$TPNAME7= <>
##$TPOAL= (0..7)
0.5 0.5 0.5 0.5 0.5 0.5 0.5 0.5 
##$TPOFFS= (0..7)
0 0 0 0 0 0 0 0 
##$TUNHIN= 0
##$TUNHOUT= 0
##$TUNXOUT= 0
##$USERA1= <user>
##$USERA2= <user>
##$USERA3= <user>
##$USERA4= <user>
##$USERA5= <user>
##$V9= 5
##$VALIST= <valist>
##$VCLIST= <CCCCCCCCCCCCCCC>
##$VD= 0
##$VDLIST= <DDDDDDDDDDDDDDD>
##$VPLIST= <PPPPPPPPPPPPPPP>
##$VTLIST= <TTTTTTTTTTTTTTT>
##$WBST= 1024
##$WBSW= 4
##$XGAIN= (0..3)
0 0 0 0 
##$XL= 0
##$YL= 0
##$YMAX_a= 193527
##$YMIN_a= -167516
##$ZGOPTNS= <>
##$ZL1= 120
##$ZL2= 120
##$ZL3= 120
##$ZL4= 120
##$ABSF1= 10
##$ABSF2= 0
##$ABSG= 5
##$ABSL= 3
##$ALPHA= 0
##$AQORDER= 0
##$ASSFAC= 0
##$ASSFACI= 0
##$ASSFACX= 0
##$ASSWID= 0
##$AUNMP= <proc_1d>
##$AZFE= 0.1
##$AZFW= 0.1
##$BCFW= 1
##$BC_mod= 2
##$BYTORDP= 1
##$COROFFS= 0
##$CY= 11.3945322036743
##$DATMOD= 1
##$DC= 2
##$DFILT= <>
##$DTYPP= 0
##$F1P= 20.1537800932815
##$F2P= 0.134698688090026
##$FCOR= 0.5
##$FTSIZE= 0
##$FT_mod= 4
##$GAMMA= 1
##$GB= 0.15
##$INTBC= 1
##$INTSCL= 1
##$ISEN= 128
##$LB= 0.24
##$LEV0= 0
##$LPBIN= 0
##$MAXI= 10000
##$MC2= 0
##$MEAN= 0
##$ME_mod= 0
##$MI= 1.114404
##$NCOEF= 0
##$NC_proc= 0
##$NLEV= 6
##$NOISF1= 3.799351
##$NOISF2= 2.8
##$NSP= 1
##$NTH_PI= 0
##$NZP= 0
##$OFFSET= 15.70392
##$PC= 1
##$PHC0= -9129.948
##$PHC1= 12.00097
##$PH_mod= 1
##$PKNL= yes
##$PPARMOD= 0
##$PSCAL= 0
##$PSIGN= 0
##$REVERSE= no
##$SF= 200.130013532006
##$SI= 16384
##$SIGF1= 3
##$SIGF2= 2
##$SINO= 400
##$SIOLD= 16384
##$SREGLST= <1H.CDCl3>
##$SSB= 0
##$STSI= 0
##$STSR= 0
##$SW_p= 3612.71676300578
##$SYMM= 0
##$S_DEV= 0
##$TDeff= 0
##$TDoff= 0
##$TI= <>
##$TILT= no
##$TM1= 0
##$TM2= 0
##$TOPLEV= 0
##$USERP1= <user>
##$USERP2= <user>
##$USERP3= <user>
##$USERP4= <user>
##$USERP5= <user>
##$WDW= 1
##$XDIM= 8192
##$YMAX_p= 0
##$YMIN_p= 0
$$ End of Bruker specific parameters
$$ ---------------------------------
##NTUPLES= NMR FID
##VAR_NAME=  TIME,          FID/REAL,        FID/IMAG
##SYMBOL=    X,             R,               I
##VAR_TYPE=  INDEPENDENT,   DEPENDENT,       DEPENDENT
##VAR_FORM=  AFFN,          ASDF,            ASDF
##VAR_DIM=   8192,          8192,            8192
##UNITS=     SECONDS,       ARBITRARY UNITS, ARBITRARY UNITS
##FACTOR=    0.0002004,     1,               1
##FIRST=     0,             0,               0
##LAST=      1.6414764,     0,               0
##MIN=       0,             -167516,         0
##MAX=       1.6414764,     193527,          0
$$ Real data points
##PAGE= N=1
##DATA TABLE= (X++(R..R)), XYDATA
0@%%%%%%%%Qj5J5j6J6j6K4l2L5m3M9n7P0q0R1j06J23j40J59j81K06k32K59k91
32a54L29l67M08m56N07n62O23o91P65q47R38j039J151j277J418j579J769j987
50a051K243k553K937l423M058m934O220q293J2158k1692Q4385J23472k51783n6637
64a14893K16518R025k41255P948K08798j7203j60919O7182J33193q7283j13022
75i1911R0117O7717r3857k6626J13757J0549j11693j1483Q1027j7380p5033K4859
87c9957Q4356J2661m5128k1781J9788J7868l5490o3699K0046R7025N279r6333
99d5365J0908J15583k7236j42152K6495J42033l6233j25312O6209J15250r4721
110E459j09994J00066P4467j16353k7964J54685J4154j57048J3998J44681o9863
$$ plain form
0 0 0 0 0 0 0 0 0 0 8 -7 8 -8 8 -8 16 -16 19 -24 25 -32 38 -42 49 -57 66 -74 85 -96 110 -122 137 -154
32 -154 175 -192 216 -240 267 -295 328 -363 402 -445 493 -546 605 -672 746 -833 936 -1051
50 -1051 1192 -1361 1576 -1847 2211 -2723 3497 -4796 7362 -14330 70055 193527 -58256 -114893
64 -114893 101625 110650 -130605 -122657 86141 68938 -91981 -24799 108394 21111 -91911
75 -91911 -1794 65923 -27934 -54560 59197 69746 -41947 -53430 27597 10217 -64816 -39957
87 -39957 44399 57060 11932 -9849 9939 27807 -7683 -71382 -51336 45689 50968 -45365
99 -45365 -34457 81126 53890 -88262 -61767 80266 44033 -81279 -15070 100180 5459
110 5459 -104535 -4469 69998 -46355 -74319 80366 94520 -62528 -48530 96151 26288
121B6288j64582Q9015J63960r3699j30561J23986J17493j36842j07877J22781
131I962P4810j14830m1943J10011K2987r1624p219O0265j9058l8774L9985L0275
143C4847l5578n620L4777j9250m5905J5471L1799j4750q742K5010M474j3092P395
156A0836q550l2147J7912M4272l0120m6179N2834N1800p2313n7762Q0045N1364
168F1992q5306l4599R6328K4461r6681j3342Q2824j2027p5211L3350O7856m3032
180F613m5431N9115K3387p6955j0478Q1347n792p9247K5857P8916l8854p4249
192e5771M3619N9550m8353m1895N3005K8543m8261j3024L6662q943k9896K4953
204A89K2706l1398o470M0535q580n0059J3991M7142k1596l8327L3316L4811l5282
$$ plain form
121 26288 -138294 -49279 114681 20982 -109579 14407 131900 -4942 -112819 9962
131 9962 84772 -30058 -72001 38010 60997 -30627 -37846 22419 3361 -35413 4572 34847
143 34847 -731 -6351 28426 9176 -36729 -21258 10541 -4209 -12951 12059 16533 3441 10836
156 10836 2286 -29861 -11949 32323 2203 -43976 8858 60658 -11655 -69417 10628 61992
168 61992 -23314 -57913 38415 62876 -33805 -47147 35677 23650 -51561 -18211 49645 6613
180 6613 -38818 20297 43684 -33271 -43749 37598 31806 -47441 -21584 57332 18478 -55771
192 -55771 -12152 47398 -955 -42850 10155 38698 -9563 -22587 14075 5132 -24764 189
204 189 22895 -8503 -14973 25562 16982 -33077 -19086 28056 6460 -31867 1449 36260 978
217I78k6655L0298Q858l0781M442K9730j0882j8105K2434O951l5518l041L7974
230A6683l755l4562J6793L5959k2361l4048K0213K0160k4268q472K8585M328j9619
243d364Q233J0590k5366j0596K9788L026l1006J2503M0053j9018m2762K1097L3483
256B5661l1790k7927M0861K6443l8072j4346L6701k443m2990Q357L9886j3980
268F361k8090K9846K5836l8472k5178L5911J2406m0404l132M6722M322l9353J487
281a1738L1163j2236l2011J1629K7037p513j3529J2438Q335j4439q771O310J130
294b195l062N750O502j054j280j829o768k553L630j842p63J2858O984j4324o778
309f724J4090k208k4072L279K9683j566k5094J0829K6834j8948l2684J6711K6506
$$ plain form
217 978 -25677 4621 13479 -17302 -12860 16870 5988 -12117 10317 17268 -18250 -21291 16683
230 16683 12928 -21634 -4841 31118 8757 -25291 -5078 15082 -9186 -17658 10927 15255 -4364
243 -4364 3869 14459 -10907 -21503 8285 11311 -19695 -7192 32861 13843 -28919 -7822 25661
256 25661 -6129 -34056 6805 33248 -4824 -19170 17531 15088 -27902 -19545 20341 6361
268 6361 -21729 8117 33953 -4519 -29697 6214 18620 -21784 -24916 21806 26128 -13225 -11738
281 -11738 19425 7189 -24822 -13193 13844 6331 -7198 5240 13575 -864 -9635 -3325 -2195
294 -2195 -5257 493 6995 5941 4661 2832 -3936 -6489 -2859 -4701 -5464 7394 14378 54 -6724
309 -6724 7366 5158 -18914 -15635 14048 12482 -12612 -1783 25051 6103 -26581 -9870 16636
322A6636k0187j8265L0651J9731l1041j6601K7212M427l2678L43L5756K13k8266
335a2069Q357K5866j6925k9831J4213K4357j3950j5161K1955J6690k1410j7171
347a5079J4165P984j6582n061J9626R990j1786o141Q087j33j3493n014J1413Q821
361F797m178k862P673K408j3333r996Q842Q539p549k457J6199O763j7865j0318
375a1337J2370K058j7472J382K4780M213j9378o2J5942r667k3040P885K2298n568
389D404j3299J4538J4393j8563j8043J2495R886j4576l192K2305P807j8398o449
402f692J2189l284j7214L359J9119J637j0560M099R091r363j4775L275J0290j536
416c65l122Q817P517p701j0760M55L614l765k228Q976R180l530p735Q77J657q072
$$ plain form
322 16636 -3551 -21816 8835 28566 -2475 -19076 8136 12563 -20115 -19772 15984 16197 -12069
335 -12069 -3712 22154 5229 -24602 -10389 13968 18 -15143 6812 23502 2092 -15079
347 -15079 -914 7070 -9512 -14573 5053 15043 3257 -2884 5203 5070 -8423 -13437 -2024 6797
361 6797 2619 -243 7430 9838 -3495 -13491 -4649 3890 -3659 -6116 10083 16846 -1019 -11337
375 -11337 1033 3091 -14381 -12999 11781 15994 -3384 -3446 12496 2829 -20211 -12326 9972 4404
389 4404 -8895 5643 20036 1473 -16570 -4075 5811 -8765 -11957 10348 18155 -243 -6692
402 -6692 5497 2213 -15001 -11642 7477 9114 -1446 2653 11744 2381 -12394 -9119 1171 -365
416 -365 -3487 5330 12847 5146 -5614 -5159 -1545 -5310 -7538 1438 10618 7088 -647 230 1887 -6185
432f185o062Q945J0609k942m410O346J753j3354p882R932O686o874R06J3550K93
447A1311j5622l558R707k775j0766P722J6028l689j2054M552O487j1861r750J1854
461b414J0820p446l803J0796J357j4506m775J0086J690p562M110J1505k227j0538
475b907j12M576m563n013O563Q036k096m547J546R94n360l990L544N374M47j665
491H27J651J812l934o150N72N441P13k422L577M975m770p868K105N089m030k994
507e406Q478N601q042n024O834M75j0439M28J2744Q91j0015K512R225p007j1918
522a0663O681J0969o071o512R911N562j2159o550R494K556r216J926J2337r73
536G292j0466J363O054o541p240P656Q230m623l862N780J196q394l319N877L036
$$ plain form
432 -6185 -12247 -3302 7307 4365 -45 6301 8054 -5300 -13182 -3250 3436 -3438 -2532 11018 11311
447 11311 -4311 -7869 1838 -937 -11703 -3981 12047 8358 -3696 856 7343 -4518 -14268 -2414
461 -2414 8406 960 -2843 7953 9310 -5196 -9971 115 1805 -5757 -1647 9858 7631 -2907
475 -2907 -3019 1557 -3006 -8019 -1456 6580 4484 -63 1483 2477 -2883 -6873 -3329 2045 2492 827
491 827 2478 4290 356 -5794 -5222 219 932 -1490 2087 7062 2292 -5576 -3471 1618 -2412 -5406
507 -5406 3072 8673 631 -4393 2441 2916 -7523 -7095 5649 6540 -3475 -963 8262 1255 -10663
522 -10663 -3982 6987 916 -5596 4315 9877 -2282 -8832 662 3218 -5998 -4072 8265 7292
536 7292 -3174 -1811 4243 -2298 -9538 -1882 6348 1725 -2137 3643 4839 -3555 -6874 -997 2039
551B039k454P39L765k77m518l625l89K201K290N97J882M085o16p234l542L234
567a823k03l981M279Q813j760o939K777L449q644n501J0429O693q538k074J0953
582G930j714j6143n99J4495l72j0408P589J4190p935j4970M560P149j0183o117
596a2528J3498Q599q320k294Q595l243j2618J630J0153k430n833P197O316q940
610b18p934N425M046m881J47Q763L648m864m133j563k446j930K66J912N215N858
626G311r62n351n9J738n774m858O163O179l831k021N612j200r031P66Q347j617
642A412m588Q420O600j1437r355Q188L134j2566q82J7634N005j2694m22J1721
656A0170m971j5691K261J1762l057o699P685O406q353n074O917R64p010L197R352
$$ plain form
551 2039 -415 324 4089 3812 -706 -4331 -4720 -2519 -229 368 2250 6335 5719 -1515 -5057 -1823
567 -1823 -2026 -6007 -1728 7085 5325 -1614 1163 4612 -4032 -9533 896 7589 -949 -3023 7930
582 7930 6216 -9927 -10526 3969 3597 -6811 778 14968 7033 -7937 -3377 3772 -6411 -12528
596 -12528 970 9569 1249 -1045 7550 4307 -8311 -6681 3472 1042 -4791 2406 8722 -218
610 -218 -8152 -2727 1319 -3562 -3415 5348 8996 4132 -1 -1564 -4010 -5940 -5674 -3762 1453 7311
626 7311 6349 998 939 2677 -3097 -7955 -1792 4387 556 -1465 4147 2947 -6084 -5318 3029 1412
642 1412 -3176 5244 11844 407 -8948 -760 2374 -10192 -11074 6560 11565 -1129 -1551 10170
656 10170 5199 -10492 -8231 3531 474 -6225 1460 7866 -487 -5561 1356 2320 -4690 -1493 7859
671G859l246q524K972M277p600n829P589P237k499j429M392M36n357l505n94J46
687c675K418K259j517J99M676l13p212r03O860K92n945K047O165l568o697K266
703b648L194l754L38P349K79n961K555N027p543q091P262P098p953m319J1410
718D243N099j1274m573R634J716r386N6Q691j121o689K311L972m517k172O019
733B009J102n562J889O593l802p941L209O352m252n190N457N628m003m162K921
748B48K181k556j462R44L45Q37J167j904k034K713K160l706k105M535K298m378
764g17j907L612N40l125M13K126j361n21K864p60m027K052M633l668n450M950
780c46N938n560n846O007N435o246m606O108L558n688k346M903R86l884O71K866
$$ plain form
671 7859 4613 -3911 -939 3338 -4262 -10091 -2502 4735 2236 807 5199 5635 278 -3227 -3821 -3675
687 -3675 -1257 1002 -515 -316 4360 4047 -3165 -4068 2792 3084 -2861 -814 5351 1783 -4914 -2648
703 -2648 546 -3208 -2870 4479 4758 -1203 1352 6379 -1164 -9255 -1993 5105 -2848 -7167 4243
718 4243 9342 -1932 -6505 3129 4845 -4541 -4485 4206 3085 -3604 -1293 2679 -1838 -4010 2009
733 2009 3111 -2451 -562 6031 2229 -5712 -2503 3849 -403 -5593 -136 5492 1489 -2673 248
748 248 2429 -127 -1589 -645 -300 537 1704 -200 -2234 479 2639 -1067 -3172 1363 3661 -717
764 -717 -2624 988 1528 -1597 -1184 942 -419 -940 1924 1164 -2863 -811 3822 154 -5296 -346
780 -346 5592 32 -5814 193 5628 -618 -5224 884 4442 -1246 -3592 1311 2297 -1587 -916 1950
796A950k096j839L411P69m536j5N278n77n431J252N563j635n512J348M828j152
812A606l764J077K846n58j863J02N69J36K69n90j094R70J889j051k223Q62K300
829A483o25j846M13J375k66j015n40M4R84R41j178j368K087K496k270l308K027
846e66K984k694l367K807L553k314k650K633K453k246j787J746L89k050J14J625
862F30j098j352K180J609k371r83L430J227l971j686L465Q78m189j397L873J667
878A912k864n49L590J151k872j371J521o7k115l45J402J00m34J237J176q16o24
895C2J266L11k115q99J673K96k565q65K563J533j535l45K686J340k259j974R01
912D4M52k172j546J653K078j22l84J337J087j107j348L69J63j302p28R95J69j206
$$ plain form
796 1950 -146 -1985 1426 2195 -2341 -2356 2922 2345 -3086 -1834 3729 2094 -3418 -2070 2758 1606
812 1606 -2158 -1081 1765 1207 -656 -554 15 151 420 -170 -1264 -294 1595 544 -1679 -817 1483
829 1483 858 -988 -575 800 534 -481 -1021 -977 7 948 -230 -1598 489 2985 715 -2593 -566
846 -566 2418 -276 -3643 -836 2717 403 -2247 386 2839 593 -1194 552 941 -1109 -995 630
862 630 -468 -1820 360 1969 -402 -1385 2045 3272 -699 -2385 1080 1958 -2231 -3628 245 1912
878 1912 -952 -1501 2089 3240 368 -1003 518 451 -1664 -2009 -607 -507 -941 296 1472 656 32
895 32 1298 1609 -506 -1405 268 564 -2001 -2866 -303 1230 -305 -650 2036 3376 1117 -857 44
912 44 496 -1676 -3222 -1569 509 387 3 1340 2427 1320 -28 341 504 -798 -1526 -531 -362 -1568
930a568L74K132J83j517J051K619j112l416J13J981k073l130K178L969r12k225
946a353K708K739k839l183J915J382l098j419L160J209k735p4L146k3k503J205
962B37K850j567l093R72J556k400k030K335K423j019n31K335J045k200j775N00
978c62J90j078m11J072J028m2m91K23Q30Q7j061j03J058j35j760l20J215n89j542
997b191J404K554n61j499J583J161k857k088K172J095k706l19L663O73l127J53
1013h90K988r60l203J299K915j646k521J804J691k403j227K711J118k077J6K281
1029A896n02k487K40J411j065j231J667J439j050n40R83o8j231J3Q11k52l49M75
1047A60P4n08J46K32n92j5J010J19q39K88P04j035j086J065Q86j093k66J696P0
$$ plain form
930 -1568 -1194 938 1121 -396 655 3274 2162 -1254 -1141 840 -1233 -4363 -2185 1784 872 -1353
946 -1353 1355 4094 1255 -1928 -13 1369 -1729 -3148 12 1221 -1514 -1588 1558 1535 -968 237
962 237 3087 1520 -1573 -601 955 -1445 -3475 -1140 1283 264 -267 2068 3113 913 -862 -362
978 -362 -172 -1250 -1661 -589 439 397 -94 129 959 1046 -15 -118 940 805 -955 -1275 -60 -649 -2191
997 -2191 -787 1767 1206 -293 1290 2451 -406 -2494 -322 773 -1933 -2252 1411 2084 -1043 -890
1013 -890 2098 1138 -2065 -766 2149 503 -2018 -214 1477 -926 -2153 558 1676 -401 -385 1896
1029 1896 1394 -1093 -853 558 -507 -1738 -71 1368 318 -222 761 693 -538 -525 286 34 -315 160
1047 160 234 -274 -128 104 -488 -503 507 626 -213 75 779 -256 -1342 -277 609 -484 -750 946 1016
1066A016j781J62J530q85j602J345J556j336j064J797N45k273l67K290o8k020
1082a155P57J968j194j757J366J347j719r15J995N84j907pJ645n72j757R13J527
1099A119j001r40J316N61j532l70J339r3j237M15J129m92q12P53M16r62k52R09
1117B66K7o73L09M45n13l44N51N9m51K62M32m01j72O00j75p62K65P46n48n15J038
1138D46M27j301k54J439j08j589N09J602q69j533J300J400j686j239J914R38k088
1155f92m38K191P9k347K21K264n75k081R44J858j232j602J378J320j522j049J460
1172A77Q08j329n13J255K93j162k50J002K54p45l00O35L57n26m76M83O64o13q39
1191h25P65J029q62j079J039J106j349j069J697R61j977p88K195N73k397j86K495
$$ plain form
1066 1016 -765 -603 927 42 -1560 -215 1341 5 -1059 738 1283 -990 -1357 933 865 -1155
1082 -1155 -398 1570 376 -1381 -15 1332 -387 -1302 693 1277 -630 -637 1008 436 -1321 -408 1119
1099 1119 118 -822 494 1055 -477 -847 492 399 -838 -423 706 214 -598 155 571 -391 -643 266
1117 266 293 -380 -71 374 -139 -483 68 127 -324 -62 370 -31 -203 397 222 -540 -275 471 -77 -592 446
1138 446 873 -428 -682 757 649 -940 -431 1171 302 -1231 69 1469 -217 -1456 458 1396 -692
1155 -692 -1130 1061 1140 -1207 -986 1278 703 -1378 -434 1424 192 -1410 -32 1288 -234 -1283 177
1172 177 985 -344 -857 398 691 -471 -721 281 535 -210 -510 125 482 -44 -520 -37 627 14 -825
1191 -825 -60 969 107 -972 67 1173 -176 -1245 452 1413 -564 -1352 843 1416 -981 -1167 1328
1208A328k10k614N72K606r75k416J227K261j634j949J879J639k003j387K065J104
1224A493k075p66J948M23j824k35J730J64j554p8J316J13j162j69J027K14r39
1241c74l71J053N74j117p41J240Q46j468p89J720P53k039o59K288N07k529j68
1258a274K703j60k775N71K809j063k766J368K585j763k196K083J912k420j531
1273a917K535J139k562p70K468L55k287l6K124k39j917L49J656l99j203L34Q84
1290E14k78o91R6N45K06m63m46N05P13o47r13P91R88j051j004J503J045j841r52
1309a380K099O73k408l40K679l6k812M97K852r05k780J281K562j711k199K039
1325A11J813k305j391K325R09k296l08K184j05j968M49J566p60j227Q73Q21q95
$$ plain form
1208 1328 1118 -1496 -924 1682 707 -1709 -482 1779 145 -1804 75 1714 -289 -1676 389 1493
1224 1493 -582 -1348 600 1023 -801 -1036 694 858 -696 -774 542 655 -507 -676 351 565 -374
1241 -374 -745 308 882 -235 -976 264 1110 -358 -1147 573 1326 -713 -1372 916 1423 -1106 -1274
1258 -1274 1429 1269 -1506 -935 1874 811 -1955 -587 1998 235 -1961 122 2034 -386 -1917
1273 -1917 618 1757 -805 -1575 893 1248 -1039 -1075 1049 810 -1107 -758 898 499 -704 -370 514
1290 514 236 -455 -359 186 392 -71 -517 -12 701 54 -859 -68 920 -131 -1135 368 1413 -428 -1380
1309 -1380 719 1392 -1016 -1356 1323 1287 -1525 -1028 1824 919 -1861 -580 1982 271 -1928 111
1325 111 1924 -381 -1772 553 1462 -834 -1142 1042 937 -1031 -582 984 224 -1003 -130 691 -204
1342b04l56Q61L6o98K56K88l80Q4M88m99m90Q92L55j262n0J583k84j732P27J875
1362A490j215j824J523J608j968j131K287P96k452l51K497k71k463P96K295j276
1378C41j929J689J603k021j172K101O17k104j29J965k90j767O78J334q69p89J055
1395C13L77j134Q1Q90o52p71J000M02j160J92J519n61j455R46J144j521r18J810
1413E02M34k069J59K297n71k151J277K044j750j782K096J214k626r51K669M22
1429A214k550M23K735p09k318J094J770j708j572J647Q04j760j62J888n2j436
1445f92O70J222r95q30R82J65j418M9J035n43o36J279O90j113N9J448p20j790
1463a138P87J183j693j028K196R35k090q8K649k14k585O92K256j583k345J637
$$ plain form
1342 -204 -560 301 337 -361 -105 183 -197 -113 375 -124 -614 278 633 -629 -679 904 620 -1112 -385 1490
1362 1490 275 -1549 -26 1582 -386 -1517 770 1566 -886 -1237 1260 989 -1474 -678 1617 341
1378 341 -1588 101 1704 -317 -1489 612 1229 -875 -1004 961 671 -1096 -418 916 47 -742 313
1395 313 690 -444 -363 527 -125 -896 104 506 -654 -462 1057 496 -959 -13 1131 -390 -1308 502
1413 502 936 -1133 -974 1323 752 -1399 -122 1922 172 -1610 486 1700 -926 -1877 792 1214
1429 1214 -1336 -913 1822 1113 -1205 -111 1659 -49 -1621 26 830 -930 -1092 796 744 -692
1445 -692 -22 1200 205 -625 357 522 -896 -847 188 -355 -991 288 978 -135 -76 1372 652 -1138
1463 -1138 -351 832 -861 -1889 307 1242 -848 -936 1713 1499 -1086 -394 1862 279 -2066 -429
1479d29J711k157j141K704R62k276J05K549o18k650O34J741j585j667J761J390
1495A034j518l36J982K40j621J97J067r87j109P70L21j084J77J267k75n77J229
1512G77O67j339l99J094n92j821N89J470j003q87J900J235j741m08K009l23k472
1529a244L54J970j243j998J658J859j692r72K476Q81k336l79K105n56k506M92
1545a131J851j107j308J814J433j424n37J665n5j867O6J213q62j131R88Q69q85
1562d08j26J349m1r74M98P07j100p39Q56k3j275M61J498n11q41J258Q99j494p21
1581g27J401o3j884K59J788o56j440J287J481j389r50J743N44k007l60J720l55
1598C92j845P54J714q78j153J454R94j492o28J377p2j597K76J306n82r71J003
$$ plain form
1479 -429 1282 -875 -2016 688 1650 -626 -521 2028 1410 -1240 -606 1135 -450 -2117 -356 1034
1495 1034 -484 -820 1162 1402 -219 -22 1045 58 -1051 -281 40 -1044 -867 400 125 -452 777
1512 777 1444 105 -294 800 208 -1613 -1024 446 -557 -1444 456 1691 -50 -458 1551 1228 -1244
1529 -1244 -890 1080 -163 -2161 -503 1356 -336 -1308 1168 2049 -287 -666 1439 883 -1623 -1131
1545 -1131 720 -387 -1695 119 1552 128 -409 1256 1201 -666 -600 613 -249 -1380 -392 477 -408
1562 -408 -534 815 774 -200 298 1005 -95 -834 22 -1 -1276 -815 683 172 -669 589 1488 -6 -727
1581 -727 674 611 -1273 -1014 774 118 -1322 -35 1446 57 -893 850 1394 -613 -973 747 392
1598 392 -1453 -699 1015 137 -1016 438 1432 -60 -688 689 617 -980 -704 602 20 -951 52
1615E2P88j000l63J183p0j167L19Q71p52p41R11M62r90j6J183j52j056N23P88
1634G73r10p13J033L83j180J4J281k53j157O41J003r63q18J141M84j246j87J317
1652F43k23j187N16J153q06q95J001O14j238k75J255n3j207L88J140o43r01Q45
1670A27N75j059l40J139M3j044K57R59n34p61P07N44q99l18R26Jq84K93Q22n07
1690D7o24P35M43q53j82Q53j13r30L81P70n60n72P84M66q62j85R24j62r54L37
1710b57Q58n76o82P48N10q49k34R70K1r46K00Q16n03o69N65N22p36k65Q36R9p56
1731c28J56O71m24n56N13L88o92k08P75o9o69K98O56m45n25N58L56p01j68P27
1751C13k2q04K88P43m30n82O22M03p25k42P47Q7q60J81P81l47o19N01M58n78l33
$$ plain form
1615 52 840 -160 -523 660 590 -577 -258 613 -139 -880 31 493 -497 -513 670 518 -538 -15 773
1634 773 -137 -850 183 566 -614 -600 681 428 -729 -88 915 -48 -866 275 759 -487 -674 643
1652 643 420 -767 -251 902 96 -799 202 816 -422 -697 558 505 -702 -314 826 183 -718 127
1670 127 702 -357 -697 442 485 -559 -302 657 123 -638 69 613 -286 -604 322 323 -561 -268 554 47
1690 47 -577 158 601 -252 -434 419 306 -624 -243 527 -33 -605 179 645 -217 -402 522 360 -594 -257
1710 -257 601 25 -657 91 601 -248 -482 488 509 -437 -237 579 76 -593 -28 494 -242 -507 329 428 -328
1731 -328 -172 499 75 -481 32 420 -272 -480 295 226 -443 -145 511 66 -459 99 455 -246 -414 313
1751 313 291 -513 -225 518 88 -494 128 531 -194 -436 311 398 -462 -281 500 153 -466 35 493 -85 -418
1772d18O35J83o68j1O10k36m75M04L39m70k01N15J8m91J53M29l16l90M57K73n55
1793b15n8N54r9n86K76N26m35m40O27K55o68p0P17q1p58K50O47m12n19N62M12
1814D85o47k42O96R4p12J08O11k31n38L78L96m72k88N18J23m88N1M71j92l73K73
1835B1K60l99j19L97Pm45K27L68k98k87L46J61m51k9N43j61m82K56M41m13l35
1856c92N08K50n93p7O43j09o14K28N42l97m22N34L35n80j98N96J4n98J79M88k50
1877H7m22L70L13m40j76M46J6m78J59M35k42l57L40K26m32o7M67q1m67K68L94
1898C59l65k87M03J70n26j6N56j08n30K39M99m20l74N13K24n27j42O07n0n66J76
1919a65M92l19l82M56K51m45j44M93n9m85K39L96l10l16M42J01m51k3N28j44m89
$$ plain form
1772 -418 217 400 -268 -279 331 95 -380 24 363 -107 -308 207 225 -266 -113 316 0 -390 67 340 -215
1793 -215 -273 281 182 -404 -128 398 -37 -477 150 405 -263 -333 384 303 -455 -205 442 30 -489 73 485
1814 485 -162 -404 292 386 -326 -218 393 162 -376 2 398 -74 -362 156 279 -209 -158 313 121 -252 21
1835 21 281 -118 -237 160 167 -278 -51 317 19 -268 78 239 -212 -241 302 141 -341 -85 356 -57 -392
1856 -392 116 366 -227 -304 339 230 -384 -156 386 -11 -433 101 436 -144 -342 254 268 -330 -151 337 87
1877 87 -335 35 348 -92 -268 178 194 -284 -125 310 68 -289 51 277 -155 -222 245 164 -303 -35 359
1898 359 -6 -293 110 280 -246 -262 294 186 -344 -105 394 -26 -400 113 337 -190 -332 275 225 -341 -165
1919 -165 327 8 -374 82 333 -112 -256 237 178 -307 -68 328 18 -298 144 245 -206 -229 299 155 -334
1940c34L24L80m00k85M93J23n75RO23j68o02L34M87m32l93N87K43o69q0O56p8
1961B43o09K36N33l59m56M77L22n43j77O12l9n30J19N10k76m38M25K47m53j35
1981b91N60j36m34K65L74l58l02M78J06n22O1N69k35m96L58L99m85k71N85J47
2001C72o93M6O59k26o36L78N85n28m22O60K92p69j19P36q3p25K83O38l68n49N74
2022A05L90o42k09O11J1o37J68O08l22n07M63L03m95j71O01On64J96L82l40l49
2043c92M18K09n01M8N67j50m68L28L40n48l10O50R6o72J09P27l21o00M75N34o46
2064a07l68P87J66q58r0Q22j62q04M11Q50n21n83P30L47q46l09P59M5p84J59Q07
2085D51k68o05M59M85o04k98N93Q8n75L5M81k73l95L65L42l98QM58p3l98J05K71
$$ plain form
1940 -334 -10 370 -30 -315 178 301 -274 -265 358 190 -412 -78 409 -23 -416 171 414 -255 -335 321 243
1961 243 -366 -130 403 44 -412 65 387 -156 -333 279 240 -290 -171 339 63 -375 50 297 -156 -291
1981 -291 269 133 -301 -36 338 -20 -322 156 262 -260 -199 370 135 -361 -3 396 -89 -360 225 372
2001 372 -321 -275 384 158 -478 -100 485 -43 -465 195 487 -282 -401 335 252 -473 -190 448 80 -469 105
2022 105 495 -147 -356 255 266 -371 -203 405 83 -424 39 342 -153 -324 277 283 -281 -85 297 -43 -392
2043 -392 26 235 -266 -218 349 199 -269 59 399 -149 -459 191 287 -385 -276 451 130 -470 5 539 -107
2064 -107 -475 312 478 -380 -470 352 190 -614 -203 647 126 -457 273 620 -226 -535 224 269 -515 -356 451
2085 451 183 -422 37 522 -82 -380 213 301 -274 -239 242 -31 -426 -61 281 -117 -109 349 276 -122 -17 254
2107B54n12k24N12J86n31J34O75k66n89M42M28o44l77O88J83q11M4Q36j87p82
2127e41M35Q12n82n74O83L41r23k83Q24O6p97K55Q55k76o20M24M42o48m30O21
2147H4J63n89L9N82j50m61L02M21m02j87L99M5m90Q6L21k82k75M02K74m14O4N12
2169D44j95n69K52L23m28l40O33J93o41O5O73j53o78L20N90n03m89O06L33p27
2189b91j84P25N3o84J70P29k65o61M08M35n79l39N67K24n86K3O31j73m94K68L45
2210C22l82k61M51O8l77J8M07j74l37K51K89l64j12L94j1m25J12M11l07k74L60
2231E9K46m80q0M93n4n14K01M60k93m36M03L71m98j80M99R2n37N9M75k13l98K82
2253d3L79m13j90M29J03n07rM98j16l91K30L07k90k48L60R0l74ML56o4l13K51
$$ plain form
2107 254 -258 -482 30 216 -315 -181 494 228 -361 81 509 -135 -512 176 359 -452 -408 428 241 -541
2127 -541 -106 706 124 -450 233 574 -349 -632 192 258 -539 -284 571 295 -325 99 541 -107 -537 84
2147 84 247 -342 -303 279 129 -332 -30 391 -11 -198 201 246 -244 -158 163 -119 -394 8 282 -132 -68 444
2169 444 249 -320 -68 255 -173 -513 120 313 -328 -263 410 257 -421 -101 489 -14 -503 103 436 -291
2189 -291 -475 250 303 -381 -211 518 253 -408 0 435 -144 -483 84 308 -278 -255 376 203 -291 -23 322
2210 322 -60 -321 130 198 -179 -161 246 72 -265 -14 275 -89 -201 193 182 -243 -131 280 -27 -301 59
2231 59 305 -175 -255 238 184 -330 -129 331 38 -398 5 376 -122 -302 197 289 -248 -189 286 73 -325 -43
2253 -43 336 -77 -267 162 265 -242 -251 247 131 -260 -30 277 -13 -261 99 189 -185 -181 175 111 -202 49
2275D9J72l01j70L36P8l68N7L61j27l06J88K31l13j49M04L6l39R0L56k21l50J81
2297a05K76k78q3L67P8l47J0L01j73l40J67K98j81j32L00N4l20n6K76o5j90J40
2319cK23j79k33K27J4k54N9K76j4j31J34J54k86k19J61L7k13J23L31p4j73J80
2341A40N0k48j56K37L9k39K3K88j13k59J47K19j41q0K78J41k83j14J14j30k49
2362c36R1K60L0m0K43R9k40j20qm2j66P4J70qm3J08%p0rR9rm0M5Nj94r4K4j9l9
2391b29K13K17O5q5Nmk93j68Q2O1q2J36K57Mj80P4N2j20j10J40J06j75r3P9m7
2416i5j17O5K01P9k3J42J5j60j62r5m6o2Q6J55J14P9P5j04j08m1rp0o3J27K3m1
2442c5p8R8po4Q0J62M2j13j3j3k12j09O8N5M1J19J64L6j29n8L5j63r8N2J27k3
$$ plain form
2275 49 221 -80 -250 86 164 -204 -147 214 87 -219 -31 200 -113 -262 142 178 -161 -71 285 64 -286 -105
2297 -105 171 -107 -190 177 255 -92 -82 219 46 -294 -127 171 -10 -142 158 212 -108 -164 112 47 -143 -3
2319 -3 220 41 -192 35 49 -205 -146 130 116 -15 119 273 -13 -232 -71 -34 -247 -124 207 133 -40 140
2341 140 190 -58 -214 23 62 -177 -154 134 21 -238 -91 128 -13 -93 185 326 43 -71 43 -87 -336
2362 -336 -245 15 45 5 248 347 107 -13 -21 -63 -229 -155 15 7 -36 72 72 2 -7 92 83 43 88 93 -101 -195 -171 -190 -229
2391 -229 -16 201 266 181 186 182 -111 -279 -197 -136 -218 -82 175 179 -1 73 125 5 -105 35 141 -34 -127 -48 -95
2416 -95 -212 -147 54 133 110 252 267 107 -55 -150 -196 -258 -172 -17 97 176 251 147 39 -2 -11 -81 -144 -17 6 -35
2442 -35 -113 -15 -22 -86 -6 156 198 85 72 59 -153 -262 -194 -139 -98 21 185 221 92 34 69 -94 -192 -140 -13 -36
2468c6J6P9J8q3l0L5K5J3L6K2p2l5o8q1N0Q0R5L1O3pr8q3l4l1n1O8P7J04o3J2
2498E2K0p4p2OQ5k3l3N6P1j30q2R0L3n7J5P7J07j41m2O7o8r8O2P3O1m1L6Jo4l3
2528d6RK6K1J5pL8l0Qn7J3J7rm3P0L4m5m9L9P2r0qO6Pj30J8R0L0j42M3R9n3o0
2560e4M2J11j04p6P2R0j14n4O7L0r9NJ28O2r9j8O1m8j01QP7Mk2M6N6k2n4l5rL0
2590b0K4QM2N1o1q7j1M7l0k3J22J29j00j01L4%j66n3K01J15r9j8J48n8k50pJ88
2617B5p7m1J15J63j25j66R2Rj54j2J83J25r2J0O7j12j73j9J53M4k4J21L1m9j52
2642e8l2k0NL1J55P0loj43r6Mll6J38J82k8j08j7j5j02j54J89J41m9nJ55l5k90
2670a30p6J74j3r3J67K42j19k68Q8K5j82j03K68K01j10l8J12q4k33q0J85N5k9
$$ plain form
2468 -36 -20 59 77 -6 -36 -1 24 37 73 95 23 -12 -80 -161 -111 -31 64 95 158 151 53 -30 -64 -95 -146 -78 -1 103 40 52
2498 52 72 -2 -74 -68 17 -6 -39 17 88 -42 -124 -34 -1 -58 -43 34 141 0 -42 25 -43 -141 -79 -6 55 14 50 51 -13 -46
2528 -46 -37 -11 10 25 18 56 26 34 -23 -10 7 -2 -45 25 59 14 -35 4 76 -14 -22 44 51 -79 -61 29 59 -83 -40 59 6 -54
2560 -54 -12 99 -5 -81 -9 81 -33 -87 -20 10 -89 -84 44 106 7 -11 50 2 -99 -91 -14 -10 -32 14 70 48 -6 -41 -50 -20
2590 -20 4 12 54 105 44 -43 -54 -7 -37 -60 62 191 91 -10 24 24 -142 -195 6 121 22 4 152 94 -156 -163 25
2617 25 -52 -93 22 185 60 -106 -14 -5 -159 -171 12 137 45 55 122 10 -163 -182 -29 15 -9 112 143 94 -58
2642 -58 -90 -110 -105 -74 81 151 148 142 -1 -97 -93 -96 -132 6 188 160 52 35 20 -82 -236 -47 94 45 40 195 160 -130
2670 -130 -206 -32 -45 -138 29 271 152 -116 -28 -3 -185 -288 -20 181 71 33 145 61 -172 -252 -67 -12 -41
2693d1R6J76j35j60K2m4o7N0J50N4K3mo6j21m2J3nK8J98Q7j62KJ7j20j95J26K42
2720A22o9m8J41R5l18j46J67N3j44Q4L01p1k22K1J24k16j32K08J79j19n4J83k
2743A37k47q3J44Mp3J03K01p2j73K2M9j22pJ00O9k2M3j7q5l3L3qo6J23J39j19
2769D0o4Q2Jj88L2J50Jj21J19J06j45j29J15O8j96j7K67M2k40J8K34j59k30J40
2793g4K03j46j19J50J42j62j24J31K4j28K6J65n1j07P6O6j60j3J44j7r2J4J56
2816A04o9j09R1M2j12J5P6Rp8R8J6r8n4J62k0j67L9K17n4k44J17J80j74k06J92
2841b7J98j88j02K21k7j70M2J43j12j43J30J88j80p0J98K7k46l1J95oj39L3J52
2864H6jj13L7L0q3mN0l3j7J05O1k02JJ51l4j56J19J76j04j93J36P9j74n4J51K5
$$ plain form
2693 -41 55 231 96 -64 -42 -86 -153 -103 47 101 124 120 54 -67 -109 -96 -101 -73 125 212 50 52 69 -51 -246 -120 122
2720 122 53 5 146 241 -77 -223 -56 -3 -147 -63 238 167 -55 -34 90 -126 -258 -50 129 10 -44 139 137
2743 137 -110 -193 -49 -45 -118 -15 186 114 -59 -37 12 -110 -117 -17 52 30 73 56 -29 -62 -29 -37 -103 20 159 40
2769 40 -24 58 59 -129 -97 53 54 -67 52 158 13 -116 -1 67 -129 -146 121 163 -77 -59 175 16 -214 -74
2793 -74 129 -17 -136 14 156 -6 -130 1 25 -103 -77 88 37 -70 6 72 -88 -101 43 26 -66 -52 104
2816 104 35 -74 17 59 -53 -38 38 47 -31 67 83 -15 -69 93 73 -94 -55 162 108 -136 -19 161 -13 -219 -27
2841 -27 171 -17 -119 102 75 -95 -53 90 -22 -165 -35 153 -27 -97 101 128 -118 -149 46 40 -99 -66 86
2864 86 85 -28 9 39 -44 -48 2 -31 -48 57 118 -84 -83 68 34 -122 -3 173 69 -124 12 91 -83 -137 14 39
2890C9j42J34J64q8k42J79R2k45j41L01J38l10k1L41m3k70J3K07k9j58M1J18j25
2913d7r3O7M6r1R3J68o0j39J48M7j79j57J00J02j28P0J46Ol3j2jj08L4Q9j29q5
2939a46J79P7j88q7K07J00j93mK66j4k54k3J01r9k03K16J77j10l9K34J2k45l5
2962g1J67j69j97J45K55j44j55K04J15j72q5J87P4j53j3L8p8j26P0M9q9J81J70
2985B03n4j12M8N0k30r6J00P7j31J07J79l7r3P5O5j65l9J65k5k16L0K08j60k06
3009b57K00K56j48q7K19P4k85j71J53nj80P9K45J7j14J23O9k44m8J06L2j73O7
3032g2J53o6j68R2J29r1k2J16N9j07ojj34o4J36M9j05J07K29q6k25R0J20j77j66
3057b10K14R9j45l1K13l1k15M5J89p5j14J01Q4j88j13J79L8k11Q9K10Lj69M7J34
$$ plain form
2890 39 -103 31 195 107 -135 44 136 -109 -250 51 189 -121 -142 199 156 -114 -101 106 77 -81 -40 78 -47
2913 -47 -140 -73 -27 -118 -25 143 83 -56 92 139 -40 -197 -97 5 -123 -53 93 99 66 54 53 -55 -21 68 -61 -146
2939 -146 33 110 -78 -165 42 142 -51 -55 211 197 -57 -80 21 -78 -281 -65 112 2 -37 197 209 -36 -71
2962 -71 96 -73 -270 -125 130 -14 -169 35 150 -22 -107 80 154 1 -12 26 -52 -178 -108 -59 -148 33 203
2985 203 149 37 85 135 -95 -191 -91 -14 -145 -38 141 104 11 86 151 -14 -53 112 87 -129 -99 109 -51 -257
3009 -257 -57 199 51 -36 183 257 -28 -199 -46 -51 -231 -152 93 110 -4 119 188 -56 -104 2 34 -139 -72
3032 -72 81 15 -153 -61 68 -23 -45 71 130 23 17 16 -118 -182 -46 3 -102 5 234 148 -77 13 133 -44 -210
3057 -210 4 103 -42 -73 140 109 -106 -61 128 53 -61 40 124 -64 -177 2 40 -171 -82 128 131 -38 9 143
3081A43j85j17Q8J26j18J7J29j5j09L3L5p3l4J19Nj02L6R7q9j20J06Q3j10qJ50
3106H7J9j88oJ84j17j16J47J33j55n8K05k6j82m0J90k2j60Q7J78j46j11J17P3
3129I3j55k1J57k4j43N0J22j11p3J15O8j31l1J66n4j57Q9J07j08p1J41M6j00k7
3153e2J15m7j10R8M7r3j8Q0M5j52M1J88o8j75R6J02j08j37J51R0j63J0J41J6j70
3178g3O3R5p7j13J69M2j25l9J07J8j79O2J36l2j06Q8L9j02o6Q0J0j04N1J34p8
3203@q8J39K1j88J2J47k5j25Q6R5q0j02J12Q3j69L6J36J8j35J7P6o1j02J09O9
3228H1j08RJ12%j51K0P2n4m9R6L5p4j7N7K4j18K7J32r1n2Q0Pp8l6J02j8o4M1J03
3257H8p4j08J17J9j23KJ09J6q6K5J02j11p3O2P9n9o1J48Qj28LJ01j8j15P9M2m8
$$ plain form
3081 143 -42 -159 -71 55 -63 -46 83 68 -41 -8 27 -46 -80 39 44 -58 -22 75 -14 -134 -28 55 -55 -63 87
3106 87 106 -82 -88 96 -21 -137 10 143 -12 -70 135 109 -73 -113 77 55 -105 -18 160 14 -97 20 93
3129 93 -62 -83 74 50 -93 -43 79 -32 -105 10 78 -53 -84 82 28 -129 -40 67 -41 -112 29 75 -25 -52
3153 -52 63 16 -94 4 51 -42 -60 20 65 -87 -46 142 74 -101 -5 97 -11 -148 3 93 -70 -60 81 97 -73
3178 -73 -10 85 8 -105 64 106 -19 -58 49 67 -112 -50 86 54 -52 36 75 -27 -93 -13 -3 -107 -56 78 0
3203 0 -88 51 72 -116 -104 43 18 -107 -21 74 -6 -108 4 87 -82 -46 90 108 -27 -10 66 5 -97 12 81
3228 81 -27 -18 94 94 -57 -37 35 -19 -68 28 63 -11 -28 29 53 -65 -38 94 3 -49 31 38 -40 -76 26 8 -56 -15 88
3257 88 14 -94 23 42 -81 -79 30 46 -40 -15 87 -24 -97 -35 44 -15 -76 72 80 -48 -45 56 38 -77 2 44 -4
3284dl8P8M6j13j7R3m3j7J6P8n6p5J07J2j07OO8k0l5N6J3o7lK6Jr9O4R5m8p2N2
3315cN4j01jO6L4j15L4Q5m5p0L7Q0p9m6Q8N5j13rR8m5r1O7P6l8r3J02N4j21j4
3344e4P0Or0N9Q4n6o0O7nll7O1Lj23P3P0m3o3Q9l0l9JO9j5q1K5N8p2qQ6j8n8l7
3377g1O7L3r3N6P3p9m2O5M4j09LQ3j8p1L9O7m6p0N4M9m9m7R9Jo7oR9l1n6M4M0
3408F1j00j5R9J3j02J9N1l2m3O8K7o4l4P0j1l8L1M9l6l6RM8p8k9Q8J8q4M6P0j04
3438c9l9Q1Mo8J3O5L5j02K0O3k5q8Q1M2o8LQ0k5n5J5L4j3o7R7K7o0k2N3rq5K5
3469b7M7Jq2R1K9r3jM9lm6L8L4m0k5M2J0q4J1N2L5q0L0O0m3q0P9j6k6KM0L4q0
3501d2L5N0m0p0N4N8l5l7O2k8k6k3K8j9oN5K3m0n5Q8jn2J7N0J4p0L2L2p3J4LK7
$$ plain form
3284 -4 -42 36 82 -31 -48 45 2 -15 1 79 23 -52 55 67 -40 -34 34 14 -21 35 48 -19 -22 4 5 -94 -30 65 17 -55 -3
3315 -3 51 -50 -51 15 49 -66 -32 53 8 -62 -25 55 -24 -70 18 73 -40 -49 49 4 -87 -20 56 18 -75 27 81 -40 -54
3344 -54 16 22 -68 -9 75 19 -41 26 21 18 -19 42 45 -78 -5 65 22 -41 48 18 -21 -20 49 34 -47 -22 36 -36 -44 42 24 -34 -71
3377 -71 -4 29 -64 -8 65 -14 -56 9 53 -56 -53 30 12 -59 -20 47 1 -69 -15 34 -15 -62 37 38 -29 -35 64 33 -23 21 61
3408 61 -39 -54 45 58 -44 -25 26 -6 -49 19 46 -18 -52 18 7 -31 0 49 13 -23 -14 34 -44 -73 15 33 -51 -5 65 -39
3438 -39 -78 3 7 -61 -48 17 52 -50 -30 33 8 -80 1 43 -25 -22 58 33 -22 -7 27 14 -53 44 71 11 -11 42 33 -52 -27
3469 -27 20 21 -61 30 59 -34 -35 14 11 -35 3 37 -3 -28 14 24 -60 -49 3 38 -42 -12 48 5 -75 4 -12 -38 -36 4 38 -42
3501 -42 -7 43 3 -67 -13 45 10 -27 35 7 -19 -42 -14 -33 -39 16 39 -1 -56 32 31 -21 -4 46 60 -10 22 54 -19 -5 -2 25
3533B5q1M8N4m9k7M4K2r1qP0J8n2K4M0k4o1M7Ok1%L7L7m9n6P9o9MJ1P0l3j9NK3
3566B4n3qN0jo3L1N0n9K4K1pl0qN7om0M3Ro6OM0J2m2L4K2k6j5K6pm2KK1L0p6N1
3601DL7m6n5O1J9p1kP8J1r3K8P3o4m0O4L9o9J6M2j4p3L4L0l3j2L6M2m7mL2K1n8
3633a4J1M4n1L4k1K5l4NRKm5OP1k4n6O0Mn5%P5ol9KM1Km8j2L9m0%J0JJ1m1O1K
3669B9p3L0J2j1l3N6L8p8lN3j9nj6L2k7JL3k1n3O9K0j3m1N2J9p4j9O5Rm9KN3k7
3702A1k2LM3l3j8J1O1o8nL6l5m7M1K3k2j2N4orl5M5k5mOL1m1KL6l1k4M0Pn4KL7
3737bK8n2nL3L3o9K6L7n4l2P3Ll8mL6J3k8J2O0n5l7J8M7m8m3J08l8n0K1M3l2l5
3769c1L6K2j6j1K0l7POlj7j1M4J0l3k9M5Ml2j5Q3n2oL2J1p3M2J5Ro9N9M4k0n8
$$ plain form
3533 25 -56 -8 46 -3 -30 14 36 -55 -63 7 25 -27 -3 37 13 -48 -1 5 -16 -16 21 58 9 -47 32 -37 -33 -22 48 15 -4 1 24
3566 24 -29 -37 13 12 -51 -20 30 -29 -5 16 9 -21 -29 28 22 -18 25 34 -32 -26 14 26 -16 18 40 14 -1 25 18 -24 -22 -1 29 -47 4
3601 4 41 -5 -60 1 20 -51 -53 25 36 -57 -29 44 -20 -60 4 43 -26 -10 32 18 -55 -21 9 -24 -36 0 42 -5 -9 23 44 -14
3633 -14 -3 41 -10 24 3 28 -6 -1 8 10 -35 -29 42 18 -38 22 26 -29 -29 46 40 1 3 44 46 -2 -14 25 -15 -15 -5 -4 7 -34 27 29
3669 29 -44 -14 -2 -13 -46 10 48 -30 -33 20 1 -4 -20 12 -15 -14 19 -2 -55 14 34 21 -20 32 51 -23 -42 23 32 -17 -15 38 11
3702 11 -11 -8 35 2 -16 -5 56 -12 -17 19 -16 -63 -22 1 -21 -33 21 15 6 -29 16 -9 -13 -7 24 -17 -15 21 -10 -34 6 13 -41 -39 -2
3737 -2 26 -26 -31 2 35 -34 -8 29 -25 -57 16 19 -19 -23 13 26 -2 10 70 15 -22 -4 43 -5 -48 60 22 -28 -7 36 4 -31
3769 -31 5 27 11 0 20 -17 -10 -4 -7 -24 -35 9 19 -14 -43 2 6 -26 -41 42 -10 -16 16 27 -46 -4 11 20 -49 10 54 34 -24
3802b4RL5k4k2M4rlk0J5Mk8K1L8po1P1j0n0k3P1rn6M7K0m0K3L3l3k5k5L8J1l7
3835b6K4j4j3K5J1Mm6OJ7Qm2L5j3Rk9L8J2l2J5L3J7n5K4nj8m6P5rl6L5K5j8l0
3868a9k2M8j8K3oK0m3j2K9j9j0J3M2jj0jN4p5n8Q2l6j8j5P8l7J0L5l3l2oN0Ll3
3901a7J7qJ2m3L3J6k4j4N4l6k7JL1n2lP0k6L0PKj6l6N1J6l5j6JN6l7lM3k9l1j5
3935b8N4j1l0M0j5j0k2Ojj5J6N8Mn2K4pk7n4Q0Kk8J0J0J4m5%%J2kM1l0K8j2j8
3969hl6K3K6Rn2K1N9m4j2K7J7q2MP6nn1L6PJo5L4K6nj7M9K3o2l4K8J6Mk8N2J7
4003E4n4m4N2k8k7N4J9j9j7J3nn1OL7MqK9J0n5QKK0nOJ6k9J3L1k7l6lM9nn1O8
4038B7L3n1m5J6K9k7PPL1j5kL0l6l4L9L1o1K4RK5l7J0J8l2K1nJ6j5n5M4j5l1q
$$ plain form
3802 -24 -15 20 -4 -26 18 9 6 -14 1 5 -23 -2 36 29 -32 39 29 -21 -44 27 18 -38 9 29 -11 12 45 12 -13 -38 0 11 -26
3835 -26 -2 -16 -29 -4 7 11 -35 -29 -12 -4 -46 -11 -24 -15 -44 -6 6 -26 -11 22 39 -16 8 3 -15 -61 14 5 -31 4 29 11 -19
3868 -19 -41 7 -11 12 6 26 -17 -29 0 -19 -29 -16 26 25 15 14 68 -7 -65 17 -19 -37 -52 26 -11 -1 34 1 -31 -37 13 16 -17
3901 -17 0 -8 4 -39 -6 10 -14 -28 26 -10 -37 -36 -5 -57 -60 10 -16 14 21 23 7 -29 22 38 3 -13 -12 44 7 4 47 18 -13 -28
3935 -28 26 15 -15 25 10 0 -22 -16 -17 -32 -16 42 46 -6 18 11 -16 -70 10 12 -16 -6 4 18 -27 -27 -27 -15 -17 24 -6 22 10 -8
3969 -8 -44 -21 5 14 -38 -17 42 -2 -14 13 30 -52 -48 28 23 -28 8 15 16 -49 -15 11 6 -11 38 61 -1 -35 -7 9 13 -15 37 54
4003 54 0 -44 8 -20 -47 7 26 7 -10 3 -2 -53 -47 -10 -6 -14 15 25 -30 -22 -20 0 -5 1 17 -12 1 32 5 -31 -34 15 10 -41 27
4038 27 60 9 -36 -20 9 -18 -11 -4 27 12 10 40 4 -30 9 40 -21 3 12 37 0 10 28 -4 17 12 28 13 -42 2 -13 -44 -52
4071e2O8k4J8K8k0n9K2Qmk9M4L1l2k0L3pn1lQ4j2l7K1J0l5k2K3L0o2N1O6pn7l
4104AK0Lp5K1R0l9l3M3On5J3J3K0nMpj4j2j6Pk5J9M9j1kJ8l8n0N3J6l0QK2L1n7
4139a2l3O2lm8K4M2%o4N0k2Rp1N5N2k5m5P8Mq0ML6K6r5P4K7J9n6pOk1j4L5K3j9
4173A1j6M7j2j1l0j8J9L5l4lK6K2k6m6qM0k1RM2J3o7NK3Po0lR2k3n1K6N3o6n0
4206g5N1M1l9k0O1M6q3jM8k3m0oO8J7o7QMJ4l1MO5lk4J0M7p6lkL9lm3L3rKk7j2
4242b9L7Pnk3L0K2n7lM9oo0nN9jl7J5PRpQJ2k9j5%O1o3j6L7K3m6l6P0L3o7M6J7
4278C7l2poK0k4K4NK0j6m2M2j1l0J1j0M4J8m8J8k8K5k4l1M9L7m3jJ2K2n1k2O1
4310A9l0rJ1L2k0m2j1N7j1q6Q9J4ok0L6Jm7l7P0Qm3K3M5m3m1k3N2L2n8M2L2K7
$$ plain form
4071 -52 16 -8 10 38 18 -41 -19 -11 -15 -44 0 31 -1 -21 12 5 -46 -49 35 23 -14 7 17 -18 -40 -17 13 -49 2 68 61 4 1
4104 1 21 24 -51 -30 60 21 -12 31 37 -18 -5 8 28 23 27 20 6 -6 -22 -15 -40 -21 28 17 15 33 -5 -55 -2 14 -16 -8 14 45 -12
4139 -12 -45 17 14 -34 -10 32 32 -32 18 -4 5 -66 -11 41 16 -29 49 53 -27 -23 13 39 -56 18 45 64 8 1 7 -14 -28 7 30 11
4173 11 -5 42 30 19 -11 -29 -10 25 -9 -12 14 36 10 -36 -44 -4 -25 -16 26 39 -28 -23 0 7 -53 -56 36 13 -38 -12 41 -25 -75
4206 -75 -24 17 -22 -42 19 65 -18 -19 29 6 -34 -40 28 45 -22 -14 -10 4 -27 -23 42 39 15 25 72 -4 -7 -9 30 27 -16 17 8 10 -17 -29
4242 -29 8 15 10 -13 17 39 -18 -21 28 22 -38 -43 16 15 -22 -7 0 9 2 10 22 -7 -22 -22 39 -24 -40 -3 20 -26 -62 8 41 -26 20 37
4278 37 5 -2 -8 12 -12 12 17 37 21 -21 21 10 -20 -9 -19 25 43 -5 13 -15 10 -14 -45 4 41 -2 -3 9 31 -20 -42 19
4310 19 -11 -20 -9 23 3 -39 -50 7 -4 -90 -1 13 7 -13 23 24 -23 -60 10 18 -25 -2 43 0 -41 -64 -12 20 -38 4 36 63
4342F3n9J5j2k6MPQJ8j0j1kj1J4k4J4M4m4K5J8k3l4lK0K3l4K4N4j4o2k1O0j2m6
4375c7j2N4Km4M5k0j8j9M8L9k5m8L8rp0L2M6J6l8O6M4n1m4lqJ4l5J4O2k5PNnk5
4409dMK3J4j7m3K1m9K8j7JM5J1J9k6K3m6m4J3K5K6k8M9K1l6m2j0L6%j5L5Rm2k1
4442c7jj2j4N2L0J7K5Pk5m5k4l4L3J7qL5N4k3l5%j9j2M0J%L0n9l5J8POL3%L6j
4477E7l8j7m0j2nK0N4k6K7L0qq4%K6RMj1K8k8l2L5k6k9P9K8l3N7k8k7o2oj0N7
4510a1M5k5O6k2l2jp2M7l0N6L3k7lj4k2RpK7K1rj1K4l6k8rlJ3N1j1J8J9k1m2l6
4544d3K8m0K3O8jK0n8k2j0J1KnN9J7n2J1on8L7K2RnJ1K1k1n1rJ6J6RK2M7ro5l
4579ij8J1jJN5Pk0J9n0m6K6qL1JM0j7j9l1K2n2K9lM1pJ6j9m2j4LM7k2JP6j4l0
$$ plain form
4342 63 4 19 7 -19 -15 -8 0 18 8 -3 -5 -16 -2 -26 -12 32 -12 13 31 8 -26 -29 -9 14 -20 4 58 44 -18 -39 21 9 -37
4375 -37 -49 5 7 -37 8 -12 -30 -49 -1 38 13 -35 3 -6 -76 -44 2 18 -20 46 90 39 -5 -8 -16 -2 -37 -23 39 14 21 26 21 -4
4409 -4 0 23 37 20 -23 -2 -51 -23 -40 -39 6 17 36 10 33 -13 -57 -44 -19 7 -21 28 49 13 -29 -39 -3 -3 -18 17 26 -16 -37
4442 -37 -38 -50 -64 -12 18 35 60 67 42 -3 -27 -61 -28 -11 -19 16 70 47 12 12 -7 -19 21 22 22 52 -7 -42 -24 -17 -11 22 22 58 57
4477 57 19 2 -38 -50 -55 -35 19 -7 20 50 42 -42 -42 -16 -7 -3 -14 14 -14 -46 -11 -37 -66 13 41 8 65 37 10 -52 -58 -68 -11
4510 -11 34 9 75 53 21 20 -52 -5 -35 21 54 27 24 10 -12 -3 -10 17 38 29 18 42 6 -22 -31 -34 -21 30 19 37 56 35 -7 -43
4544 -43 -15 -55 -32 36 35 55 -3 -25 -35 -24 -22 -27 32 49 -3 8 2 -56 -19 3 12 7 18 39 18 -33 -42 -26 -10 -1 21 68 59 -6 -9
4579 -9 -27 -16 -17 -16 39 46 26 45 -5 -51 -25 -33 -2 -1 39 22 3 -28 -6 -58 -29 -32 9 2 18 -1 -43 -57 -54 -7 -29 -28 48 34 4
4614Dk1K3l0rLP5j1n2K1M4q0nN5K0oJ3qj9k3l6K9K9l1M8mqmpJ6n1J3jK3m3NK1
4650gL6o5K5l3M2JL7m1K1k0j1l3J9L5k8K4K8J1l7l1J4j0j1lN6k5lJK9m1j0N4J9
4683D3l8qK4Pm2j2M4NrqL3l0%oJ9l0k7N5J2l1j1J2j4j7J6RQj9J4olmnm1M4K9p
4720FpNL6n1k3J7M1o1K4L8j3k3k3N6Kr2P4M4o8j8O1j3Ql1N7%n5%N6k3p1O9Kj6
4754HMJ7J7n2OL9rk0Rj9Kk9M8om2L0nk6lJ9K6m5LL3Km0O6k9m5M6QK5o6K6J2j2
4790bk6PN6m9k1N6J5l2k5M0On2rL3M1l3K8kl0j9j1M9j8KK9j1j1KK1m1l3L8lL6
4824C1Mok1n9J4J5llO5j5m3kPk9lK9J1oNN1k4o1NN5rk7L8J8k9n3P3rm3J1M0J2
4860C9o3O1J6n7j0J6mJ5PL4k0p1L4Ok1J0M0Ml9J3J8m2n3M0K6j6OM1J1n8k3P0n5
$$ plain form
4614 4 -17 6 -24 -33 -30 45 34 -18 3 47 -33 -38 17 37 31 44 36 17 -6 -42 -13 16 -15 33 29 21 17 10 26 -25 -12 -13 10 -33 -28 -7
4650 -7 29 -36 -11 -44 -2 -1 36 -5 16 -4 -15 -48 -29 6 -22 2 30 41 4 -27 -13 -23 -34 -37 19 -6 -9 -8 21 -20 -30 24 43
4683 43 5 -3 21 28 -14 -26 18 23 14 6 39 9 9 3 22 -8 -35 20 32 1 -10 2 -12 -29 -13 -4 4 -15 -1 -7 -10 -14 -19 -60 -16 13 6
4720 6 -1 4 40 -11 -34 -17 24 -37 -13 25 12 -11 -34 22 24 -68 6 50 -18 -36 25 12 20 -11 46 46 -9 -9 47 24 -47 22 24 8
4754 8 12 29 46 -6 0 39 30 10 19 0 2 -27 21 15 -27 3 -2 -28 -31 -12 14 -31 -28 5 7 -33 33 4 -41 5 13 38 -28 -2 10 -2
4790 -2 -28 -21 35 -14 -35 21 36 4 -21 19 25 -27 -36 -3 38 5 33 31 1 -18 -29 20 2 4 33 22 11 13 34 -7 -40 -2 -5 31
4824 31 35 29 8 -51 -37 -22 -25 -28 37 22 -21 -23 -16 -45 -48 -19 -8 -14 -9 42 18 -43 -38 17 8 -19 19 37 8 -45 28 19 -24 -13 27 39
4860 39 -24 37 53 -4 -14 2 -2 13 20 54 34 -37 -3 3 -18 -8 32 36 -3 10 28 -14 -67 -27 -1 -17 -11 30 41 -17 -40 30 -25
4893b5m4R1J8k5m4QK6k6l1O9j5nj7O8p0l5J9L1NoN1Km3J7J3o1k7N5lK8j8J3Nm8
4927b4jL0m3J5O1J0m4jJ1n1nM4J0l7kO1l2l6kM4o7J8O9qk2o6O7Nn8j5Q4J2k5M
4961FL0k8p2M3K5l4L5J4K4k8j9K1lm9L9K1lj1JJ1o6OO0j8l1O5J6l8k3K1l2j8O
4994b9O8n9J4K7l9j9lL0K7l9K7O2o7l3K2nj3nN7J6o8L2J8l8m6M5K9k8j6O1nk6
5026cl2N4l9J3P5k8k8j4J2k6l4K4O3Ql0N0l0o6L7k1M4n4L5L6n0KoK2o5L1M3K7
5058E0q1M1N4j01oK5L0n5L5O1j4n8OOk1l7P7J0k2k8O9j8n4j3N6Lk0J9K0k7k3M1
5090B5l2KJL5Nq%kl1j2L1Ko8N9O0o4%qL4n3qO2j7l6J0M0k5o9O3M0k4k2J9Qn5L
5126c5O5m5l0L6N5l7m0L7Kl5jM6j3m0N6J4k1j0K5om7J1M7Mo5JO7m4oM5Rn6M0J2
$$ plain form
4893 -25 -69 22 40 15 -29 -21 5 -21 -52 17 2 -3 -20 48 -22 -57 -38 -7 -2 -8 43 45 2 19 32 -29 -56 -1 -4 24 6 19 24 -24
4927 -24 -25 5 -38 -23 38 48 4 3 14 -37 -42 2 12 -25 -27 34 2 -34 -36 8 -59 -41 28 20 -2 -68 -1 4 -54 -69 15 27 2 6
4961 6 36 8 -64 -21 4 -30 5 19 43 15 -4 17 14 -35 4 25 22 11 12 23 -43 -37 23 5 -26 39 55 17 -6 15 -17 -35 -29
4994 -29 39 -20 -6 21 -18 -37 -40 -10 17 -22 5 67 0 -33 -11 -16 -29 -34 23 39 -29 3 21 -17 -63 -18 11 -17 -33 28 23 -3
5026 -3 -35 19 -20 -7 68 40 12 -2 10 -16 -50 -26 37 45 15 65 35 -31 6 -15 29 -25 10 46 -4 -2 -8 14 -51 -20 23 50
5058 50 -31 10 64 -37 -43 -18 12 -43 -8 53 39 -19 -13 -7 -28 -65 12 22 0 -28 41 23 -31 -44 12 15 -5 14 34 7 -16 25
5090 25 -7 -5 -4 31 36 28 28 26 -5 -17 14 16 -52 7 67 3 3 -5 29 -24 -32 30 13 -23 -13 27 2 -67 -4 36 12 -10 9 17 -38 -35
5126 -35 30 -15 -45 -9 46 9 -31 6 8 -27 -28 18 5 -35 21 35 14 4 29 23 -24 -13 34 38 -27 -26 41 -3 -9 36 45 -11 29 41
5160D1j1m2J7M2n1m1L6P1q6K5N0m6r1N8N8k8l3M0Nm4k9P4Nl8mP9m9k7N6k9l7J6
5192a3N4l1k8%J8Ln3N8Ql9ML0pk3K7L9l3k6L8J2n0J3M3l5l5K0M7l3k8K1M7o5K
5225a5M5l3j7K7J2j8rj0J6k5K8K0j7ml5L1k1j2J1M1m2j3O6k1m0N5om8j8P0j8j6
5257a6j1M3k3pj4N8Rn8O7Ln5j3P3n2j9K1K3Qr2N5J0Lk7L5K8p4QL5mm5J6%qqJ3
5292a8L4o2O4L4o1l8N3nk6j8N8qm1J9RL1p0P1L6j01k7R6k9l4M1L7l1l3M8K1k4
5323B6l2J2J4m8LN1pm3M4Rlk2J6J0n9K2M8r8J3L3K4l5j5R1m6m0K1L7m3l7M1K6
5355A3j0m3R3m8m6L5J7K2n4J7Jl3j4P5k0k5QM5k8k7L3L2p8qM3J5l4mP4n2j5L7
5387B1J9k5m2M2J9o4L7Rjn0J7Q4o2LK4l1m1M5J3j5k4K2J8l0l7P1M5j38M1L4J7
$$ plain form
5160 41 30 -12 5 47 -4 -45 -9 62 -24 1 51 5 -86 -28 30 2 -31 9 14 -30 -59 15 20 -18 -22 57 8 -19 37 8 -29 -13
5192 -13 41 10 -18 -18 0 3 -50 8 16 -23 -19 11 4 -19 8 47 14 -12 26 38 -12 1 44 9 -26 -6 41 8 -20 1 48 -17 -15
5225 -15 30 -3 -20 7 19 1 -8 -18 -2 -27 1 21 4 0 -35 -4 -25 -37 -26 15 -27 -40 26 5 -35 20 14 -34 -52 18 0 -16
5257 -16 -27 16 -7 -14 -28 30 39 -19 48 51 -4 -17 56 4 -15 6 29 37 -55 0 10 13 -14 21 49 -25 -17 18 14 -31 -15 -15 -23 -31 -18
5292 -18 16 -46 18 52 -9 -47 6 1 -25 -43 15 7 -34 -15 -6 25 -45 26 62 -39 -66 30 1 -33 8 45 14 -19 29 50 26
5323 26 -6 6 20 -28 -25 26 19 -24 20 29 26 4 20 30 -29 -7 41 -57 -44 -11 13 -22 -37 54 8 -32 -11 26 -17 -54 -13 13
5355 13 3 -40 53 5 -41 -6 11 33 -21 -4 -3 -36 -50 25 5 -20 -12 33 5 -22 11 43 -35 -43 0 15 -19 -23 51 -1 -16 21
5387 21 40 15 -27 15 34 -30 7 16 15 -35 -18 66 4 7 31 0 -41 4 17 2 -22 0 18 -12 -49 22 67 -71 -30 4 21
5418B1n9LN4m8KL1K0n2k0R0j5n0QK9j4n5K6O5m5J9PJm2L9Kj8KJ4j8k9L6N6l6m0
5452a6K9J9l2j8K6J0m1MN8j8p9O4J5m1k0O2J4o9K7O9m7p2L6O7m8n7M3O8j01K7
5482b1L1%o6M4L3K4o5L2J6m2lL5Rn3L6L4k7l2N3j5om0M7l5QJ9Ok4l4P1Lp3L9N8
5516F2o1plL7k9n2P8k5k9M1L7n0l5K9K4m8j0L7J9m8j7P9l6l1K0O0n8j7M7K0l9
5547ek8N6Mo2J1O1m6J4J2ok8M0K6p4jM3J8m2KN4Kj09M4M7l0n1M3L7m1k1P2j6o9
5580d3K4M0j6l5PN9l8p8Q3K0o0J4O4qn5K4J7k1o9Q5Kqk9N2l5l3L6M4l8j1M3Nn6
5613a4J8N7m4j9L3Nl2j2J1qj3L7J6j3k9QO0n8l7N0nl9MM0j7j6lN5n6m3O5J6m5
5646b8nN7ql3kL5j6j0K5J6l5l5L6K9o4K2M8ol3NM5o1J2M2n3j1M2K5n1j6O2J6q3
$$ plain form
5418 21 -38 -35 19 -29 -27 4 24 -28 -48 42 27 -23 -15 14 0 -55 -29 36 -9 10 17 18 -24 15 17 -1 1 15 -3 -32 4 60 24 -16
5452 -16 13 32 0 -18 8 18 -23 -19 39 21 -58 6 21 -20 -40 22 36 -33 -6 63 16 -56 -20 47 -1 -58 -15 53 -48 -21
5482 -21 10 10 -56 -12 21 45 -20 12 28 -14 -17 18 27 -26 10 44 17 -15 38 23 17 -23 24 -11 -3 16 22 -2 -36 35 38 -35 4 62
5516 62 1 -6 -9 28 -1 -53 25 0 -29 12 49 -1 -36 -7 17 -31 -41 -4 15 -33 -50 29 -7 -38 -18 42 -16 -33 14 34 -5
5547 -5 -33 23 27 -35 -24 37 -9 5 17 11 -17 23 49 -25 -26 17 35 -7 -5 49 51 -58 -14 33 3 -48 -5 32 -9 -30 42 26 -43
5580 -43 -19 21 5 -30 -23 36 -2 -80 3 23 -37 -23 41 33 -22 2 19 -2 -71 14 16 8 -21 31 -4 -37 -1 43 5 -6 37 42 -14
5613 -14 4 61 17 -2 31 36 4 -8 3 -5 -18 19 35 22 -7 1 61 3 -34 16 11 -28 -24 16 -1 -17 -20 35 -21 -64 1 17 -28
5646 -28 -33 24 16 -17 -19 16 0 -10 15 31 -4 -39 -3 26 -38 -16 32 26 -7 -2 43 -18 -6 36 -17 -28 14 39 -12 -28 34 50 -33
5679c3L1M7l8m%N0o9kM9J3m8j6Q1k7p4K8N3n2k9L8K1m4%M1j7m4JP8l4o0N1K9n4
5712c4JN2lm3J5K7j3k7N7om4L3jl8rL5K3k0m5N8ok9J1L1Kk8pM9m7mK2J1qj6L9
5747C8Lq1M1M8k9m3L4J1j4m0N0j1o0K8N5k7m4L7J6k1l3K8%jk8O7m7J7j0N0l1j8
5779a5K5j4J1kJ7k5J2L8l6j9J1J2Rn4RM7Nl0N4j8n0j6L6Om0oN8k1m2O1j7lk7N3
5813B9on2J2J6Lk8K2L3k3p2N7L9k6j8K4k6j6N0J9rOj3j2k5oklK1J7j5J2J8Qj2
5847B2l5L0K2n8J3K0l8OJ2L2qj8NL2lm1l1N1k2j3J4P3q2qL6Ok8%J7j8j5K9Rj6
5881ej7K5j3k5K6J3l8L2J3l3J9j5J0qQNJ9j8J0J8j1j8nLMKK5j6pPK1j1m2M5K4
5916D7Kn6jN3k9n0M8RljM5o0ok7J4m3K2MM7j3mJ6rl9mL3NJ2k5JMoK9j3K3j5J6
$$ plain form
5679 -33 -2 45 7 3 3 53 -16 -18 31 44 -4 -20 61 34 -40 -12 41 -11 -40 -2 19 -25 -25 16 -1 -45 -44 34 0 -60 -9 20 -34
5712 -34 -33 19 16 -27 -12 15 2 -25 32 26 -18 15 14 -24 -33 2 25 5 -40 18 12 -17 -6 25 27 -1 -8 41 -6 -10 12 23 15 -1 38
5747 38 41 -40 1 49 20 -23 11 22 8 -32 18 7 -53 -25 30 3 -41 -4 12 -9 -42 -14 -14 -15 -43 24 -23 -6 -16 34 3 -15
5779 -15 10 -4 7 5 22 -3 9 47 11 -8 3 15 24 -30 -21 26 31 1 55 37 -13 -29 7 13 -27 -33 25 4 -38 23 6 3 -24 29
5813 29 23 -29 -17 -1 2 -26 -4 29 6 -66 -9 30 4 -14 10 -16 -32 18 37 28 34 21 9 -16 -22 -24 -27 -6 11 -4 8 26 34 22
5847 22 -13 17 39 -19 -6 14 -24 -18 -6 26 18 0 5 37 34 -7 -38 13 -9 -22 -8 65 -17 -25 11 17 -11 -11 6 -12 -27 2 11 -5
5881 -5 -22 3 -10 -35 -9 4 -34 -2 11 -22 -3 -18 -8 -16 -8 -3 16 -2 8 26 15 -3 -8 -5 -1 1 26 10 3 10 31 20 -22 23 47
5916 47 49 -7 -8 45 16 -34 14 23 20 19 64 4 -2 -29 -15 -58 -36 -32 15 2 -2 14 5 -34 -38 -5 0 12 -13 -12 -8 -14 15 2 25 10 26
5953B6nm0RoJ9l7L6j6K6OK4l3qJ8k4j9J4N6l6lk3K7K1n5OK1mJ4J0J2n3j4j0M7
5987Fm7J4K9J5j6J1j9K7o1nM9j6J4%J3l8j1L3k1jK9k3J1J0K1m9OK5k8MK9Rj3L
6021A0J0nk8MJ5Qk3oK1L0l8k3M4j1qj5M0j5l9L8Ql6j0M2m2K5j1J5K1m3Kj2M1n5
6055d6L2J3Ok3LNk4L1m7K9MK3L%qL0l9k4K1PJ6KLK1k5J0j5m3L0M8k0Qk3K0Lj4
6091A7n0K5L0m2J4OMj2J2Qm4K8nK9nj7J2j5k8jL8j5k6J8N7k7pLk5qL2k8oN0j4
6126Hl1nK8j3PLK4qk2j5L8qo6M0QPL0PJ0l4j2j6Rl1K5L3j1l1M8ok3J0j7J5KK6
6162B9j4jj3j7j1qP4l7J9j8K5m7m3J8J6PJ1J6Kj6Nm6P3m1K0K4l5J5Omj6l6%N3
6196A0Lj8O2k5l5l7L2Jk0O7Pj7%J2l3m3L4lJ8K0l0K9k2j6%j4KL0K2j1kJl0lk6
$$ plain form
5953 26 21 -19 -10 -16 3 -34 2 -14 12 18 42 9 1 19 -5 -24 -10 46 10 7 -16 11 32 -23 -17 4 0 14 24 36 -17 -31 -41 6
5987 6 -41 -27 2 17 1 12 -7 20 -41 -46 3 -13 1 1 14 -24 -35 -2 -23 -24 5 -18 -7 3 24 -25 -19 6 -22 -18 11 20 7 10
6021 10 20 15 -13 -9 6 14 -9 -15 6 36 -2 -25 19 8 0 -15 25 10 -29 9 17 -19 -29 13 -29 -4 -15 0 21 -22 -20 -32 9 -46
6055 -46 -14 -1 5 -18 -15 -10 -34 -3 -50 -21 -17 6 9 9 1 31 -8 -32 -11 -4 12 14 17 38 13 23 8 -35 -5 43 23 31 8 28 31 17
6091 17 -33 -8 22 -20 -6 0 4 -8 4 12 -32 -4 -9 20 15 -2 10 -5 -33 -34 4 -11 -37 -19 38 11 4 7 -18 -26 6 -22 -28 22 8
6126 8 -23 -28 0 -13 -6 -3 21 13 -9 -24 14 6 -60 -20 -12 -5 25 32 42 8 -4 -20 -11 -42 -17 16 5 -26 22 16 -7 3 -14 1 3 29
6162 29 15 14 1 -16 -27 -35 39 2 21 3 28 -19 -62 -44 -28 -21 -10 6 8 -8 -3 -49 24 -17 3 27 -8 7 13 9 -7 -43 -43 10
6196 10 13 -5 57 32 -3 -40 -8 -7 -27 40 47 30 30 42 9 -34 0 -3 15 35 5 34 12 -4 -4 -18 -16 14 36 25 23 24 -6 -9 -35
6231c5J1J2K5J2k1mj6MKo8P4LM9k6l9L4j2l3MJ5L2k7N5rok2k1PmK7J2Nk5noMk6
6268a8J8k6K5J0Pj5Jj4k5K7j8L5pmJnpj4O0m4m5L1L2Mj0j4K9n3J4J0L3k7m0M5
6302dM4m3k2N2Np0M9j3j5NL3Pj4l3K4k1K7j4JK6k7oK7pk7M5l8M1l5M4m8J1m6L5
6336gK1k5K8l5PK8Jn0k0N1k8J7K7Mm1j1K6J6l7mM4kolj9K0k7J7jOK4j2rj3LnJ6
6373Aj0k6M0NJ2KMk6lj3J3J5mK7rKj2k7k3L0J4j0j0L2Mlm3Lj4j1K0M3k0nj2J1
6409ck9kL2J0Kol0L3l3J2K6l2j5K9K8Qj0l3Rk4J2K1k5O4k3jj3J2j1j2j7J0L6j7
6443HM3j8k0pj3KJ1oK4J5n3L5j1l0qNL0JJ3lqlm5J6J8k5K1J6qj0k2j1J9J0K0K3
6479B9LpJ5l7lk6K4j7K7J4L5l0k2mJm8K8K0J4Rl5N6j7m9J8oK3J5MRk6Rl5ojJ7
$$ plain form
6231 -35 -24 -12 13 25 4 0 -16 -12 -10 -78 -4 -1 48 22 -17 17 5 -28 -24 -9 23 -4 51 42 36 14 -7 0 -4 23 35 40 15 10 4 8 -18
6268 -18 0 -26 -1 9 16 1 2 -12 -37 -10 -28 7 0 -4 -3 -8 -15 -29 31 -13 -58 -27 5 9 -1 -15 14 -39 -25 -15 18 -9 -49 -4
6302 -4 40 -3 -25 27 32 -38 11 -2 -17 -12 21 28 14 -19 5 -16 11 -3 -2 24 -3 -9 18 11 -16 29 -9 32 -3 41 -7 4 -42 -7
6336 -7 14 -11 17 -18 -11 17 18 -32 -52 -1 -29 -12 15 19 -22 -33 -7 9 -28 -32 12 10 4 1 -18 2 -25 -8 -9 -3 21 9 0 -13 -10 -15 1
6373 1 -9 -35 5 10 22 24 28 2 -1 -14 -1 14 10 37 28 30 18 -9 -32 -2 12 2 -8 24 28 25 -18 -15 -29 -40 -20 23 3 -2 -14 -3
6409 -3 -32 -34 -2 8 10 4 -26 7 -26 -14 12 -20 -35 -6 22 30 20 -13 -4 -28 -16 5 -20 44 21 20 7 19 8 -4 -21 -11 25 8
6443 8 51 33 13 6 -7 -5 6 0 24 39 -14 21 10 -20 -28 -23 7 8 21 18 10 7 -38 -22 -4 -29 -8 8 0 -10 -32 -43 -24 -14 6 29
6479 29 32 25 40 3 0 -26 -2 -19 8 22 57 27 5 1 2 -46 -18 2 16 25 -10 46 29 -20 -2 -8 15 30 34 43 17 26 -9 -15 -16 1
6515AnK1k4j1pjj0N3k2JJ4J8m0j4J5jj3OJ0Qj2L5j2jk3J1K7k4J3K2Jk7Lj8J8k1
6551iJ7M7m2k2J7K0l3qL6k2j3kL4j8j7J7MNl2K7J9j6JNm7K8J3k9l6N2Ll0OQjj8
6587c6L4k2L6l4K3oJ1k9%K0qj0J4J9l0j2K4J3j2J7J0nKk5L6l2j2K4J4j1Noj4j2
6621a4K1k2K2jJ0Ol6L9rk0nJml1M8rkl2K5J0Jj1J9J9n9K1%N5m9L4L3m7Qm0L3k0
6657fj6Q7n1j2Ojk1JNOOOOj5J8m1M0j2k5K8LolK2k7pK2l5M1l5j0M1l0lj4rK6Q
6695gpL8l2jJ2j8j3J7LoqN1j6k6J9J7k8l3M0kQJj2On0O2rNJ1K5l0l8RMJ9k8N4
6732C7j7k5L3m4Jk5J6N5m3pO9l1m2K1J0j0l8J7L6j9QJ6Kk0m3K9j2J8jM3m0j2J0
6765hprJM1qRJ7j7j6l4jL0J4K0rPkl4M3k5PRJ0l0QK5k7l2J0k0L1OJ8l4K0l3j8
$$ plain form
6515 1 -4 17 -7 -18 -25 -26 -36 17 -5 -4 10 28 -12 -26 -11 -12 -25 -19 -9 -1 -13 22 10 9 -14 -3 24 0 13 35 36 9 12 -6 12 -9
6551 -9 8 55 13 -9 8 28 -5 -13 23 1 -12 -14 20 2 -15 2 6 11 -21 6 25 9 10 15 -32 -4 9 -20 -56 -4 -1 -31 -25 -17 -18 -36
6587 -36 -2 -24 12 -22 1 -5 6 -23 -23 -3 -11 -21 -7 12 -18 -30 -6 7 -5 12 22 17 19 -6 30 -2 -14 10 24 13 18 12 -2 -14
6621 -14 7 -15 7 6 16 22 -14 25 16 -4 -9 -8 -12 -43 5 -4 -6 -38 -13 -3 -2 -13 6 25 -34 -13 -13 42 -7 27 60 13 21 -19 14 -6
6657 -6 -22 65 14 2 8 7 -14 -13 -8 -2 4 10 16 1 19 -22 18 6 -19 9 12 6 3 25 -2 -9 13 -22 19 -16 -26 15 -15 -18 -32 -41 -15 -7
6695 -7 -14 24 -8 -9 3 -15 -28 -11 -8 -14 -22 29 13 -13 6 23 -5 -38 2 0 8 9 -3 3 -47 15 6 11 22 47 17 -21 -12 -8 11 -17 37
6732 37 20 -5 28 -16 -15 -40 -24 31 -12 -19 50 19 -23 -2 8 -2 -40 -23 13 -6 2 18 20 0 -43 -14 -26 -8 -9 34 -6 -18 -8
6765 -8 -15 -24 -23 18 10 19 36 19 3 -31 -32 -2 12 32 23 30 28 -6 37 12 19 28 38 8 16 41 14 -18 -8 -28 3 9 27 -7 13 -20 -38
6802c8J4j2K2O1o0oK5Pn6J7J4Mj6MPK6j2j5J5PjnkK1Qn3K8k2MjL3k5M3Jpj6k1
6839gk0K3OJ4j3K1m5K3OJ2Kol5J6M1j5m2J1L4m0J4nL9n1K3ok6JJ5k9K5PkrJ4k4
6875b8L3l1O%qM1RjJ8n3K1KoJ5%j0j9L5Moj8qJ5J6l5J3nj1K3K5m5MJ7NLk5J7j2
6913AmJ8k8j0K9j8K5l9L3L4k8k2J2JOk4j3lL9ll0J4j1J0RmL5k6ll1J9L4l5mMK9
6949A6l3mL4k3J5k0K1okK4Qj8qmKJ1j5%K4j3ol1oL1j2%k3N3nm7M1QJ0rl5J0PJ1
6987FRk1j2kJ2rl4M9loqQnOnK0j1J8j6L3j1k7K9j0m2O8k0m8K9lK8Nrk3J4%J6J6
7025D1l4J7m6L2j0l8N3k9nJ2JRJj4j5L5rqK2j2n4K5PL0k0k3K4OJ2j1k4J9Pk0L
7060a6K4J6k2J4jm0M9j1j4ONJ6m6K4J3j0K1pnJ6j5MJ0l8M6l1k8K8k5J6K1k0j0
$$ plain form
6802 -38 -24 -36 -14 47 -13 -19 6 13 -43 -26 -12 -8 -24 -20 -13 13 1 -14 1 8 7 2 0 21 29 -24 4 -18 -14 -15 18 -7 36 37 30 14 -7
6839 -7 -27 -4 2 16 3 24 -21 2 8 20 22 16 -19 -3 38 23 -19 -8 26 -14 0 -5 34 -17 6 0 -26 -25 -10 -39 -14 -7 -9 -18 -4 -28
6875 -28 5 -26 -20 -20 -28 13 22 21 39 -14 7 9 3 18 18 8 -11 24 28 22 4 -4 11 27 -8 5 0 -11 12 37 -8 -4 13 18 21 -4 13 1
6913 1 -3 15 -13 -23 6 -12 13 -26 7 41 13 -9 3 4 10 -14 -27 -30 9 6 -24 -10 -21 -11 -2 -6 29 3 0 -31 -12 22 -13 -17 -13 16
6949 16 -17 -21 13 -10 5 -15 6 0 -2 22 30 12 4 0 2 13 -2 -2 22 9 3 -28 -34 -3 -15 -15 -38 15 10 -37 4 12 22 13 -22 -12 -5 6
6987 6 15 -6 -18 -20 -8 -17 -51 -2 -5 -11 -19 -11 -16 -10 -15 5 -6 12 -4 29 18 -9 20 10 -32 36 16 -32 -3 -6 22 27 18 -5 9 9 25 41
7025 41 7 24 -22 10 0 -38 15 -14 -19 -7 -6 3 4 -10 -25 10 1 -7 15 3 -51 -26 -19 11 -9 -32 -8 -2 10 -1 -25 -6 1 -19 -16
7060 -16 8 24 2 16 15 -25 24 13 -1 5 10 26 -20 4 17 7 28 21 16 32 17 21 31 -7 39 8 -20 8 -17 -1 20 0 -10
7093a0MJ5%k6J4K7l7J8J0o5K4K2QL6l3qqk8K7J1J9j5K6Jl2Pj6L1j5J7l5L4kk3
7127bQn0N7j8RnJ0j2N1k6m9K7oqQJ6K0j3l4N3m7J3%k9K7j5M2k5j8K1jk8PK8nk0
7163a4K3J7k9J2k7Oj7PN1m5kL7j7k7K8k5M7k3pKJ4J0j0jj0L1m5K5QMk0M8n6K6
7197B1jm5L2j6j4J6j2NK5J4j9L3n5J4O5p8QpL3j2j3J3Mk4J6l5L2j3K0k9K1j9k
7230b2K4lm0L2JnJ1J3j8k9L3K0l1l0M9Kj8OJ8K1ol4O1k8pj6J1K6l6J1kj9kJlj3
7266b2K9lRk4nL2j3j1J2k3J8k0L8m4MjJ4j6j9N9q%j8K7l5J5kK6k0jL1k9l0K1J7
7301Hk5M1jm9M0l1J3j1K8j2KkqK9l2mJ9J4j3j1J2j9k9L3J5j4j2J0J1j9JNkj4K4
7336cJ7j9K1k1K9rm5M4qj4J7Nk9J6PPj7K7l7kJ1nJ6oK6jj3opK6qj6%RpOqJ5k1
$$ plain form
7093 -10 -6 9 9 -17 -3 24 -13 5 15 -50 -26 -4 4 40 7 -1 -9 -37 -10 1 20 5 31 32 0 7 -9 22 7 24 -11 23 21 -2
7127 -2 6 -44 13 -5 4 -1 9 -3 48 22 -27 0 -6 -14 -6 10 30 17 -17 36 -11 2 2 -27 0 -15 27 2 -16 5 4 -24 -17 11 6 -14
7163 -14 9 26 -3 9 -18 -12 -29 -22 29 -16 -18 19 2 -25 3 -22 25 2 -5 -3 11 21 11 10 0 31 -14 11 19 23 3 51 -5 21
7197 21 20 -25 7 -9 -23 -7 -19 -14 11 25 6 39 -16 -2 63 -15 -7 -14 19 7 -6 7 11 -13 3 -32 0 -13 7 -22 -1 -20 -22
7230 -22 2 -1 -41 -9 -8 -13 -2 11 -7 -36 -3 17 -14 -44 5 7 -11 -5 13 34 28 -6 55 27 20 4 15 41 5 16 14 -5 -7 -6 -9 -22
7266 -22 7 4 13 -11 -16 16 3 -8 4 -19 -1 -21 17 -27 -23 -24 -10 -26 -45 14 6 6 -12 15 -20 -5 -7 19 -1 -2 29 0 -30 -9 8
7301 8 -17 24 23 -26 14 -17 -4 -15 13 1 3 1 -7 22 -10 -14 5 19 6 -5 7 -12 -41 -8 7 -7 -19 -9 2 -17 -16 -11 -13 -27 -3
7336 -3 14 -5 16 -5 24 15 -30 14 6 -8 9 14 -15 1 8 15 -2 25 -12 -14 -3 -8 8 2 28 27 14 8 1 27 19 3 3 12 5 11 3 18 -3
7375cJ9j7K1j7j0J0j0kJKj2L0k4j3lMM9l5%K6k7PMqkoJ3Okl6J8JPJ1Mk8J5J8k8
7414a7J7K4k3QL5l0k3J0k0qK9K0Nm0J9K2k6j7K9nMj0QnJ4j9jlk5K9l2K0J7j8Q
7449dlj2OJ1J4j5Qk2LL0m1KK8Njnl2L3Olk3J3MK4nk9PJ5kk1J8m4M4J5jpL9l7J0
7488B8l1OJ0jL3o1J6RJ2m4K6RkokjkPj4pK7k0J0j1K4k0l2kPL0ML1n4L9j6JJ0k4
7526a1j0J8J6k5j4J4OrJ7rRJ8nK1m4JK3mMMNj1qKK2n2K5L3m4K1j9J6LNK9m0Op
7564Fj4J0m3P6k7m6M0k0KK6JPk0k7J8J8k9jJ4KK7ml7K2NJNj5M3o2J2LJ6j7j1M
7600a5O1k0Qj8RJk8kJ0j5jL4j6Jok3N1n7J2K0Rrj1J1j9j8M4Kl8L0l2j3J1L8j9
7635hK6j4k7L8l6M8k9Oj1K1Qm1KK9j0J4j6K0j8LpJ6J1j1Nk0%OLj8NJ0K2l8K8j2
$$ plain form
7375 -3 16 -1 20 3 -7 3 -7 -9 -8 -6 -18 12 -12 -25 -28 -24 25 -10 -10 16 -11 -4 0 -8 -10 -16 -3 3 1 -35 -17 -16 -9 2 6 -22 -7 11 -17
7414 -17 0 24 1 9 44 14 -9 1 -19 -27 2 22 27 -13 6 28 2 -15 14 9 13 3 11 6 20 1 0 -3 -28 1 -31 -11 6 -12 -4
7449 -4 -7 -19 -13 -2 12 -3 5 -17 -14 16 -25 -23 5 10 9 4 -28 5 11 8 -15 -2 2 26 21 -8 -1 14 12 -9 9 -35 9 24 23 16 55 18 28
7488 28 -3 3 13 12 45 -16 0 9 21 -23 3 12 10 4 2 1 -1 6 -8 -15 12 -8 2 -9 15 -5 -37 -39 -32 -2 2 33 -21 18 2 3 13 -11
7526 -11 -21 -3 13 -12 -26 -12 -6 -15 2 -7 2 20 15 36 -8 -7 16 12 16 20 25 14 6 8 30 -22 3 36 -8 13 -6 10 13 18 47 7 13 6
7564 6 -8 2 -41 35 8 -38 2 -18 -16 10 11 18 -2 -29 -11 7 -22 -23 -9 -7 20 16 -21 1 6 7 12 -3 40 -22 -10 -7 9 -8 -19 -15
7600 -15 46 26 34 16 25 26 -2 -4 6 -9 -10 24 8 9 3 -20 31 -26 -14 6 15 6 -5 6 -13 -31 13 15 -23 7 -25 -38 -27 11 -8
7635 -8 18 4 -23 15 -21 27 -2 4 -7 14 22 -19 -17 12 2 16 0 20 2 5 -2 14 25 14 19 -1 -1 5 8 -10 -5 5 27 -11 17 5
7671ErmpN2l9pM7j4m0M4o0L3j6J8oj2K1m1M6j1QRl4J5J1K0l2pj0K0J7k4Nj8L3
7706A3Oj2oJ3J2k6M2m3J9k3L8k2j9RJ9lK5l0j9K1j2%Qk6lL8l3LK0m3N6m7K3j2
7740a4PM5o4jK9J8k9kJ3%j2jOK8k1OlJ1K9m4j4J3JRPj1QJ2j6LK1k6k5K5j5L1q
7777A6Ok0K0m9L5JJ2Ol0J5mlk7JK1Rk4%J2k1Pj3J1J1JqJ6j3J6qlJ5rNj0OpmJ7
7816FPl0QNL9j7NPl3K6k1%k1L3j1Ql1J7RJ3l3j0L2MKj6NQJ0k0Mj1J5Qk3j1QJ5
7854Fj8J8k3j7J5JRoKLj0OrlJ3j1PJ4nK4j2K2k9k3K2j9N2m2J9J7J6k7pJLrJ9m
7892A5lLlJ3om0N9k8Jj5j5J2rK9lm8M5j8K4j3Pm7M8rk6mJ1K5k0L1j4j7L0l1KJ
7928a3rK4J1Qk5J1Jl8J0K2jJ2l0L7l5L0k9L8l7J0K3nJ1j2Kj7M1k3qqJ4l1M4n2
$$ plain form
7671 5 -4 -8 -15 37 -2 -9 38 24 -16 28 -32 1 -15 3 -3 -15 6 -35 11 0 8 17 -17 -2 9 29 -3 -10 -20 0 17 -7 -2 -20 13
7706 13 19 7 1 14 26 0 42 -1 18 -5 33 11 -8 1 20 17 42 12 -7 14 2 2 10 -16 -19 19 -14 -11 9 -34 22 -25 -2 -14
7740 -14 -7 38 -26 -27 2 20 -9 -11 2 2 -10 -11 -5 23 2 8 5 16 45 1 -13 0 1 10 17 6 14 26 10 13 34 8 -17 8 -7 24 16
7777 16 22 2 22 -27 8 9 21 27 -3 12 8 5 -22 -21 0 9 -15 -15 -3 -24 -17 -30 -19 -8 -7 -15 1 -12 4 -4 -7 8 -1 4 -6 0 -7 -11 6
7816 6 13 -17 -9 -4 35 18 23 30 -3 23 2 2 -19 14 3 11 -20 -3 6 19 -14 -24 8 12 14 -2 3 11 21 1 5 -6 9 17 -6 -17 -9 6
7854 6 -12 6 -17 -34 -19 -18 -9 -15 -13 -10 -20 -14 -23 -26 -13 -24 -17 -3 -8 16 4 26 -3 -26 -4 -23 29 -13 6 23 39 12 5 6 9 0 19 15
7892 15 12 15 12 25 19 -21 38 10 11 -4 -19 -7 -16 13 10 -38 7 -11 13 0 7 -40 8 -1 -27 -31 -20 5 -15 16 2 -15 15 -16 -14 -13
7928 -13 -22 2 13 21 -4 7 8 -30 -20 2 1 13 -17 20 -15 15 -14 24 -13 -3 20 15 26 14 16 -1 40 17 9 1 15 -16 28 -24
7962b4%M3j8PMj6nj1J6kJ0pLJ2m0K4KK8n0lK7JK5j2j3K6l5j2M8l4L6m1nL4Pm2
7998a7J6NK3k4K3nKk1L0m2M7k4nJ5J1%n0J8K0pj8j1J4KJ3Nj9Qj9J3rnoK4k9j9
8034d1M4j8MJJ3%%oRj5K5ok2K6j8nK6l6K1%J5j4Mj5kJ8J0j0J6k7J6k9L8kK8k2
8070B6Ok3J9l2JRj4L9l5L1%nm6K9KlL2m4j1k0K2L1k0Rk2J9k4J5J3Ook8OJ1j2J9
8106@JK1k8k9L7J8rPj4J5l2K0On%oM4J0j5o0J6Ojj0J8pjQK3m0K2m3K9j5mJ5j8
8143b1J0jK2k4J9j3LnL2j0nJ2j5nj5rLN1l6Ml9M3K1j7l8O0m4L6Mn9L8j9LL3ql5
8179b4L9j6MQJ8j1Pql6N3k5O
$$ plain form
7962 -24 -24 19 1 8 12 -4 -9 -20 -4 -6 4 -3 0 12 -28 -4 -2 26 -24 -27 0 1 26 14 1 27 -8 -20 28 -6 30 -11 -16 18 25 -17
7998 -17 -1 4 27 3 26 21 23 2 32 -10 37 13 8 23 34 34 -16 2 22 15 -3 -14 0 2 15 20 1 9 -10 3 -6 -11 -17 7 -22 -41
8034 -41 3 -15 -11 -10 3 3 3 -3 6 -9 16 10 -12 14 -4 -9 17 -19 2 2 17 3 7 -8 -10 8 18 8 24 -3 13 -16 22 20 48 26
8070 26 32 9 28 -4 -3 6 -8 31 -4 27 27 22 -24 5 7 4 36 -8 -19 -39 -17 14 -6 3 -19 0 -24 -9 4 10 4 -24 -18 -7 -19 0
8106 0 1 22 -6 -35 2 20 11 18 4 19 -13 7 13 8 8 2 46 56 41 -19 -3 3 2 -8 10 3 2 10 33 -7 15 -28 1 -14 -18 -3 -21
8143 -21 -11 -12 10 -14 5 -8 -5 -10 22 12 7 19 4 -1 -16 -25 -22 29 -7 -3 -42 1 22 5 -33 27 -17 19 23 -36 2 -17 -14 19 11 -24
8179 -24 15 -1 3 11 29 18 25 17 -19 34 9 15
8191A5
$$ Imaginary data points
##PAGE= N=2
##DATA TABLE= (X++(I..I)), XYDATA
0@%%%%%%%%Qj6J6j7K5l3M1m9N7p2Q8j04J21j39J63j87K12k45K81l21L64m13M67
31B47n26N90o59P37q23R16j019J131j252J389j541J704j884K089k316K569k857
48a505L184l562M004m527N160n945O944q266J0113j2895J7612k7633Q2798j11548
62d6066j21450K46079J6030k18857l598K39800j3094j77714L7193J47862q5420
73B0765j22421Q6626R4763r2487m3148J01516J5771j19328j1422R5959J018p3074
85d5462K9388Q2793o903p0239k3235K4684J5615k7451l5981L3456Q6915l452r7019
98c6891j187J02410k2209j30969K7331J45621k8715j34142M9292J18476q2960
109F057j14120R9468R7072j03809m8340J36275J8125j62096n894J47678m2799
$$ plain form
0 0 0 0 0 0 0 0 0 0 8 -8 8 -9 16 -17 24 -25 32 -40 48 -56 65 -74 89 -98 114 -131 150 -171 193 -220 247
31 247 -279 311 -348 389 -434 482 -537 594 -658 731 -810 894 -990 1099 -1217 1352 -1505
48 -1505 1679 -1883 2121 -2406 2754 -3191 3753 -4513 5600 -7295 10317 -17316 65482 -46066
62 -46066 -167516 78563 94593 -124264 -127862 111938 98844 -78870 -41677 106185 20765
73 20765 -101656 -15030 79733 -12754 -55902 45614 61385 -57943 -69365 26594 27612 -45462
85 -45462 -16074 66719 59816 -10423 -33658 -8974 6641 -20810 -56791 -23335 63580 60128 -36891
98 -36891 -38078 64332 42123 -88846 -61515 84106 55391 -78751 -29459 89017 6057
109 6057 -108063 -8595 88477 -15332 -63672 72603 90728 -71368 -77262 70416 27617
120B7617j52342Q5529J70631q8573j47515J07303J20553j35331j15407J30773
130C238R3376j17303n6705J13266L1064j03088j5890P6520m640m6906L2366L4830
142D0128m0117k0637L2379r817m1363J9987M2778j2316j8336K0915N140k2383
154c642j210J096j9847J4332M0476k2429m5331M0870M8306o3888n5606P7540N6653
167F7320q2009m3097R0743K8312r8985k0470R0203J833p7691K4650P3033l8540
179A5302n8110M9765L2967o9120j6492Q0824L337q0324J6100P9003l3711p7716
191e8175M1720O7972m5605n0363N1241L4760n2094k1755M2471K231l2442J8482
203a557K7265k8644j5486L5238k243m6278J2004N0359j6733m2349K7864L6142
$$ plain form
120 27617 -124725 -39196 131435 42862 -104653 2650 123203 -12128 -127535 3238
130 3238 96614 -20689 -77394 35872 66936 -36152 -52042 24478 19838 -27068 5298 40128
142 40128 11 -20626 11753 1936 -39427 -19440 23338 11022 -7314 13601 18741 -3642
154 -3642 -4852 -3756 -23603 -9271 31205 8776 -36555 4315 52621 -11267 -66873 10667 67320
167 67320 -14689 -57786 32957 61269 -37716 -58186 32017 33850 -43841 -19191 53842 15302
179 15302 -42808 6957 39924 -29196 -45688 35136 38473 -41851 -25751 53252 19541 -58175
191 -58175 -16455 51517 5912 -44451 6790 41550 -10544 -32299 10172 12403 -20039 -1557
203 -1557 25708 -2936 -18422 16816 14573 -31705 -19701 30658 13925 -28424 -560 35582
215C5582l5978l2227L2661J8276k9843q34L1463p767k4814J5668J1595k9750m545
228b0513L8306P43l6079J0233L4673k1200l6496K1339K8027k1132j2921K7617
240A2597O359k5523K91J3715j7604j0301K9249Q614k9504M890L5078j7337m3218
253c2694J9393L8770k5480k9482L7741K7632m0490k2027L6120N207l9762O762
265a8310M3517r893l3733K1385K5468l6256k6752L7478J9846l6749o054M4826
277B4773L371m4536k995L4034p530l1108J3554L1207q779k0251R108R333j4931
290d750q988J0866O016l197L639M960m502n327j755l636l92O468K097r70P788
305H317L405j4982q659J3108K263j8233M185K8547j482k7689N008K4480j6330
$$ plain form
215 35582 -396 -32623 38 18314 -11529 -12363 19100 11333 -13481 2187 13782 -15968 -20513
228 -20513 17793 18536 -17543 -7310 27363 6163 -30333 -8994 19033 -2099 -15020 12597
240 12597 18956 -6567 -6276 7439 -10165 -20466 8783 17397 -12107 -7217 27861 10524 -32694
253 -32694 -13301 25469 -11 -29493 8248 35880 -4610 -26637 9483 14690 -25072 -18310
265 -18310 25207 15314 -18419 2966 28434 -7822 -34574 2904 22750 -13999 -20053 24773
277 24773 28144 -16392 -19387 14647 7117 -23991 -10437 20770 11991 -8260 848 10181 -4750
290 -4750 -13738 -2872 3144 -53 3586 8546 4044 -1283 -3038 -6674 -7066 -598 1499 529 8317
305 8317 11722 -3260 -11919 1189 3452 -14781 -10596 17951 16469 -11220 -6212 18268 1938
318A938l0515J8401L1200j6819k1317K5782J8263l2483j9755K8376J0683k8988
330a5234m36L5672M85l2617K886K5578j3843k8202J6535K8724j2709j8890J7891
343E840J4701k3448j8349J7357J3064j4101m787J9331P622j6524r497Q311J970
356A490j0682j243J4004Q287p176o408M432J010j1519o362J2039J0903o623m809
370b657J1546L351j8766j0012J4731P014j3235J424K2338J460k3310l973J6058
383E969n516j9134J0276K4573n381j7476R267J2225j8316j7296J5700J5240j1818
396a687n007J9072M925k2003q886J4099J497j3720N014J9822j23j5215q8Q014
410E714q105j2316P126J4047p15n649N024M087r981j0568L551P795o71j267P490
$$ plain form
318 1938 -28577 -10176 21024 4205 -17112 8670 26933 -5550 -25305 3071 13754 -15234
330 -15234 -15670 20002 20487 -12130 -9244 16334 2491 -25711 -9176 19548 6839 -12051 5840
343 5840 20541 -2907 -21256 -3899 9165 -4936 -9723 9608 17230 706 -8791 -480 1490
356 1490 -9192 -10435 3569 11856 4680 -1728 2704 3714 -7805 -14167 -2128 8775 2152 -2657
370 -2657 8889 12240 -6526 -16538 -1807 5207 -8028 -6604 15734 17194 -6116 -10089 5969
383 5969 453 -18681 -8405 16168 10787 -6689 2578 14803 -3513 -20809 -5109 10131 -1687
396 -1687 -6694 12378 17303 -4700 -13586 513 2010 -11710 -6696 13126 13003 -2212 -2300 5714
410 5714 -2391 -14707 -7581 6466 5751 102 5126 9213 -768 -11336 -7785 10 -661 -1928 5562
425E562N759p278r987O72L947m018k525J0128R624n661q370L113J619j0689m583
440a2687J2831Q878p140k487R540j652j6035k854J2749J332q779O500J3996o254
454G938j5275K753Q384q330p360J3224J1486r170p684Q074J341j3658l148J2994
468A569M299p729J815R300m154j2168K50P341j680l771O606P034m530p118Q32
483b104J980l568j927N327N554j108l635j42Q21l431m078K695O665R60l530J168
499A647L017m992p070L427P004k254l403O601M113q906o121O907K782q251P22
514d777J2277N19j1698J28Q912n183j0569P374J2243n922q672P597N364j1745
528d152o388J1117N166q642K80J0915j998j2256L83P894l861n960Q070Q390o058
$$ plain form
425 5562 11321 4043 -5944 -5272 -1325 -5343 -7868 2260 11884 6223 -2147 966 2585 -8104 -12687
440 -12687 144 9022 1882 -605 8935 7283 -8752 -11606 1143 2475 -6304 196 14192 7938
454 7938 -7337 -4584 3800 -4530 -11890 1334 12820 3650 -4034 4040 5381 -8277 -11425 1569
468 1569 5868 -1861 -46 9254 5100 -7068 -6818 523 -1157 -4928 1678 8712 4182 -2936 -2104
483 -2104 -124 -3692 -5619 -292 5262 4154 519 377 1198 -2233 -6311 -3616 3049 4009 479 1647
499 1647 4664 -328 -7398 -3971 3033 779 -2624 3977 8090 -816 -6937 -30 2752 -5499 -4777
514 -4777 7500 8019 -3679 -3551 5361 178 -10391 -3017 9226 3304 -5368 2229 7593 -4152
528 -4152 -10540 577 5743 -2899 -2619 8296 6298 -5958 -5575 2319 -1542 -7502 568 8958 2900
543B900o452M520J837p511k030P792L866l731j070K575j344m848j807K399L883
558I79K409j53l04R90k361o718k084N512K680k530L160O720l377q789J285M615
574B034n706l938J0342O725r415m890Q888n65j3876J012J6419J225j1839L972
588C88J1540r180j5953N509J1264o399n281J3228Q113j1188o368P255j487j1042
602i601K859J2243j299p587M743N488q876p454P469O746m171j141P018J060q164
617f67n235P46P10P21K914L476L410K099l926p068q36K798k861k708O839O446
633F858m741m429M185m4p517J302R419m86o256M581M578j1185q932R726O942r058
649e057o07J6282L256j5880l920J0844l330j4163M025J4748j640q608N577O323
$$ plain form
543 2900 -3552 968 2805 -4706 -6736 1056 4922 1191 121 2696 1352 -3496 -5303 -2904 979
558 979 3388 3235 2931 3921 1560 -5158 -7242 -1730 950 -1580 1580 8300 4923 -3866 -2581 2034
574 2034 -3672 -7610 2732 9457 42 -4848 4040 3475 -10401 -9389 7030 8255 -3584 388
588 388 11928 2748 -13205 -7696 3568 -2831 -8112 5116 13229 2041 -4327 2928 1441 -9601
602 -9601 -6742 5501 4202 -3385 1358 6846 -2030 -9484 -2015 4731 560 -581 6437 7497 -667
617 -667 -5902 -5156 -4446 -3725 -811 2665 6075 8174 4248 -2820 -3656 -858 -3719 -6427 412 6858
633 6858 2117 -2312 1873 1829 -5688 -4386 5033 4547 -1709 2872 7450 -3735 -12667 -2941 4001 -5057
649 -5057 -5664 10618 13874 -2006 -5926 4918 1588 -12575 -8550 6198 4558 -4050 1527 7850
663G850q606o136P637L235o584J410Q120l828r672K498O198m950m188Q775P513
678I272m765m680K601l17n988k407K606K524K498J857j615j156K726p74o362m59
694d439P278Q30o383P44N799l176o738L051N504k368q55N853j59p275L55M802
710B823n523o558P944Q361p014n283R761M494j1904n298J0312L178r379o85R192
725D421n75p850J643N361l289k878N565J832n843J58N760l298p523L531P381l366
741A030n470N189N497m976n215L258K994k832j752J891J008J3M75j449j732K331
757B60K177l224k123M186K209m658k186L962J272l392M1K787q46j333K103k09
773A026l512J310M363k794n016M371N790n272n979N839N646o150n005O194M091
$$ plain form
663 7850 -756 -6892 745 3980 -2604 -1194 6926 3098 -6574 -4076 2122 -2828 -7016 1759 9272
678 9272 4507 -173 2428 2111 -3877 -6284 -3678 -1154 1344 3201 1586 430 3156 2382 -3980 -4439
694 -4439 2839 3669 -2714 -1970 3829 653 -6085 -3034 2470 102 -753 5100 4941 -2334 -1979 2823
710 2823 -2700 -9258 -1314 7047 33 -5250 4511 9005 -2899 -8197 2115 5293 -4086 -4771 4421
725 4421 3846 -4004 -2361 3000 -289 -3167 2398 4230 -1613 -1455 4305 1007 -6516 -2985 4396 1030
741 1030 -4440 749 6246 1270 -3945 -687 2307 -525 -2277 -386 622 635 1110 -339 -2071 260
757 260 2437 -787 -2910 1276 3485 -1173 -3359 603 1875 -1517 -1476 1311 465 -868 1235 1026
773 1026 -2486 -1176 3187 393 -4623 -252 5538 266 -5713 126 5772 -378 -5383 811 4902
788D902n942k946N335J707m381j66L366j404k395K717J315l938m16M966k93n387
804b960R11N513j577n581J525N238j198m299J098L342r18k391L31J091L2n4l30
821b27o88Q38J508j005k147R93K306p71k062M57J597m08j187j02O11Q52N66r85
839A46j149J583J844k321l108K084L147k249l064K956L621k508l109K430K488
854B791k606k310J862R94j856r5J941m54j333J744J564k242j382K793Q72l968
870a685j622L644J310l739r16M320J815l207j052L095N82l530j604K014N74j696
886a697N9K082N15o63O54Q47j133j109P82J81j810o97J861O56j951k79K880J506
904B684j845r20J908N32k935k048J289J140j377o65K431K206n74j186N89M07j558
$$ plain form
788 4902 -1040 -3986 1349 3056 -1325 -1491 1875 471 -1924 793 2108 -1830 -2246 2720 2427 -2960
804 -2960 -2049 3464 1887 -3694 -2169 3069 1871 -2428 -1330 2012 1094 -1297 -966 125 157 103 -227
821 -227 -915 -77 1431 426 -1721 -728 1578 807 -1255 -798 799 391 -796 -898 -287 565 1131 146
839 146 -1003 580 2424 103 -3005 -921 2226 -23 -3087 -131 3490 982 -2127 303 2791
854 2791 185 -2125 -263 731 -1125 -1220 721 267 -1066 678 2242 0 -1382 1411 2283 -1685
870 -1685 -3307 337 1647 -2092 -3008 1312 3127 -80 -1132 1963 2545 -985 -2589 -575 -1 -1697
886 -1697 -1638 444 959 296 950 1797 664 -445 337 518 -1292 -1989 -128 528 -1423 -1702 1178 2684
904 2684 839 -81 1827 2359 -576 -2624 -1335 -195 -1572 -2237 194 2400 1826 640 1229 1636 78
921G8j584M50O44q15l75J322P04q15L50J864l5j838K39J714j478l358L49K586
939Bq45k165K665M062j298l078J587K158l244l348K140K264k377j120L456J536
955B395k759n42L005K3k890M46K419j661l252J112K287j515j449K829K553j487
971A514j424J456L72k685j785J126J042n71K4J371Q96m10p72lN90j79j053k44
989g35Q95j10j490m1J554P4j096J268K229r88k233P62J027k475j734K606J866
1006A379k229m65L355N55l445m63K971o74l133J144L051j507k723J740K085k032
1022c91j287K713J259k382o83K041m72k572L12J985n68j086J565J357j309j109
1038f27Q58J28j233J10J048j10n73M47J96n45nM51l25j32Q78R3j029k9P36o73
$$ plain form
921 78 -1506 -1056 -412 -1227 -1602 -280 424 -391 -41 1823 1788 -50 189 1903 425 -2933 -2584 2
939 2 -843 -3008 -343 3719 2421 -657 930 3088 -156 -3504 -1364 900 -1477 -2597 859 2395
955 2395 -364 -906 2099 2122 -768 -322 2097 436 -2816 -1704 583 -932 -2381 448 3001 1514
971 1514 90 1546 1918 -767 -2552 -1426 -384 -955 -931 440 1336 926 154 151 741 562 -491 -735
989 -735 160 50 -1440 -1481 73 147 -949 319 2548 1560 -673 89 1116 -1359 -3093 -487 1379
1006 1379 -850 -1315 2040 2595 -850 -1313 1658 984 -2149 -1005 2046 539 -2184 -444 1641 -391
1022 -391 -1678 1035 2294 -88 -771 1270 798 -1774 -1462 523 -45 -1131 434 1791 482 -627
1038 -627 231 359 -874 -764 284 174 -399 48 244 -301 -306 145 -180 -312 566 659 -370 -399 337 -336
1058c36r03J132J129j008n35J357J34j843nJ614m79j484J167J656j319j351J498
1075D24P12k059l83K334J36k121M26J964j005j951J287J574j544j081J871P31
1091A315j969l56J791k74j786Q16J705r35j261J120P28j489m97J466J76j298L06
1108d42J265m90j021O16O14q81l39R85J82p97J23N63m44l96N44K66m80J13M55
1127D36l53l27M53Mo89K15P75l39o21Q18M77j263l52J412M0j520L13J596o85j621
1147a231J091J492j499j325J793J042j964o84K171J93k327J37K320m10k159P83
1163e77J959j109j720J311J468j472j204J501R78j430o52J325L91j209l16J154
1179C98K41q62k49O73L56n73m57N27N29n42p05O58R81q41j062R25J112j220j084
$$ plain form
1058 -336 -1239 -107 1022 14 -521 836 970 -873 -878 736 257 -1227 -60 1596 277 -1074 424
1075 424 1136 -923 -1306 1028 1164 -957 -531 1433 428 -1523 -236 1338 -206 -1287 584 1315
1091 1315 -654 -1010 781 507 -1279 -463 1242 307 -954 166 894 -595 -1092 374 550 -748 -442
1108 -442 823 333 -688 -72 542 -339 -678 307 489 -308 -185 378 -66 -462 82 348 -132 -19 436
1127 436 83 -244 209 213 -476 -261 514 175 -446 372 849 -414 -766 646 686 -834 -521 1075 390 -1231
1147 -1231 -140 1352 -147 -1472 321 1363 -601 -1285 886 1079 -1248 -1111 1209 799 -1360 -577
1163 -577 1382 273 -1447 -136 1332 -140 -1344 157 1135 -295 -947 378 769 -440 -756 398
1179 398 639 -223 -472 201 557 -16 -473 54 583 41 -664 -6 975 134 -928 -3 1109 -111 -1195
1198a195J515J055j864r00K106O77k309m16K460jk583M17K625q08k530J100K379
1215A728j451k117J751J837j944j574K065J246k069r34K043N88j874l29J792K03
1231I61j639j25J397Q6j209r5J050K09r66k84R74N20j087o88J177P94j322q13
1249a060J581P58j895p53K204N88k394l47K612L9k756L27K761q26k797J228K690
1266A960j570k373J895K100k265j723K434J337k559r52K570N52k444j79K238j23
1282H98k026L47J779l85j404L47J053l09p94K19O20O4n26l08M65N70n56p91O96
1301d1R64q90j017J307J009j688r96J938P98k275m55K524J70k734K40K849p30
1318I73k838J093K696j514k366J844J999k196j587K333J167k306o11K244Q6k103
$$ plain form
1198 -1195 320 1375 -489 -1389 717 1394 -915 -1331 1129 1128 -1455 -1038 1587 779 -1751 -651 1728
1215 1728 277 -1840 -89 1748 -196 -1770 295 1541 -528 -1462 581 1169 -705 -1034 758 961
1231 961 -678 -803 594 680 -529 -624 426 635 -331 -615 359 879 -208 -896 281 1075 -247 -1060
1249 -1060 521 1279 -616 -1369 835 1423 -971 -1318 1294 1333 -1423 -1096 1665 839 -1958 -730 1960
1266 1960 390 -1983 -88 2012 -253 -1976 458 1795 -764 -1716 854 1406 -1038 -1217 1021 898
1282 898 -1128 -781 998 613 -791 -444 609 300 -494 -275 345 409 -117 -425 40 610 54 -737 -41
1301 -41 923 33 -984 323 1332 -356 -1352 586 1384 -891 -1346 1178 1348 -1386 -1146 1703 973
1318 973 -1865 -772 1924 410 -1956 -112 1887 -309 -1896 437 1604 -702 -1313 931 1017 -1086
1334a086K72J771n79j449Q49J059q72n88Q72J82p74Q9N11k95j08M62k94n17P00
1353B05M36j073j71J434j32j699N48J796j028j847J400J715j681j405K131R85
1369A614k432o14K487L7k441M98K407j018k117J464J788j904j380K007R38k141
1385h07l78K125j24j920N24J608p62j141R91O01j164j62J007l73p69Q44O69j051
1403b82r9J356m51j535O86J314j255j030J713P59j938j54K218l06k248R12K026
1420A686j529j995J913J496k392j022K689P75k598Q8K667o34k628P90J984j465
1436a75j673J743J290j667l91J873O9j668L21J286r60j080R17M87j251K4J377
1453E22j91p64R96O95j257l86J113n01j734O85J528j131j006K085J151k084n20
$$ plain form
1334 -1086 -814 957 378 -1071 -222 837 -35 -623 249 431 -343 -254 257 -38 -146 316 22 -495 205
1353 205 641 -432 -603 831 699 -1000 -452 1344 316 -1531 -131 1584 -97 -1502 629 1614
1369 1614 -818 -1432 1055 1092 -1349 -851 1556 538 -1579 -115 1673 -231 -1611 396 1334 -807
1385 -807 -1185 940 816 -1104 -580 1028 266 -875 116 717 -447 -609 398 25 -744 100 769 -282
1403 -282 -381 975 524 -1011 -325 989 -266 -1296 417 1176 -762 -916 1302 996 -1252 -340 1686
1420 1686 157 -1838 75 1571 -821 -1843 846 1621 -977 -889 1778 1144 -1484 -694 1290 -175
1436 -175 -1848 -105 1185 -482 -873 1000 1069 -599 -278 1008 48 -1032 -115 372 -879 -855 522
1453 522 331 -433 563 1258 1 -385 728 227 -1507 -822 706 -425 -1431 654 1805 -279 -799
1470g99K341j59k754L23K338j219k302J638K175j777j277K560J094k522n64K355
1486A451n19k812M98K214j067j518J843J660j549p64J677K13k008j28J207o93
1502b95j115R50Q35q19N3J326j02r11O53N45j465p60J127j18j462O93J809n86
1520C58j031J571J094j945r60J714j06k389K88K267p05j916J602K142j625j341
1536i82K075Q19k537q34K129k38k325N91K292o20j423J593J414j658j101J420
1552F15J01j870n1J537m07j101J062J149q80m09J130m3j208J34O92r20p49J007
1570b11M56r60M33J427m08j145Q12Q15j541r13J386L02j663K37J967l58j523R83
1588I6J475j349j275J488O75j970n11J867Pj746O95J867p53j390J157J022j587
$$ plain form
1470 -799 1542 1383 -1371 -1048 1290 71 -2231 -593 1582 -195 -1472 1088 2182 -340 -904 1451
1486 1451 932 -1880 -1382 832 -235 -1753 90 1750 201 -563 1114 1327 -681 -809 398 -295
1502 -295 -1410 -460 375 -444 -391 935 833 -78 575 1120 -345 -1105 22 -96 -1558 -865 944 358
1520 358 -673 898 1992 47 -913 801 695 -1694 -1406 861 156 -1760 -158 1984 359 -982
1536 -982 1093 1912 -625 -1459 670 432 -1893 -1302 990 370 -1053 540 1954 296 -805 615
1552 615 716 -1154 -1205 332 -75 -1176 -114 1035 155 -254 876 833 -375 -241 451 -469 -1218 -211
1570 -211 245 -715 -282 1145 737 -408 404 1219 -322 -1235 151 453 -1210 -973 994 636 -887 96
1588 96 1571 222 -1053 435 1110 -860 -1371 496 503 -1243 -548 1319 566 -824 333 1355 -232
1605b32q90J342K60j479K21J524l91j074Q05R18j039n78J058R0j218J45J033n14
1623a9p90Q42O84r10k30J119j48j127L09Q93p71p36R87N79j069j72J283j54j261
1642f91M41J052p92r31J060O91j270k81J294jj287L49J249o83j053R04P51j131
1660c29m71J262J23j234K55J162n35j021O95P45r17m41J094J94j046J08J002m09
1678B37r20N98P33q99l94R68J43r15J62Q43l58p30O02N71q61l50Q53L6q86K81
1698b86Q84m40p10P22N12q49l43Q76K1r81K09R36m06p42O79N91q19l45Q80R8r78
1719d91Q1R01l68p62N48O33o63l67Q02J73q17J6P55l55o46M78N37o34k91P71J09
1740D10p34J09O96l70o51N64M84p09k64P50O4p53J70P96l96o56N22N04p17l67
$$ plain form
1605 -232 -1122 220 480 -999 -778 746 355 -719 86 1004 -35 -613 445 535 -683 -538 495 -19
1623 -19 -809 33 717 -193 -423 696 548 -579 -270 623 -148 -884 103 682 -387 -559 724 570 -691
1642 -691 -250 802 10 -921 139 830 -440 -721 573 572 -715 -366 883 200 -853 51 802 -329
1660 -329 -800 462 585 -649 -394 768 233 -788 -93 652 -265 -706 388 582 -464 -356 646 237
1678 237 -683 -85 648 -251 -645 323 466 -449 -287 556 198 -532 70 641 -220 -570 283 319 -567 -286
1698 -286 598 158 -552 170 682 -167 -510 366 387 -594 -385 551 145 -597 82 673 -146 -491 389 487 -491
1719 -491 -410 491 123 -639 -91 542 -121 -488 314 487 -330 -314 441 86 -560 -82 455 -179 -470 301 410
1740 410 -324 -215 481 111 -540 24 508 -201 -465 285 349 -404 -234 562 166 -490 32 536 -181 -548
1760e48Q40J16q45Q9Q40k58o83M22N44o12l98O63J94o57j3O21j50n46L00M36l93
1781c8l14M90J09m93N8N00k38m28L87L41n22j35N76n9n76J85N48l40m75N33L38
1802D47o04k12P05k9p32J76O69l10n84M83M84o15l32O79J74o86l4O88j79o10L24
1823i8M80m25l56N27K04n44K1M96j91m42K67L19l63j90M30R7m44J11M01k58l37
1844b95L20K30m46p6N12n7m94K16M73l50l97M69K65n36j69O12ro19J54N82l09
1865G6m40M20L81n57k60N63R9n88O4N46j70m74L08L95m27k34M42P7m74Q4M67k22
1887G6l55K79K84m44j00M88k0m48J37M33l26l49M06K37n06l5N05J8o07J64N48
1908C85l36m35M65K94n25j79N73K0n89J44N25k50m44M10K89m35j84M47M2n02J69
$$ plain form
1760 -548 292 408 -437 -348 492 234 -449 -27 517 -95 -493 170 364 -293 -306 315 165 -381 -81 355 -38
1781 -38 -352 138 247 -246 -188 312 74 -354 33 374 -148 -283 293 234 -342 -157 391 51 -424 109 447
1802 447 -157 -369 336 307 -425 -249 420 110 -474 9 493 -122 -454 225 399 -287 -321 367 188 -422 -98
1823 -98 382 -43 -399 128 332 -212 -191 305 114 -328 -61 258 -105 -295 135 232 -212 -101 300 42 -295
1844 -295 25 255 -191 -267 245 188 -306 -90 383 33 -364 105 370 -166 -335 277 268 -351 -197 385 76
1865 76 -364 56 437 -120 -380 183 282 -306 -242 304 134 -340 -32 363 -64 -298 144 221 -253 -169 298 76
1887 76 -279 0 284 -160 -260 228 208 -240 -103 330 4 -345 61 298 -208 -243 262 280 -327 -163 385
1908 385 49 -386 79 373 -152 -331 242 262 -327 -183 342 92 -352 58 347 -88 -272 175 217 -285 -116
1929a16M09k30l81L87K17m30j13M72m0m89K36M36l27l68M28K18n21o8N65q1n99
1950c95K53N30l53m61N12L21o16j60O58Lo16J44N95l17m97M02M12n12k65N54R3
1971B85n48J04N07k73m32L72L16m66j34M96j4n10K26L97l15l20L98J79m99l3N80
1992C16j57n28L13M38m39l63N59K48o85o0P30j49o78L00O19m49m80N87L45p24
2012b57k13P41M8p50K39O89l34o19M88M60o04l38O40J60o72R5O22k22n63L61M32
2033D03m91k19N23O6n82J07M69k74l78L85K90m40n8N56j44n10K28L51m22k93N57
2054A24K15o30K0P07k41o27L62O04n98m35O44L02q14j40Q59n5p78L62Q25n08o67
2075d69N88L78p80l64Q38J62p34J15Q34k41o99L33M98n31l73N49K36o13m7N50
$$ plain form
1929 -116 293 63 -318 69 286 -144 -257 215 175 -314 -78 358 31 -337 91 309 -212 -280 285 204 -395
1950 -395 -142 388 35 -426 86 407 -209 -369 289 292 -324 -180 415 98 -399 3 415 -97 -362 192 285
1971 285 -263 -159 348 75 -357 15 331 -135 -269 227 213 -297 -71 326 11 -309 89 268 -231 -264 316
1992 316 159 -369 -56 382 -57 -420 139 387 -298 -358 372 223 -455 -155 464 15 -465 122 467 -257
2012 -257 -470 271 319 -431 -192 497 163 -456 32 492 -112 -450 190 350 -322 -227 395 173 -390 -29 403
2033 403 -88 -307 216 282 -300 -193 276 2 -376 9 299 -141 -199 357 213 -297 -69 282 -140 -433 124
2054 124 339 -291 -271 436 195 -432 -70 534 -64 -499 145 447 -367 -507 352 297 -481 -119 706 198 -469
2075 -469 119 497 -283 -647 191 353 -381 -266 568 327 -372 -39 459 -72 -445 104 340 -273 -320 230
2095B30j28m32L28L79l63j75M13k2n15O7L85l58k29N44K43n01J6N49j77o73L21
2116i8M88n37m32O81L29p52q3Q70j07q16L69P73n39p17N96M69q22l49Q64K55p61
2137c19J33Q33k41q12L07N33o01m78O70L30n53r7O79j24n69K67M45l92l22M00
2157H9P8m54L1M06j63k96L98L09m21q0M05j58n64K04M90l91l25O15K37n94m0O22
2179C98q1p45K02O46l77n44N18M45o56k83P51J55o75N9O69k54o74L09N29m82m31
2200e21O17L27n46q1N62r1n93J75M26k84l24M04K00m29n6M36q2l88K22K65l09
2221g0j88L92L7m08P6M11j66l80L43K61m03j83M91O1n80J18N18k42m45L86L59
2242C88m22l28N19J46n12j8N24j45m76L03L85l61l08L76J63m31k7M58o6m20J90
$$ plain form
2095 230 102 -330 -2 377 14 -161 252 230 -285 -218 167 -191 -420 124 367 -134 -118 431 254 -419 -98
2116 -98 390 -147 -579 102 431 -321 -404 466 359 -457 -88 685 146 -571 25 494 -328 -677 187 442 -319
2137 -319 -186 647 406 -406 -99 434 -167 -645 25 355 -198 -295 384 260 -309 -42 403 11 -311 89
2157 89 167 -287 -256 150 -13 -309 89 398 -23 -103 302 144 -420 -216 274 -117 -442 173 410 -184 -224 398
2179 398 317 -428 -226 420 43 -501 17 462 -194 -477 274 429 -246 -187 482 228 -446 -137 392 -90 -521
2200 -521 96 423 -123 -204 358 267 -326 -151 275 -9 -333 71 271 -158 -214 222 140 -248 -26 239 -70
2221 -70 -258 134 171 -237 -161 250 84 -296 47 308 -95 -278 213 274 -306 -188 330 88 -357 29 388
2242 388 -34 -362 157 303 -209 -227 297 152 -324 -21 364 3 -305 71 234 -197 -224 234 168 -252 -62
2263f2L58k70l02L48J39l30p1L74n4l23J34K60k93j84L65R1l15K0L35j41l50J97
2285g4K74k75j60L26J72l67j2L19j53l53K52K97k64j53L45J05m04n4L14o6l19
2306b50J83K96j58j94K15J26l30p9K76L2k55J08K11j71k04J82J19k26J3L22k2
2327A94k24N6Q3k29j98K12J50j42Q0K63l8k60N5J01k25j64K72J05j85J1K55p4
2349I8k66J08K57j15j32K11N9l32j49J98J8k00J52L08pj00P3K4k64k09J31K6q4
2372a95J38J89l3j10Q0L6j25l4J25j0j28L0K5j94m8J49R0RJ73J70j08k36l7Ok25
2397b63r1K05J76l6Q4K20q6k19k3O8q1q8J43P2j76n0J13K2k9P9J78%p8k9Kk50
2423a37j49M3R9O4J44J33L9m4o0j07j44rK5%K4O6P9j02%L8N5n6O9Q4l7j71o5L3
$$ plain form
2263 -62 296 26 -276 72 211 -119 -190 184 130 -193 -59 201 -92 -276 89 180 -135 -115 220 79 -271 -74
2285 -74 200 -75 -235 91 263 -104 -116 203 50 -303 -51 246 -18 -171 174 279 -125 -179 135 69 -250
2306 -250 -67 229 71 -123 92 218 -112 -191 85 117 -138 -30 181 10 -194 -12 107 -119 -106 216 194
2327 194 -30 26 109 -120 -318 -106 44 -98 -18 245 207 -53 2 103 -122 -286 -14 91 -94 -83 172 98
2349 98 -168 -60 197 82 -50 161 220 -112 -261 -63 -45 -245 -93 215 208 108 181 205 -59 -268 -137 -111 -195
2372 -195 -57 132 99 -11 69 105 -20 -54 71 61 -67 -37 -12 -206 -254 -105 -15 -6 167 337 229 -7 -44 -38 -263
2397 -263 -354 -149 27 -9 75 295 209 -10 -33 35 -46 -134 9 81 -95 -145 -32 -10 -39 40 218 218 140 111 113 -137
2423 -137 -286 -243 -144 -80 64 197 236 192 132 25 -119 -128 -103 -103 -79 -13 66 -36 -36 2 57 1 70 154 117 -54 -119 -86
2451h6j54K3J87J07K5P6R9q4k58o4Qk2n8J66J70l6o0M1Oj00j9J14J1m5n1L1n7
2478c0o6LM4nJ21Q8J6m3p2j10j13J2O2L7K9J12M0q7m0J4m3q1N1J05K1j12O2K9
2506D4j31l0Q1Q3j4m2P5J1j31m7Q5no1N5J42l8n7kj7j4l9N3J2lOlK6Rm6m4M7K3
2538B8j1j2M7Lm4o0P3J4o0l7P1J6j08L7Q4Mj05J7J14k5j30O0R9p6j03P5J29j27
2566b7r1R2O7p5l1J48K5r1o0L5k3q6Q0O7L7o8N8Qp1o1j7Q3kK8L3lj7o1p2O1O3
2597B9kn0J18L2q7j16J1J8q0J2J88J22j40o3P4o5k11K8K20Mr0J32J08j74j69R7
2623e4R1j29l1K67P0j83j03M3Lj61P5J82L3n6M7K4j44j23%J05L3Q0M8M8n2j02
2649A1r1q3O9J03N3N2Q2j13j05j8j8p1p1K44J70j26o7N0k3k91k7K99K6p0N4K10
$$ plain form
2451 -86 -240 -217 -30 77 102 178 277 193 -65 -129 -121 -143 -201 -35 135 99 39 80 86 -14 -33 81 92 47 -4 27 -30
2478 -30 -96 -93 -49 -54 67 155 171 128 56 -54 -167 -155 -93 -56 -27 85 125 38 -2 12 -31 -112 -61 44 65 -47 15 44
2506 44 -87 -117 -36 47 33 -9 66 77 -54 -101 -16 -21 -82 -27 115 77 20 18 1 -13 -52 1 13 10 16 13 39 48 2 -42 5 28
2538 28 17 5 52 55 11 -49 24 38 -22 -59 12 28 -80 -43 41 45 -60 -43 71 46 -84 -24 75 -1 -104 -29 100 -27
2566 -27 -118 -26 41 -34 -65 83 108 17 -43 -8 -31 -117 -37 30 67 -1 57 65 -6 -67 -84 -1 -3 25 58 55 38 -23 -95 -34 29
2597 29 27 -23 95 127 40 -76 -65 -47 -127 -115 73 195 55 -8 66 1 -210 -182 38 42 -48 84 192 18 -151 -54
2623 -54 37 -92 -123 144 214 31 -72 -29 -26 -187 -112 70 103 47 94 118 -26 -149 -149 -44 -11 69 117 165 113 11
2649 11 -80 -163 -94 9 62 114 196 83 -22 -40 -58 -129 -200 44 214 88 21 71 48 -243 -270 29 55 -15 39 249
2675B49j73k62J0J75q8p5K59J76j82j03O0n4k37O5K45R5r0O0K5j55j64J6P2J9
2699e7O3J51J3j01m4n1j24PJ19N4M2J01l8j76j1L0n9j23J93J60m3j10N1O9k80
2724a64j10K58J05j17K5K18q9k68m1J74q3j08K23J71j55j16J40j5k43k0K68M2
2746I5j05Q4J29j64j90O5J15q7M4O0J02j01j2nr7n1P7O9o1J05J01j57j11R1M7
2771D3j40j8K19K5j49L2J06j28j00Q3Q6j17k9K27J9k69J1K16r9k11J44K20j22
2794D9j57J15J23j95q9J21J03j36K4J43m6j14M5P4j13n3J46O0j61N8J10p4j22
2817h9O2O7o1l1J06Ko7N5J2j03m6J67qj98R6K11j03j87Q6J80j73j90J86J81j68
2842a3j05K24j3j82jJ75q3j43J53J38j66j62K42M8k64l7K50M1j61J9J80p2j56
$$ plain form
2675 249 76 -186 -176 -1 -89 -164 95 271 89 -14 46 -8 -245 -180 65 160 70 130 155 0 -164 -148 -76 -57
2699 -57 6 157 170 69 25 -26 -150 -143 -24 30 72 173 135 -41 -52 -22 -81 -204 -11 149 106 -4 47 116 -164
2724 -164 -274 -16 89 -28 -3 215 126 -142 -183 -9 -92 -200 23 194 39 -77 63 48 -195 -215 53 95
2746 95 -10 74 203 39 -151 -86 29 -58 -14 46 148 47 35 30 -67 -118 -41 28 -33 72 173 16 -95 -4 43
2771 43 -97 -115 104 129 -20 12 118 -10 -110 -27 59 -58 -87 140 159 -110 -99 117 18 -193 -49 171 49
2794 49 -108 7 130 -65 -154 -33 70 -66 -42 101 55 -59 -14 60 -53 -106 40 100 -61 -3 107 33 -89
2817 -89 -27 40 -21 -52 54 56 -11 44 56 -47 -93 74 66 -132 -36 175 72 -115 -29 151 -22 -212 -26 155 -13
2842 -13 -118 106 93 -89 -90 85 2 -141 12 150 -16 -178 64 112 -152 -189 61 102 -59 -40 140 68 -88
2865h8P2L4l6m5R9j9n5J06J9j32n3J75jj35L4K03q7k05O0J08j25k9J40R5j28J6
2891B3J61j49j94J02J67k33p0K70J27k33j10K85m2k43k6K80m3j90L9J52j02r4
2913a23J00Q7r6P7J16j16j11K5Q7j77p7J83J13n4pJ15k0j44J7Qj16O6O5j1j18
2938a11J16J42j85p3K11Q8k28k0K41m1l06m0K25l2j76K23K02j32j04J44Kk88m8
2961a90J98n7j73J77K44j19j94J78J25k17p6J66N9j71o1R1m9n3M8J43n1Q5J38
2984B41q0k27L1L5j90l9K29J35j29L9J62r5j43J6N9j17m1J40K0j73PK01l2j90
3008a41J64K80k06j58J17J11l30j19K01J11j44R3K47k2j83mN9j65r4J60O2j27
3030h8L3J74p2j46R8J28r8n2J23Jj40m4R2j04n2J67R7q7M5J41j05k56N9J46j59
$$ plain form
2865 -88 -16 18 -18 -63 36 17 -38 68 87 -45 -98 77 76 -59 -25 178 91 -114 -54 54 -71 -100 40 135 7 23
2891 23 184 35 -159 -57 110 -123 -193 77 204 -29 -139 146 104 -139 -165 115 72 -118 -79 73 -29 -123
2913 -123 -23 64 -32 45 161 45 -66 -41 46 -131 -208 -25 88 34 27 142 122 -22 -5 3 -113 -47 18 7 -111
2938 -111 5 147 -38 -111 100 188 -40 -60 181 140 -166 -206 19 -13 -189 34 236 104 0 144 146 -142 -190
2961 -190 8 -49 -222 -45 199 80 -114 64 189 -28 -104 62 121 -50 -111 -20 -69 -122 -74 69 18 103 241
2984 241 161 -66 -35 0 -190 -229 0 135 6 45 207 112 -31 -15 44 -73 -114 26 46 -127 -120 81 49 -141
3008 -141 23 303 97 -61 56 167 -163 -282 -81 30 -114 -21 226 204 21 17 76 -89 -183 -23 39 -88
3030 -88 -55 119 47 -99 -1 127 29 -23 100 101 -39 -83 9 -95 -147 20 117 30 75 216 111 -145 -86 60 -99
3055i9r4K07J52j98k8J56K1k04L9J48k7j53O6J31k36p5J93J05j80J3K81q6k13
3078h1J7J28j14j39J71J12p2m6R3Kj32K8N9n9m1J47l1j06K0J32q5j37J27J54j39
3103Hm9J39j0j88K5J43m4j25J33J11j54o9J44J6j88J7J99l5k30J55J38j02j75
3126a41J40R9j43n2J44M1j82N7J60j50q0J00M9j06m8J54k9j12M0J28m3j18J18
3149B6L4j06pQ1j4j23N7J10r3n7J37N0j57J7J65o7j63M8J46j05q6J30P1r9p5J57
3175G7K1j87M5J12l7j16J05N9j31n7J32K6j54P1J19lj73R5P0j46l4J29L8j28P7
3200A0R9o7j07J09K2j21k9J29J6j28K1J37r8q9J07N8p9l7J42mj35j1J19q9p3J03
3226EJ06j24m9J08kj63K9J57m5p6P0O7q5q1Q6J7p3kJ22n7n3N7K4q7m4Q6M6p1J6
$$ plain form
3055 -99 -193 14 166 -32 -60 96 117 -87 -48 100 73 -80 -14 117 -119 -194 -1 104 -76 -63 218 132 -81
3078 -81 -64 64 -50 -189 -18 94 22 -24 69 71 -61 -33 26 -33 -74 73 42 -64 -44 88 3 -134 -7 147 8
3103 8 -41 98 88 -100 -75 68 24 -101 32 143 -11 -80 64 80 -108 -91 108 73 -157 -2 136 34 -141
3126 -141 -1 98 -45 -97 47 88 -94 -37 123 -27 -107 -7 42 -64 -112 42 13 -99 -59 69 26 -92 26
3149 26 60 -46 -53 28 14 -109 -52 58 -35 -92 45 95 -62 -45 120 53 -110 -62 84 -21 -107 23 94 -5 -80 77
3175 77 98 -89 -44 68 31 -85 20 79 -52 -109 23 49 -105 -34 85 82 -91 4 74 -72 -106 23 61 -67 10
3200 10 109 42 -65 44 66 -55 -84 45 61 -67 -46 91 -7 -96 11 69 -10 -47 95 91 -44 -55 64 -25 -98 5
3226 5 111 -13 -62 46 44 -119 -90 67 22 -54 16 83 -2 -83 3 20 -53 -55 67 10 -43 14 38 -49 -93 -7 39 -32 -16
3255a6J01m2j21N4P6j06l6J24N1j25K0O5o0j03J22O5q9l6J07N7j57m0J65l3j17
3280g4P0N8n5l3O7L1j20J9R1k7o4L7Q3q6n2N8L7o6jR5jj08L1L8m6n2O1J8m6J2
3310b5O7m2q4Q7N0o4n8R4M0r3j1M8j0n1L9Q5q4l8P9jp3j2J17qj22K7J24m3q5N0
3340CO5r5k9R7J2q1j1Q1k7n3P3L9j15PM1J9m3rP4n4m1M0K0m7K6L3K9j11K1N7n9
3371c8l5P6M5r7k3R1j1o4J3R2o0o3O8L2p1j1Q1J3j12N2M7k7n9O0Q7q9o6R2J8p5
3401c4k0J08l1n4M0K6n0m4N0N6p9RO6o2l3O0M4q4m0Q2Qn4J2O0k0p6O2J6n0MM3
3432A5Jo7O9J8l3n9N4J8k8m9R2J5r5K3K6j2m0N1M2n6qO0J8r2JN7k8m2N0O1n0k6
3464a4N1n0Lj6R5n5r6Q2J8n7k9R1j0j5QL5k1p6M1M6q5J3P2Pp4L3N0n4m1L7J7%
$$ plain form
3255 -16 85 43 -78 -24 52 -54 -90 34 85 -40 -20 45 -15 -118 4 69 -20 -56 51 108 -49 -89 76 43 -74
3280 -74 -4 54 -1 -34 33 64 -56 -37 54 27 -37 0 83 -3 -55 3 40 -26 -27 68 67 -41 -10 28 -18 -70 -9 9 -37 -25
3310 -25 42 0 -84 3 53 -11 -69 25 65 -28 -39 9 -1 -52 -13 72 -12 -50 29 28 -45 -57 60 52 -70 -43 81 38 -47 3
3340 3 68 -27 -56 41 53 -28 -39 42 15 -38 35 74 -41 -34 7 26 -17 -26 48 -6 -47 -7 13 -34 -8 25 54 -57 -36 21 -38
3371 -38 -73 3 48 -49 -72 19 8 -56 -43 49 -11 -74 -6 26 -45 -56 25 38 -74 -22 25 -2 -61 -1 86 -3 -69 23 41 -34
3401 -34 -54 54 23 -31 9 35 -15 -59 -9 47 -32 -23 43 -19 -52 8 52 -32 -72 10 18 -36 -24 36 16 -60 2 18 -32 -28 15
3432 15 16 -51 18 36 3 -56 -2 16 -12 -61 31 46 -49 -26 0 -12 -52 -1 41 -15 -23 37 55 -37 -36 21 -7 -49 1 62 12 -14
3464 -14 37 -13 -10 -26 69 14 -82 0 18 -39 -68 23 13 -2 6 41 20 -56 -15 31 -54 -41 31 38 -36 -3 47 -7 -48 -11 6 6
3496Fk1K0M4q1j3O5k6n1K6Q8m6k3L0Mo7K7M5j5j6K9K9p4k0O9L5q7QL8K3j07N6
3527eK9k5o5M8L4n3K2O0k6m5L5Pn1k3Q6J2p3LQ4k5q1J7O4n3rO4k5l7rO9l1l5O4
3560B7K1l8l0M2lq5N6K7k4k3M4L4l5n7L3K9m0K5L5m6nJ0L4p3%P9qm4RM0k1n9J3
3593c3N3n0j4R8k8m0L9J5n9l6M2L7m4l3P8qm1pK2J2k8L0J6k5k3K3K2l3k7O2l1
3624a1k3K2N5k5o7P0rk6J8M7k5m7L5Kk6k9P0Pm7mL5k3k7N3ml9OL0K9m9n8Q6Lo0
3658c1K5J2rl5M3L3p1J4M7k3m1M5J1o0K7J9J7k9j9K3J4l8N9L1n2j6J7Lj3l9P9
3689D3n2k7L6N7p7lO4pn7lM7j0m5N4J3k9mJ9Nl0J2J5j8o2L7N0k2k0K9K5n0j0N6
3722C6l7L3k1K5n6rJ7L2p1M4J9Lm4rO5l7jJ5Ml2k2O0K3p1K7K0j6k4M2M0p5J1L5
$$ plain form
3496 6 -15 5 49 -32 -45 20 -6 -57 -31 57 11 -12 18 22 -45 -18 27 12 -4 25 54 -20 -40 29 64 -23 -15 23 46 -61 -5
3527 -5 24 -1 -66 -18 16 -37 -15 45 19 -26 9 16 -35 -58 28 40 -33 -30 54 29 -52 -35 29 -24 -33 31 6 -31 -40 29 -2 -37 27
3560 27 48 10 -20 22 19 -66 -10 17 -7 -30 14 48 13 -44 -11 18 -22 3 38 -8 -13 -3 31 -42 -42 37 29 -15 -6 34 13 -46 -33
3593 -33 20 -30 -44 54 26 -14 25 40 -19 -55 -13 24 -20 -53 25 17 -24 -31 -9 3 -25 5 21 -4 -27 -4 18 -15 -42 20 -11
3624 -11 -34 -12 43 18 -49 21 12 -14 4 51 26 -21 14 16 -10 -39 31 38 -9 -13 22 -1 -28 25 21 -18 -12 18 47 -2 -60 26 29 -31
3658 -31 -6 6 -3 -38 5 38 -33 -19 28 5 -36 9 20 -40 -13 6 23 -6 -25 -2 12 -26 33 64 12 -4 13 16 3 -36 43
3689 43 -9 -36 0 57 -20 -23 41 34 -23 -26 21 11 -34 20 33 4 0 19 24 -6 6 21 3 -59 -22 28 6 -14 15 40 -10 -20 36
3722 36 -1 32 11 36 -20 -29 -12 20 -51 -7 12 15 -29 -38 27 -10 -11 4 8 -24 -46 14 37 -34 -7 13 -3 -27 15 55 -20 -9 26
3755B6Qp2J0O2k2m1K9M6p4J5Qrl5M8K4l2RLqm9M7K6j0o7M3N3o4RL6J3p1lJ09l5
3789C2p3K1L8l7j5L4M5n3kL8j2l3J5M9l1m7K4J5j8nM4rl3J4K8j2k1QNl6JM0Kn5
3823c9K8K5Pj9ROm6KJ8Qj3JM0l1NJ9k5j1J9L0k6m3K5J0k7KJ3N2l9j1M2j0l6K0
3857ELl1l1L6N3l6J9l1K3Ml6O9m3l5K7Ll1K9j0K1j9J9N5m0k4J4ok9pK9J3oLM1
3891E1k5j3j4k9J3j8L4K4n0J4K5k1l3J8M6l0LO1l2m6mmk4J8R0m7K4k5P0j8n2j0
3923dL8n4k6M3L9k9j8K8J3p3J4O6K2n7mJ6m5j7K6M6l3J0L5j6p2O8ll0m1R7j1m1
3955a3lK6k2l9L0Rj2JO4k5n0kK5n1L4K1M0Ll4J6J1o8mO7qm4K7N7m2l4K9K0p5N3
3989GM7j8m9J1K6j7l1M3l2L1k7N4k4m1qJ6lj3M6J8k2j0K0k2m0L2kJ2j9K9jm3j1
$$ plain form
3755 26 34 -38 -28 34 12 -29 0 46 -28 -13 -5 -14 -49 -1 23 -9 0 3 -5 -54 -7 19 9 -58 -15 38 -26 -17 19 32 -39 -42 67 32
3789 32 -41 -20 18 -19 -34 0 45 -8 -10 28 16 -17 -2 47 16 -31 -7 8 -10 -15 29 20 -13 1 29 17 -4 4 9 -27 -26 14 16 -39
3823 -39 -11 14 21 2 11 17 -29 -27 -9 -1 -14 -13 27 -4 1 20 -5 -16 3 33 7 -36 -11 -1 -28 -26 -13 39 0 -11 31 21 -15 5
3857 5 8 -23 -54 -18 35 -1 18 -13 10 14 -22 47 4 -31 -4 -1 -32 -3 -13 8 -11 8 63 23 -1 13 7 -22 -29 0 13 7 10 51
3891 51 26 13 -1 -30 -17 -35 -1 23 -27 -13 12 -9 -42 -24 22 -8 -5 56 24 -22 -26 -30 -54 -36 54 7 31 6 76 58 6 -4
3923 -4 34 -20 -46 -3 36 7 -11 17 30 -43 -29 37 59 2 -2 14 -31 -48 -22 24 -9 1 36 20 -52 16 13 -17 -58 39 28 -13
3955 -13 -16 10 -12 -51 -21 -12 -24 -23 41 16 -34 -36 -11 -62 -28 -7 33 36 2 18 29 -39 -43 24 16 -28 -1 56 14 -20 9 29 -46 7
3989 7 54 36 -13 -2 24 7 -24 19 -13 18 -9 45 21 -20 -28 -12 -15 -28 18 36 14 4 24 2 -38 -6 -8 4 -15 14 13 -30 -41
4022d1L7j8K8k5K0l1K1Rn4J0qP1ll1K2M6p3l5Q5k0j6j0O6K0o0qK5k0m0N1J3Mn3
4055a8N0np3K5K9J2m0K6K4m6j5K5k9J0J1L8Jl9J0mk3JJ9K8l4K0L7o3j4K9J9j4
4087cNM3ln4J4L6l6n4N0J2qJ0J6K5q2j8P0k7j1K3M9j1l7j7oj2%M0K0k0RKl4j8
4121b7OJ2J7LK6j9Ll4rk0K5M3rl0M2J4p1k3M8Pq2O8O9k0p8L0L3l9j9L3L9j6k9
4154gL7K8q5o0P4M6n2N1jj0m4K8Mj8k2L8L8j3l3%J1l3l3qN3J3M2mm0%lj1k0M8
4188A4k9RK5L3p1m6O4LqJN6Qr0J2M9m4l6K2Q5l2l1K9Om3n1J03K1j07N1K7k0n0
4220d0J5O3j6l7K7O4p9k1jN0k9J7m3N7k7j1k8M2Nj6oMrK4m2O3Qp6J2L6Nl3qM2
4254A2K1m9j4M5qr6Q9L4l1l9M9K8o4nL1M1n9PL0J6j9m5O6j9m8K0K1JkNK7k5l4
$$ plain form
4022 -41 -4 -22 6 -19 1 -30 -9 0 -54 -44 -52 19 16 -15 7 53 -20 -55 30 10 -6 -16 50 70 10 2 27 7 -33 18 31 35 -18
4055 -18 32 27 -46 -21 8 20 -20 6 30 -16 -31 -6 -35 -25 -14 24 25 -14 -4 -8 -31 -30 -11 17 -17 3 40 -23 -37 -8 11 -3
4087 -3 2 45 42 -12 2 38 2 -52 -2 10 2 12 28 53 -29 -47 23 -4 -15 8 57 46 9 -8 -14 -26 -26 14 34 14 23 25 -9 -27
4121 -27 -21 -9 8 11 37 18 21 -13 -22 -42 -17 26 17 -13 29 43 -28 -51 -3 4 -78 -10 59 39 -39 -9 24 -15 -34 -1 38 22 -7
4154 -7 30 58 -27 -87 -13 33 -19 32 31 21 -23 5 9 -9 -31 7 45 32 -1 -1 10 -23 -56 -64 -11 2 44 40 0 0 -3 -14 -34 14
4188 14 -15 -6 19 52 -19 -65 -1 2 -6 -5 51 59 -31 -19 30 -14 -50 -28 57 25 -6 23 29 -14 -65 38 59 -48 3 30 10 -40
4220 -40 -25 38 22 -15 12 76 -3 -24 -25 25 -4 13 -30 27 0 -11 -39 3 8 -8 -14 -10 -19 5 -37 26 34 -42 -30 6 11 -22 -30 12
4254 12 33 -16 -30 15 7 -89 0 34 3 -36 13 41 -23 -28 3 44 -15 -8 22 38 19 -26 40 21 -27 -7 14 15 13 18 45 20 -14
4287a4J5j9OK7j5K6J6k8l7J8K6o0PL6N2p7J3L3j2l3k7Q2J1l2n0N7k3m0M2J8k2
4318dk4L9L8k3l6L1l5J5l2M9N5p4J2j3N1p8QK1J7m6M6KKm5K1j1mK9oJ7KOl3qj6
4353b7L5l3L9km0j8K1Pkk4N4Rn2K7M8qq9ON1rl0O7L0n0m2J0L6l1j8O3J0k0l1L6
4387B3k5n1L0M2K9l4J0Nl2m2L7j7J9j0L9J2j5mk1j4K1koL4rk5Nm4M2JlL9J5j9
4421C0l5nk1Ok9K1L1KL9rk4n1M0J9j7k1N8k1j6m9L6J9l0K3O9jm2K6o3j7ojL7M0
4455C8mJ2Om2k3k4J3J5L3j6j5J0ol6nM1J8PPK6m2m9oll4L9O4L5j3l7K1n0l5kM4
4490a3Ok1P1l3k3j4J0M8nJ9J5j8qm0k7k9JO8L4Roj3J3o4j5J4mL1K5RKn3Pk9jL6
4526BJ2J4nk5J3o7j1K8pO7QK4k1m5lj1n0K7N0J5K4Pm8k9k1J7M3nj9P4l1o5pL2
$$ plain form
4287 -14 1 -18 -12 15 0 26 42 14 -23 -5 21 -39 -32 4 56 -21 -8 25 13 -20 -47 35 46 14 -36 21 -2 -42 0 18 -4
4318 -4 -28 11 49 26 -10 21 -14 1 -31 18 73 -1 11 -2 49 -29 -21 0 17 -29 17 19 21 -24 -3 -14 -18 11 5 22 24 30 -3 -11 -27
4353 -27 8 -25 14 12 -28 -46 -25 -18 -20 -44 10 19 -33 -6 42 34 -55 -49 2 -7 -37 30 60 10 -32 -22 14 -17 -35 28 38 18 -13 23
4387 23 -2 -53 -23 19 48 14 24 29 -3 -45 -8 -25 -6 -16 23 35 20 16 -5 -19 2 0 -6 28 19 -6 -1 -45 -3 -2 -5 34 49 30
4421 30 -5 -10 -31 -25 -54 -33 -2 0 39 30 6 -45 -5 14 -3 -24 34 13 -3 -52 -16 3 -27 -4 65 64 22 48 -15 -32 -38 -39 -2 38
4455 38 34 46 52 10 -13 -37 -24 -9 24 8 -7 3 -3 -39 -44 -3 15 22 29 55 13 -36 -42 -45 -79 -40 24 59 46 9 30 -20 -55 -57 -13
4490 -13 -7 -28 43 10 -13 -27 -17 31 26 45 60 42 34 -6 -33 -62 -61 7 41 50 44 31 44 -20 -35 -21 -25 6 31 40 42 -11 -4 -33 -34 2
4526 2 14 28 23 -2 11 -56 -67 -39 -46 21 29 53 32 -13 -16 -27 -77 -50 0 15 39 46 -2 -31 -52 -35 8 3 -16 58 27 -38 -45 -13
4560a3oj4L9O8n5j3K3l1l1m9R2K4j7J7loql9J7j9mO0K3m5j2J1Qm5L2j0RL4m5J6
4594Hm6KlNL1L4k3Qk6%l1k9O2j9M3Jj1K3k8l8L4K1l2L3K7m9Kl9K2Rn9P3M2j9q
4629B0J9j6l8nJO2m0L6Qk6l2KK8l0NQJ0Nj0m0J0kJ4j5K3Mpjk8ROk5M0K0j6K5m
4666B0pn6j9M9Jl4N5jK8n4J9K2km8L1L9k2m3K8Rl8jM4J7m5K4L9l6m7J2Lj7J2L
4700a5L3m6K2J2J6k2k5J5K3j7J3Pm2j0M9k5lM3n0K4l3K2mk3OM0j8%J4J4k2RJ3
4733B0k2l4L3J8j4n9O4Qk1JL2%l8QN2k4p4L7J5llJ8l7L2qK3jj8j5J9j8k2L3Km7
4768d3K5J0k8rN5k9j3QL3ml1KK1l0j3M6mk3J4M7l1m6M3M3n9rN5K6n4k6L3lj4J5
4802GL8jo2nM9l3oJ1mJ7J9K5m4m9M4%Mj5K4Rk5J0k2k8l6M6nK2j0L9km4%J7Nm4
$$ plain form
4560 -13 -19 -33 6 74 19 6 29 -2 -33 -82 10 34 17 34 31 25 17 -22 -5 -24 -28 32 55 10 -2 9 17 -28 4 -6 3 37 -8 8
4594 8 -38 -36 -39 -34 -3 31 8 16 -10 -10 -41 -70 -8 -27 16 17 6 29 1 -37 -3 18 -14 19 46 -3 -1 -40 -18 -9 -68 5 47 28 20
4629 20 39 23 -15 -20 -19 43 3 39 47 21 -11 -9 19 -11 -6 2 12 17 7 -33 -23 -25 -11 -26 -3 1 -6 -7 -35 -26 -20 -45 -5 15 -1 24 20
4666 20 13 -43 -62 -13 -12 -46 9 8 36 -18 1 23 21 -27 4 43 21 -22 6 15 -23 -24 20 37 -8 16 55 19 -28 -16 -13 -30 -18 -15
4700 -15 18 -28 -6 6 22 0 -25 -10 13 -4 9 16 -26 -36 13 -12 -15 28 -22 2 -31 -9 -13 -36 -30 10 -8 -8 6 20 -2 7 20
4733 20 -2 -36 -3 15 1 -58 6 14 -7 -6 26 26 -12 -4 48 24 -50 -13 2 -1 -4 14 -23 9 1 24 23 5 -10 9 -9 -31 2 4 -43
4768 -43 -18 -8 -36 -45 10 -19 -32 -24 9 5 -26 -24 -3 -33 -46 0 -4 -27 -13 34 3 -43 0 43 -16 -25 30 56 2 -24 9 6 -8 7
4802 7 45 44 -18 -23 26 -7 -13 -2 -6 11 30 55 11 -38 6 6 10 -5 19 28 3 13 -9 -37 -73 -27 -32 -10 -20 19 17 -27 -27 -10 -5 -49
4838d9N1K2rl8N5j7p4L3L8L8o0L8J7m4m8Q5j8n9L1N2qp1N1Km8nL8L7l9pK6km4
4871b6QK2j7NK7%m5J3J8m0j5P5K3m6l6O7Qr8kP3j0m5O4Mn3l8M5K6m9%O1Kl5jL1
4906A6j4m6K4L8k3L2L8m9j5k5M8j5j6N0J1m2MJ0l2m1J4Q1l8k2N5jo4k5N2om5K9
4938a7L3j4j6L3j5o4kM7Rl0M7L1k5q4O7K0l7NM7Jj0m1K0l2k9K9O8m1nM0j9m4Q
4971b0KJ7j1L9M3p0j0J3J9m8K6MJ2K2Kj3j5k9K7On7N9J5j4o8N4k0pm5O3M1n4j
5004a8O5q3m2N9N2n7j1Q8J6r9lO8l3o2M9K6j5LrL6q2J2O1j4KK2K4k8r1N8rk7L5
5037gO2j4j3K6l7m5l5O9L5n5L7K5m3k4j4O8o3J6N8mn9j0M9l2m9N4K2j3j3M1qn2
5069b8k5O5l3j6L8P9o9k2K2Jm6J8J8J4k9lN1l6k1L2Rm6N1K2j4p5L8K5m2oO0%j2
$$ plain form
4838 -49 2 24 15 -23 32 15 -59 -26 12 50 -10 28 45 1 -47 38 20 -39 -8 44 36 -35 16 18 -30 -35 3 40 1 -6 20 18 -26
4871 -26 -18 4 -13 -8 19 19 -26 -13 5 -35 -50 25 48 2 -34 33 41 -57 -59 14 4 -41 23 27 -26 -64 -19 7 -42 -42 19 21 -14 -15 16
4906 16 2 -44 -20 18 -5 27 65 16 1 -24 24 9 -7 43 54 12 16 26 -6 -47 -33 48 10 -12 43 42 -22 -47 5 -1 -46 -17
4938 -17 16 2 -14 19 4 -60 -62 -15 -6 -36 11 42 17 -67 0 20 -17 -12 35 36 26 -15 5 -27 -56 -27 41 0 -5 35 16 -28 -20
4971 -20 -18 -1 -12 27 70 0 -10 3 22 -26 0 4 16 38 40 27 12 -17 10 16 -41 18 33 19 -49 5 -15 -22 -67 -4 37 -17 -18
5004 -18 47 -36 -78 -19 33 -24 -35 53 69 -30 -33 35 2 -60 -11 15 0 3 -6 30 -52 -40 21 7 9 31 55 27 -64 -6 -15 -42 -7
5037 -7 55 41 28 54 17 -28 -63 6 41 -14 23 48 5 -19 -33 35 -28 -12 46 42 -17 -27 22 -10 -59 -5 17 4 -9 32 24 -28
5069 -28 -53 12 -21 -37 1 80 11 -11 11 12 -34 -16 2 16 -13 -16 35 -1 -22 10 19 -27 24 46 32 -43 -5 20 -22 -28 32 32 20
$$ [...]
8191a5
##END NTUPLES=NMR FID
##END=
