##TITLE=1H_AM A510.CO2-2
 CDCl3, 8 sc, 
 30.7.2019
##JCAMPDX= 6.0         $$ Bruker NMR JCAMP-DX V2.0
##DATA TYPE= NMR FID
##DATA CLASS= NTUPLES
##ORIGIN= UXNMR, Bruker Analytische Messtechnik GmbH
##OWNER= root
$$ XWIN-NMR		Version 3.5
$$ Tue Jul 30 13:46:49 2019 Russian Standard Time (UT+4h)  she@DPX200
##.OBSERVE FREQUENCY= 200.13155
##.OBSERVE NUCLEUS= ^1H
##.DELAY= (6, 6)
##.ACQUISITION MODE= SIMULTANEOUS
##.ACQUISITION SCHEME= undefined
##.AVERAGES= 8
##.DIGITISER RES= 18
##SPECTROMETER/DATA SYSTEM= spect
##.PULSE SEQUENCE= zg30
##.SOLVENT NAME= CDCl3
##.SHIFT REFERENCE= (INTERNAL, CDCl3, 0, 15.7039)
##AUDIT TRAIL= $$ (NUMBER, WHEN, WHO, WHERE, WHAT)
$$ ##TITLE= Audit trail, XWIN-NMR		Version 3.5
$$ ##JCAMPDX= 5.01
$$ ##ORIGIN= Bruker BioSpin GmbH
$$ ##OWNER= she
$$ F:/spectra/data/she/nmr/H-F/1/audita.txt
$$ ##AUDIT TRAIL=  $$ (NUMBER, WHEN, WHO, WHERE, WHAT)
(   1,<2019-07-30 13:45:34.03 +0400>,<she>,<DPX200>,
      <created by zg, POWCHK disabled, PULCHK disabled
       configuration hash MD5:
       00 E9 B6 7A A2 85 ED C7 34 08 36 98 17 FE 4E 26
       data hash MD5: 16K
       02 9B 8A 3E 9B 5F CA 41 99 08 F8 88 5C 53 D4 9D>)
$$ ##END=
$$ 
$$ hash MD5
$$ 1A 45 D5 30 49 DB 53 43 3A 67 E4 1B 49 9C 18 09
##$RELAX= 
##$RELAX= 
##$RELAX= 
##$RELAX= 
##$RELAX= 
##$RELAX= 
$$ Bruker specific parameters
$$ --------------------------
##$DU= <F:/spectra>
##$EXPNO= 1
##$NAME= <H-F>
##$PROCNO= 1
##$TYPE= <nmr>
##$USER= <she>
##$AMP= (0..31)
100 100 100 100 100 100 100 100 100 100 100 100 100 100 100 100 100 100 
100 100 100 100 100 100 100 100 100 100 100 100 100 100 
##$AQSEQ= 0
##$AQ_mod= 1
##$AUNM= <au_zg>
##$AUTOPOS= <>
##$BF1= 200.13
##$BF2= 200.13
##$BF3= 200.13
##$BF4= 200.13
##$BF5= 200.13
##$BF6= 200.13
##$BF7= 200.13
##$BF8= 200.13
##$BYTORDA= 1
##$CFDGTYP= 0
##$CFRGTYP= 5
##$CHEMSTR= <none>
##$CNST= (0..31)
1 1 145 1 1 1 1 1 1 1 1 1 1 1 1 1 1 1 1 1 1 1 1 1 1 1 1 1 1 1 1 1 
##$CPDPRG= <>
##$CPDPRG1= <>
##$CPDPRG2= <>
##$CPDPRG3= <>
##$CPDPRG4= <mlev>
##$CPDPRG5= <mlev>
##$CPDPRG6= <mlev>
##$CPDPRG7= <mlev>
##$CPDPRG8= <mlev>
##$CPDPRGB= <>
##$CPDPRGT= <>
##$D= (0..31)
0 1.2 0 0 0 0 0 0 0 0 0 0.03 0 0 0 0 0 0 0 0 0 0 0 0 0 0 0 0 0 0 0 0 
##$DATE= 1564479933
##$DBL= (0..7)
120 120 120 120 120 120 120 120 
##$DBP= (0..7)
150 150 150 150 150 150 150 150 
##$DBP07= 0
##$DBPNAM0= <>
##$DBPNAM1= <>
##$DBPNAM2= <>
##$DBPNAM3= <>
##$DBPNAM4= <>
##$DBPNAM5= <>
##$DBPNAM6= <>
##$DBPNAM7= <>
##$DBPOAL= (0..7)
0.5 0.5 0.5 0.5 0.5 0.5 0.5 0.5 
##$DBPOFFS= (0..7)
0 0 0 0 0 0 0 0 
##$DE= 6
##$DECBNUC= <off>
##$DECIM= 24
##$DECNUC= <off>
##$DECSTAT= 4
##$DIGMOD= 1
##$DIGTYP= 9
##$DL= (0..7)
0 120 120 120 120 120 120 120 
##$DP= (0..7)
150 150 150 150 150 150 150 150 
##$DP07= 0
##$DPNAME0= <>
##$DPNAME1= <>
##$DPNAME2= <>
##$DPNAME3= <>
##$DPNAME4= <>
##$DPNAME5= <>
##$DPNAME6= <>
##$DPNAME7= <>
##$DPOAL= (0..7)
0.5 0.5 0.5 0.5 0.5 0.5 0.5 0.5 
##$DPOFFS= (0..7)
0 0 0 0 0 0 0 0 
##$DQDMODE= 0
##$DR= 18
##$DS= 0
##$DSLIST= <SSSSSSSSSSSSSSS>
$$ [...]
##$SUBNAM2= <"">
##$SUBNAM3= <"">
##$SUBNAM4= <"">
##$SUBNAM5= <"">
##$SUBNAM6= <"">
##$SUBNAM7= <"">
##$SUBNAM8= <"">
##$SUBNAM9= <"">
##$SW= 24.9336996594482
##$SWIBOX= (0..15)
0 0 2 0 0 0 0 0 0 0 0 0 0 0 0 0 
##$SW_h= 4990.01996007984
##$TD= 16384
##$TD0= 1
##$TE= 0
##$TE2= 300
##$TE3= 300
##$TEG= 300
##$TL= (0..7)
0 120 120 120 120 120 120 120 
##$TP= (0..7)
150 150 150 150 150 150 150 150 
##$TP07= 0
##$TPNAME0= <>
##$TPNAME1= <>
##$TPNAME2= <>
##$TPNAME3= <>
##$TPNAME4= <>
##$TPNAME5= <>
##$TPNAME6= <>
##$TPNAME7= <>
##$TPOAL= (0..7)
0.5 0.5 0.5 0.5 0.5 0.5 0.5 0.5 
##$TPOFFS= (0..7)
0 0 0 0 0 0 0 0 
##$TUNHIN= 0
##$TUNHOUT= 0
##$TUNXOUT= 0
##$USERA1= <user>
##$USERA2= <user>
##$USERA3= <user>
##$USERA4= <user>
##$USERA5= <user>
##$V9= 5
##$VALIST= <valist>
##$VCLIST= <CCCCCCCCCCCCCCC>
##$VD= 0
##$VDLIST= <DDDDDDDDDDDDDDD>
##$VPLIST= <PPPPPPPPPPPPPPP>
##$VTLIST= <TTTTTTTTTTTTTTT>
##$WBST= 1024
##$WBSW= 4
##$XGAIN= (0..3)
0 0 0 0 
##$XL= 0
##$YL= 0
##$YMAX_a= 126792
##$YMIN_a= -114767
##$ZGOPTNS= <>
##$ZL1= 120
##$ZL2= 120
##$ZL3= 120
##$ZL4= 120
##$ABSF1= 10
##$ABSF2= 0
##$ABSG= 5
##$ABSL= 3
##$ALPHA= 0
##$AQORDER= 0
##$ASSFAC= 0
##$ASSFACI= 0
##$ASSFACX= 0
##$ASSWID= 0
##$AUNMP= <proc_1d>
##$AZFE= 0.1
##$AZFW= 0.1
##$BCFW= 1
##$BC_mod= 2
##$BYTORDP= 1
##$COROFFS= 0
##$CY= 11.3945322036743
##$DATMOD= 1
##$DC= 2
##$DFILT= <>
##$DTYPP= 0
##$F1P= 20.1537800932815
##$F2P= 0.134698688090026
##$FCOR= 0.5
##$FTSIZE= 0
##$FT_mod= 4
##$GAMMA= 1
##$GB= 0.15
##$INTBC= 1
##$INTSCL= 1
##$ISEN= 128
##$LB= 0.24
##$LEV0= 0
##$LPBIN= 0
##$MAXI= 10000
##$MC2= 0
##$MEAN= 0
##$ME_mod= 0
##$MI= 1.114404
##$NCOEF= 0
##$NC_proc= 0
##$NLEV= 6
##$NOISF1= 3.799351
##$NOISF2= 2.8
##$NSP= 1
##$NTH_PI= 0
##$NZP= 0
##$OFFSET= 15.70392
##$PC= 1
##$PHC0= -9487.825
##$PHC1= 12.40097
##$PH_mod= 1
##$PKNL= yes
##$PPARMOD= 0
##$PSCAL= 0
##$PSIGN= 0
##$REVERSE= no
##$SF= 200.130013532006
##$SI= 16384
##$SIGF1= 3
##$SIGF2= 2
##$SINO= 400
##$SIOLD= 16384
##$SREGLST= <1H.CDCl3>
##$SSB= 0
##$STSI= 0
##$STSR= 0
##$SW_p= 3612.71676300578
##$SYMM= 0
##$S_DEV= 0
##$TDeff= 0
##$TDoff= 0
##$TI= <>
##$TILT= no
##$TM1= 0
##$TM2= 0
##$TOPLEV= 0
##$USERP1= <user>
##$USERP2= <user>
##$USERP3= <user>
##$USERP4= <user>
##$USERP5= <user>
##$WDW= 1
##$XDIM= 8192
##$YMAX_p= 0
##$YMIN_p= 0
$$ End of Bruker specific parameters
$$ ---------------------------------
##NTUPLES= NMR FID
##VAR_NAME=  TIME,          FID/REAL,        FID/IMAG
##SYMBOL=    X,             R,               I
##VAR_TYPE=  INDEPENDENT,   DEPENDENT,       DEPENDENT
##VAR_FORM=  AFFN,          ASDF,            ASDF
##VAR_DIM=   8192,          8192,            8192
##UNITS=     SECONDS,       ARBITRARY UNITS, ARBITRARY UNITS
##FACTOR=    0.0002004,     1,               1
##FIRST=     0,             0,               0
##LAST=      1.6414764,     0,               0
##MIN=       0,             -114767,         0
##MAX=       1.6414764,     126792,          0
$$ Real data points
##PAGE= N=1
##DATA TABLE= (X++(R..R)), XYDATA
0@%%%%%%%%%%%qJ6j6J6j6K2l0L2l4M2m9N7o6P4q8J01j12J26j43J61j80K02k25
$$ 0 0 0 0 0 0 0 0 0 0 0 0 -8 8 -8 8 -8 14 -16 16 -18 24 -25 32 -34 40 -48 53 -59 67 -76 85 -95 107 -118
34a18K52k83L15l48L84m26M72n23N78o39P09p85Q72r73J090j227J387j579J818
$$ -118 134 -149 166 -182 202 -224 248 -275 303 -336 373 -412 460 -513 577 -650 737 -842 976
53I76k121K519l070L878n188P649j3755N4054Q1850j72913l9833J56989R548j68229
$$ 976 -1145 1374 -1696 2182 -3006 4643 -9112 44942 126792 -46121 -85954 71035 80583 -87646
67h7646R210J48950k2275j23345N2946J04079o6652q7370P1971N8324p5515l2989
$$ -87646 -78436 70514 48239 -75106 -22160 81919 15267 -72103 -132 58192 -17323 -50312
79e0312Q4165J8968q0177j3398O3147m089n6300R263N5312O121l3273j0548J9073
$$ -50312 33853 52821 -27356 -40754 22393 18304 -37996 -28733 26579 32700 -573 -11121 7952
92G952J1578k3098l5156J4604N2567m340n5789J3955O7399k4537q0980K9006Q1337
$$ 7952 19530 -3568 -38724 -24120 28447 24107 -31682 -17727 49672 25135 -55845 -26839 54498
105E4498l8695p2693N7776O5438p5788n8421Q2681L6343r3693q898J12320m779
$$ 54498 15803 -56890 886 66324 -9464 -67885 14796 51139 -42554 -51452 60868 56089
117E6089j12427K6191J05096n8936j10169P4007J03526q2017q1458R9702O7703
$$ 56089 -56338 -30147 74949 16013 -94156 -20149 83377 1360 -80098 19604 87307
128H7307j07177n4596J01324L1443r6385r571R0472n244p7106J7497N7401l2622
$$ 87307 -19870 -74466 26858 58301 -38084 -47655 42817 37573 -39533 -22036 35365 2743
140B743m1725M3230L1562m1117j4876L9192j069m1285L177L1947n292j8469J0363
$$ 2743 -38982 4248 35810 -5307 -20183 19009 17940 -23345 -20168 11779 6487 -11982 -1619
153a619J3132m617n046o382p584J2764J3665k0812j3750L3605J4362m4674j4363
$$ -1619 11513 6896 1850 -4532 -12116 648 14313 -6499 -20249 13356 27718 -16956 -31319
166c1319M9571Q058n2100L457N6127j2053n3968K0902M4455l5227l6639M6494
$$ -31319 18252 26310 -25790 -22333 33794 21741 -32227 -11325 33130 -2097 -38736 7758
178G758K7858n1503j1771N8231m075o4178J5539O2947k7852n7631M0680N2052
$$ 7758 35616 -15887 -27658 30573 26498 -37680 -22141 40806 12954 -44677 -3997 48055
190D8055m9433m4164N3267L1933n5459j8394N6008P069n1447M302M2820j7621
$$ 48055 -1378 -45542 7725 39658 -15801 -34195 21813 28882 -22565 -18263 24557 6936
202F936l5725K7163K8179l1169j6416L5134N322l8737P87L5985o799k9987J3805
$$ 6936 -28789 -1626 26553 -4616 -21032 14102 19424 -19313 -18526 17459 10660 -19327 -5522
215e522K5981j5550j9950J3324J0173j2764k983J0839m66l724N442l079j0396
$$ -5522 20459 4909 -15041 -1717 8456 -4308 -7291 3548 3082 -642 4800 1721 -8675
228h675O543R983j0570o293J6702M215j8955o51J6933p664j6512J4903J5431j8331
$$ -8675 -2132 7851 -2719 -9012 7690 11905 -7050 -7701 9232 1568 -14944 -41 15390 -2941
242b941q050K4546J03l2081L906L3220j0875l1744K1204L2878k7367l1024L0384
$$ -2941 -10991 13555 13658 -18423 -14517 18703 7828 -23916 -2712 30166 2799 -28225 2159
255B159K3468l6207j7035M0546J2425l8739l625L6707p213l7477J2470L3664j6724
$$ 2159 25627 -10580 -27615 12931 25356 -13383 -17008 19699 12486 -24991 -12521 21143 4419
268D419k5398K4939K1177k9536j8056K8373J0096k9645l792L1302K628k6786J008
$$ 4419 -20979 3960 25137 -4399 -22455 5918 16014 -13631 -17423 13879 16507 -10279 -9271
281i271K1816o214k0881O048J7735l627j1021M890Q176n057q403R54N788J256
$$ -9271 12545 6331 -14550 -8502 9233 5606 -5415 -525 7651 2594 -5809 -4855 933 2189
295B189l606k35O581K348r156n333Q491L024j1398m5J7255P97j8745J016J8550
$$ 2189 -1417 -1652 4929 7277 -1879 -7212 1279 4303 -7095 -7140 10115 10912 -7833 -6817 11733
310A1733p204k2293J0322K4021j1737k0816J7502J9581k2718k0162K2764J5269
$$ 11733 4529 -17764 -7442 16579 4842 -15974 1528 21109 -1609 -21771 993 16262
322A6262k4617q961K9343P153k9408l803K6517l422k7370P604K7227q628k2337
$$ 16262 -8355 -17316 12027 19180 -10228 -14031 12486 9064 -18306 -10702 16525 7897 -14440
335a4440J3149J9356j7540j9299J6580J5450j6100r703J9222R002j8794q529J4923
$$ -14440 -1291 18065 525 -18774 -2194 13256 -2844 -12547 6675 15677 -3117 -11646 3277
348C277M107j4907k091J5754L899j2069k468R980l52j2195j644J1575L578q440
$$ 3277 7384 -7523 -9614 6140 10039 -2030 -4498 5482 5130 -7065 -8709 2866 6444 -1996
362a996r58R889r8j3062k601J1758J717j1132J899J4866j497j5951Q57J3223n533
$$ -1996 -2954 6935 6837 -6225 -8826 2932 4649 -6483 -4584 10282 8785 -7166 -6309 6914 1381
377A381j4645Q601J7454p249j4402R505J1240j4751j2812J5028J1504j3985o050
$$ 1381 -13264 -4663 12791 5542 -8860 645 11885 -2866 -15678 -650 10854 -3131 -9181
390i181J7557M615j9358m898J6296K79j6139M243J8825l318j6412M146J2263q952
$$ -9181 8376 12991 -6367 -11265 5031 5310 -10829 -6586 12239 8921 -7491 -3345 8918 -34
404c4j2978R968J3128p790q593R852O562j2216q153R526N852q082j917J0905L053
$$ -34 -13012 -3044 10084 2294 -6299 3553 10115 -2101 -10254 -728 5124 -2958 -4875 6030 9083
419I083j0664m550P069J294p751J40J0187K513q256k078O549r44r534j74J0328
$$ 9083 -1581 -6131 938 2232 -5519 -5379 4808 7321 -935 -3013 3536 2592 -6942 -7116 3212
434C212J983p606J034Q615l406j1842J498J0408k090q218O254J0269o932j0957
$$ 3212 5195 -2411 -1377 7238 3832 -8010 -6512 3896 1806 -6412 -158 10111 3179 -7778
448g778N950P665q857o715J1719Q064j0249n514J0181J675j3295j640J3376J552
$$ -7778 -1828 5837 -3020 -9735 1984 10048 -201 -5715 4466 6141 -7154 -8794 4582 6134
462F134j0636K201J0982m585j1993L753R545n139p106P928P805p585o831O177
$$ 6134 -4502 -2301 8681 4096 -7897 -4144 5401 262 -6844 1084 8889 1304 -5527 650
476F50L387p833k497Q835L502o695k019N729l43p035m88O557J248m566K40N023
$$ 650 4037 -3796 -6293 2542 6044 -651 -2670 3059 2716 -4319 -4807 1750 2998 -1568 -1328 3695
492C695o15o287j136N099R38m365R28O281n55p278n33O209j075o436L024Q223
$$ 3695 3080 -3207 -4343 756 1694 -2671 -1743 4538 3983 -3295 -3828 2381 1306 -5130 -2106 6117
508F117k884p985L632O723o162p355P529P634p264n500Q764L756j1041l770J1031
$$ 6117 3233 -4752 -1120 5603 -559 -7914 -385 7249 -15 -5515 3249 7005 -4036 -7806 3225
523C225K664j0042L59J0803k123j1292K346R382m253p878O658Q044o543o499O252
$$ 3225 5889 -4153 -3794 7009 4886 -6406 -4060 5322 1069 -6809 -151 7893 1350 -5149 1103
538A103L418q078k834Q481K963o557r16N999r26o733J70N670K54l662J014L756
$$ 1103 4521 -3557 -6391 2090 5053 -1504 -2420 3579 2653 -4080 -3910 1760 2014 -1648 -634 3122
554C122r20m415j192K655J216j754K89L996J396m509l058K938J064m400M9O828
$$ 3122 2202 -2213 -3405 -750 466 -1288 -999 2997 4393 -116 -3174 -236 828 -3572 -3523 3305
570C305J102o173K16N954l014p824L703Q399l839o584O391N924r273p066Q823
$$ 3305 4407 -1766 -1550 4404 1390 -6434 -2731 5668 1829 -4755 1636 7560 -1713 -8779 44
585D4N632q516k015J1324J708j1585j659Q830k375r519M267J0143l341o682N406
$$ 44 5676 -2840 -4855 6469 8177 -3408 -5067 3763 1388 -8131 -3864 6279 2938 -3744 1662
600A662M629q033n145P228L671o253p39P150k51p654n87N476l39l832K278M986
$$ 1662 6291 -1742 -6887 341 4012 -2241 -2980 4170 3919 -3735 -4322 1154 815 -3017 -739 4247
616D247k98l751j540N01n45j627l21L030L848m75l098N32K067l226l812L272M136
$$ 4247 3949 198 -1342 -841 -1386 -3013 -3334 -304 3544 3069 -29 503 2570 -656 -4468 -1196 2940
633B940l040k212M829J180o819j308O816M3o029L450P908m595r047L870O154o832
$$ 2940 -100 -2312 2517 3697 -3122 -4430 2386 2429 -3600 -150 7758 3163 -5884 -2014 4140 -2692
649b692n689R182O863p386l809P973J284r912j791P937q3o119L065O280l942n472
$$ -2692 -8381 801 7664 278 -3531 4442 5726 -4186 -5977 1960 1877 -4242 -1177 5103 1161 -4311
665d311M026L364m962j390O394J260n959p63M417j639n173J389M951K88j845J293
$$ -4311 -285 3079 -1883 -3273 3121 4381 -1578 -2341 2076 437 -4736 -3347 1604 1892 47 1340
681A340J466j377k218j296mJ676J150j377j83K963L28l855o06L634k98l259J711
$$ 1340 2806 1429 -789 -2085 -2089 -413 737 -640 -823 2140 2468 -1387 -1993 1641 1343 -1916 -205
698b05L554k686l492K695J504m278J8O195J49n767J671N777l961p114L935O186
$$ -205 3349 663 -2829 -134 1370 -2908 -2890 3305 3454 -2313 -642 5135 1174 -5940 -2005 4181
714D181m768m872O459M886o264l871N682J838n780m33N470n39m568J682L194l085
$$ 4181 -587 -5459 1000 5886 -378 -4249 1433 3271 -2509 -2942 2528 1989 -2579 -897 2297 -788
730g88k369L978J752l920l72M483l52m627P2L576q19k835J275K756m65j665j9
$$ -788 -3157 821 2573 -1347 -1719 2764 2412 -2215 -2143 1433 614 -2221 -946 1810 1345 -320 -339
747c39N16K84l8r69n96J720J075k078j099K408P45k801l41K933j9k480P58J778
$$ -339 177 461 423 -546 -1142 578 1653 -425 -1524 884 1629 -1172 -1513 1420 1401 -1079 -321 1457
765A457j911j343K741N39l367M80M044j338m436K255M412l156m462L747M137l937
$$ 1457 -454 -1797 944 1483 -1884 -1404 2640 1302 -3134 -879 3533 377 -4085 -338 3799 -138
781a38l432M046K566m085j586L819O93l360K40K651j085j955K016J311k572p75
$$ -138 -3570 476 3042 -1043 -2629 1190 1883 -1477 -1237 1414 329 -1626 390 1701 -871 -1646
797a646K931K21k991J80K832m00k450N77K081l70j645p8R74M41l34p24o7J164
$$ -1646 1285 1506 -1485 -1305 1527 1127 -1323 -746 1335 965 -680 -758 216 657 323 -401 -468 696
815F96L41j595n42J879M84k206k97K177Q5j965M20J578j063j145J724O82k257
$$ 696 1037 -558 -1100 779 1263 -943 -1240 937 1022 -943 -523 1055 -8 -1153 571 1253 -1004
832a004o6K527q45k980J554L203k023l070K660K994k867k623K879J800l157j334
$$ -1004 -1070 1457 612 -2368 -814 2389 366 -2704 -44 2950 83 -2540 339 2139 -1018 -2352
848b352L046P88k493R1K181n87j564J235R82j811p24J849J39j929K71J921l62
$$ -2352 694 1482 -1011 -920 1261 674 -890 345 1327 -484 -1208 641 780 -1149 -878 1043 681
865F81j548O77J479m07j040l5K71R8k98o57o5J149M43j195j7J951M0k302j93J893
$$ 681 -867 -190 1289 882 -158 -193 78 176 -122 -779 -844 305 748 -447 -464 1487 1527 -775 -968 925
885I25o06k189R70J992j312j330K167J199k334n07K595l49l136P89K971j719l130
$$ 925 319 -1870 -900 1092 -220 -1550 617 1816 -518 -1025 1570 1221 -1915 -1126 1845 126 -3004
902c004K120L061k115k093L017J983l017j687K598M91k940l65K435k2j580J133
$$ -3004 -884 2177 62 -2031 986 2969 -48 -1735 863 1354 -1586 -1951 484 462 -1118 15
918A5J756j044j166J067L56j422k65J035l15r62L69P85j84mM59%M1M72n41j211
$$ 15 1771 727 -439 628 984 -438 -703 332 17 -945 -576 209 25 21 480 480 521 993 452 -759
938g59L41N99j315p38K070J272j786m17K395K3k784K1K341j001k559J519K401
$$ -759 -418 181 -1134 -1872 198 1470 -316 -733 1662 1685 -1099 -1078 1263 262 -2297 -778 1623
955A623j821j804K486J426k644n01L091j5l301K17K665j326k711J767K631j580
$$ 1623 -198 -2002 484 1910 -734 -1235 1856 1841 -1460 -1243 1422 96 -2615 -848 1783 203
971B03j595K400J404k416j198J802L8j966K26J837l36j113P19Q68p49l37P69m
$$ 203 -1392 1008 2412 -4 -1202 600 638 -1328 -1102 735 399 -714 5 873 124 -213 556 552
989E52p05J64K15o54j30M46k71k89J036O09r17q2J027o59j718O82J500j146j220
$$ 552 -153 11 226 -428 -558 -112 -383 -672 364 973 56 -26 1001 342 -1376 -694 806 -340 -1560
1008a560J819J306j967q13K219K54k513J52K530n65k417J012J981j631j701K075
$$ -1560 259 1565 -402 -1215 1004 1258 -1255 -1103 1427 862 -1555 -543 1438 -193 -1894 181
1024A81J520k030p48K246K32k427M8K029p53j783J192J721j159j120J349N75j589
$$ 181 1701 -329 -1077 1169 1401 -1026 -978 1051 298 -1485 -293 1428 269 -851 498 1073 -516
1041e16k88J435p3j163L65R16o66o03P22K30o89J34P06l05m85M63M8q13J14Q41
$$ -516 -804 631 558 -605 -240 676 10 -593 129 359 -330 -196 510 205 -280 183 231 -582 -468 373
1061C73k88n90P31M50j031k51J054r6j246N16J218o94j003J082P98j511o30J674
$$ 373 85 -505 226 676 -355 -606 448 352 -894 -378 840 146 -857 225 1023 -488 -1118 556
1079E56L39j640J37J739n95j695R07J485j220j199J477R24j651m20J672l3j719
$$ 556 895 -745 -608 1131 536 -1159 -252 1233 13 -1186 291 1215 -436 -856 816 783 -936
1096i36L08J650n98j295R01J024j169q11J209M69j224j06J121j49r46L69P48n79
$$ -936 -628 1022 424 -871 30 1054 -115 -926 283 752 -472 -578 543 394 -552 -183 565 -14
1114a4n94O58L22n48j7M39k07m06K85K92l65J8L74k01l32M25J65o06k1O50j74
$$ -14 -608 50 372 -176 -193 246 39 -367 -82 210 -155 -137 237 36 -296 129 294 -312 -333 317 143
1135A43o20N16O44p57n82R43L59j086j21J282k21j309M96J316p41j229R98J030
$$ 143 -477 39 683 -74 -656 287 646 -440 -561 721 500 -809 -313 1003 262 -967 31 1061
1153A061j251p73J446M96j565k88J615n3j522L40J433o47j276Q34J071r18q88
$$ 1061 -190 -963 483 979 -586 -874 741 688 -834 -494 939 292 -984 -150 921 3 -885
1170h85J010O10j036k82R58J13r22j4P51p3n05J13L81j27k93O9K33P6j70k69J43
$$ -885 125 735 -301 -583 375 488 -434 -448 303 230 -275 -162 219 92 -201 -132 101 177 7 -262 -119
1191a19M17j33n09K67N91m50o62O43P46q68o84J021N72j161m05J391J46j546Q5
$$ -119 298 165 -344 -77 514 64 -598 45 791 -77 -761 260 832 -329 -734 657 803 -743 -658
1210f58J583l05j583N81J483q94j362J127J234j345j029J413P78j439n02J449
$$ -658 925 620 -963 -382 1101 207 -1155 -28 1206 -139 -1168 245 1023 -416 -918 531
1226E31K15j443M6J292j35j151K45R64l60p90M18O35l67n72L32M20j53l33M1L18
$$ 531 746 -697 -651 641 506 -645 -400 564 204 -586 -168 467 100 -472 -140 280 127 -206 -165 153
1246A53P1l61j40N39K06o97l30Q67K67r19j78J081L0j231J67J358l95j413N99
$$ 153 224 -137 -277 262 468 -229 -559 308 575 -344 -522 559 589 -642 -475 883 488 -925 -326
1265c26J335q36j210J140J095j395r42J510P04j605m20J633R6j587J71J552m32
$$ -326 1009 173 -1037 103 1198 -197 -1139 371 1075 -530 -950 683 779 -808 -637 915 483
1282D83j412N67J214p24r18Q11O64q47m66P65L12o20j43M93j0k89J0J25K1J7r8
$$ 483 -929 -362 852 128 -790 21 685 -162 -628 137 449 -171 -314 179 169 -120 -110 15 36 53 -45
1303d5j21K37K69m06l13N68K41p79q4R61o5j077K11J181m16j159O46J098r06r81
$$ -45 -166 71 340 -66 -379 189 430 -349 -433 528 463 -614 -403 778 362 -797 -151 947 41 -940
1323i40J140P84j296o33J427L04j405N7J363l21j332N98J118q22q69R45N80j019
$$ -940 200 984 -312 -945 482 786 -619 -562 801 480 -852 -254 864 42 -827 118 698 -321
1341c21l39J103M5j000J65Q30l88n80N51L21o23j04N90j31m95M53L28o19j42P45
$$ -321 -660 443 488 -512 -347 483 95 -485 66 387 -236 -340 250 119 -376 77 405 -214 -356 389
1361C89o1q28L31P49n85o13Q49M57r99k50J062n3j033L60R65o31q54Q77O52j017
$$ 389 328 -500 -169 580 -5 -618 231 688 -311 -561 501 448 -585 -225 740 109 -745 132 784 -233
1381b33m37J075J47j121J34J128m18r54N84P56p85m52R09J71r64R3Q44m30p24
$$ -233 -670 405 552 -569 -435 693 275 -679 -95 661 -124 -576 333 504 -460 -367 477 47 -677
1400f77P26N04q48k03J024m8j049L28Q85o56p77R09N43j091k20J190n8j107M18
$$ -677 49 553 -295 -498 526 478 -571 -243 642 -14 -791 118 661 -430 -650 540 482 -625 -207
1419b07J109p63r95R69P39j250m91J296J92j246K23J322m14j121O02Q34r28o07
$$ -207 902 139 -856 113 852 -398 -889 407 599 -647 -424 898 484 -637 -35 799 -129 -736
1437g36R14K63r26K5J014k54p29N26N36o96l60P54n8q16J77O76m47m33Q32L34
$$ -736 178 441 -485 -460 554 300 -429 97 633 -63 -423 331 273 -543 -366 310 -137 -570 262 596
1457E96q25J0Q81m24r55N79O86r31n59J234M05j176lJ381k66j378N65J180r60
$$ 596 -229 -219 662 238 -717 -138 548 -383 -942 292 697 -479 -482 899 633 -745 -180 1000 40
1476D0j199J136P86j268l83J506K30j356K64J287n38j353O61Q66j053o26J166
$$ 40 -1159 -23 763 -505 -888 618 848 -508 -244 1043 505 -848 -187 679 -374 -1000 166
1493A66M78r94kJ053j54r17L65N74o82m98O24R0o16K13O68l23l25P07K17p80q3
$$ 166 644 -350 -352 701 547 -370 -5 569 -113 -611 13 103 -513 -300 368 45 -280 427 644 -136 -219
1514b19O11m10p97N44O34o89l27J138K55j031R0J042n19j206O65R25r98p59J243
$$ -219 392 -18 -815 -271 363 -326 -653 485 740 -291 -201 841 322 -884 -219 706 -292 -1051 192
1533A92N90j224j11J459q8j395L44J125p88j136Q40Q20j005m47J310L13j042L8
$$ 192 782 -442 -553 906 818 -577 -233 892 104 -1032 -192 628 -377 -824 486 799 -243 -205
1551b05J004m32r67M00O51p15m29P56K78o38R4P21k19n42L96K90o37j75N11j64
$$ -205 799 367 -600 -200 451 -264 -693 63 341 -297 -203 518 299 -243 153 443 -194 -369 142 -22
1571b2n59M50N64m71k63P32Q6q31M3P75m37p74N24P03p19l82R68K51r63K8J022
$$ -22 -581 -131 433 -38 -301 431 517 -314 -271 504 67 -707 -183 520 -199 -581 387 638 -325 -297 725
1592G25l59r80M34P84p46o51R33N19r54j34J022m2r64K00Q06n51p07O30N21o74
$$ 725 366 -614 -180 604 -142 -793 140 659 -295 -429 593 551 -413 -213 593 42 -665 -35 486 -188
1612a88k92Q23N7p28J42O89l97n45M39L51n76j50N85L1n83K11N44l18m10M40J70
$$ -188 -480 343 400 -328 -186 503 106 -439 0 351 -225 -375 210 241 -342 -131 413 95 -315 125 295
1633B95n51l8N77j51m95L37M06m44k37N57Q2o22P8O07k46n62M09M43n78k56O73
$$ 295 -256 -294 283 132 -363 -26 380 -64 -301 256 338 -284 -206 401 155 -407 2 445 -133 -389 284
1654B84J20o99P8O48k76o12M33M95n33l58O27J89o72pO59k06o43L91N10m52l72
$$ 284 404 -295 -217 431 155 -457 -24 471 -62 -420 207 396 -276 -283 376 170 -473 -82 428 -24 -396
1675c96N28K27o11m1N98j34n38K37M66l83l00M59K08n06l6M70n9m50K11L05l09
$$ -396 132 359 -252 -293 305 171 -367 -130 336 -47 -347 112 320 -186 -222 248 189 -261 -50 255 -54
1696e4k39L94J35m24M2M10j21l66K45K59l38j90L90L3m04R9L95k02l57L42K52
$$ -54 -293 101 236 -188 -146 264 143 -223 22 281 -57 -247 143 176 -228 -129 266 64 -293 49 301
1717C01l80j51M00Mm19J13M42k56l30L08K60l66j44M00J6m46P1M30k16l65L32
$$ 301 -79 -230 170 174 -245 -132 310 54 -276 32 292 -74 -218 182 198 -248 -177 253 37 -328 4
1738DL02m16j36M27N0m16M7L78j74l54K92K66l62j61M03R5m15P2L29j21l40K01
$$ 4 306 -110 -246 181 231 -185 -138 240 66 -288 4 270 -92 -253 150 245 -170 -98 231 110 -230 -29
1760b9K55k82j71L13Q9k92J5L21j39k77J68K35k40j47K71Qk21N7K15j50j35J82
$$ -29 226 -56 -227 86 175 -117 -102 219 80 -197 -29 206 -34 -181 90 98 -123 -66 149 -1 -136 46
1782D6O8k07j4K32m6k55J82J75k24j44K97O2l49L0K98p0l41K46K41k91j87L49
$$ 46 114 -93 -107 125 79 -176 6 181 -43 -187 110 172 -177 -147 151 81 -260 -14 227 -64 -251 98
1804I8J19l76j1L31k6l47J25L55k48k68K85J95k88r6L19j5l41J00K77j45k07J60
$$ 98 217 -159 -170 161 135 -212 -87 268 20 -248 37 232 -56 -152 167 152 -189 -89 188 43 -164 -4
1826dJ88k27o6K23J0j95JJ83q7j49J57P2k03QJ78m4j67J56Q8j99jJ45Ok00M1K20
$$ -4 184 -43 -109 114 124 -71 -70 113 26 -123 34 106 -97 -89 89 45 -122 34 122 -77 -78 67 73 -127 -86 134
1852A34j39j62J96J18k50n7K89J6l27R6K58j31k51K23K30k67j50K64P2k97LK95
$$ 134 -5 -167 29 147 -103 -160 129 145 -182 -86 172 41 -210 13 243 -24 -174 90 162 -135 -132 163
1874A63o1k53J47J93j96j49K35Q8k57k5L00p5k24Q0J80j68j09K11K6j59m4K28
$$ 163 102 -151 -4 189 -7 -156 79 167 -90 -115 185 110 -114 -34 146 -22 -131 80 106 -53 -97 131
1896A31p2k18J61J11j56r4K08J7k00M8J82r2j65J82Q1j57o8J64K1k23J06J35j01
$$ 131 59 -159 2 113 -43 -137 71 88 -112 -64 118 26 -139 43 124 -33 -101 63 84 -139 -33 102 1
1919Aj46K03J08k63LK12m8k22J04K31j81j50K22P8k29o2K99n3l02J76K15j88j68
$$ 1 -145 58 166 -97 -94 118 70 -152 -48 183 2 -148 74 152 -77 -139 160 107 -195 -19 196 8 -160
1942a60J93J50k75p2L31l5k56N8K47j55k04K18J29k34j04K80J1k41L0K64j12k47
$$ -160 33 183 -92 -164 167 132 -124 -66 181 26 -178 40 169 -65 -169 111 122 -119 -89 175 63 -184
1964a84J67J67j90o8J99%j91N0J91j14j19J23Q2j90oK05n2j75J28R9j34r9K02
$$ -184 -17 150 -40 -108 91 91 -100 -50 141 27 -92 31 113 -77 -83 122 70 -105 23 122 -12 -111 91
1987I1Mk36O2K41j15k19K15J70k83r6K97M6l45M0L16j03k81J87K50k60k01L17
$$ 91 95 -141 -79 162 47 -172 43 213 -70 -166 131 177 -168 -128 188 85 -196 -9 241 -19 -220 97
2009I7J21l73l2L53o8l17J50K99k13k24K77J23k91q1K71M6k84N2K77j25k02J69
$$ 97 218 -155 -187 166 98 -219 -69 230 17 -207 70 193 -98 -179 92 138 -146 -94 183 58 -144 25
2031B5J06j90l7K23l9j53L6J62j57r7K06K8j99M7K22j03j92J81P6k35m8K46lk78
$$ 25 131 -59 -96 127 88 -65 -29 133 -24 -121 85 113 -86 -39 183 80 -112 69 145 -90 -138 108 105 -173
2055a73J53K21k05j97K71J60k95j25L65j7l71N5L71k09k63K86K47k88j75L54J5
$$ -173 -20 201 -4 -201 70 230 -65 -190 175 158 -213 -158 213 4 -259 27 274 -14 -189 165 180
2076A80l85l0L97q3l12J78K73j83k30K90J16l37m1L07l3k58R0J71j37j41J84J46
$$ 180 -205 -235 162 79 -233 -55 218 35 -195 95 211 -126 -167 140 107 -151 -61 110 -27 -168 16 162
2098A62j75J4J33p9j53R4Q7k06j9K03L6k02J50J67j97j62K10O9k85j1L36j28k84
$$ 162 -13 1 134 55 -98 -4 83 -123 -142 61 97 -105 45 212 15 -147 63 132 -153 -164 172 44 -240
2121b40J95K60k30k08L29J41l33r2L41n6m10J38L60j28l34L00K67l52j52L79K1
$$ -240 -45 215 -15 -223 106 247 -86 -178 163 107 -303 -165 195 67 -267 33 300 -52 -204 175 196
2142A96l89J4K95o1k43J91K45k51j66K59J03k81J0K24j00j96J58N6j39k6K06M4
$$ 196 -193 -179 116 55 -188 3 248 -3 -169 90 193 -88 -78 146 46 -150 8 64 -75 -101 105 149
2164A49k35J30J68k15j68K04N6k01K9K45q8k32J61K06k20j43K63N5l07MK98o8
$$ 149 -86 44 212 -3 -171 33 89 -112 -83 162 74 -158 3 209 -11 -154 109 164 -143 -139 159 91
2186I1l24J86K41j92j77K66J40l06q7K71m0k53J13K57j64j92K44J50k59q1K20
$$ 91 -233 -47 194 2 -175 91 231 -75 -162 109 69 -184 -71 186 22 -170 74 224 -35 -116 104
2207A04J4k78J07K48j77j66J99J23k31o4K66l8k32J08J64j15j57J77Q0k22l6K48
$$ 104 118 -160 -53 195 18 -148 51 174 -57 -121 145 107 -125 -17 147 32 -125 52 132 -90 -126 122
2229A22j8k28J04J87j85j17K06P4k34%J82rj87O4J76j42j18J95N1j95PJ63n0j62
$$ 122 104 -124 -20 167 -18 -135 71 145 -89 -89 93 84 -103 -39 137 -5 -123 72 123 -72 -65 98 48 -114
2253a14J41J26k07q6K13M5k15M8J70o3j95J44J42j45j36K09L7k07L5K13j00k01
$$ -114 27 153 -54 -140 73 118 -97 -49 121 58 -137 7 149 4 -132 77 114 -93 -58 155 55 -146
2275a46J69J07j81p1K13K7j89m2K19o2j79J30J42j29r8J56K6k14J5J69j4j15Q0
$$ -146 23 130 -51 -122 91 118 -71 -113 106 44 -135 -5 137 8 -90 66 92 -122 -107 62 48 -67 13
2298A3J36j50r0J24N0j45J9J18k8j10P2R9j11n2J03j9q5M3J46j24j00J01K2r5
$$ 13 149 -1 -91 33 83 -62 -43 75 47 -63 9 108 -3 -55 48 29 -56 -13 133 9 -91 10 32 -63
2322f3K4J59j0j22O8Q3j99q3J38Rj15O5J79k2j64N4J37j54j28J63J31k09l4J77
$$ -63 -39 120 110 -12 56 139 -60 -143 -5 4 -111 -46 133 111 -53 1 138 -16 -144 19 150 -59 -93 84
2346H4pk04Q1J50q5o0J45O4j53q9L3Mp6J9J53nl9J04J3j06n4J6m2o7R1O8k6LN2
$$ 84 77 -127 -46 104 19 -41 104 168 15 -74 -41 -37 -113 -94 59 54 15 119 132 26 -28 -12 -54 -121 -30 38 12 15 67
2375F7k9m4K2R4q4l7J12l6j74oJ26p8j5J13J50p3q4N7J1k08j05K12%j05O4J98
$$ 67 38 -6 16 110 26 -11 101 65 -109 -115 11 -67 -82 31 181 108 24 81 92 -116 -221 -9 -9 -114 -50 148
2401A48j00p8Q0N7j43l9J52Qj42k2O3j3j08J05J15k2J0O8l7j25m4Mm5j6J02Q7
$$ 148 48 -30 50 107 -36 -75 77 85 -57 -79 -16 -29 -137 -32 83 61 71 139 102 -23 -67 -63 -108 -124 -22 65
2427F5LK7J3k1j33K3M6o0qP7L7j40L8J17p1n3J02R2r5l3M1n1j75K1J43k6l1J30
$$ 65 68 95 108 87 -46 -23 23 -37 -45 32 69 -71 -33 84 13 -40 62 154 59 26 67 16 -159 -138 5 -21 -52 78
2455G8J01j19n7L7j2j37J1J30j9n7O5Q0j31o1J30K5q6N2Q4r0j10Q1K0q2j8J63
$$ 78 179 60 3 40 28 -109 -98 32 13 -44 21 101 -30 -91 39 64 -22 30 114 24 -86 -5 15 -67 -85 78
2481G8Ln5M4P4j05j36L8P6o8J0R8L3j02oJ03o0q6Q2M9n2k9L8pn8j3P5l0k6O9L0
$$ 78 81 26 70 144 39 -97 -59 17 -51 -41 57 90 -12 -18 85 25 -61 21 70 18 -11 27 20 -38 -51 24 -6 -32 37 67
2511F7n8l9L1k5p1N2O1po2J11jn8j5L2p6k2Q1R7n4j11Q9N4j22J5J16m2j42P6J12
$$ 67 9 -30 1 -24 -95 -43 18 11 -51 60 59 1 -14 18 -58 -80 1 98 44 -67 22 76 -46 -31 85 43 -99 -23 89
2540H9q8n5O5P8j18l9J27K4j15JJ21n9j06Q7O6p1n6P4L3o8j2O3j1q1M4K1oj2J4
$$ 89 1 -54 11 89 -29 -68 59 83 -32 -31 90 31 -75 12 78 7 -49 25 58 -10 -22 41 30 -51 -7 14 8 -4 10
2569A0J6KJ0K3o5k2j4j0J9K6Q0r5J7M8%r2K4P4k0q0O6J05j01j26Q2R2o7n2J63
$$ 10 26 28 38 61 -4 -26 -40 -50 -31 -5 75 -20 -3 45 45 -47 -23 51 31 -49 17 122 21 -105 -23 69 2 -50 113
2598A13K8j60l8R0j6j00K8J52l1j14J03K2p7j07O0O7j7MP8nr8l6QM1m2L1O5Nk1
$$ 113 141 -19 -57 33 17 -83 -55 97 66 -48 55 77 0 -107 -47 20 3 7 85 80 -18 -54 -46 -5 -47 -16 49 54 33
2627C3j9l3pm8j5N2J08Lm4M1q4Nq6M8Q7j2m1R1Pq5m3j0L7n8O0Q3M9j17j3Nk5r2
$$ 33 14 -19 -26 -74 -89 -37 71 74 30 71 -13 -8 -94 -46 41 29 -12 79 86 1 -42 -52 -15 -73 -13 70 119 2 -11 -6 -31 -123
2659a23J02R5Nm1J5K6j08o8NP0PL4R3K7j33o8l3kN0K3M6N0m2k2k5k2o4rQ2N8L7
$$ -123 -21 74 79 38 53 79 -29 -97 -92 -22 -15 19 112 139 6 -62 -95 -97 -47 -24 22 72 30 8 -17 -39 -103 -112 -30 28 65
2690F5k6L5n2j00k3mR6K0K8N5k3o6o7M2l1j5M0J09K3m1l1rj03j1L6P1L0J6nl1
$$ 65 39 74 22 -78 -101 -105 -9 11 39 94 71 5 -62 -20 -51 -66 -26 83 106 65 34 25 -78 -89 -53 18 48 64 59 28
2720B8Kp7m0N9PO2jN5j6p0p4j2M6k0N5M8K7p2n1K5o6LK1J10n1J2L9J4j02l5L1
$$ 28 30 -47 -87 -28 -21 41 40 95 79 9 -65 -77 -31 -51 4 52 79 7 -44 -19 -85 -82 -61 49 -2 10 49 63 -39 -74 -43
2751d3L1kK4M3Nn1o3N1pJnJ1M9M0k2k8n4J3m2K4N5O0m3l0Ql5n3L4J2M7n4N2N2
$$ -43 -12 -14 10 53 58 7 -56 -5 -12 -11 -16 -5 44 84 62 34 -20 -7 -49 -25 30 90 47 17 25 -10 -63 -29 -17 30 -24 28 80
2784H0p9q9P0O4q6n3J44M1j07p1J05Op8j2P8nm6P1P7o9q8O0J9n9K3R3m0p8L1L8
$$ 80 1 -88 -18 46 -40 -93 51 92 -15 -86 19 25 -53 -65 13 8 -38 33 110 41 -47 13 32 -27 -4 89 49 -29 2 40
2814D0l7p4N8N8n3J1J4K3rk3j0k9K7Pj9j2R2Jr1lR5j2j35K1J52m8q7M6J01j02
$$ 40 3 -71 -13 45 -8 3 17 40 31 8 -2 -31 -4 3 -16 -28 64 65 -26 -29 66 54 -81 -60 92 44 -43 3 104 2
2844Bo2O4N2j13j3J60o7j06M4J08p9j62R8J91j44p5J13J09j67n0J05L8q5PQ4l6
$$ 2 -60 4 56 -57 -70 90 23 -83 -39 69 -10 -172 -74 117 -27 -102 11 120 -47 -97 8 46 -39 -32 52 16
2870A6k7L0jo3K7N9On3M1O5j13l8O0J9m3NO1l5pN9m8r4J4Q1p5o7J62J34j66j33
$$ 16 -11 19 18 -45 -18 41 47 -6 35 100 -13 -51 9 28 -15 -10 51 16 9 68 20 -74 -60 21 -54 -121 41 175 9 -124
2900a24J80J00k10o4K07K4j93QJ35l4j68Q4J33q1l9J69pj91j5J39r0j63J26J81
$$ -124 56 156 -54 -118 89 113 -80 -72 63 29 -139 -55 78 -3 -42 127 120 -71 -86 53 -37 -200 -74 107
2924A07q1j19J83M1j14r4Q2L1q6N5N5j10j9P8J8q3O7J68j22j01J35M8k04p3J02
$$ 107 26 -93 90 131 17 -77 5 36 -50 5 60 -50 -69 9 27 -56 11 179 57 -44 91 139 -65 -138 -36
2949c6M5r9N6K17m7j63J17K9j92m7J68rj96R6J96q3j84R2K24j56j59J45J40k33
$$ -36 9 -90 -34 183 136 -27 90 119 -73 -120 48 39 -157 -61 135 52 -132 -40 184 28 -131 14 154 -79
2973g9p3J32n8q0Q0J79n8k7J45l8j13q2J04r1j62J94J42o7n5J07K2j80K4J42r1
$$ -79 -152 -20 -78 -158 -78 101 43 16 161 123 10 -72 32 -59 -221 -27 115 48 -7 100 122 -58 -34 108 17
2998A7j12J33K2j43o1J85j6j83J59K48r2k13R1Q3k43j10J96R5j33J9K23n5j55
$$ 17 -95 38 60 -83 -144 41 25 -158 1 249 157 -56 35 118 -125 -235 -39 56 -77 -58 165 110 -45
3021d5K6J34j91j08J68J18j67j3J75n7j81J06J90j08q7J22M3j88q5J20k5p5J41
$$ -45 -19 115 -76 -184 -16 102 -65 -78 97 40 -141 -35 155 47 -40 82 125 -63 -148 -28 -53 -128 13
3044A3J01o6qJ00l2k43L9J67o8j71J91J48j90j06J97O7k21J8K47p7k10J00R3j53
$$ 13 114 48 40 140 108 -135 -96 71 3 -168 23 171 -19 -125 72 139 -82 -64 183 106 -104 -4 89 -64
3068f4j38K04J02j87O3K21j08k30Q1J59j59j26J58J27j57k7J65k2j83N0J37p3
$$ -64 -202 2 104 -83 -20 201 93 -137 -56 103 -56 -182 -24 103 -54 -81 84 62 -121 -71 66 -7
3090gp5J19J6j57M0J35j8j60J03J38j47o1J39lj75O0J31n7j08J18J33k01m9J87
$$ -7 -82 37 53 -104 -64 71 53 -107 -4 134 -13 -74 65 62 -113 -53 78 21 -87 31 164 -37 -86 101
3114A01j7k30Q6K14q6k08J46J86k04j48J83P9j66k0J74j0k38J20J40j10p6J03
$$ 101 84 -146 -60 154 68 -140 6 192 -12 -160 23 102 -64 -84 90 80 -158 -38 102 -8 -84 19
3136A9J04j76o8K23m6j69N9J45q4j08J31O9j37k1J19j1j34M4J10j01p1J56O2j57
$$ 19 123 -53 -121 102 56 -113 -54 91 7 -101 30 99 -38 -59 60 49 -85 -41 69 -32 -103 53 115 -42
3160d2pJ89p5j75J06J30j56r6J71N1j46jJ55l0k01J47J03j28p3J44kj70M3J56
$$ -42 -49 140 65 -110 -4 126 -30 -126 45 96 -50 -51 104 74 -127 20 123 -5 -78 66 64 -106 -63 93
3184I3m2j34O4J71j58r1J38M4j79JJ54k8r5P1R9j39l5P4Q0j67NJ52m8j47J11J18
$$ 93 51 -83 -19 152 -6 -97 41 85 -94 -93 61 33 -62 9 108 -31 -66 8 88 -79 -74 78 30 -117 -6 112
3210A12j04j44J45J16j80RJ65q3j79J17Q5r4o2J47J03k18J1J58m0j74N8R0j3q4
$$ 112 8 -136 9 125 -55 -46 119 36 -143 -26 59 -35 -97 50 153 -65 -54 104 64 -110 -52 38 25 -59
3234e9J21M9j72l1J44j1j13O8J11j01n7Q2L2j45qJ26l2o8P4J08j55q6J35J2j18
$$ -59 62 111 -61 -92 52 41 -72 -4 107 6 -51 31 63 -82 -90 36 4 -64 10 118 -37 -123 12 24 -94
3259i4N1J39k5j48R4R6j50q3J66N1j62J3J72q1j34N8J19j16m4J27O6j63m7J80
$$ -94 -43 96 71 -77 17 113 -37 -120 46 97 -65 -52 120 39 -95 -37 82 -34 -78 49 115 -48 -95 85
3283H5n4j35Q3J18q3q6J10L9j38jJ08m9m7M3R8q4o4N4P1j29J7J03k6q4L2O9o5
$$ 85 31 -104 -21 97 14 -72 38 77 -61 -62 46 -3 -50 -7 91 7 -57 -3 68 -61 -44 59 33 -51 -19 50 -15
3310a5o3Q9J9j02K1J16k6j09M4J08j05n2O3N2o0j3J41p6j08Q2Q6r4r0J24M5j27
$$ -15 -78 11 30 -72 -51 65 39 -70 -26 82 -23 -75 -12 40 -20 -33 108 32 -76 6 92 -2 -92 32 77 -50
3336e0QQ7J4j09lJ58j01p7J13L3r8l3Q8j8o7L6R0p7m6O9N0j42J8Q9k2p2N6P6q6
$$ -50 -42 45 59 -50 -53 105 4 -73 40 73 -25 -58 30 12 -55 -19 71 -6 -52 17 67 -75 -57 32 10 -62 -6 70 -16
3365a6n3Q3J1p0K0J09o9p2N8L9q2j5R3K2n9o7J15j7j16J07N3o6p9J08M2r9k6R9
$$ -16 -69 14 25 -45 -25 84 15 -57 1 40 -42 -57 36 58 -1 -68 47 30 -86 21 74 8 -71 37 79 -20 -46 53
3393E3k6j19J38N7q3p8Q5N5j33J7J11Kj21K8P1k2n2M4K4q0lR0l6q3O4L0n1l9Q9
$$ 53 27 -92 46 103 20 -58 27 82 -51 -34 77 79 -42 -14 57 35 -17 27 51 -29 -32 58 22 -61 3 33 -18 -57 32
3422C2L1j17j1J15j7q4L8J02p0q2Q2K2p9j5R8k4o6O2L8n8o1P9On3pQ5j5j14P7
$$ 32 63 -54 -65 50 33 -51 -13 89 19 -63 19 41 -38 -53 45 21 -45 17 55 -3 -64 15 21 -32 -39 46 31 -83 -6
3451fO5n1o9R1j8q5M4J23n1q3J7P3m9m6Q0K6p0l1Q4k2p7L9N6o5RL7L2q4nQ9k0
$$ -6 59 8 -61 30 12 -73 -29 94 43 -40 -23 50 1 -45 35 61 -9 -40 44 22 -55 -16 40 -25 -16 21 53 -31 -36 53 33
3482C3j00O7O2p6l7P4M5j42J5J04k6p2P5N8j17l3Q5K7o6n1J52m3o3J7P1o5l5Q9
$$ 33 -67 0 62 -14 -51 23 68 -74 -59 45 19 -53 22 80 -37 -70 15 42 -24 -75 77 34 -29 -12 59 -6 -41 48
3510D8k4q0K4O1J6j14O7M3p2k2R0K9j16J1O1j2q6N8N7rr1J15k3q2KO2j8q4P7J04
$$ 48 24 -56 -32 29 45 -69 -2 41 -31 -53 37 66 -50 -39 22 10 -76 -18 39 30 -61 54 31 -51 -49 13 -5 -89 -12 92
3540I2j04%L9J5j01OJ24l2q5N9M8q6n7J09J4p8NJ10m1p8N3K4j8r7J12K6n2j2O4
$$ 92 -12 -12 27 42 -59 -53 71 39 -46 13 61 -25 -82 27 41 -37 -32 78 37 -41 12 36 18 -79 33 59 7 -5 59
3569E9m6p8N9N1n4k4M6J3p6J4P5n4n0M6O5m0l8P3m2j4k9M1j9o4J00M1o9nN3j4
$$ 59 13 -65 -6 45 -9 -33 13 26 -50 -36 39 -15 -65 -19 46 6 -32 41 -1 -15 -44 -3 -22 -86 14 55 -14 -19 34 20
3599B0n3L9O8n7o1L9N9n6n4O9M0r3J4O4Or3N8K4r5%J03j4l8J1O8p3o0L5J11q1
$$ 20 -33 6 74 17 -44 -5 54 -2 -56 13 53 -40 -26 38 44 -49 9 33 -62 -62 41 27 -11 0 68 -5 -65 -30 81 0
3629@m5O0L7n7l1N3l7j7L2N0p7M5M0k2j05K1Q0j6p6Q5N6r0rK3L3o6J6L4k3m2N3
$$ 0 -45 15 52 -5 -36 17 -20 -37 -5 45 -32 13 53 31 -74 -53 27 11 -65 20 76 -14 -23 0 33 -33 -17 17 -6 -48 5
3660EN2r1j3J33o7m4K1M5m4p0O1M3n8oP0Nn6K6J8n0k7N3L5n3j8O7k2m3K0O0k6
$$ 5 57 -34 -47 86 19 -25 -4 41 -3 -73 -12 31 -27 -33 37 42 -14 12 30 -20 -47 6 41 -12 -30 37 15 -28 -8 52 26
3691B6o3O7On5rO2n2k3K1M7Qn7N3M9j18J2P6l5l3J2N3m6m3N8J9n9j4L9rnj2L3
$$ 26 -37 30 36 -19 -28 34 -18 -41 -20 27 35 -22 31 80 -38 -26 50 15 -18 -6 47 1 -42 16 35 -24 -38 1 -8 -13 -25 8
3723Hm9QQ3j1p6N2L9m9k3NM5m0kJ8POl7M7k5n6N8L8m5l9O1j8o8L1N1j2p3M0P7
$$ 8 -41 -33 50 39 -37 15 54 5 -18 -13 32 -8 -10 8 15 21 -16 31 6 -50 8 46 1 -38 23 5 -63 -32 19 7 -66 -26 51
3756E1k8o4P5Mo6OO4l1n0N5J6%o3J1K3j6k3M9j5m9N3Pj5n4Q1Kk5j6L0%p5L9L6
$$ 51 23 -41 34 38 -28 -22 42 11 -39 16 32 32 -31 -20 3 -13 -36 13 -2 -51 2 9 -6 -60 21 23 -2 -18 12 12 -63 -24 12
3789A2m4J6M0k7m2L9L6k3o7O4L0l3l6N9k7k7J8L1on3M8nj2l7P3k5l8m2P4Ol8O0
$$ 12 -32 -16 24 -3 -45 -6 30 7 -60 4 34 1 -35 24 -3 -30 -12 19 13 -40 8 3 -9 -46 27 2 -36 -78 -4 2 -36 24
3821B4J4m3j6L4L2n2MN9o5j5PL4k1QJ8ll8K0J4ql9J0N9n6qN5jm8KN5k2l8kQm6
$$ 24 38 -5 -21 13 45 -7 -3 56 -9 -24 -17 17 -4 4 22 19 -19 1 15 7 -32 -22 37 -19 -27 28 27 -21 -19 36 14 -24 -26 -18 -64
3856f4J6Q2j5l0oM5n7NM9J3l8pJ8po0M4J5J0j4K5J0l9m2L8jm7K6N3Mk1L9Nn9J4
$$ -64 -48 34 19 -11 -17 28 -29 -24 25 38 0 -7 11 4 -56 -12 3 13 -1 24 34 -5 -47 -9 -10 -57 -31 22 26 5 44 49 -10 4
3890Dk0Ok4j0Q6m6l7K2Qk7J8M8j0k4K3Kk6l5J4K3m6K1L1J3%Qm3kl3O7J1n7ON9
$$ 4 -16 -10 -34 -44 42 -4 -41 -19 -11 -38 -20 28 18 -6 17 19 -7 -42 -28 -5 -51 -30 1 14 14 22 -21 -23 -56 11 22 -35 -29 30
3924C0pn8M0K4m3oL6K7l6JJ6o1j8J5N1J0LlL8o7o6N5J9l2K6L4ql8M4om6nO0l0
$$ 30 23 -35 5 29 -14 -20 16 43 7 8 24 -37 -55 -40 11 21 24 21 59 -8 -74 -19 0 -32 -6 28 20 -18 26 20 -26 -31 29 -1
3958aKL3mm7%j8L3j8J1N5l7l8MM8l3Pj4J8nj8M4j4m9K2L3j7pM0j2J6j8qj0k2L
$$ -1 1 34 30 -17 -17 -35 -2 -20 -9 46 9 -29 -25 23 -10 -3 -17 1 -4 -22 22 8 -41 -19 14 -3 -10 30 18 34 16 8 -2 -24 -21
3993b1N1rJ7l4K2m3lJ3J1J3K5l0L0o3L0oPl0L0K8k8J3j6k6j2J9lL2oL2m4j5NL0
$$ -21 30 21 38 4 26 -17 -20 -7 4 17 42 12 42 -21 9 3 10 -20 10 38 10 23 7 -19 -31 -12 -15 17 11 43 -1 -16 -11 19
4027A9n0j1M7K8m1L7j6j8m3L2J4j0k1Q4on9LqL5l2K6j4J1j7K7k0nj5M6mpj2J8
$$ 19 -31 -42 5 33 -8 29 13 -5 -48 -16 -2 -12 -33 51 45 -14 -11 -19 16 -16 10 -4 7 -10 17 -3 -8 -23 23 19 12 0 18
4060A8nl7PK4j9K9J0j2m5J3NrK6K5k0n5Q1kp1PJ9K6k4QL9l4k0j6M3l0J7J9Rjm1
$$ 18 13 -24 -17 7 -12 17 27 15 -30 -17 -12 -21 5 30 10 -45 36 34 -37 -30 -11 15 -9 -1 38 4 -16 -32 11 -19 -2 17 26 25 -16
4095a6M2l3j4j1L7J9l9N4k1J1n3J9Qj3J1K7k7M1l2j3k1K2K0l0K8K1Lp0mL7rLJ2
$$ -16 26 -7 -21 -32 5 24 -15 39 18 29 -24 -5 3 -10 1 28 1 42 10 -3 -24 -2 18 -12 16 37 40 -30 -34 3 -6 -3 9
4128InkLK0k6k7jJ8J9rN0L5r0j1l9M5J6j9M2K0n8j0L3k1m1M2OjJ1oK9Mo4J8J3
$$ 9 4 2 5 25 -1 -28 -29 -11 8 -1 49 84 -6 -17 -56 -11 5 -14 28 48 -10 -20 13 -8 -49 -7 -1 -2 9 3 32 36 -28 -10 3
4163CQj9M0L5k9o0j5K1RJ4qL9j2m1jJ6nj2pN8k2jj0kj0k1L1JJ3k7N2qm0l6K9R
$$ 3 11 -8 32 67 38 -22 -37 -16 -7 7 -1 38 26 -15 -16 0 -5 -17 -24 34 12 11 1 -1 -11 -32 -1 0 13 -14 38 30 -10 -46 -17 -8
4199hJ1lL0L1r3J0K3j3k4K1L5j1l0KL2k1l1J4J8nJ5K0Kk7rpM6k6J6m1L5pl9M3
$$ -8 3 0 30 61 -32 -22 1 -12 -36 -15 20 9 -21 -19 13 -8 -39 -25 -7 -12 3 23 25 -2 -11 -18 28 2 18 -23 12 5 -34 9
4233Ij1qj7L1nKk3L6nMj4KnL5m0L9j6k1j0RK9j5l5K0J9J4l1ROl0Pk2M4j1j7J5
$$ 9 -2 -10 -27 4 -1 1 -22 14 9 13 -1 1 -4 31 -9 30 14 -7 -17 -8 21 6 -29 -9 10 24 -7 2 8 -22 -15 -37 7 -4 -21 -6
4269fJ3Ok5M8o5J2K2J8j1Jnoj7lj3%L9jk9M2qJ2l0PJ0k2L9Kl6jJ9Jm2J7J3L0j0
$$ -6 7 13 -12 36 -29 -17 5 23 12 13 8 2 -15 -18 -31 -31 8 7 -22 20 12 24 -6 1 11 -11 28 30 -6 -7 12 13 -29 -12 1 31 21
4306B1Ql5j8J4k5RN7nll4J8j4kNOl8L6Mj2k0K2QlolN2j8Rl7J3l2J6mOOMK4Prm0
$$ 21 29 -6 -24 -10 -35 -26 31 26 23 -11 7 -7 -9 -4 2 -36 0 4 -8 -28 -6 2 -1 -7 -10 42 24 33 -4 9 -23 -7 -11 -5 1 5 29 36 27 -13
4346a3MM2l6%LNJ3l7J0joLK2J4k1L2J6l8l3LN2l4J5j6M2k9m7K8K2m0L2OQl5K2
$$ -13 -9 33 -3 -3 0 5 18 -19 -9 -10 -16 -13 9 23 2 34 50 12 -21 -18 34 0 15 -1 41 12 -35 -7 15 -25 7 13 21 -14 8
4381Hm5K1L4Lk4RK4l3l2L6l4J6J8L0Kqj2rNMj9J5Qj6J6l5K1l2K1NL1mK7k5m4%
$$ 8 -37 -16 18 21 -3 6 30 -3 -35 1 -33 -17 1 31 33 25 13 4 9 13 -6 9 17 1 17 -18 3 -29 -8 -3 28 24 51 26 -18 -18
4417a8j4mKPK2L0j1k0j1j3JK8k0M2k3j2J3jqj3M0kk0K8Jj4n1rJ2K8LLM8k1k1K2
$$ -18 -32 -36 -34 -27 -5 25 14 -6 -17 -30 -29 -1 -21 21 -2 -14 -1 -2 -10 -23 17 15 -5 23 24 10 -41 -50 -38 -10 -7 -4 44 23 2 24
4453B4j3m5K8J5JPj5rK6j3kK8k2K2j2L3n1m7J5K7k5N6pL7k5n7O8p8j0L7K4j4J1
$$ 24 11 -34 -6 9 10 17 2 -7 19 6 4 32 10 32 20 53 2 -45 -30 -3 -28 28 21 58 33 -24 44 -34 -44 -7 17 3 14
4486A4j1j8Qj5J4k4N8Jj7kj8k9ooN6J9j1L8j3j3n6K3K6j4j8L0J1jkpl8l7N8K4
$$ 14 3 -15 -7 -22 -8 -32 26 27 10 8 -10 -39 -45 -51 5 24 13 51 38 25 -31 -8 18 4 -14 16 27 26 24 17 -21 -58 0 24
4520B4jk3qJ9m5%L0j0j4L6M4k3n5L9m7k8L0M2jK1k7L2n1lL4j4j7K7K5k4l5JRm7
$$ 24 23 0 -8 11 -34 -34 -4 -14 -28 8 52 29 -26 13 -34 -62 -32 10 9 30 3 35 -16 -19 15 1 -16 11 36 12 -23 -22 -13 -60
4554f0K8O2njK8k9ln3K8Mk2N9j9L2n2rK0l3PL6J6k8K6k6kk6K6j6K7nL1rm2qJK6
$$ -60 -32 30 25 24 52 23 20 -33 -5 -1 -23 36 17 49 -3 -12 8 -25 -18 18 34 6 32 6 4 -22 4 -12 15 10 41 32 -10 -18 -17 9
4590Ij8kK3J8l9L7j3j3j8M3l4Mj1M3k2l4K9k8qJ5N4j8j5J6j4j9KJ4J6l3K4L4j0
$$ 9 -9 -11 12 30 -9 28 15 2 -16 27 -7 -3 -14 29 7 -27 2 -26 -34 -19 35 17 2 18 4 -15 -13 1 17 -16 8 42 32
4623C2o9M0Kjj8N7j6j0j5L7k2l6NNL1j1RK6n8KoN3l5nJPj1lMj8K6J5nj0J3Rnl3
$$ 32 -37 3 5 4 -14 43 27 17 2 39 17 -19 -14 -9 22 11 20 46 -12 -10 -16 37 2 -3 -2 5 -6 -9 -5 -23 3 18 13 3 16 25 20 -13
4661a3l0K8j2L4L0k6l0K1J2l7MM9Jm3K8L4n8J3j3N7lp9N7Lk6k7O6l3m6J0M8lo
$$ -13 -43 -15 -27 7 37 11 -19 2 14 -23 -19 30 31 -12 16 50 -8 5 -8 49 46 -33 24 27 1 -26 40 7 -39 -29 19 16 10
4694A0qL9j9k2RJ8pj6Kk8K7rM8l7j9j5J3lL2oj7j9K5j4KK8mll1j0M5ll0N6k8j9
$$ 10 2 41 22 0 9 27 20 4 6 -22 5 -4 44 7 -12 -27 -14 -17 15 9 -8 -27 -2 -16 -14 14 10 7 -24 -34 11 8 -22 34 6 -13
4730a3J1M9k7l1PL6l9j7L0kLk3M2j4k5L0J9l4j2PM5p0L3J6k8MoOlJ5k5M9l6LJ5
$$ -13 -2 47 20 -11 -4 32 -7 -24 6 4 7 -16 26 12 -13 17 36 2 -10 -3 42 -28 5 21 -7 -3 -9 -3 -6 9 -16 33 -3 0 15
4765A5mqO%k4J7OoK1n5M0Km3M5Mk8J5J7j7l2K6L1Pn4oK1J1k2lL3k5J2K0k0j5J8
$$ 15 11 3 9 9 -15 2 8 2 23 -32 8 10 -33 12 16 -12 3 20 3 -29 -3 28 35 -19 -25 -4 7 -15 -18 15 -10 2 22 2 -13 5
4801EQmqQPRj9%Pk0n0P0k8OJ6j3k3%K2J7l2L2%j2j0K9j5l3J7J2lJ2PJ8l3l2L6
$$ 5 13 9 1 9 16 25 6 6 13 -7 -57 13 -15 -9 7 -6 -29 -29 -7 10 -22 10 10 -2 -12 17 2 -31 -14 -2 -5 7 14 32 -1 -33 3
4838CK3j3J4j3j8l0J5K6j4j3K0J4Mj4L6qn1kL1J6n2N1%m8kN5m5J2J0J5jj6j0L6
$$ 3 26 13 27 14 -4 -34 -19 7 -7 -20 0 14 18 4 40 32 -19 -21 10 26 -26 25 25 -23 -25 30 -15 -3 7 22 21 5 -5 31
4872C1m7j2M4nn4N4jok5K1K4n1K7K4qm9L1krn0Q7Np2N0Jlk3OJ6k3j7P4No0QL2
$$ 31 -16 -28 16 11 -43 11 10 4 -21 0 24 -27 0 24 16 -33 -2 -4 -13 -63 24 29 -43 7 8 5 -18 -12 4 -19 -36 38 43 -17 -9 23
4908B3j8k5J9pL1j4OLl5k8L6J7rnK3k3oM1k0j5kL3k1j6N3n1Kj8K6Kk6N6J0m7R
$$ 23 5 -20 -1 -8 23 9 15 18 -17 -45 -9 8 -1 -6 17 -6 -12 29 9 -6 -8 25 4 -12 41 -10 -8 -26 0 2 -24 32 42 -5 4
4943Dj0J1l1J3M9Ln6J6J1nl6L9Rl7L3Qj4k4J5L4k3n5N5N2p7k0N4pk4j3N6j8j6
$$ 4 -6 5 -26 -13 36 39 -17 -1 10 5 -31 8 17 -20 13 21 7 -17 -2 32 9 -46 9 61 -16 -36 18 11 -13 -26 30 12 -4
4976dJ8mk2l8M1K0J4k1K0k4%PL2l6k4K9lj2J6%Kl0L8j5mL0mPo1J9K2j0j3N6j8
$$ -4 14 10 -12 -50 -9 11 25 4 24 0 0 7 39 3 -21 8 5 -7 9 9 11 -19 19 4 0 30 26 33 -28 -9 13 3 -10 46 28
5011B8l0j3N2m4MJ1K2Oo0KJ01q6j7L9J0m6jM9J2o6L8Ll6NL5K4o1N6K3o1mpM7l7
$$ 28 -2 -15 37 -7 -3 8 30 36 -24 -22 79 -7 -24 15 25 -21 -22 27 39 -27 11 14 -22 -17 18 42 -19 37 60 -1 -5 -12 35 -2
5045bl1M8qpjJ4Lm9M8jj5k4M3J4p7K0K5p%PM7m2nK9k1nkN9m6k2L4Qm6J1J0k6j1
$$ -2 -33 15 7 0 -1 13 16 -33 15 14 -1 -25 18 32 -45 -25 0 -7 -7 0 47 5 0 29 8 3 1 60 14 -8 26 34 -12 -1 9 -17 -28
5082b8O9k5l8L1K2po8J5J5M8k4j3M1ro6QN8k7l2N2Rk9lJ2l5KM0Kk1ML2j7m2mM7
$$ -28 41 16 -22 9 31 24 -44 -29 -14 34 10 -3 38 29 -37 -29 29 2 -30 22 31 2 -1 11 -24 -22 18 20 -1 3 35 18 -24 -28 19
5117A9j7K%Pj7K9j1j9j0J3K4mrJlj7LK2k5OL6lo1J5N3j5l7l3O5K4o5K2M1j8l6
$$ 19 2 4 4 11 -6 23 12 -7 -17 -4 20 16 7 8 5 -12 -9 13 -12 -6 30 27 -34 -19 34 19 -18 -51 14 38 -27 -5 36 18 -18
5152a8J0K7k7J2Nok0NL8j0l9K0L8o1K4J9Pn8M5%k3QJ0Jk3J8k2L1k7K4K2Jl9J6
$$ -18 -8 19 -8 4 9 3 -17 -12 26 16 -23 -3 35 -26 -2 17 24 -34 11 11 -12 -4 6 7 -16 2 -20 11 -16 8 30 31 -8 8
5186Hj1%j2P1n2k2J1N6m0k6K5j4l0K6L2m0NL8K8m8j8J4M5n2k5L7L3o3M2j5Nk8
$$ 8 -3 -3 -15 56 4 -18 -7 49 9 -17 8 -6 -36 -10 22 -18 -13 25 53 5 -13 1 46 -6 -31 6 39 -24 18 3 8 -20
5218b0L6KJ0k5j3K6k2j7M0k4J2Prj3jK8kj2pL7l4LOOk4PL7k7k8L4onk5K6J1k3
$$ -20 16 18 28 3 -10 16 -6 -23 17 -7 5 12 3 -10 -11 17 15 3 -4 33 -1 2 8 14 -10 -3 34 7 -21 13 7 2 -23 3 14 -9
5254irL2J2m0L5j1k6k2M5L5k8m5O5rl1j9J6K0k9J2K0l2J8qL6n1J6J9rQl8M6m0
$$ -9 -18 14 26 -14 21 10 -16 -38 7 42 14 -31 34 25 -6 -25 -9 11 -18 -6 14 -18 0 -8 28 -23 -7 12 3 11 -27 19 -21
5287b1j1L4J8k2mJ6ojmK9n1QJ0N1l5k4J7j1j3M3qj8j7J1Kk2K8L0j0k9RK5k5qN9
$$ -21 -32 2 20 -2 -6 10 4 3 -1 28 -23 -15 -5 46 11 -13 4 -7 -20 23 15 -3 -20 -9 -7 -29 -1 29 19 -10 -1 24 -1 -9 50
5322E0j4k2k1K1rj2L6n2j7M4jL0k2j1K5n2J2L1k2j1K9nK3m6J8J2m1RN7k5m3K7
$$ 50 36 14 -7 14 5 -7 29 -23 -40 4 3 33 11 0 25 -27 -15 16 -6 -17 12 7 30 -16 2 14 -27 -18 39 14 -29 -2
5354bJ0j0J4m2P7j3m7L9pj3j0PK9m6LN7j3n1L1j0Jk4M1Ko3N7k3Rj8L9pl8M3oj8
$$ -2 8 -2 12 -30 47 34 -13 26 19 6 -4 3 32 -14 -11 46 33 -18 13 3 4 -20 21 23 -40 17 -6 3 -15 24 17 -21 22 16 -2
5389bJl5K7j0K5OJk1nM8nk3qL8k8k8L1j4j1nM1J1m0j8O0k8j4J5%j9%J0K8l7K2
$$ -2 -1 -36 -9 -19 6 12 13 -8 -13 35 30 7 -1 37 9 -19 12 -2 -13 -18 23 34 -6 -24 36 8 -6 9 9 -10 -10 0 28 -9 13
5424A3mMRmOl4K2kmj9jK0J4lj1L2m8nJ4RKk8K6k3JL0Pl4QJ8ppj7J1Lj9J2N0p1
$$ 13 9 13 22 18 24 -10 12 10 6 -13 -14 6 20 17 6 38 -10 -15 -1 8 10 -18 8 -15 -14 16 23 -11 -3 15 8 1 -16 -5 -2 -21 -9 41 -30
5463c0J3J0Ppj7N6j8k8M1l0pk5N0l0oOM8m5oOK4j5k1L6oj5j0K2%j4mRj0K9kjk4
$$ -30 -17 -7 0 -7 -24 32 14 -14 27 -3 -10 -35 15 -15 -21 -15 33 -12 -18 -12 12 -3 -24 12 6 -9 -19 3 3 -11 -15 -6 -16 13 11 10 -14
5500a4J6J4j5jk8L9j4kK8jj1nnj1oJ0MlOOK4m3RJ6J3kj3Rk5K9l2j1K1J6l2K8k5
$$ -14 2 16 1 0 -28 11 -3 -5 23 22 11 6 1 -10 -16 -6 -2 -5 1 7 31 -12 -3 13 26 24 11 20 -5 24 -8 -19 2 18 -14 14 -11
5537a1PJ2KlL4j2k7%j4PnK0k0k4P1lm5J8k3M2m4PQNMk6L2j3k8N0k0Rm%ml9J9L1
$$ -11 -4 8 10 7 41 29 2 2 -12 -5 -10 10 -10 -34 37 34 -11 7 -16 26 -18 -11 -3 2 6 -20 12 -1 -29 21 1 10 6 6 2 -37 -18 13
5575A3j3k8M7NJ6m6K2j0k4J7L3l5J8j0%J4m6L8rk4K2oL2k8Rk8L8j3J4k1mMK5m5
$$ 13 0 -28 19 24 40 -6 16 6 -18 -1 32 -3 15 5 5 19 -27 11 2 -22 0 -6 26 -2 7 -21 17 4 18 -3 -7 -3 22 -23
5609b3K3k6K1j8JJ9jj3j0L1K7l3Moj3N1l6M2p9N7J3l3J9k5L4pl9K0J7lkj3lk2
$$ -23 0 -26 -5 -23 -22 -3 -4 -17 -27 4 31 -2 2 -4 -17 34 -2 40 -39 18 31 -2 17 -8 26 19 -20 0 17 14 12 -1 -4 -26
5643b6K6L9m2j2MJ0j5JJ4K2n1M0onjK5Jp1N5kk7J3K0K0rk3J8j1Mk8K3k0K1L1l1
$$ -26 0 39 -3 -15 -11 -1 -16 -15 -1 21 -30 10 4 -1 -2 23 24 -47 8 6 -21 -8 12 32 23 0 18 7 11 -17 6 -14 7 38 7
5678Glk2J7K3k1PjQk7NJ6j3j4L3qmqK9k1Pj8pJ9j4J5k4j3NJ3K0k0rK9j7K5l3J3
$$ 7 4 -18 -1 22 1 8 7 15 -12 -7 9 -4 -18 15 7 3 -5 24 3 10 -8 -15 4 -10 5 -19 -32 -27 -14 6 -14 -23 6 -11 14 -19 -6
5715fQrj1K0ppRJ6l2L0k2jLJ7kOknPj1JJ0k7O1m9lj0L1j7MpJ1J6k8kL2k0l1L4
$$ -6 2 -7 -18 2 -5 -12 -3 13 -19 11 -11 -12 -9 8 6 12 10 5 12 1 2 12 -15 46 -3 -6 -16 15 -2 2 -5 6 22 -6 -8 24 4 -27 7
5754GNj3j1M2qj8j6KOKj8L2k9L8l8j2J3J6L2l5oK0K4m3k7L8Ppj3J0rORjMJ2j9
$$ 7 12 -1 -12 30 22 4 -12 -10 -4 -2 -20 12 -17 21 -17 -29 -16 0 32 -3 -9 11 35 -8 -35 3 10 3 -10 0 -9 -3 6 5 9 21 2
5791Bj5j9J9K7j8k1M2j0JkRj1Nj1J1nl0RK7j0j5oJ9J7j2PPj7L2j7l9M3l1J2rL6
$$ 2 -13 -32 -13 14 -4 -25 17 7 8 6 15 4 9 -2 9 4 -26 -17 10 0 -15 -21 -2 15 3 10 17 0 32 15 -24 19 -12 0 -9 27
5827B7j8j2rK1mj9J0MJ4j1kMooK1Jm6L5K1k9oJ1PrlPl3J6J4J2j1MkLj9QNJpnL0
$$ 27 9 -3 -12 9 5 -14 -4 0 14 3 1 5 -1 -7 14 15 -31 4 25 -4 -10 1 8 -1 -4 3 -30 -14 0 12 1 5 3 6 -13 -5 0 1 -6 -11 19
5868A9m5NQJ%K2j6Mj3lL4k3J4kJ4j3j6J9j4J0j%o4N5pL1k2J5nlj4J1Mj6qmL9m1
$$ 19 -26 -21 -13 -12 -12 10 -6 -2 -15 -18 16 -7 7 5 19 6 -10 9 -5 5 4 4 -60 -5 -12 19 -3 12 7 4 -10 1 5 -11 -19 -23 16 -25
5906b5K5plJ4Kk0J5j1lK8l1J5Mk5OK0K1k1j3%K0rRj1J5LPj6j2J2J0j6J2Mqk5j
$$ -25 0 -7 -10 4 6 -14 1 -10 -13 15 -16 -1 3 -22 -16 4 25 4 -9 -9 11 2 11 0 15 18 25 9 -3 9 19 3 15 19 11 -14 -15
5943a5mL1k7mlL0n4L1J8k4L5l8K2j4J3K9k2j6JJ6PnnM4o2K4j9qK8J0rk4K4k4R
$$ -15 -19 12 -15 -19 -22 8 -46 -15 3 -21 14 -24 -2 -16 -3 26 4 -12 -11 5 12 7 2 46 -16 8 -11 -19 9 19 10 -14 10 -14 -5
5978eLMOLj2MJ4j3J3k5J0oj8J3J8Mj2L1l5J1J9l6j2K5KQm1M2ql1R%j0J5ooK6k0
$$ -5 -2 2 8 11 -1 3 17 4 17 -8 2 -4 -22 -9 9 13 1 32 -3 8 27 -9 -21 4 6 14 -27 15 7 -24 -15 -15 -25 -10 -16 -22 4 -16
6016a6J5nK6k0pj3L0j6mJ9m3J7J9OpnQnkJ7k5M4Ql6K2J5m7J5jnmRPl4K7k7jN1
$$ -16 -1 -6 20 0 -7 -20 10 -6 -10 9 -34 -17 2 8 1 -4 4 -1 -3 14 -11 33 41 5 27 42 -5 10 9 4 0 9 16 -18 9 -18 -19 32
6054C2o3K1k1N0k5J2M0l8j1j3M1j1Ok9PrLj2K5M0l7J5k7k5L1k4K5K5j3j2MolJ4
$$ 32 -31 -10 -31 19 -6 6 46 8 -3 -16 25 14 20 -9 -2 -11 -8 -20 5 45 8 23 -4 -29 2 -22 3 28 15 3 7 1 -2 12
6088A2k3kM5l7klM3k0k4L7k2njK2ljpl4j0L9Lm0M5J4%m4K9j8J0Pj2K9j4Ok1j5
$$ 12 -11 -13 32 -5 -7 -10 33 13 -11 26 4 -1 -2 20 17 16 9 -25 -35 4 7 -33 12 26 26 -18 11 -7 3 10 -2 27 13 19 -2 -17
6124a7J8l0J5QlLK2j0k1J6J8j7J5j3L1l0J7j7oK4pn0L4K2rKnLpqkK4j8J2KK3m7
$$ -17 1 -29 -14 -6 -9 -6 16 6 -15 1 19 2 17 4 35 5 22 5 -1 23 16 -34 0 22 13 15 10 13 6 -2 -4 20 2 14 16 39 -8
6161hj4K7mK2oj4j3L1l3L6j4k6KLnJ8j8L0k0JPqRk9K7k5J7J8lk0LL3k1j5J1K0
$$ -8 -22 5 1 23 17 3 -10 21 -12 24 10 -16 -14 -11 -16 2 -16 14 -6 -5 2 -6 3 -26 1 -24 -7 11 8 -12 -9 24 3 -12 -1 19
6197A9l1L2j1%l2K4J0J3KQn3K8jJlqkK7m6J4L5j0J4pj5Kk0J4m2L5K5oJ3k7l%j
$$ 19 -12 20 9 9 -23 1 11 24 26 34 -19 9 8 9 6 -2 -4 23 -23 -9 26 16 30 23 8 10 -10 4 -38 -3 22 16 29 2 -1 -1 -2
6234bk7O2k5j2nj0N8j3l4J9Qj9k5L8kk3J2L5n4K7l2L0k3K5Nj6K2Lm2K7Ll0N0j1
$$ -2 -29 33 8 -4 -9 -19 39 26 -8 11 19 0 -25 13 11 -12 0 35 -19 8 -24 6 -17 8 13 -3 19 22 -20 7 10 -20 30 19
6268A9JRk7Lj1rJ5J8J3l4J2JMj7oL7j3k6KJ8k5QpJ6pJ2mpJ5m2K3NmJ6jqk2K8K3
$$ 19 20 29 2 5 -6 -15 0 18 31 -3 9 10 14 -3 -9 28 15 -11 -9 9 -16 -8 -15 1 -6 6 2 -5 10 -32 -9 -4 -8 8 7 -1 -23 5 28
6307B8j3j8lK6qj3K6kl0j0O2n3J7Nj3mRj1M1k6j6JN0k9LNm6RQK0lQj4%k6K7j0
$$ 28 15 -3 -6 20 12 -1 25 23 -7 -17 45 -8 9 14 1 -3 6 -5 36 10 -6 -5 45 16 19 24 -22 -13 -5 15 12 20 6 6 -20 7 -3
6344cL3k2j6L5l1QrRqj2kL1k4J8k5K0k5N6m5J8K4l6QjMrpJ8j9Nj7%K4m4L5Qk1
$$ -3 30 8 -8 27 -4 4 -5 4 -4 -16 -18 13 -11 7 -18 2 -23 33 -12 6 30 -6 2 1 5 -4 -11 7 -12 -7 -24 -24 0 -44 -9 -1 -22
6381b2j5L6K8j6rkJqnK6mJ1j1plk1M7k5%J4Ok7J7k4J1kJ6K8j9l5LK3j2l4M0j1
$$ -22 -37 -1 27 11 2 0 1 -7 -12 14 10 21 10 3 0 -21 26 1 1 15 21 -6 11 -13 -2 -4 12 40 21 -14 -11 12 0 -34 6 -5
6417eOK2Jj5Nm2K3j1J2oK9Nk0J4k6k8L6%jml2L9Pj1j2K0J0k7J0J2j7Rj9k2M5M
$$ -5 1 23 24 9 14 -28 -5 -16 -4 -10 19 24 4 18 -8 -36 0 0 -1 -5 -37 2 9 -2 -14 6 16 -11 -1 11 -6 3 -16 -38 7 11
6453A1k4K4l4M1m1L3l3J0KlJ0j1J0j2K2Km0J7Mj6KL4Jj6j5L0l2K0qK3ql3M1j4
$$ 11 -13 11 -23 18 -23 10 -23 -13 -11 -14 -4 -15 -5 -17 5 7 -33 -16 -12 -28 -26 8 9 -7 -22 8 -24 -4 -12 11 3 -30 11 -3
6487cl5K4K3Kj7%%k9M1ljlj9K5k5J4J4k5K2k9K2l4J7K9k0PK4j0k6Jk8N5j8J7o
$$ -3 -38 -14 9 11 -6 -6 -6 -35 6 3 2 -1 -20 5 -20 -6 8 -17 5 -24 -2 -36 -19 10 -10 -3 21 11 -15 -14 -42 13 -5 12 6
6522FK0j7j7KK5n6L5KrJ4j8M0Jm5K4Ll5K6JM7p7J4L2J9l6Lk3K2Mj3KLk7M0Rl6
$$ 6 26 9 -8 -6 19 -37 -2 0 -9 5 -13 27 28 -17 7 10 -25 1 2 49 -28 -14 18 37 1 4 -19 3 7 -6 -4 -1 -28 12 21 -15
6558a5M2j2k0%J3Ln9N1J1m5K9K6nk9j6K6J4j4moRj1mL3j1m0M8l9K3JP%k7MKRj5
$$ -15 27 15 -5 -5 8 11 -48 3 14 -31 -2 24 19 -10 -26 0 14 0 -4 -10 -1 -12 -16 17 6 -34 14 -25 -2 -1 6 6 -21 -17 -15 -6 -21
6595b1L5j3qL1Pl2jJ5Lm3L0rlm5J9N2jj4j1K1k6NK0l9J9JK7jl0lK9j2QJ9j4j4
$$ -21 14 1 -7 24 31 -1 -2 13 16 -27 3 -6 -9 -54 -35 17 16 2 -9 12 -14 -9 11 -28 -9 -8 19 18 -12 -15 14 2 10 29 15 1
6631ApJ0K3m8L2Om3PK4jJ3nK0k3l8L5kMk0L0k7J5j7J8Kk7K3oj1Jj2K2J6j7K6m7
$$ 1 -6 4 27 -21 11 17 -26 -19 5 4 17 12 32 9 -29 6 4 8 -12 18 -9 6 -11 7 9 -18 5 -1 -12 -11 -23 -1 15 -2 24 -23
6667b3Nj1K4l3P3n7L7Jl3L1j4j6J5J3Lj0qPj2j0J4N%Ln%k2K3k0K7k3K9j8KKnj5
$$ -23 -18 -29 -5 -38 35 -22 15 16 -17 14 0 -16 -1 12 15 5 -3 4 -8 -18 -4 1 1 4 -1 -1 -23 0 -20 7 -16 13 -5 -3 -1 -6 -21
6704b1OJ8j3j3L5j0mJ9l7N0o5PL6Kk5nJ3NJrOJ8PJ3j4j7j1J2j2QJ0Kj0Kj5K1k9
$$ -21 -15 3 -10 -23 12 2 -2 17 -20 30 -35 -28 8 10 -15 -20 -7 -2 -1 -10 -4 14 21 34 20 3 -8 4 -8 0 10 12 2 4 -11 10 -19
6741a9L2J3l9J6j0J9j5J3j0Jk9J5K7Kl6K6J9l3jK4k4lM0j9llpj2LK1j4LRj6L0
$$ -19 13 26 -13 3 -7 12 -3 10 0 1 -28 -13 14 16 -20 6 25 -8 -9 15 -9 -12 28 9 6 3 -4 -16 -13 8 -6 -3 6 -10 20
6776B0pj7rjPKK1J4k3qQmmj8J6PjK3j2j3lJ7j4J1kPj2J7ql9L1kQl1J5k6K3Ol4
$$ 20 13 -4 -13 -14 -7 -5 16 30 7 -1 7 3 -1 -19 -3 4 3 26 14 1 -2 15 1 12 10 17 5 22 14 -25 6 4 12 -19 -4 -30 -7 -1 -35
6815c5N1pjj7J5k5NK4Mj8Mjj2L3j8kNrj6mL6k5RLj2JL0l3KJ6Nl5L4J2k2J7nk9
$$ -35 16 9 8 -9 6 -19 -14 10 14 -4 0 -1 -13 20 2 0 5 -4 -20 -24 12 -13 -4 -1 -13 -12 18 -15 -13 3 8 -27 7 19 -3 14 9 -20
6853b0K4Kj4J7j9J2rJ4k5K8k7mJ1j8J2J1j%nL2qrj2j0K3k6J7k1QkN1p7M1rJ3j
$$ -20 4 6 -8 9 -10 2 -7 7 -18 10 -17 -21 -10 -28 -16 -5 -6 -6 -11 21 13 4 -8 -18 5 -21 -4 -25 -17 -19 32 -45 -4 -13 0 -1
6889aj0J4k3K0q%J1k1J1lL1rl3N%J1J8qk5J6j8K5lk2L1J8k3j6J2J6j9J0L4n1R
$$ -1 -11 3 -20 0 -8 -8 3 -18 -7 -10 21 12 -21 -16 -16 -5 13 5 -20 -4 -22 3 0 -22 9 27 4 -12 0 16 -3 7 41 -10 -1
6924aK8km5J9KrK0J1l9K0j0K3k9K7k5nJ2mK6k2k5nJ7J7j3MJ0LJ9k7j4K2J0j6K6
$$ -1 27 25 -20 -1 1 -8 12 23 -16 4 -6 17 -12 15 -10 -15 -3 -7 19 -3 -28 -33 -16 1 -12 -8 2 5 24 -3 -17 5 15 -1 25
6959B5jrjj0Pk2J7Mk3L1%m7L0L1l3Mpoj6J3J4J3j2Rk3PL1k8J2kmj9M1l9j1K0k
$$ 25 24 15 14 4 11 -11 6 10 -13 18 18 -29 1 32 -1 3 -4 -10 -26 -13 1 14 2 11 -12 -5 26 -2 10 8 4 -15 26 -13 -24 -4 -6
6996fk0L0j2J0j4Kkkj2K1j1J7Olm1K6J6j6PNJ5j9K1l4L9l2J2Mj1Rj9K3J2j6k3
$$ -6 -26 4 -8 2 -12 -10 -12 -14 -26 -5 -16 1 7 4 -37 -11 5 -11 -4 1 16 -3 18 -16 23 -9 3 7 -4 5 -14 9 21 5 -18
7031a8L0j7LK1Jj8J4Ll5qL9l0L1k1j7N1k2Lj6Ol6M9j9Ql8J2N0k9rL2k8pK8m3J5
$$ -18 12 -5 -2 19 20 2 16 19 -16 -24 15 -15 16 -5 -22 29 7 10 -6 0 -36 13 -6 2 -36 -24 26 -3 -12 20 -8 -15 13 -30 -15
7066a5nJ4NPqjNj4%K0j0QJ1l4RQqj0J8oJ4j0j0J7k8%jJ6MPJL7m0j1M0n1M2l7K9
$$ -15 -20 -6 -1 6 -2 -3 2 -12 -12 8 -2 6 17 -17 -8 0 -8 -18 0 -6 8 -2 -12 5 -23 -23 -24 -8 -4 3 4 41 1 -10 30 -21 21 -16 13
7105A3j5J0nm0O6m7L7k0k8L0qJ3J5l3L3l1K3jQk7j9L9k2j1KM3k5J9k3qJ1J2j5
$$ 13 -2 8 3 -37 29 -18 19 -1 -29 1 -7 6 21 -12 21 -10 13 12 20 -7 -26 13 -9 -20 -18 25 0 19 -4 -12 -1 11 -4
7138dK8k2j9J1KoK4Pm0K0j0Qmj1K3k4J1jJ4j2j2L8k8K6j3J9j6l0K9Pm3L3njmJ5
$$ -4 24 2 -17 -6 -4 -10 14 21 -19 1 -9 -1 -5 -16 7 -17 -6 -7 7 -5 -17 21 -7 19 6 25 9 -21 8 15 -28 5 0 -1 -5 10
7174A0l1j8L3jPJ8m4qL1oK5k6J1k1NJN1n2K3K2q3Q8l3K3m0k0L1OOj8J8l1L7j2
$$ 10 -21 -39 -6 -7 0 18 -26 -34 -3 -9 16 -10 1 -20 -15 -14 37 -15 8 30 -53 35 2 25 -15 -35 -4 2 8 -10 8 -23 14 2
7208BJ6k3mKJ1LJ2j7J4j4qpj1K2nJ5J3l4k3J2J7nLk2J2J0J3mL1k7j8L2k3k4L4
$$ 2 18 -5 -9 -7 4 7 19 2 16 2 -6 -13 -24 -2 -7 8 21 -13 -36 -24 -7 -12 -9 -31 -19 -9 4 0 31 4 -14 18 -5 -29 5
7243Ej3K0o8L2L5j9K6k3K1l0OoPQJK8m1J2K3m0NLRlQk2L7j6j1Nkj9M4l5J5qK1
$$ 5 -8 12 -56 -24 11 -8 18 -5 16 -14 -8 -14 -7 1 2 30 -11 1 24 -16 -11 -8 1 -2 6 -16 21 5 -6 -1 -3 -22 22 -13 2 -6 15
7280A5k8M5l7k3J2K7l6K7Pk3K7Mom3M0Jk0OJ6qJ1j1l4L2JJj7mjK6k1J5Oj7J4j5
$$ 15 -13 32 -5 -28 -16 11 -25 2 9 -14 13 17 11 -32 8 9 -11 -5 11 3 14 3 -31 1 2 3 -14 -18 -19 7 -14 1 7 -10 4 -11
7316a1RJJ7k1KJ4j9jK2k1j0J5mJ3k3J8qPl0K8J3pkj9L0m6K6J3j4k2K4Ljl4L7k
$$ -11 -2 -1 16 -5 -3 11 -8 -9 13 -8 -18 -3 -7 6 -17 1 -7 0 -30 -2 11 4 2 -17 13 -33 -7 6 -8 -30 -6 -3 -4 -38 -1 -3
7352cpj7L4lj8MK6k3Lj5K0QqJl4LpN2l2Oj8K2RMJqORj6KLpk6K1j2J0kO%J4oqj0
$$ -3 -10 -27 7 4 -14 -10 16 -7 -4 -19 1 9 1 2 -32 -29 -36 16 -16 -10 -28 -6 3 7 8 0 6 15 -1 1 4 -3 -29 -8 -20 -10 -12 -6 -6 8 2 -6 -16
7395a6K7J2m1K9lk0PJ8k1mLJ3k6JJ1%j3mL7j9J1Kj4lK3okjnJj5QJ4J5l6OJ6OK
$$ -16 11 23 -18 11 8 -12 -5 13 -8 -12 -9 4 -22 -21 -10 -10 -23 -27 10 -9 2 4 -10 -13 10 4 2 1 -4 -3 -18 -10 4 19 -17 -11 5 11 13
7434A3lj8J9k3J0JK4l4%K4pRJ8j5Poj9QJ9l6K1olmrJ2K7m1KK1Qm9L7rj1qK9Jl0
$$ 13 10 -8 11 -12 -2 -1 23 -11 -11 13 6 15 33 18 25 19 0 8 27 -9 12 6 3 -1 -10 2 29 -12 -10 11 19 -30 7 -2 -13 -21 8 9 -21
7473b1OLK9l2kL1k5ROQj9POj2RqOJ0k3jK6Lk5L2Qm9J5j5RkL5k3j7K2jl0NK4j1
$$ -21 -15 -12 17 -15 -17 14 -11 -2 4 12 -7 0 6 -6 3 -5 1 11 -12 -13 13 16 -9 23 31 -18 -3 -18 -9 -11 24 1 -16 6 5 -25 -20 4 -7
7512gj0L7j1k4K5l4J7Nj7qK0Pl2M4K9m0qKK5m0J0K6Pl4Ok4P0l9k7N5o1J3J4j8
$$ -7 -17 20 9 -15 10 -24 -7 -2 -19 -27 -7 0 -32 12 41 1 -7 -5 20 -20 -10 16 23 -11 -5 -29 41 2 -25 30 -31 -18 -4 -22
7546b2NPnJN5m7mJ3J0k1MQnJ3j6j5MPnJ2j9JJ0J1Qk4j1J1PkkjJ2j4k3J7L3k1J
$$ -22 -17 -10 -15 -14 41 -6 -10 3 13 -8 -4 4 -1 12 -4 -19 -15 -8 -13 -1 -20 -19 -9 2 10 -14 -25 -14 -7 -9 -11 -12 0 -14 -37 -20 13 -8 -7
7585gRPm0J2JkJ4Ppk4NJ9j0JL3j9Nj0J2pnr%qJ0J8k8L2kk1lk0L2qK0rJ5k3J2K
$$ -7 2 9 -31 -19 -18 -20 -6 1 -6 -30 -25 -6 -16 -15 18 -1 4 -6 6 -1 -6 -15 -15 -23 -13 5 -23 9 7 -14 -17 -37 -5 -13 7 -2 13 -10 2 4
7625DnK3k4LOj3J3J0rmJ0l3Oj1K9jl2qJ4K4k8N9o1K0J6j0k6K1jK7k2Rml2L3L0
$$ 4 -1 22 -2 1 7 -6 7 17 8 4 14 -19 -13 -24 5 4 -28 -36 -22 2 -26 33 -28 -8 8 -2 -28 -7 -8 19 -3 6 2 -30 3 33
7661C3Jn2lJ5j0L6k2NJ7rnj9J7l0L8k5J3j1K2j3j6m0M6K3k6M3m1J0Pk9K6j1Rj6
$$ 33 34 -18 -21 -6 -16 20 -2 3 20 11 6 -13 4 -26 12 -13 0 -11 11 -2 -18 -58 -12 11 -15 28 -13 -3 4 -25 1 -10 -1 -17
7695a7pL2j4JRRk1J2k8J2j6J4pk0L0j3Nl7M1K0q%qJ2Rj7j9J4J8mPl4L3n%Qk0K2
$$ -17 -24 8 -6 -5 4 13 -8 4 -24 -12 -28 -14 -21 -41 -11 -24 -19 -56 -15 5 -3 -3 -11 1 10 -7 -26 -12 6 2 9 -25 8 3 3 11 -9 13
7733A3kpKj2M8m9J6m0K7J1l3K1nj5%K4K8l3J3Nj8j5L5pj7jJ0j0klNNjJ2j4J7k1
$$ 13 11 4 6 -6 42 -7 9 -31 -4 7 -26 -5 -10 -25 -25 -1 27 -6 7 12 -6 -21 14 7 -10 -11 -1 -11 -13 -16 -11 -6 -7 5 -9 8 -13
7770a3K6rK1kj4mK7m2jj4M3j9j2j5M9J0%k5j8K6qpj0L7l0j2L1j4j2Rk5J3kJ6r
$$ -13 13 4 25 23 9 5 32 -10 -11 -25 18 -1 -13 -28 21 31 31 6 -12 14 6 -1 -11 26 -4 -16 15 1 -11 -2 -27 -14 -16 0 -9
7805iK0npQj7K6Ojj4QJ7j5k1j3J5RKj1kqRl1J4PNLmk1K5j4J1J3L0p5J4K9Rk7M3
$$ -9 11 6 -1 7 -10 16 22 21 7 15 32 17 -4 -17 -2 7 9 -2 -4 -12 -3 -34 -20 -13 -8 -5 -9 -30 -5 -19 -8 5 35 -40 -26 3 12 -15 28
7844B8j2pJ2j5j1J0k1j3PM0j6k0%K2l2K7J9j6Rkk0K3Ml1mL2k4K0Nk5J3j0K2k5
$$ 28 16 9 21 6 -5 5 -16 -29 -22 18 2 -18 -18 4 -28 -1 18 2 11 9 -11 12 16 -15 -19 13 -11 9 14 -11 2 -8 14 -11
7878a1J9ll2J1J8l6K9k9K3Rj1J6qK6m8L0nkJ3jJ1j2j0pK9j5j6%K0jj0J0k1J1j2
$$ -11 8 5 -27 -16 2 -34 -5 -34 -11 -2 -13 3 -5 21 -27 3 -2 -4 9 8 19 7 -3 -10 19 4 -12 -12 8 7 -3 7 -14 -3 -15
7913a5JL3k0K4m1L0j0j0k1K9L4o8K4K0k3L7jkj7j1J3k5K5j0KRj0%OJJ1k5J9qJ
$$ -15 -14 19 -1 23 -18 12 2 -8 -29 0 34 -34 -10 10 -13 24 23 21 4 -7 6 -19 6 -4 -2 7 -3 -3 3 4 15 -10 9 1 2
7948BrMK9k0pPqlKLJ5nKj2Jj3J7j3J5k7J6Pj9QL%J8KooJ5J4j6k0kk6N9j8k5J3
$$ 2 -7 -3 26 6 -1 6 -2 -5 -3 0 15 10 12 0 1 -12 5 -8 7 -20 -4 3 -16 -8 -5 -5 13 15 9 3 18 32 16 -4 -6 -32 27 9 -16 -3
7988crj1J4j1K4l%pj6L6k0J8l0M0j8j5J5J1k1j7K8j3J1oK3n1L1J0qK0rk2L3o7
$$ -3 -12 -23 -9 -20 4 1 1 -6 -22 14 -6 12 -18 22 4 -11 4 15 -6 -23 5 -8 3 -3 20 -31 0 10 2 22 13 -9 24 -43
8022d3L5Pm%nLK7m8L3k8N3l1L0l7J8j7Lj3J4k4jNPM4j7j6krQQK0k0j6j1M0j3J4
$$ -43 -8 -1 -5 -5 -10 -7 20 -28 5 -23 30 -1 29 -8 10 -7 -4 -17 -3 -27 -28 -23 -16 28 11 -5 -7 -16 -8 0 20 0 -16 -27 13 0 14
8059A4pKj2oJ1l8O0k5onlnK6l7QOM8k8Kj3jnK5j9j4K0Mj2jqjM5k9J5jl1jJ4%Q
$$ 14 7 9 -3 -9 2 -36 24 -1 -7 -12 -15 -20 6 -31 -23 -17 31 3 5 -8 -9 -14 11 -8 -22 -2 2 -10 -11 -19 -20 25 -4 11 10 -21 -22 -8 -8 0
8099@J1L2l9k5K2J5k2Nj5KRQK7k3RRj3k3J1j0K7mk8J9o6O3J5k5K0j3j9J1J0J4
$$ 0 11 43 4 -21 1 16 -6 -1 -16 -14 -5 3 30 7 16 25 12 -11 0 -10 17 13 -15 4 -62 1 16 -9 11 -2 -21 -10 0 14
8133A4K2o7O6j9l1J6j3L3Nm2mJ1NJ6j6Mk5QK9j9J%K1j0j0J6j1J5l4L2k5J1j1k
$$ 14 36 -31 35 16 -15 1 -12 21 26 -16 -20 -9 -4 12 -4 0 -25 -17 12 -7 -6 -6 15 5 -5 11 0 15 -19 13 -12 -1 -12 -14
8167a4J1J0Nook6K8K0j2j7J0l4N5m6K1j7K3rJ4k0j2PJ3K3
$$ -14 -3 7 12 6 0 -26 2 22 10 -7 3 -31 24 -22 -1 -18 5 -4 10 -10 -22 -15 -2 21
8191B1
$$ Imaginary data points
##PAGE= N=2
##DATA TABLE= (X++(I..I)), XYDATA
0@%%%%%%%%Qj6J6j6J6k4L2l2M0m9N7p0Q0r1J07j24J44j67J92k19K47k80L17l56
$$ 0 0 0 0 0 0 0 0 0 8 -8 8 -8 8 -16 16 -16 24 -25 32 -38 42 -49 58 -66 78 -89 103 -116 131 -149 168 -188
32a88L99m48N02n61O25o94P70q53R44j047J161j284J421j577J750j943K167k426
$$ -188 211 -237 265 -296 329 -365 405 -448 496 -551 610 -674 747 -830 920 -1023 1144 -1282
50a282K727l084L514m048M729n630O890q787J2004j8841N6602p6915q2646J75000
$$ -1282 1445 -1639 1875 -2173 2556 -3074 3816 -4971 7033 -11808 44794 -32121 -114767 60233
64F0233J3815j56089l567J67077j7473j31946L4646J15243o4529r4833O7812P5297
$$ 60233 74048 -82041 -85608 81469 63996 -67950 -33304 81939 17410 -77423 -9611 65686
76F5686p4771m3193P8688K5069q5661j5958P1244O314n7924J0799N7126j865m6616
$$ 65686 -9085 -52278 26410 51479 -34182 -50140 21104 27418 -30506 -19707 37419 35554 -11062
89a1062j0596K2529R146k1142k1211K0941M6835p502n4202P255O0224k0466p5222
$$ -11062 -21658 871 10017 -11125 -32336 -11395 35440 27938 -26264 -19009 41215 20749 -54473
102e4473K6829Q2958l2654p7442M7390O8490o8012o2844Q0202M9691q6365k1381
$$ -54473 -27644 55314 22660 -54782 -7392 61098 -6914 -69758 10444 60135 -26230 -47611
114d7611J03762R39j15379J2868J07474m3235j06937O9243J09889p6851r2692
$$ -47611 56151 57090 -58289 -45421 62053 18818 -88119 -18876 91013 14162 -78530
125g8530R0465P3190j05879o2407J04803M3704r8415j9662R4069J436q4930J1215
$$ -78530 11935 85125 -20754 -83161 21642 65346 -33069 -52731 41338 42774 -42156 -30941
137c0941O7504k4747m8461L9401L6775m3391k4247L9073N453m0789L449L8384
$$ -30941 36563 11816 -36645 2756 39531 -3860 -28107 10966 16419 -24370 -20921 17463
149A7463l270k4355Q463J5154r054j0118j222j461R985J1798j6051j3888K6908
$$ 17463 14193 -10162 -1699 13455 4401 -5717 -6939 -8400 1585 13383 -2668 -16556 10352
162A0352J3852l9795j4792M7889J2240n0647k364N4206q292n6353J5859M9537
$$ 10352 24204 -15591 -30383 17506 29746 -20901 -23265 30941 22649 -33704 -17845 31692
174C1692k7678m0114M1839L3054m9308k0467N4416L202o1919J0028O4478k1381
$$ 31692 4014 -36100 5739 38793 -10515 -30982 23434 26636 -35283 -25255 39223 17842
186A7842o0479L4516N4904m5813m8609N1838L8446n4460k5024N6136J2483n4529
$$ 17842 -42637 -8121 46783 970 -47639 4199 42645 -11815 -36839 19297 31780 -22749
198b2749j666M7255j0980l8959K3214L2398k9550k2663L2929J0312l7462j814
$$ -22749 -24415 22840 11860 -27099 -3885 28513 -1037 -23700 9229 19541 -17921 -19735
210a9735L8252l492l2802J0558K7843j5508k3556J4481J5192j2814n870J2380
$$ -19735 18517 15025 -17777 -7219 20624 5116 -18440 -3959 11233 -1581 -7451 4929
222D929J197p721K669j48q325N072J0914q170q137J3660N062j8617l038J8039
$$ 4929 6126 -1595 1074 926 -7399 -2327 8587 417 -7720 5940 11002 -7615 -10653 7386
236G386l096j6396J1900J6594j6769j2464K0806L519k8759K060L3545o698l2234
$$ 7386 4290 -12106 -206 16388 -381 -12845 7961 11480 -17279 -15219 18326 11628 -20606
249b0606J6087L2140k5047l2772K8722K7624l2938j9760L9064J4922m0248q728
$$ -20606 -4519 27621 2574 -30198 -1476 26148 -6790 -26550 12514 27436 -12812 -21540
261b1540L7274k157l7069J0527L6583j4121k9455K0606K2639k8179k0143K9212
$$ -21540 15734 13577 -23492 -12965 23618 9497 -19958 648 23287 -4892 -25035 4177
273D177J4517k8433o122L1001L012k9687j420K3771l970k1103O883J9999m487
$$ 4177 18694 -9739 -15861 15140 18152 -11535 -12955 10816 6846 -14257 -7374 12625 8138
286H138j4411L908Q842n655q345L282P436P75m058p96M551P13q384m287Q828M778
$$ 8138 -6273 -2365 6477 822 -7523 -4241 3195 3970 -88 -884 3667 4380 -4004 -8291 537 5315
302E315r167j110J4474K31j8730o83J8273m037k0057R449K3860j0680k2703J4148
$$ 5315 -3852 -4962 9512 9743 -8987 -9670 8603 4566 -15491 -6042 17818 7138 -15565 -1417
316a417J9605k0740k0245K3123J8487k3027j1657K7135P634l0132o100K7705L44
$$ -1417 18188 -2552 -22797 326 18813 -4214 -15871 11264 18898 -11234 -17334 10371 10715
329A0715k6529O249K7944p984k5064J0414K0198j5902j9388J7608J8062j5774
$$ 10715 -15814 -9565 18379 10395 -14669 -4255 15943 41 -19347 -1739 16323 549
341E49j2254J7620Q743j9817r328J6727O604j4313k423J5802K950j4299l823J0328
$$ 549 -11705 5915 14658 -5159 -14487 2240 8844 -5469 -7892 7910 10860 -3439 -7262 3066
355C066O35j0938o4J2485L186r827k633Q461k26j1817j248J2870K934j0841K41
$$ 3066 3701 -7237 -7301 5184 8370 -1457 -4090 4371 4145 -7672 -8920 3950 6884 -3957 -3716
370c716J2815k286j6187O03J4540k720j3235P842J6584q055j6597P608J2189j2347
$$ -3716 9099 6813 -9374 -8771 5769 3049 -10186 -2344 14240 6185 -10412 -2804 9385 -2962
384b962j1744J5634J2991j3970q795J5373M651j9268n130J8088L144j5472K617
$$ -2962 -14706 928 13919 -51 -8846 6527 11178 -8090 -13220 4868 8012 -7460 -4843
397d843J7702m182j8381L024J3935o578j2078J0268J3670q713j1101Q200O779
$$ -4843 12859 8677 -9704 -6680 7255 677 -11401 -1133 12537 3824 -7277 923 7702
410G702j1552p406J1341P618q120l514R332J857j1590m346Q747L269o664J02R328
$$ 7702 -3850 -11256 85 7703 -417 -3931 5401 7258 -4332 -8678 69 3338 -3326 -3224 6104
425F104J036r680l009O823L57p759J001J0640J572q919r37P402k829j0487K636
$$ 6104 7140 -2540 -5549 1274 1631 -6128 -5127 5513 7085 -1834 -2771 4631 1802 -8685 -6049
440f049J1765j042q863M236Q883p227j1264O197R470o919o546J0779P551j1288
$$ -6049 5716 4674 -4189 47 8930 1703 -9561 -3364 6106 -813 -7359 3420 10971 -317
454c17p405R667L250j1699j221J3946K094j1946O0J0303l962j1822M225J1177
$$ -317 -7722 1945 5195 -6504 -7725 6221 8315 -3631 -3571 6732 2770 -9052 -4827 6350
468F350m010p915O741P256q274p803O595N093o735k400Q765L079q006l127N787
$$ 6350 2340 -5575 1166 8422 148 -7655 -1060 4033 -2702 -5102 3663 6742 -1264 -4391 1396
483A396N94o351K61P160J217n418o47M438q22n898j99N964J469m369O9N155j101
$$ 1396 1990 -4361 -4100 3060 4277 -1141 -1788 2650 1828 -4070 -4269 1695 3164 -1205 -1136 4019 2918
500B918p100k06O814N6n943K296P381l122q397K906P217m801o871P198P762p362
$$ 2918 -4182 -4388 2426 2482 -3461 -1165 6216 3094 -5303 -2397 4820 19 -6852 346 8108 746
516G46o803P716M360j0066l662J1349L524j0393j244J0182j573j1345K218J0551
$$ 746 -6057 1659 6019 -4047 -7709 3640 7164 -3229 -4473 5709 4136 -7209 -4991 5560
530E560l029q301N631P846o855p659O089M850o987k758Q683L064p544k189N943
$$ 5560 2531 -5770 -139 7707 852 -6807 -718 4132 -2855 -5613 3070 6134 -1410 -3599 2344
545B344k91o408P64O505K86m518L07L409j333m263n9L726J674j723k80K698J38
$$ 2344 2053 -4355 -3591 2914 3200 -1318 -1011 2398 1065 -3198 -3257 469 2143 420 140 2838 2976
562B976m771k611L605K318l194k4N894N41o768q98N750j715o871L663Q461l563
$$ 2976 -1795 -4406 -801 1517 -1677 -1701 4193 4734 -2034 -2932 2818 1103 -5768 -2105 6356 2793
578B793p650M812N890q104o523R429O894q272l688R715J370j2114k195J0151j76
$$ 2793 -4857 -45 5845 -2259 -8782 647 7541 -731 -4419 5296 6666 -5448 -7643 2508 2332
593B332q661L981J0317l683q697L911N153p061m932P959M803o472k166O559j24
$$ 2332 -6329 -2348 7969 4286 -4411 -500 4653 -2408 -7340 619 5422 -1050 -3216 3343 3219
608C219p668j38O839N63m243J533M290j779m990j085J829O81m28Q34K918K280
$$ 3219 -4449 -4587 2252 2815 -1428 105 4395 2616 -2374 -3459 -1630 -949 -1377 -543 2375 4655
624D655j907m050j00K157k010k813L583M374k934l204L737J439n970j200P072
$$ 4655 2748 -1302 -1402 755 -1255 -4068 -485 3889 955 -2249 1488 2927 -3043 -4243 2829
639B829J037o220J613O659m631r019M004P838m924n296Q634O556q391n842P133
$$ 2829 3866 -2354 -741 5918 1287 -7732 -3728 4110 -814 -6110 2524 9080 689 -5153 1980
654A980K009r305j475R265J296o644J767O174l774o104L942M549m358k213N734
$$ 1980 3989 -5316 -6791 2474 3770 -2874 -1107 5067 1293 -4811 -869 3680 -678 -2891 2843
669B843J139o534j269M995l76m501K004N543k76l375K21J130j868k161rJ326J913
$$ 2843 3982 -2552 -3821 1174 798 -3703 -1699 3844 3568 193 414 1544 -324 -2485 -2494 -1168 745
686G45R86j304o65K029M9l604n69L787K71l408R41L329k393l695K663K648l203
$$ 745 1731 427 -238 1791 1840 -1764 -2333 1454 1725 -1683 -742 2587 194 -3501 -838 1810 -1393
703a393m43N490P6o222L79N490l060o574M107O973m053n356N766M859o596m568
$$ -1393 -1836 3654 3730 -2492 -2113 3377 317 -6257 -2150 4823 770 -4586 1180 6039 -557 -5125
719e125N827K838n684j038N714p5n059J077L880k335k676L665K180l923j136M079
$$ -5125 702 3540 -2144 -3182 2532 2457 -2602 -1525 2355 20 -2656 1009 3189 -734 -1870 2209
735B209j90m721J79M171k96l062J236K835r78k284J28R82J13k40o11l11J395R16
$$ 2209 2019 -2702 -2523 1648 1352 -1710 -474 2361 1383 -901 -773 209 322 82 -529 -840 555 1471
753A471j947j171K274R43k607n40K913J65k795K81K125j318j579K400J004l045
$$ 1471 -476 -1647 627 1570 -1037 -1577 1336 1501 -1294 -1013 1112 -206 -1785 615 1619 -1426
769a426m3L753r82m283J821M413k724m423L524M354l876l804M063K976m099k079
$$ -1426 -1469 2284 1302 -2981 -1160 3253 529 -3894 -370 3984 108 -3696 367 3343 -756 -2835
785b835M006J145l636k00L025o14k293J569J559k311j023K778M51k950lK912k78
$$ -2835 1171 2316 -1320 -1520 1505 891 -1402 167 1726 -585 -1608 1170 1621 -1329 -1332 1580 1302
802A302k681M89K293n34j939J57J387K36o15n63N5R25K14j417m97J770N04k026
$$ 1302 -1379 -890 1403 869 -1070 -913 474 710 95 -468 -413 512 726 -691 -1188 582 1086 -940
820i40l95K210K47k110J59J770p35j366J407R24k031m12K363l35k748J231L202
$$ -940 -1335 875 1122 -988 -829 941 206 -1160 247 1171 -860 -1272 1091 756 -1992 -761 2441
837B441j705l178K316L062k851k917K904K221l062j495L212J160k778l54K368
$$ 2441 736 -2442 -126 2936 85 -2832 72 2293 -769 -2264 948 2108 -670 -1024 1344
852A344l87j943Q49J199j548q27J844M02j797J30J970l04j704N03J507o43j433
$$ 1344 957 -986 -137 1062 -486 -1313 531 933 -864 -734 1236 932 -772 -269 1238 595 -838
869h38J05O33M2k74k66K11J009L65j135k73J518j16k279k39K074j79j952Q92K213
$$ -838 -733 -100 -58 -332 -598 -387 622 987 -148 -421 1097 981 -1298 -1537 537 358 -1594 -702 1511
888A511j039j594J764J277k349j006K403J6k916N32L081j182k923K005L268k031
$$ 1511 472 -1122 642 1919 -430 -1436 967 983 -1933 -1401 1680 498 -2425 -420 2848 817
904H17k521K523J908l251k013K746J051k776l18K947L46j912O58J609j259j611
$$ 817 -1704 819 2727 -524 -2537 209 1260 -1516 -1834 1113 1459 -453 205 1814 555 -1056
920a056R58O67j375k96J223N1r12M55J030k23l71L25p9l33P3m61r63M06R43o47
$$ -1056 -98 569 -806 -1102 121 172 -740 -285 745 522 151 476 397 64 137 -324 -1287 -881 62 -585
940e85m36J897J137j940r40J978O7k774j11K632m84k383J385K584j612k030K223
$$ -585 -1021 876 2013 73 -867 1111 1178 -1596 -1707 925 441 -1942 -557 2027 415 -1615 608
957F08J566k552j016K760J57l354J6L015o84k545J705K852j618k101J913J313
$$ 608 2174 -378 -1394 1366 1523 -1831 -1815 1200 516 -2029 -324 2528 910 -1191 722 2035
973B035k605j444K042O17j799K24K034k27j452N28R69p65o63O74J14p93N2M56
$$ 2035 -570 -2014 28 645 -1154 -930 1104 877 -575 -47 922 157 -506 168 282 -511 -459 -3
991cm26j49O51N2k79P50M96j114m81Q64l72j439O81J754q05j262J510J303j886
$$ -3 -429 -578 73 125 -154 596 1092 -22 -503 361 -11 -1450 -769 985 180 -1082 428 1731 -155
1010a55j147K011N32k390o2K568l35k499P52K216j265j822J943J654k098j185
$$ -155 -1302 709 1241 -1149 -1211 1357 1022 -1477 -725 1491 226 -1596 347 2001 -97 -1282
1026a282K084M14k411j16K236l25j846J054J802j192j524J227Q04j497m14J511
$$ -1282 802 1216 -1195 -1311 925 600 -1246 -192 1610 418 -1106 121 925 -572 -986 525
1042E25J70j350K26J039n32p47O84M69p49pP19k46o66L55K78o15O5Q61j20p36
$$ 525 695 -655 -429 610 78 -669 15 484 -265 -272 447 201 -465 -110 168 -447 -382 479 359 -377
1062c77M83N27r37l69J035J30j135K90J292o01j170R19Q86j345o70J598N18j674
$$ -377 106 633 -304 -673 362 492 -643 -353 939 338 -832 87 973 -372 -1042 556 1074 -600
1080f00n8J666m12j746P42J618j058j333J344J065j575o96J637J96j714K04J701
$$ -600 -658 1008 596 -1150 -408 1210 152 -1181 163 1228 -347 -1043 594 790 -924 -720 981
1097I81m60j448P34J089j035r05J208O14j170k86J165k4j025K67Q02n00o11O15
$$ 981 521 -927 -193 896 -139 -1044 164 778 -392 -678 487 463 -562 -295 507 7 -604 11
1115A1M81n90k05N31j16m31K88L58l33j18L57j44l24L21K20n09j13O80q2o19L74
$$ 11 492 -98 -303 228 112 -319 -31 327 -6 -124 233 89 -235 86 306 -203 -316 364 282 -337 37
1136C7O34p15o09Q53M74j005k63J206n3j295L29J346o29j321Q67J163j134q89
$$ 37 671 -44 -653 200 674 -331 -594 612 559 -736 -407 939 310 -1011 -144 1019 -115 -1004
1154a004J349O12j598l39J644R7j542J68J459m72j387P50J210r33r77J018P19
$$ -1004 345 957 -641 -980 664 761 -781 -613 846 374 -1013 -263 947 14 -963 55 774
1171G74r88m56J007K17r40r1Q48Ro78J08M89j30l66J13K54j3j53j87J55L24q4
$$ 774 -214 -670 337 554 -386 -477 371 380 -298 -190 299 169 -197 -84 170 157 4 -183 -28 296 212
1192B12m99J91N36l72n91N33O87p35p31R67O23j143m67J272K81j473k0J590k23
$$ 212 -287 -96 440 68 -523 10 697 -38 -769 198 821 -322 -789 483 764 -709 -729 861 638
1211F38j613M38J545p18j438R91J272j202j085J324Q96j438n74J428L04j398p1
$$ 638 -975 -537 1008 290 -1148 -157 1115 -87 -1172 152 1048 -390 -964 464 768 -630 -701
1228g01J358n1j277K25J045k98q71L96P11l73o17L46N19k29m03Q5L71ql38j04
$$ -701 657 606 -671 -446 599 301 -570 -174 537 164 -453 -107 412 183 -220 -135 236 228 -110 -214
1248b14M05J95n79k86P68K85q86k18J017J29j201O4J293k84j408M85J419p26j308
$$ -214 191 386 -193 -479 289 574 -312 -530 487 616 -585 -521 772 488 -920 -435 984 258 -1050
1267a050J000J170j266j026J440Q17j567n64J648K44j621J9J621l24j471N15J292
$$ -1050 -50 1120 -146 -1172 268 1085 -482 -1046 602 846 -775 -756 865 541 -930 -415 877
1284H77o12j082P60P62p86n69Q05L68o65k10N29N3l55J2K12l3m4j3n2J26K09l23
$$ 877 265 -817 -57 705 -81 -650 155 523 -142 -352 177 230 -125 -113 99 66 22 9 -43 83 292 -31
1306c1l53M94L19o43k01Q32O3r97P0J165l23j189M90J197p80j058J008Q99j233
$$ -31 -384 110 429 -214 -415 417 480 -517 -447 718 395 -794 -304 893 113 -945 63 962 -271
1325b71p25J347M89j395j40J408j99j357M42J220o79j006R18P11r92m17J011J91
$$ -271 -996 351 840 -555 -695 713 514 -843 -401 819 140 -866 52 763 -229 -646 365 556
1343E56j041M4R20k49o92M82M36o40k04O96m3n58K88M35n61k34O95j1p56K33P60
$$ 556 -485 -441 479 230 -462 20 456 -184 -388 308 265 -293 -5 430 -131 -365 330 319 -437 -204 556
1364E56m24o68O91M88q79l69R76R4j022K07J032m82r44P46P73r27o20J098K47
$$ 556 132 -536 155 643 -236 -605 371 465 -557 -350 682 200 -744 2 775 -152 -772 326 573
1383E73j144N8J155l15j069N24R10p21o23Q71L21r72l7R15k67p70N70O42p74l21
$$ 573 -571 -513 642 327 -742 -218 692 -29 -652 219 540 -432 -469 446 179 -591 -21 621 -153 -474
1403d74R07N9j038J68R54m49q43P90O83j006m03J212O7j154K20J106n82j070Q09
$$ -474 433 492 -546 -378 576 127 -716 74 757 -249 -652 560 627 -527 -307 799 217 -853 -44
1422d4Q64j077n96J278L74j288M3J294l57j283N18R43p96p31R82M85r53r8J041
$$ -44 820 -257 -853 425 799 -489 -446 848 491 -792 -274 669 -127 -858 124 609 -344 -442 599
1441E99j68r01M20N94o90m70P33J37p98J73Q11k89n28O80L76q46k07P80k35r58
$$ 599 431 -470 -50 544 -146 -616 117 254 -544 -371 440 151 -377 303 679 -167 -374 406 171 -787
1461g87M48Q92o95n88J158N25j200k52J285j92j434L99J271q44j137J053J049
$$ -787 -339 553 -142 -730 428 953 -247 -499 786 594 -840 -441 830 -14 -1151 -98 951
1478I51j162n14J448K77j452j2J306n28j392O08J108q22o52J153O08j093k53J076
$$ 951 -211 -725 723 1000 -452 -464 842 314 -1078 -470 638 -184 -836 317 925 -168 -421 655
1496F55j63j064K27P37o04n11O94L20n36P4O92k40m81M45K44p87k18O73j99o97
$$ 655 492 -572 -345 392 -212 -723 -29 291 -245 -171 521 281 -200 245 489 -298 -516 157 -42 -739
1516g39N72P99n82m38R55K77j159j20J025l94j173N94J106q18p87J182O94j177
$$ -739 -167 632 50 -388 567 844 -315 -435 590 196 -977 -383 723 -95 -882 300 994 -183
1534a83l48J329p4j452J32J205n73j120Q67J019q57n61J158L83j214j93J005l06
$$ -183 -531 798 724 -728 -596 609 36 -1084 -217 802 -55 -616 542 925 -289 -482 523 217
1552B17j035M45P88n16n41Q25L82o91m6O42j86o53K82L40n39k17N57Q8m80L76
$$ 217 -818 -373 415 -101 -642 183 565 -126 -172 470 284 -369 -87 253 -286 -503 54 142 -338 38
1572C8N74m56m47N97R8q01k8P59k53p36N34P74n88n07Q37L06r84j67R70k13j020
$$ 38 612 156 -291 306 404 -397 -425 334 81 -655 -121 653 65 -442 395 701 -283 -450 520 307 -713
1593g13L71Q70n60o63Q49O28r10l47R73J9j044J11Q56l74p45O10O68o80l83P95
$$ -713 -342 528 -32 -695 154 782 -128 -475 498 517 -527 -416 440 66 -679 -69 599 -81 -464 331
1613C31J04p66Q0O64k93o32M30M79n32k84O53J12n91R7N69l07m45L58K59n09r1
$$ 331 435 -331 -251 413 120 -512 -82 397 -135 -419 234 346 -245 -148 421 114 -331 27 286 -223 -314
1634c14N74l8n09K34M84m23l36N11J56n77j4N98j48n85L51M49m91l12N70K27p15
$$ -314 260 222 -287 -53 431 8 -328 183 339 -238 -252 346 198 -387 -36 413 -78 -390 180 407 -308
1655c08oO75j72o44L64N80n12m27O19K59o62j12O64r7o75L19N42l84m38M83L26
$$ -308 -314 361 189 -455 -91 489 -23 -450 169 428 -234 -346 318 221 -454 -135 407 23 -415 68 394
1676C94o19j13O30n2o13K23M92k90l80M27K43m64j18N30o0m72J20L86k52k99L83
$$ 394 -225 -338 292 240 -373 -150 342 52 -328 99 342 -122 -240 290 230 -242 -122 264 12 -287 96
1697I6J78l64p2M32j21l85K15K74l18k27M17R7l92K6M04j43l53K27L05l78k08
$$ 96 274 -90 -162 270 149 -236 -21 253 -65 -292 125 222 -170 -144 260 117 -236 -9 296 -82 -290
1718b90M38M6m15K5M47j36m09L02K94l80j79M14L2m31J6M62j32l42K16L08l35
$$ -290 148 194 -221 -196 251 115 -294 8 302 -78 -257 157 189 -242 -226 236 104 -238 -22 286 -49
1739d9j95L83J16m44NM36j72l59K76K86l01k07L41J59m18j4L77j18l41J81L16
$$ -49 -244 139 255 -189 -184 252 80 -279 -3 283 -18 -225 116 275 -143 -157 220 102 -239 -58 258
1760B58k46k25K88J34l04k6L09j05k54J25K31j84j62K35Q0k78K8K39p8k20J53
$$ 258 12 -213 75 209 -95 -121 188 83 -171 -46 185 1 -161 74 154 -124 -96 143 65 -155 -2
1781bJ48k16m0K76q4k47J12K13j64j57K25J04l02oL18o7k69J13K98k67k29L23
$$ -2 146 -70 -110 166 82 -165 -53 160 -4 -161 64 168 -134 -140 178 111 -158 -45 253 -14 -243 80
1803H0J59l30r6L69j2l62J17L41j72l11K16K12k56j67L20P0l32N8K75j21k27J18
$$ 80 239 -91 -187 182 170 -192 -75 266 94 -217 -1 211 -45 -212 108 178 -154 -96 179 58 -169 -51
1825e1K04j74j15K00P5k37k2J94m9j18R9J04j73nJ62l4j57O4J25j35j04K25K6
$$ -51 153 -21 -136 64 139 -98 -120 74 25 -93 6 110 -63 -68 94 60 -97 -33 92 -43 -147 78 104
1848A04k03K4K11r8j54J80J05k20j09K99Ok74M4K90j03k90K01K20k48j93K82J35
$$ 104 -99 -75 136 38 -116 64 169 -51 -160 139 145 -129 -85 205 102 -188 13 233 -15 -208 74 209
1870B09l09k3L17p5k74J16K19j66j84K05J36k54k6K33qk50P0K00j21j59J96P2
$$ 209 -100 -123 194 119 -155 -39 180 14 -170 35 171 -83 -109 124 116 -134 -64 136 15 -144 52 124
1892A24k03l0J90j9k00J18J32j44q0J92K5k06K1J98r8j38J36J13j56p1J82L4k43
$$ 124 -79 -109 81 62 -138 -20 112 -32 -112 80 105 -101 -80 118 20 -118 18 131 -25 -96 86 120 -123
1915a23O8J72j01j50J68J28k00p6K25ok51J09K20j64j59J63J15k05q2K59Ok72
$$ -123 -55 117 16 -134 34 162 -38 -114 111 105 -146 -37 183 19 -140 23 138 -67 -149 110 116 -156
1937a56J04K43j80j88J98J75k88q3L31Pl23N5K64r9k40J80K18k76j09K65Q0k92
$$ -156 -52 191 11 -177 21 196 -92 -175 156 163 -160 -105 159 60 -180 0 218 -58 -167 98 178 -114
1959a14QK72j06k12J15J83j63j18J89Q2k25M8K00r4j74J30R8j37o3J98j8j87P5
$$ -114 -106 166 60 -152 -37 146 -17 -135 54 136 -89 -41 159 65 -109 21 119 -18 -81 117 99 -88 -13
1982a3J36r5j50K00M5k34L2J99p1j83J62J65k57j14K64O4k87j0L22r3k92J71L10
$$ -13 123 28 -122 78 123 -111 -79 120 49 -134 28 193 -64 -178 86 150 -137 -147 175 82 -210 -39 271
2005B71k95k16L12J48l32q6L18ql00J12L34k07k47K14J73k41j13K64M1k83N9K53
$$ 271 -24 -240 72 220 -112 -198 120 112 -188 -76 258 51 -196 18 191 -50 -163 101 142 -141 -82 171
2027A71r8k39J52J80j93q6K18J3k24M6J43j13r1J77O3j58PJ71p6j83J25R0j68
$$ 171 73 -166 -14 166 -27 -113 105 118 -106 -60 83 -30 -121 56 119 -39 -32 139 63 -120 5 95 -73
2050g3r1K95j7k63R7K61j78k33K54J74l22j22L15Q8l59J3L79r2l64K50K93k99
$$ -73 -164 131 114 -149 -52 209 31 -202 52 226 -96 -218 97 185 -174 -161 218 126 -238 12 305 6
2072Fk64L52J21m25j6M29m7l40J45L21k15k62K24J72k60j21K74L8k96Q1K43j30
$$ 6 -258 94 215 -210 -226 203 156 -184 -39 282 67 -195 29 201 -59 -180 94 132 -164 -83 160 30
2094C0j65K00J45k03r5J92o9j80Q3J43j49o2K53j4j72J7J96j79j88K22J13k27
$$ 30 -135 65 210 7 -88 104 35 -145 -62 81 -68 -130 123 109 -63 -46 150 -29 -217 5 118 -109
2116a09n8K98m5k73J39K89k02k30K70J56l38j55L84k7l45J00L94q8l43K36K37
$$ -109 -167 131 86 -187 -48 241 39 -191 79 235 -103 -258 126 99 -246 -146 248 160 -183 53 290
2137B90l38k11L36J34m10%L89p4k58J19K50j95k06K29J37k55p1K07n2j73Q3J73
$$ 290 -48 -259 77 211 -199 -199 190 116 -142 -23 227 32 -174 55 192 -63 -134 73 21 -152 -69 104
2159A04j06r8K03L0j93K5J27j23j69J80J51k02l4K48m5k19P6K28j70k00K26J12
$$ 104 -2 -100 103 133 -60 -35 92 -31 -200 -20 131 -71 -105 143 98 -121 -45 183 13 -187 39 151
2181A51k72j4K76j5k97R2L49j86k37K30J43l45q0K95M0k80O5L17j57k28J98J53
$$ 151 -121 -135 141 126 -171 -79 270 84 -153 77 220 -125 -205 90 130 -150 -85 232 75 -153 45 198
2203A98k54j30K72L0k23K6K43j27k14J81J38k00r6K42qj93L6K10j27j66J57J27
$$ 198 -56 -186 86 116 -107 -81 162 35 -179 2 140 -60 -156 86 78 -115 -79 131 4 -162 -5 122
2225A22k05k1K07j7k22R2J64j20j40J75J00j83k7K36m3k08O8J71j25j43J90Q0
$$ 122 -83 -104 103 86 -136 -44 120 0 -140 35 135 -48 -75 161 118 -90 -22 149 24 -119 71 151
2247A51k11k6J91n3j46R8J28j50j19J74Q3j84j3K00o5j95J34J22j16j45J76N7
$$ 151 -60 -86 105 52 -94 4 132 -18 -137 37 120 -64 -77 123 58 -137 -3 119 3 -142 34 91
2269I1j84K6K04j07k16J81J52j48j11J56N5j72m6J91Jj69Q0J59j61j03J69K2j32
$$ 91 -93 -67 137 30 -186 -5 147 -1 -112 44 99 -73 -119 72 73 -96 -16 143 -18 -121 48 70 -62
2292f2n8K12j0j32O0J34j33j36J31N2o2n1J67l4j09N6K9p4q1J15O6j34M5Q8p8
$$ -62 -120 92 82 -50 10 144 11 -125 6 58 -4 -55 112 78 -31 25 54 -20 -101 14 80 -54 -9 79 1
2317Ar6R4O5r7J7J16j9j37O5O0j53o9J49Q9j50L7J82m9k09L6J41q7j38J54R4j68
$$ 1 -95 -1 64 -33 -16 100 81 -56 9 69 -84 -153 -4 85 -65 -28 154 105 -104 -68 73 -14 -152 2 96 -72
2343g2j9J55J0j51M7J47m0j31P7J11k17o9J11L2n5N5J68lr9RJ4j14p4P0J1k9R7
$$ -72 -91 64 74 -77 -30 117 77 -54 23 134 -83 -152 -41 -9 -64 -9 159 156 57 66 80 -34 -108 -38 -27 -56 41
2370D1O0p3nJ1No4M6O5r1o8P2n0m8JJ49Mr4J30J14j15j83L3O1j74k1K34O5j22
$$ 41 101 28 23 34 39 -25 21 86 -5 -73 -1 -51 -99 -98 51 55 -39 91 205 90 -93 -60 1 -173 -194 40 105 -17
2398a7K0J55j05j28P0R2j46o0J55L9j51rR9K8o4N6J68j15p9M2n9j13j4Q8J2lR2
$$ -17 3 158 53 -75 -5 87 -59 -119 36 75 -76 -85 14 42 -22 34 202 87 8 50 -9 -122 -136 -48 -36 -39 53
2425E3J17q6m6L6r2j00N2O5n5j5R6M0j04J5Q0mq6O9Q7j33q0N3j6j09N9J69j3m3
$$ 53 170 84 38 74 -18 -118 -66 -1 -56 -71 25 65 -39 -24 56 52 -34 35 122 -11 -91 -38 -54 -163 -104 65 52 9
2453IJ04Jr0r9L2K2r9K5J60Nr9P4M6j06o8J71k1q9K6O9o0j36N2J03m7m0J24Q1
$$ 9 113 114 24 -75 -43 -21 -120 -95 65 70 -29 45 91 -15 -83 88 67 -22 4 73 13 -123 -71 32 -15 -55 69 150
2481A50j40j3J05j09j30O2R4pm4R6L9j42%Q3k9n2J6N0l6k9M2kn2l5Q8OJ2J8Rr2
$$ 150 10 -3 102 -7 -137 -75 19 12 -32 64 103 -39 -39 44 15 -37 -21 29 -7 -36 6 4 -48 -83 5 11 23 41 50 -42
2511d2j4M1qm5Q2N1m2m1O7Lq7j4Q3m1m7Q0P3p8j05J26J2n5m5J38m8q6K8J23o8
$$ -42 -56 -15 -23 -68 14 65 23 -18 49 52 -35 -49 34 -7 -54 26 99 21 -84 42 54 -1 -46 92 44 -42 -14 109 41
2540D1j11Q0O0r5m4J10L8j31QJ06l4j11O4J20q8q5Q0L7k8p6N3J6l4k5O5J3n0M1
$$ 41 -70 10 70 -25 -69 41 79 -52 -44 62 28 -83 -19 101 13 -72 8 45 17 -59 -6 10 -24 -49 16 29 -21 20
2568B0J3k6k4L5m4J0j7M7PM8J7r1j1J4K1m8lJ01j5q7M9P8j01o1M9P1m6j7R5L7
$$ 20 33 7 -17 18 -26 -16 -33 14 21 69 86 -5 -16 -2 19 -29 -32 69 54 -33 16 94 -7 -68 -19 52 6 -11 84 121
2598A21j68p9J37M1j22N3J18l8q4K5N0r8r6R3J12n9%P3k6j06o4Q3L1l3L0R5l6
$$ 121 -47 -126 11 52 -70 -17 101 63 -21 4 54 -44 -140 -47 65 6 6 79 53 -53 -117 -34 -3 -36 -6 89 53
2625E3m7m7j3J5m3O7Q4M2m6l8n2K4m4m6Q5R4K3r4M1J4j33k2M9M6NJ0J05j1j69
$$ 53 6 -41 -54 -39 -82 -15 69 111 65 27 -25 -1 -45 -91 -6 88 111 17 58 72 -61 -83 -34 12 17 27 132 121 -48
2654d8k5N5Ln9Q7J24o2m2j9M7j18m4M9R5okN2m3r3o4M0N1j4O6Q1l1n2o2pNn6J4
$$ -48 -73 -18 -15 -74 13 137 75 33 14 61 -57 -101 -52 43 37 35 87 44 -49 -113 -73 -22 -36 30 111 80 28 -34 -41 -36 -92 -78
2686g8J12O7k5m1j7l4p6J1Q6L3L6Jk1l7o9l7O7J7K4M7O6m5m4p9k6KJ3N5Q6Rm6
$$ -78 34 101 76 35 18 -16 -92 -81 5 38 74 75 54 17 -52 -89 -22 -5 19 66 132 87 43 -36 -62 -60 -47 8 94 103 57
2717E7n0m1Kn0K5P8PL6m4K7m7j01kM9N0L6J5J9l0p2k1K2KnN7O8k5o1L4l6m6o8
$$ 57 7 -34 -32 -82 -57 21 28 64 20 47 0 -101 -103 -54 -4 32 47 66 36 -36 -57 -35 -33 -38 19 87 62 1 35 -1 -47 -115
2749a15J02O8qj1N4nr2p8P9L5k4M0Mnm2kl6pM2OkM0M0l9p2oK2m0L3K6J9j8J2L9
$$ -115 -13 55 47 36 90 85 -7 -85 -6 29 5 45 49 44 2 0 -36 -43 -1 5 3 43 83 44 -28 -34 -12 -52 -19 7 26 8 20 59
2783E9q1o7N6P9m9n1J16L2j09r3J38K3j16K1R6Kr1N4L7l7n0K8M9j8k2P6m0o3n
$$ 59 -22 -89 -33 46 -3 -54 62 94 -15 -108 30 53 -63 -42 54 56 -35 19 56 19 -31 -3 46 28 6 82 42 -21 -26
2812b6J06o3o7N5M5j2m3L9j1J2m7k3K2K0N9l7o2Q4qj08kJ32jj34K3J50l3j33K3
$$ -26 80 17 -50 5 50 38 -5 34 23 35 -12 -35 -13 7 66 29 -33 51 43 -65 -67 65 64 -70 -47 103 70 -63 -40
2841d0R6n8r4J02Q4j22OJ03m5j43N9J56j34j19J31J81j39j32J43Q5j56n2J24O0
$$ -40 56 -2 -96 6 90 -32 -26 77 32 -111 -52 104 -30 -149 -18 163 24 -108 35 120 -36 -88 36 96
2865I6j04MO1mp2M7j5k7J4R0k8r6M0L5r1l7Q3O8l7oP4o0n6N4k0j01K6J29m7p2
$$ 96 -8 -4 57 53 -19 28 13 -14 0 90 62 -34 6 41 -50 -87 -4 64 27 21 95 35 -21 33 13 -88 -62 67 20 -52
2895e2J11Q9j60j25J65J43k39p8K29Oj85nJ87k5j55Q1J35n1j09J33qj94l1J75
$$ -52 59 148 -12 -137 28 171 -68 -146 83 89 -96 -101 86 61 -94 -13 122 71 -38 95 87 -107 -138 37
2919C7k0j05P0J96o8j61J14P2j51j22J36K9r9L1Q9m4l0Q0Pp4O2P8o2j77N5J08
$$ 37 17 -88 -18 178 110 -51 63 135 -16 -138 -2 27 -72 -41 48 4 -26 54 61 -13 49 127 65 -112 -57 51
2945E1j64n0J58Q7j05P0J52o0j94M3M2j69m3K36Pj58O9K10r6k39J44J65j39j78
$$ 51 -113 -163 -5 82 -23 47 199 139 -55 -12 30 -139 -182 54 61 -97 -28 182 86 -153 -9 156 17 -161
2969a61J74J19j89j17J94Jo5O4J64n1j13N5Lj86n3J62l2p8J17J82j22q5R7K7j65
$$ -161 13 132 -57 -174 20 21 -44 20 184 133 20 75 78 -108 -161 1 -31 -109 8 190 68 -17 80 107 -58
2994e8j4J09l7q6N4J02j22m9J90N6j97L5K23j17k87R4J41j72j05K57J63j60%J51
$$ -58 -72 37 0 -86 -32 70 -52 -101 89 145 -52 -17 206 89 -198 -104 37 -135 -240 17 180 20 20 171
3018A71n4k22J9J23q7r8J40P7j06n9J71J3j99Q3K00j05j04L1J03j78p5J75J3n9
$$ 171 117 -105 -86 37 -50 -148 -8 69 -37 -96 75 88 -111 -28 172 67 -37 -6 97 -81 -156 19 32 -27
3042b7J22R3j04j13Q4m1j64N4J78l0j21J45J00j54j63K21P3k08m6K10n2j81P2
$$ -27 95 188 84 -29 55 14 -150 -96 82 52 -69 76 176 22 -141 80 153 -55 -101 109 57 -124 -52
3065e2J52j38j05K46Q3k20pJ60k0k95R5K34j26j58J84J45j60o7J12K4j78N7J03
$$ -52 100 -38 -143 103 186 -34 -41 119 99 -196 -101 133 7 -151 33 178 18 -49 63 87 -91 -34 69
3088F9l1j01J18pj16rJ72n6j14Q4J19j13j12J41M7j89J1J91l2j32J09Q9j60q4
$$ 69 38 -63 55 48 -68 -77 95 39 -75 9 128 15 -97 44 91 -98 -87 104 72 -60 49 138 -22 -106
3112a06J66M1j97LK37r2j78J13J71j76j18J71Q9j97l1K04j8k16Q8J82j23r1J07
$$ -106 60 101 -96 -93 144 52 -126 -13 158 -18 -136 35 124 -73 -104 100 82 -134 -46 136 13 -78 29
3135B9N9j39p0J82K4j97N9J63p3j35J06J46j82p6J67jj33O5P3p5n2J12Q5j74l1
$$ 29 88 -51 -121 61 85 -112 -53 110 37 -98 8 154 -28 -104 63 62 -71 -6 67 -8 -60 52 137 -37 -68
3160f8J90p4j36O1J63j59j08J70N6j46kJ32j3j71O8J41j04j14J24J06j91oJ74
$$ -68 122 48 -88 -27 136 -23 -131 39 95 -51 -53 79 66 -105 -37 104 0 -114 10 116 -75 -81 93
3183I3k6j58P8J33j14j28J27Q4j59l7K05k6j25O9R0j10q7J24Q1j73rJ37j0j44
$$ 93 67 -91 -13 120 6 -122 5 89 -70 -107 98 72 -53 16 106 -4 -91 33 114 -59 -68 69 59 -85
3207h5P9J14r5j25J43J10j76m2J73m3j46O5J34q8r2J51M7j47q1J79rj80Q0J14
$$ -85 -6 108 13 -112 31 141 -35 -77 96 53 -93 -28 106 18 -74 77 124 -23 -104 75 66 -114 -34 80
3231H0l7j14R6P7j36n9J17J9j27P3J28j20r2J24M8j22j5J24K9j46L8J25j29r6
$$ 80 43 -71 25 102 -34 -93 24 43 -84 -11 117 -3 -95 29 77 -45 -60 64 93 -53 -15 110 -19 -115
3255a15J31O6j22L3Q6m0j11M2J29r0j02J54O0j82J4J48k1j71O4J15p0r2J02R4
$$ -115 16 82 -40 -7 79 39 -72 -30 99 9 -93 61 121 -61 -47 101 80 -91 -27 88 18 -74 28 122
3279A22j30o3J54l6j09L5J22n1r5O8Q6j61k2J28np7N2R1n9j32P8O2j21oJ32m0
$$ 122 -8 -71 83 47 -62 -27 95 44 -51 17 103 -58 -80 48 43 -34 18 109 50 -82 -4 58 -63 -69 63 23
3305B3l2JR5j21k5R8M2j30K6J15l5j20M5Q5q3l4R3M4j00QO7k5r2L4R8p4j01J42
$$ 23 -9 -8 87 -34 -59 39 81 -49 -23 92 57 -63 -18 67 -16 -50 43 87 -13 -5 62 37 -55 -21 77 3 -98 44
3333D4N6j55j0J23j2j00L7J11o0j16J03O7j10k5R1j5q8N8O8o5j01J14P5j11k5
$$ 44 100 -55 -65 58 46 -54 -17 94 34 -82 21 88 -22 -47 44 29 -59 -1 67 2 -99 15 90 -21 -46
3358d6R8j2q5K5Q9m4o4N8K5l4o5J24Jj31N9N5l2p7R6N2j05m3J27l9n8RR1p2o1
$$ -46 52 40 -45 -20 69 25 -39 19 44 10 -55 69 70 -61 -2 53 21 -56 40 92 -13 -56 71 32 -26 -17 74 2 -59
3387e9J16J5j03j7J42m2j02N2R7r2p9J08M2j00m0J33k1j00kR9l5p8R7L8p7l6J15
$$ -59 57 72 -31 -48 94 52 -50 2 99 7 -72 36 78 -22 -62 71 50 -50 -52 47 12 -66 31 69 -8 -44 71
3414G1rr9K2R3o7p5R3K7r3OQ4j0q3M0M8l1o3N5O5j11jJ08j9j12O2N5p2o3P9O1
$$ 71 62 -37 -15 78 11 -64 29 56 -37 -31 53 43 -40 0 48 17 -46 9 74 -37 -38 70 51 -61 1 56 -16 -79 0 61
3444F1q9J1J17r2p3L7R0q1k6N8L2m9m1J08j2p7j7R6o9l3R3M3j25nP5k4o5N1Q0
$$ 61 -28 -17 100 8 -65 -28 62 -19 -45 13 45 -4 -45 63 51 -26 -43 53 -16 -49 44 87 -38 -43 32 8 -57 -6 74
3473G4n6n7P4M0j06k0Q4K5j33R4N7o4n4N5L3j12K5J07k6n1L6N8p8r1Q6N3p7rR4
$$ 74 18 -39 35 75 -31 -51 33 58 -75 19 76 12 -42 13 46 -66 -41 66 40 -11 25 83 5 -86 0 53 -24 -33 61
3502F1mj17L7O9q2j2R8J4p5QO4j1j37N8R4n2p3J21J0j06qQ7m4n7P2N5m1o8Q3R
$$ 61 57 -60 -23 46 -36 -48 50 64 -11 -3 61 50 -87 -29 65 13 -60 61 71 -35 -43 44 0 -57 15 70 29 -39 44 53
3532E3p6l3J04l1q0N4R9r1o6Q0L4r1KQ2J2r9M6L7p2k5P4N6q8J0R4k6j13J2N5l7
$$ 53 -23 -56 48 17 -63 -9 90 -1 -67 13 47 -44 -42 40 52 -47 -1 36 -36 -61 13 69 -19 -9 85 59 -54 -42 13 -24
3562b4m9P3Q1o6k5N8l8m8L5K1m0j0R2j7q0M0M8l6m9M6J02j21k9M4j1k3pP7j7l6
$$ -24 -73 0 81 15 -10 48 10 -38 -3 18 -22 -32 60 43 -37 3 51 15 -34 12 114 -7 -36 8 -3 -26 -33 44 27 -9
3592iL7N1p2l8O8k9o7K4J02n5o9O6O3p2m1R2L6r7j7Q4m5p2J5R1n2j0N4K6o6KK9
$$ -9 28 79 7 -31 37 8 -59 -35 67 12 -57 9 72 0 -41 51 87 -10 -27 57 12 -60 -45 46 -6 -16 38 64 -2 0 29
3623B9k5p0M1Q1n8m6J02ln4J7Knn8R7l9j7oM2J5q5K1P6j9p1O5M6n4n0N4K3q7K2
$$ 29 4 -66 -25 56 -2 -48 54 51 -3 14 16 11 -47 50 11 -6 -12 30 45 -40 -19 57 38 -33 32 78 24 -26 28 51 -36 -14
3655a4P2o3m7J03%q8KN1Oj6j0P3p0m2N8M1l6l3O3k6o5M1J7k7j1J5N1n2j9Q4k8
$$ -14 58 -5 -52 51 51 -37 -35 16 22 6 -4 69 -1 -43 15 56 20 -13 50 24 -41 0 17 -10 -21 -6 45 -7 -26 58 30
3686C0n9K0N8k5n2M1K4o0oM5Mm9jR9o9m0K9O7p4j8P0pn6K0N0l2m9L6N6o4j1M7
$$ 30 -29 -9 49 24 -28 13 37 -23 -29 16 20 -29 -30 69 0 -40 -11 56 -18 -36 34 27 -29 -9 41 9 -40 -4 52 -12 -23 24
3718B4Jj8kM2k6o4N6L1m3j2K1Jn9L0O9m7k6L1K2o5L2L1j9m5L6K7k3k6L8J8n5K7
$$ 24 25 7 5 47 21 -43 13 44 1 -11 10 11 -48 -18 51 4 -22 9 31 -34 -2 29 10 -35 1 28 5 -21 17 35 -20 7
3750GK9Kj03L7Q1m2m4L9M1p5J0O6j9k7OK5k1m9K3N8m4nK7pl6M3j0ml5O5L0o7p
$$ 7 36 38 -65 -28 53 11 -33 6 47 -28 -18 48 29 2 8 33 12 -37 -14 44 0 -5 22 15 -21 22 12 8 -27 38 68 1 -6
3783fL6l2m0N3%J3p9J03k0p3N5J4m4j6N0K8n4m3J06j6n1J7N3m7l9L3M0n8oL3J6
$$ -6 30 -2 -42 11 11 24 -55 48 28 -45 10 24 -20 -36 14 42 -12 -55 51 35 -16 1 54 7 -32 1 41 -17 -23 10 26
3814B6n0lO9j5k9J4L2m2m8N4L0l2n4Q0j2l3KK9Oo1L6J6l3M3L0n8m9P1ll2K3K7
$$ 26 -24 -27 42 27 -2 12 44 2 -46 8 38 6 -48 32 20 -13 -11 18 24 -37 -1 15 -18 25 55 -3 -52 19 16 -16 7 34
3846C4K0k9l6L3j1n8N0K4o4L4M3j4okJ9k9j5K2pol0M9j1l2K6N3k0l6K0Mk5n3P4
$$ 34 54 25 -11 22 11 -47 3 27 -37 -3 40 26 20 18 37 8 -7 15 8 2 -28 21 10 -22 4 57 37 1 21 25 0 -53 21
3879B1j8l1L4P3m4k8K0J1n6LK9kl3L3J6k2l1J4K2qj9M4Ql0kl5J2l3O7J2j0j9M8
$$ 21 3 -28 6 79 35 7 27 38 -18 -15 14 12 -21 12 28 6 -25 -11 11 3 -16 28 36 6 4 -31 -19 -52 15 27 17 -2 46
3912D6l0rj8J1j8j1N0j2lk1L6Mn9M9J9m9J2N1k4m2J3j2L6l8M4N1k6l6n%o0jM0
$$ 46 16 7 -11 0 -18 -29 21 9 6 -15 21 25 -34 15 34 -15 -3 48 24 -18 -5 -17 19 -19 25 76 50 14 9 9 -51 -52 -12
3945a2J9j7K3K7Jm2kJrJ1O5l7l3nK7k3l2N0J2%k7L4l9j6j7M2l1K4K3LjnJk4j2
$$ -12 7 -10 13 40 41 -1 -3 -2 -11 0 65 28 -5 -10 17 -6 -38 12 24 24 -3 31 -8 -24 -41 1 -30 -6 17 20 19 14 15 -9 -21
3980b1KN3j1l0L1K2n6lM5m4pK9L7nk5k3Rk0J8OJ6q%nj5k1L2j0k8K9J5mN5r7K5
$$ -21 -19 34 23 -7 24 46 -10 -13 32 -12 -19 10 47 42 17 -6 3 -17 1 7 23 15 15 10 -5 -26 6 -4 -32 -3 12 8 63 -34 -9
4015iqlJ4M0n9N5oo9J4L8K5n8K8M4j7o6J6L0Qn1M9J5k7mJ5Qm6LK8NJ7k8K8j7q
$$ -9 -17 -20 -6 34 -25 30 24 -45 -31 7 32 -26 2 46 29 -37 -21 9 17 -34 15 30 3 -1 14 22 -24 -21 7 12 29 1 29 12 4
4050DL6l5j9JK4M5j0o6K9Mm1L6J4M1j4n1lk7K4mlJ9%J0k6K8mk9ON7l8K4lK7n9
$$ 4 40 5 -14 -13 11 56 46 -20 9 13 -28 8 22 63 49 -2 -5 -32 -8 -12 -15 4 4 14 -12 16 12 -17 -11 46 8 32 29 56 -3
4085ck9K8J9l4K9J2J8j5l3L7l9l6M1L5L7n6J6L0n8j6j1P3nl2M4k2m4RJ3l3J9l
$$ -3 -32 -4 15 -19 10 22 40 25 -8 29 -10 -46 -5 30 67 11 27 57 -1 -17 -28 45 40 8 52 30 -14 -5 8 -25 -6 -9
4117iJ1K5J2l9l6J6j0LL3J3K6k2l5M0l5k3L2J3kJ1k1J3k0l9J1K7K5n4J00m0o7
$$ -9 2 27 39 0 -36 -20 -30 -27 6 19 45 23 -12 28 -7 -30 2 15 13 24 3 16 -4 -43 -32 -5 20 -34 66 26 -41
4148d1K9J3j4k8L0K4K3k9oQj2J0J7K6k3j5K8k8m5L7k4J5L1j1K2j8K7m3j6OlK7
$$ -41 -12 1 -13 -41 -11 13 36 7 1 9 -3 7 24 50 27 12 40 12 -33 4 -20 -5 26 15 37 19 46 3 -13 -7 -10 17
4180A7KOJ6l7m8K7L0m8L1K2J1k2k9N0l4o1Q8J8l5LJRn1OJ8K4k4K7PL2m0j7P%k7
$$ 17 19 25 41 4 -44 -17 13 -35 -4 18 29 7 -22 28 -6 -67 21 39 4 7 8 17 -34 -28 -10 14 -10 17 24 56 16 -1 6 6 -21
4215b1LL5j1j0K9J0l5l8L7J6L0k1l3N2nm2%JKj4K3PK1m2j5N3k7k0kL8n1J4L0K9
$$ -21 -18 17 6 -4 25 35 0 -38 -1 15 45 24 -9 43 38 -4 -4 -3 -1 -15 8 15 36 -6 -21 32 5 -15 -17 21 -30 -16 14 43
4249D3n0j3K5K4l7NJ1M8p5J7OJ6m6M6oll5L6NjMk1L1k6OK5j8J3j5j2RMk2J3J2
$$ 43 -7 -20 5 29 -8 -3 8 56 -19 -2 4 20 -26 20 14 11 -24 12 17 16 20 -1 30 4 10 35 17 30 15 3 12 16 -6 7 19
4284A9k9K8k4M6m1rk1O4k3j7J0K1k4k2QJ9j7lj3N8k1k9J8Jk5L1J4Oj7l4L6J5m5
$$ 19 -10 18 -6 40 -1 -10 -31 33 10 -7 3 24 0 -22 -14 5 -12 -15 -28 30 9 -20 -2 -1 -26 5 19 25 8 -26 10 25 -20
4317b0M7qq%j9jM0l5nJ5k2j0L6J2M0k1n9K4nQj1K6k5J6l6K9Rm1NM5l2J1M6n4J1
$$ -20 27 19 11 11 -8 -9 31 -4 -9 6 -16 -26 10 22 62 41 -18 6 1 9 -2 24 -1 15 -21 8 17 -24 -19 26 -6 5 51 -3 8
4352Hj2K6Kl0nK3jk1lPqJJ2jL6k6j3K9j7j5kL1mK1k2Qm3J3J7jJ0K1Pj3j7j0l8
$$ 8 -4 22 24 -6 -11 12 11 -10 -13 -6 -14 -13 -1 -2 34 8 -5 24 7 -8 -10 21 17 38 16 24 -19 -6 11 10 20 41 48 35 18 8 -30
4389c0J5L4k1jL2Nk6oj0K1j3L2Oj7o2K8J2Pk0LL7j3kPmm4l3L3L1J1K0Lj0ok5l3
$$ -30 -15 19 -2 -3 29 34 8 2 -8 13 0 32 38 21 -41 -13 -1 6 -14 -11 26 13 11 18 14 -30 -63 -30 1 12 32 35 25 19 -6 -39
4425c9K2lK9KJmkk2JoK4J7J0k1k2K9m0j3M8NkK2l2M4m3k2J7pk0L8K4J0m2k7L4
$$ -39 -17 -20 9 11 12 8 6 -16 -15 -21 3 20 30 9 -13 16 -24 -37 11 16 14 36 4 48 5 -17 0 -7 -27 11 35 45 3 -24 10
4460A0j5k4L4L3Pl8jj9k2k4M8J1K2M8l2nn5J9k3J0QPK4pJK3n2LK4J2j5OJj3lj1
$$ 10 -5 -29 5 38 45 7 6 -13 -35 -59 -11 0 22 70 38 33 -22 -3 -26 -16 -8 -1 23 16 17 40 -12 -9 15 27 12 18 19 6 3 -8
4496hj5k2L7M4Ok0j2Ol2rj0K7K8l1O6j7j9j3k3N3n6K4L0J1l9k9QpOQM0j9J6kQ
$$ -8 -23 -45 -8 36 42 22 10 16 -16 -25 -35 -8 20 -11 55 38 19 6 -17 36 -20 4 34 45 6 -23 -15 -22 -16 -8 32 13 29 27 35
4531C5n0lqpK4N9j2j5l5j9K9k8K4jJ1rK2Pl6K5pl2K7L1mjl4J2l2j2M7OJ6m7O1
$$ 35 -15 -18 -26 -33 -9 50 38 23 -12 -31 -2 -30 -6 -7 4 -5 17 24 -12 13 6 -26 1 32 28 27 -7 5 -27 -39 8 14 30 -17 44
4566D4k4n7K6L5k2j4J7JK0k1pMj3NM6Nm0J0J5k0k4K9j6rK6K6k3m6k5J9lK7j1L6
$$ 44 20 -37 -11 24 2 -12 5 6 26 5 -2 2 -11 -6 40 45 5 15 30 10 -14 15 -1 -10 16 42 19 -27 -52 -33 -36 -9 -20 16
4600A6kqM1m7oJ1JRmN6l6j8J5j1j4KK0Lk9K3k2Nm3M1K8l5J2K0Rm3l3M0K0n5K4
$$ 16 14 6 47 0 -6 5 6 15 11 67 31 13 28 17 3 5 25 28 -1 22 0 5 -38 3 31 -4 8 28 37 -6 -39 1 21 -34 -10
4635a0N6j3o3N3j2onL5J6n4L0rj9MMmj8NK1K3jj4qnn1J4J2J9PJ8l5JOL3l7J1J2
$$ -10 46 33 -30 23 11 5 0 35 51 -3 27 18 -1 3 7 3 -15 -10 11 34 33 19 11 6 -45 -31 -19 0 7 25 -10 -9 -3 30 -7 4 16
4672A6J0m7K8j5L0m7L2M8l9pJ8j3k1kOJ6l3K3J3km0K7OQl1L1rkj1L3mm5%M9j6
$$ 16 26 -21 7 -8 22 -25 7 55 16 9 27 14 -7 -9 -3 13 -20 3 16 14 -26 1 7 15 -16 15 6 4 -7 26 22 -23 -23 26 10
4707A0k6lK4LKJ9l4j0K0J6k4J1K5k6KjK9l3k3M6j5j6NJ4Po0L0L5l1K6j1J7m6N
$$ 10 -16 -19 5 8 10 29 -5 -15 5 21 -3 8 33 7 9 8 37 4 -19 27 12 -4 1 15 22 -38 -8 27 -4 22 11 28 -18 -13
4741a3L6j2o1L5L7j8l4K9pK3n1J9K6j2KK7ll9J9J7l9j7L2J7k9L0K8n0OjM5m1j5
$$ -13 23 11 -50 -15 22 4 -30 -1 -8 15 -36 -17 9 -3 -1 26 23 -16 3 20 -19 -36 -4 13 -16 14 42 -8 -2 -3 42 1 -14
4774a4M2qk5K1Ql4k3N8Qo6N0K8l4k7%J9K5m9M9K7k1p7O0rl2K3L0k3n2O7ml4K2
$$ -14 28 20 -5 16 24 -10 -33 25 33 -33 17 45 11 -16 -16 3 28 -21 28 55 34 -43 17 8 -24 -1 29 6 -46 21 17 -17 5
4807EOJ6l7%M9k9l6O2j5m5J3J6L2o6N9k0pl6K8L5m7K4K9Rn4RK8k7k7K1L6l5lM9
$$ 5 11 27 -10 -10 39 10 -26 36 21 -24 -11 5 37 -29 30 10 3 -33 -5 30 -17 7 36 45 -9 0 28 1 -26 -5 31 -4 -7 42
4841D2k3n5RO3k6k8K8Om3J3L2k0k4K7K7J8o8K4mj8OJ1M4o9M6K7k8l5M2km5jN8
$$ 42 19 -36 -27 36 10 -18 10 16 -27 -14 18 -2 -26 1 28 46 -22 2 -2 -20 -14 -3 41 -28 18 45 17 -18 24 22 -23 -24 34
4874C4Rk4pL3o4j2M2j0oJ1O3m9l0J4J3j7k4P7On8J0K3qo0K7N4k6k3L4rk8MK1k
$$ 34 43 19 12 45 -19 -31 11 1 -5 6 69 20 -10 4 17 0 -24 53 59 1 11 34 26 -34 -7 47 21 -2 32 23 -5 -1 20 18
4908A8m7J8L7j0k1J1qj8J2L5rl9M3mj6l1L4j1m8O3N0l9l2jL2l2kK0K3jm5K6k8
$$ 18 -29 -11 26 16 -5 6 -2 -20 -8 27 18 -21 22 18 2 -29 5 -6 -54 9 59 20 -12 -13 19 -13 -15 5 28 27 -18 8 -20
4941b0pL8JJ7k6K7rl5K5kmk6J9K2j4j1K4K1o2qN4pj8nL0ok9L4k0k6KN6qk6L2k
$$ -20 -27 11 12 29 3 30 21 -14 11 9 5 -21 -2 20 6 -5 19 40 -22 -30 24 17 -1 -6 24 18 -11 23 3 -23 -21 35 27 1 33 31
4977C1j9n1O6Kl1ML0j7k5KK%k1L2J3qj2J4k2l7K7M2l9K8%j7k5J8M6m0k8L4M5m6
$$ 31 12 -39 27 29 -2 2 32 15 -10 -8 -6 -6 -27 5 18 10 -2 12 -10 -47 -20 22 -17 11 11 -6 -31 -13 33 -7 -35 -1 44 -2
5011bl1Q3mq4K7N1m7kRKj0j3J9M6m9j7L7Pj5j1J8j9l8O2k9K8k4K2Ml0J4J3j1n8
$$ -2 -33 50 46 -38 -11 40 -7 -9 0 2 -8 -21 -2 44 -5 -22 15 22 7 -4 14 -5 -43 19 -10 18 -6 16 20 -10 4 17 6 -52
5045e2M1K7l0K9J1j6kk4M0n1L7J8j9l1Q%L1n5N8j7OMk2M8o7M0Rlk1J4K1m2JJ8
$$ -52 -11 16 -14 15 26 10 8 -16 24 -27 10 28 9 -22 -14 -14 17 -38 20 3 9 13 -9 39 -28 12 21 18 -3 11 32 -10 -9 9
5079IJ3k4rL5%n0J6J9k2jK8j1J7l5L4j1j3mK1%j1J4j8J1pmJ1j7K9Rl9mP%l9M0
$$ 9 22 -2 -11 24 24 -26 -10 9 -13 -14 14 3 20 -15 19 8 -5 -9 12 12 1 15 -3 8 1 -3 8 -9 20 29 -10 -14 -7 -7 -46 -6
5115fL4jk1KK4n5J5k9L0NlJ8Jj8J8%l3J0MM9o6K4oQl0K4k0L2l0J5J6j9j1Q8k2
$$ -6 28 27 6 8 32 -23 -8 -37 -7 -2 -5 13 14 -4 14 14 -19 -9 -5 44 -22 2 -4 4 -26 -2 -22 10 -20 -5 11 -8 -19 69 47
5150D7p0K4oJ2j4K8o3K7qN2k5KJ3J3k0l4M5L3o0%L9l8k9L6L8n8L0qK3k6k2L1j7
$$ 47 -23 1 -5 7 -7 21 -42 -15 -23 29 4 6 19 32 12 -22 23 56 -4 -4 35 -3 -32 4 42 -16 14 6 29 3 -19 12 -5
5183eJK2lk3J0L8k2k2oO9m4l2oL8k8K1OPm7JK4Ql6L2j2koJ0J5l2L1L7k3l3J3K7
$$ -5 -4 18 15 -8 2 40 18 -4 -10 59 15 -17 -23 15 -13 8 14 21 -26 -25 -1 7 -29 3 -9 -11 -17 -7 8 -24 7 44 21 -12 1 28
5219B8nl2K7L8n9LM1m7j8J4pPoK2K1m8j4O2j0j1j0Kj3J5J8k4Mk2M8l4j1J9K3k9
$$ 28 23 -9 18 56 -3 0 41 -6 -24 -10 -17 -10 -16 6 27 -21 -35 27 17 6 -4 -2 -15 0 18 -6 -2 -24 24 -10 -21 -2 21 -8
5253hj2K1J6j1ojJ5j0j6K1k3oN1k5j6k1L3%k7K9%j9J5K1K5k5orOj0K1K3k8l1K2
$$ -8 -20 1 17 6 0 -1 14 4 -12 9 -14 -20 31 6 -10 -31 2 2 -25 4 4 -15 0 21 46 21 15 6 12 2 23 46 18 -13 9
5288IK4m5J3qJ6l7L1J5qj1JoOMJ7j1l9M3Oj5n5O6J3j7k6L6j5m4K7Pj4j7L3J4q
$$ 9 33 -12 1 -7 9 -28 3 18 10 -1 0 -6 0 4 21 10 -29 14 20 5 -50 16 29 12 -14 22 7 -37 -10 -3 -17 -34 -1 13 5
5323Ej8L2j9nK4nNLmJ1m0K5J3n1K3N2J0n9%oQj4j1K9k4J1PL6n5OJ2K6k9K5J1l4
$$ 5 -13 19 0 -5 19 14 19 22 18 29 -11 14 27 -24 -1 51 61 2 2 -4 4 -10 -21 8 -16 -5 2 38 -17 -11 1 27 -2 23 34 0
5359@k1J5K0l2j3N7k1j0KK7j4m6M1K3j3j8lJ8j8KM7k0j8MK0j6LojkNJ3k1k0J5
$$ 0 -21 -6 14 -18 -31 26 5 -5 -3 24 10 -36 5 28 15 -3 -6 12 -6 -4 43 23 5 9 29 13 16 10 9 7 12 25 4 -16 -1
5394aK8l4J4J0l3K3oK0j4k7M6j1J7l8K4qj9K5pLj2K9J8m6k1M8k7j0k2L8j6k4N1
$$ -1 27 -7 7 17 -16 7 1 21 7 -20 26 15 32 -6 18 10 -9 16 9 12 0 29 47 1 -20 28 1 -9 -31 7 -9 -33 18
5427A8nJj2L6l7nk8K7K1k1JK3ml9L0K2j0j0J6j3j6k1N8l9pJ0M9rjpl9J5Onk3K3
$$ 18 13 14 2 38 1 -4 -32 -5 16 -5 -4 19 15 -24 6 28 18 8 24 11 -5 -26 32 -7 -14 -4 45 36 35 28 -11 4 10 5 -18 5
5463EJ0%k1K9J7l8j3K9lPm7N6l9j4L2j3J3JNj2k2qN1kk3k6N7k7rML0k3kK2k0m
$$ 5 15 15 -6 23 40 2 -11 18 15 22 -25 31 -8 -22 10 -3 10 11 16 4 -18 -26 25 23 0 -26 31 4 -5 -1 29 6 4 26 6 2
5499Bj5K2j7Ok9N8p7N6j7J8j3LJ7j1Pj3K4k4qK7j2Mj1K0k1jK7l0mjK4%m8K2L0
$$ 2 -13 9 -8 -2 -31 27 -50 6 -11 7 -6 -3 14 3 10 -3 21 -3 -11 16 4 8 -3 17 -4 -5 22 -8 -12 -13 11 11 -37 -15 15
5534A5j0j4J2J0m5J6L5K3n2L6l4K9k7M1j8m%oLj7ML2l2NPjn0M2K9l9Kj1M3l3k2
$$ 15 5 -9 3 13 -32 -16 19 42 -10 26 -8 21 -6 35 17 13 13 7 10 -7 -3 29 -3 2 9 8 -42 0 29 -10 -8 -19 24 -9 -31
5569c1M5J6l0J9k6M1m0L0L9m0m2L0j4oJK0J8j1Qml0LNJ1k7J1J7j3Rk2J0JlOJ6
$$ -31 14 30 0 19 -7 34 -6 24 63 23 -19 11 -3 -9 -8 12 30 19 27 23 -7 -4 1 12 -15 -4 13 0 9 -13 -3 -2 -5 1 17
5604A7k9J4rNrNK6j6j4L7j4j0K2j5m1K2K7l9kKRNRk4M5J6k5RPl9kK5oj8j3M9l8
$$ 17 -12 2 -7 -2 -11 -6 20 4 -10 27 13 3 25 10 -31 -9 18 -21 -23 -21 -12 -7 2 -22 23 39 14 23 30 -9 -11 14 8 -10 -23 26 -12
5641a2LL8Knk7L7ol3j4L9k8KK%l4N2j9J8nk6L1l5J9J1Rj1k1N2k3j9J8J2k0j0J7
$$ -12 -9 29 31 26 -1 36 30 -3 -17 22 -6 -4 -2 -2 -36 16 -3 15 10 -16 15 -20 -1 10 19 8 -13 39 16 -3 15 27 7 -3 14
5676A4kj5mM5pl1oL1Kl5K5qK0m7L6l2NOj0K2rJ4j7J1j0L2j7k7K5j0j6PNmj0NJ1
$$ 14 12 -3 -7 38 31 0 -6 25 27 -8 17 9 29 -18 18 -14 -9 -3 -13 9 0 14 -3 8 -2 30 13 -14 11 1 -15 -8 -3 -7 -17 -12 -1
5713aL3l3J8j2K6m4L7%j5k2K8Jk4KKQj6K4Kl2J4L2l3j3K1K4m0QJ9Kj3j7L7k8Q
$$ -1 32 -1 17 5 31 -13 24 24 9 -13 15 16 -8 -6 -4 4 -12 12 14 -18 -4 28 -5 -18 3 27 -13 -5 14 16 3 -14 23 -5 3
5748CpK3Nm9K0L7l1j0L5j7k4NK3lk5M5J7o5N5k8J4m8L5J9j9J0krK6l6K4qpJ5j1
$$ 3 -4 19 24 -25 -5 32 1 -9 26 9 -15 -10 13 10 -15 30 47 -18 37 9 23 -25 10 29 10 20 18 9 35 -1 23 15 8 23 12
5783A2l1J0M2m6M3l9K5j1l1M2Nj6j1J7pl4N7K1m3J2j7lJ6k2M7k2k5QJj5K7l2K9
$$ 12 -19 -9 33 -13 30 -9 16 5 -26 16 21 5 -6 11 4 -30 27 48 5 17 0 -3 13 -9 38 16 -9 -1 0 -15 12 -20 9
$$ [...]
8191b
##END NTUPLES=NMR FID
##END=
