##TITLE=1H_AM A510.CO2-1
 CDCl3, 8 sc, 
 29.7.2019
##JCAMPDX= 6.0         $$ Bruker NMR JCAMP-DX V2.0
##DATA TYPE= NMR FID
##DATA CLASS= NTUPLES
##ORIGIN= UXNMR, Bruker Analytische Messtechnik GmbH
##OWNER= root
$$ XWIN-NMR		Version 3.5
$$ Mon Jul 29 15:29:26 2019 Russian Standard Time (UT+4h)  she@DPX200
##.OBSERVE FREQUENCY= 200.13155
##.OBSERVE NUCLEUS= ^1H
##.DELAY= (6, 6)
##.ACQUISITION MODE= SIMULTANEOUS
##.ACQUISITION SCHEME= undefined
##.AVERAGES= 8
##.DIGITISER RES= 18
##SPECTROMETER/DATA SYSTEM= spect
##.PULSE SEQUENCE= zg30
##.SOLVENT NAME= CDCl3
##.SHIFT REFERENCE= (INTERNAL, CDCl3, 0, 15.7039)
##AUDIT TRAIL= $$ (NUMBER, WHEN, WHO, WHERE, WHAT)
$$ ##TITLE= Audit trail, XWIN-NMR		Version 3.5
$$ ##JCAMPDX= 5.01
$$ ##ORIGIN= Bruker BioSpin GmbH
$$ ##OWNER= she
$$ F:/spectra/data/she/nmr/H-F/1/audita.txt
$$ ##AUDIT TRAIL=  $$ (NUMBER, WHEN, WHO, WHERE, WHAT)
(   1,<2019-07-29 15:28:15.43 +0400>,<she>,<DPX200>,
      <created by zg, POWCHK disabled, PULCHK disabled
       configuration hash MD5:
       00 E9 B6 7A A2 85 ED C7 34 08 36 98 17 FE 4E 26
       data hash MD5: 16K
       44 7D 59 5F 1A C4 4B 46 3F 52 3D E2 2D 91 FB 2E>)
$$ ##END=
$$ 
$$ hash MD5
$$ 30 19 D7 16 FC BE 5F 80 EE A7 E2 9D 3C FB 31 60
##$RELAX= 
##$RELAX= 
##$RELAX= 
##$RELAX= 
##$RELAX= 
##$RELAX= 
$$ Bruker specific parameters
$$ --------------------------
##$DU= <F:/spectra>
##$EXPNO= 1
##$NAME= <H-F>
##$PROCNO= 1
##$TYPE= <nmr>
##$USER= <she>
##$AMP= (0..31)
100 100 100 100 100 100 100 100 100 100 100 100 100 100 100 100 100 100 
100 100 100 100 100 100 100 100 100 100 100 100 100 100 
##$AQSEQ= 0
##$AQ_mod= 1
##$AUNM= <au_zg>
##$AUTOPOS= <>
##$BF1= 200.13
##$BF2= 200.13
##$BF3= 200.13
##$BF4= 200.13
##$BF5= 200.13
##$BF6= 200.13
##$BF7= 200.13
##$BF8= 200.13
##$BYTORDA= 1
##$CFDGTYP= 0
##$CFRGTYP= 5
##$CHEMSTR= <none>
##$CNST= (0..31)
1 1 145 1 1 1 1 1 1 1 1 1 1 1 1 1 1 1 1 1 1 1 1 1 1 1 1 1 1 1 1 1 
##$CPDPRG= <>
##$CPDPRG1= <>
##$CPDPRG2= <>
##$CPDPRG3= <>
##$CPDPRG4= <mlev>
##$CPDPRG5= <mlev>
##$CPDPRG6= <mlev>
##$CPDPRG7= <mlev>
##$CPDPRG8= <mlev>
##$CPDPRGB= <>
##$CPDPRGT= <>
##$D= (0..31)
0 1.2 0 0 0 0 0 0 0 0 0 0.03 0 0 0 0 0 0 0 0 0 0 0 0 0 0 0 0 0 0 0 0 
##$DATE= 1564399694
##$DBL= (0..7)
120 120 120 120 120 120 120 120 
##$DBP= (0..7)
150 150 150 150 150 150 150 150 
##$DBP07= 0
##$DBPNAM0= <>
##$DBPNAM1= <>
##$DBPNAM2= <>
##$DBPNAM3= <>
##$DBPNAM4= <>
##$DBPNAM5= <>
##$DBPNAM6= <>
##$DBPNAM7= <>
##$DBPOAL= (0..7)
0.5 0.5 0.5 0.5 0.5 0.5 0.5 0.5 
##$DBPOFFS= (0..7)
0 0 0 0 0 0 0 0 
##$DE= 6
##$DECBNUC= <off>
##$DECIM= 24
##$DECNUC= <off>
##$DECSTAT= 4
##$DIGMOD= 1
##$DIGTYP= 9
##$DL= (0..7)
0 120 120 120 120 120 120 120 
##$DP= (0..7)
150 150 150 150 150 150 150 150 
##$DP07= 0
##$DPNAME0= <>
##$DPNAME1= <>
##$DPNAME2= <>
##$DPNAME3= <>
##$DPNAME4= <>
##$DPNAME5= <>
##$DPNAME6= <>
##$DPNAME7= <>
##$DPOAL= (0..7)
0.5 0.5 0.5 0.5 0.5 0.5 0.5 0.5 
##$DPOFFS= (0..7)
0 0 0 0 0 0 0 0 
##$DQDMODE= 0
##$DR= 18
##$DS= 0
##$DSLIST= <SSSSSSSSSSSSSSS>
$$ [...]
##$SUBNAM2= <"">
##$SUBNAM3= <"">
##$SUBNAM4= <"">
##$SUBNAM5= <"">
##$SUBNAM6= <"">
##$SUBNAM7= <"">
##$SUBNAM8= <"">
##$SUBNAM9= <"">
##$SW= 24.9336996594482
##$SWIBOX= (0..15)
0 0 2 0 0 0 0 0 0 0 0 0 0 0 0 0 
##$SW_h= 4990.01996007984
##$TD= 16384
##$TD0= 1
##$TE= 0
##$TE2= 300
##$TE3= 300
##$TEG= 300
##$TL= (0..7)
0 120 120 120 120 120 120 120 
##$TP= (0..7)
150 150 150 150 150 150 150 150 
##$TP07= 0
##$TPNAME0= <>
##$TPNAME1= <>
##$TPNAME2= <>
##$TPNAME3= <>
##$TPNAME4= <>
##$TPNAME5= <>
##$TPNAME6= <>
##$TPNAME7= <>
##$TPOAL= (0..7)
0.5 0.5 0.5 0.5 0.5 0.5 0.5 0.5 
##$TPOFFS= (0..7)
0 0 0 0 0 0 0 0 
##$TUNHIN= 0
##$TUNHOUT= 0
##$TUNXOUT= 0
##$USERA1= <user>
##$USERA2= <user>
##$USERA3= <user>
##$USERA4= <user>
##$USERA5= <user>
##$V9= 5
##$VALIST= <valist>
##$VCLIST= <CCCCCCCCCCCCCCC>
##$VD= 0
##$VDLIST= <DDDDDDDDDDDDDDD>
##$VPLIST= <PPPPPPPPPPPPPPP>
##$VTLIST= <TTTTTTTTTTTTTTT>
##$WBST= 1024
##$WBSW= 4
##$XGAIN= (0..3)
0 0 0 0 
##$XL= 0
##$YL= 0
##$YMAX_a= 119957
##$YMIN_a= -105267
##$ZGOPTNS= <>
##$ZL1= 120
##$ZL2= 120
##$ZL3= 120
##$ZL4= 120
##$ABSF1= 10
##$ABSF2= 0
##$ABSG= 5
##$ABSL= 3
##$ALPHA= 0
##$AQORDER= 0
##$ASSFAC= 0
##$ASSFACI= 0
##$ASSFACX= 0
##$ASSWID= 0
##$AUNMP= <proc_1d>
##$AZFE= 0.1
##$AZFW= 0.1
##$BCFW= 1
##$BC_mod= 2
##$BYTORDP= 1
##$COROFFS= 0
##$CY= 11.3945322036743
##$DATMOD= 1
##$DC= 2
##$DFILT= <>
##$DTYPP= 0
##$F1P= 20.1537800932815
##$F2P= 0.134698688090026
##$FCOR= 0.5
##$FTSIZE= 0
##$FT_mod= 4
##$GAMMA= 1
##$GB= 0.15
##$INTBC= 1
##$INTSCL= 1
##$ISEN= 128
##$LB= 0.24
##$LEV0= 0
##$LPBIN= 0
##$MAXI= 10000
##$MC2= 0
##$MEAN= 0
##$ME_mod= 0
##$MI= 1.114404
##$NCOEF= 0
##$NC_proc= 0
##$NLEV= 6
##$NOISF1= 3.799351
##$NOISF2= 2.8
##$NSP= 1
##$NTH_PI= 0
##$NZP= 0
##$OFFSET= 15.70392
##$PC= 1
##$PHC0= -9129.092
##$PHC1= 10.60097
##$PH_mod= 1
##$PKNL= yes
##$PPARMOD= 0
##$PSCAL= 0
##$PSIGN= 0
##$REVERSE= no
##$SF= 200.130013532006
##$SI= 16384
##$SIGF1= 3
##$SIGF2= 2
##$SINO= 400
##$SIOLD= 16384
##$SREGLST= <1H.CDCl3>
##$SSB= 0
##$STSI= 0
##$STSR= 0
##$SW_p= 3612.71676300578
##$SYMM= 0
##$S_DEV= 0
##$TDeff= 0
##$TDoff= 0
##$TI= <>
##$TILT= no
##$TM1= 0
##$TM2= 0
##$TOPLEV= 0
##$USERP1= <user>
##$USERP2= <user>
##$USERP3= <user>
##$USERP4= <user>
##$USERP5= <user>
##$WDW= 1
##$XDIM= 8192
##$YMAX_p= 0
##$YMIN_p= 0
$$ End of Bruker specific parameters
$$ ---------------------------------
##NTUPLES= NMR FID
##VAR_NAME=  TIME,          FID/REAL,        FID/IMAG
##SYMBOL=    X,             R,               I
##VAR_TYPE=  INDEPENDENT,   DEPENDENT,       DEPENDENT
##VAR_FORM=  AFFN,          ASDF,            ASDF
##VAR_DIM=   8192,          8192,            8192
##UNITS=     SECONDS,       ARBITRARY UNITS, ARBITRARY UNITS
##FACTOR=    0.0002004,     1,               1
##FIRST=     0,             0,               0
##LAST=      1.6414764,     0,               0
##MIN=       0,             -105267,         0
##MAX=       1.6414764,     119957,          0
$$ Real data points
##PAGE= N=1
##DATA TABLE= (X++(R..R)), XYDATA
0@%%%%%%%%%%%qJ6j6J6j6K3l1L2l4M2n0N8o6P5q9J01j14J30j46J64j85K08k31
$$ 0 0 0 0 0 0 0 0 0 0 0 0 -8 8 -8 8 -8 15 -16 16 -18 24 -26 32 -34 41 -48 53 -61 69 -77 87 -98 110 -121
34a21K56k86L18l52L91m35M83n32N88o54P25q02Q91r95J113j249J410j607J849
$$ -121 135 -151 167 -185 206 -229 254 -278 310 -344 381 -421 470 -525 588 -661 749 -858 991
53I91k154K556l108L919n227P669j3681N3005P5987j61751l2330J41296K590j54519
$$ 991 -1163 1393 -1715 2204 -3023 4646 -9035 43970 119957 -41794 -74124 67172 69762 -84757
67h4757J1752J34378j9725j05718M9806Q6673o2200p2129O4511M3554o5927j7814
$$ -84757 -73005 61373 41648 -64070 -14264 72409 10209 -61920 2591 46145 -19782 -37596
79c7596P5545N712p2689m339N3978j2478m8008J7266N1335L220k8911r975J3823
$$ -37596 37949 43661 -29028 -33367 20611 8133 -39875 -22609 28726 31946 3035 -6940 6883
92F883R235k2125l5500J5163N5914k774n7327J3251O8058k4972q2708K7682Q2400
$$ 6883 16118 -6007 -41507 -26344 29570 26796 -30531 -17280 50778 25806 -56902 -29220 53180
105E3180l5043p1552N3243O3034p0711n6963P4385L4251q2139m103J01654q090
$$ 53180 18137 -53415 -172 62862 -7849 -64812 9573 43824 -38315 -42418 59236 51146
117E1146j01176K6683R0561o0574r6765P4472R2730p8099o9996R4450N7730j01223
$$ 51146 -50030 -23347 67214 6640 -90125 -15653 77077 -1022 -71018 23432 81162 -20061
129b0061m8776R1743K8112q4017p704P7596m229o4006J2681M2752k5749k6553
$$ -20061 -68837 22906 51018 -32999 -40703 36893 32664 -31342 -18661 24091 -1658 -28211
141b8211L6108J8529l1974l151K8265j2641l1870J1795K2812j0364q198J4699
$$ -28211 7897 26426 -5548 -8699 19566 6925 -24945 -13150 9662 -702 -8900 5799
153E799M346p160J623p116j4196J5093J9973k3624j8765L7462J8712m9566j9160
$$ 5799 10145 2985 4608 -2508 -16704 -1611 18362 -5262 -24027 13435 32147 -17419 -36579
166c6579N4299J3302n5911j297N9965o671n7935J3610M6828k7403l8033L8962
$$ -36579 17720 31022 -24889 -26186 33779 27108 -30827 -17217 29611 2208 -35825 3137
178C137K9821m2544j3622M8087k761n4491J3382N3326k4273m7758L6403M2864
$$ 3137 32958 -9586 -23208 24879 22118 -32373 -18991 34335 10062 -37696 -1293 41571
190D1571m3975l6584M5684K5411m5755j2831M5176L429l9433N420K8861j7101
$$ 41571 -2404 -38988 6696 32107 -13648 -26479 18697 22126 -17307 -11887 16974 -127
202a27k0574K5360J3148k7197j445K9253r707l2127J4499K8513j8507k1065K4376
$$ -127 -20701 4659 17807 -9390 -10835 18418 8711 -23416 -8917 19596 1089 -19976 4400
215D400J6883k4665j1658J9633J757j6761N846J3840q320n371J2345l410j7383
$$ 4400 21283 -3382 -15040 4593 6350 -10411 -4565 9275 955 -4416 7929 4519 -12864
228a2864P442J6990j1311j2335J8054J0236k0753p778J7563n82j6318Q396J5844
$$ -12864 -5422 11568 257 -12078 5976 16212 -4541 -12319 5244 4662 -11656 -3260 12584
241A2584j0559q283J5472q94k3309M457K4254j0219k1567K0591K2650k6208k1795
$$ 12584 2025 -6258 9214 8320 -14989 -10532 13722 3503 -18064 2527 25177 -1031 -22826
254b2826K7059J4013l1280p254L5130M249l1782K882K7136j3470k6920J7724K2993
$$ -22826 4233 18246 -13034 -20288 14842 19091 -12691 -9809 17327 3857 -23063 -5339 17654
267A7654j9409j3222K6377Q031l0586n969K7346j744k6559Q689K8321q433k3308
$$ 17654 -1755 -14977 11400 19431 -11155 -17124 10222 8478 -18081 -9392 18929 10496 -12812
280a2812R848J6487j4644j5187J3849J2879r267n527R233J946r448l118M172J036
$$ -12812 -2964 13523 -1121 -16308 -2459 10420 1153 -4374 4859 6805 -2643 -5761 -1589 -553
294e53m38K213J927Q71n41m699l518L601J441n221K784J1490k107j3241L048J1481
$$ -553 -991 1222 3149 4020 3479 -1220 -4738 -1137 304 -4917 -2133 9357 7250 -5991 -2943 8538
310H538r780j4653J3354J7123j3192j3063J7850J0411k3486j1641K2419P564k1890
$$ 8538 -1242 -15895 -2541 14582 1390 -11673 6177 16588 -6898 -18539 3880 11444 -10446
323a0446l62K5985j408k5577K902K0759r805k0210J4098K0515j3253j4896J5948
$$ -10446 -10808 15177 13769 -11808 -8906 11853 2048 -18162 -4064 16451 3198 -11698 4250
336D250J0268k0449j0712J8826Q039j5965j701J8424Q86j8303k275J2950j526
$$ 4250 14518 -5931 -16643 2183 10222 -5743 -7444 10980 11866 -6437 -8712 4238 2712
349B712j1761M137J3436q84r830P03O114m073q568K302R224J209n439J050O011
$$ 2712 -9049 -4912 8524 7640 -2190 -1487 4627 554 -8014 -5712 3512 4721 -718 332 6343
364F343l252j0224O4R211J52p110M477J0796m822j3010K624R235o827r028J1179
$$ 6343 3091 -7133 -7069 2142 2294 -4816 -339 10457 5635 -7375 -4751 4484 -2343 -11371 -192
379a92J2652r096r945R405N090j4910o446J5404O563j2147n26J4634k043j7285
$$ -192 12460 3364 -6581 2824 7914 -6996 -13442 1962 8525 -3622 -4148 10486 8443 -8842
393h842K42J3233l441j0786Q807J3775p612j2186O094O595j0431o575J2012Q270
$$ -8842 -8600 4633 1192 -9594 -787 12988 5376 -6810 -716 5879 -4552 -11127 885 9155
407I155q100l923Q431N78j1658l248R018K839n541J776Q122j277r224k115M925
$$ 9155 1055 -2868 5563 6141 -5517 -8765 253 3092 -2449 -673 7449 6172 -3052 -5167 -242
422b42l39m399L033P995J12o854j296L751k554o536K624Q896N23n726J723N001
$$ -242 -581 -4980 -1947 6048 6160 -694 -1990 1761 -793 -7329 -4705 4191 4714 -1012 711 5712
438E712n520q808L756Q230k688m470P071N633q737p418O267L848p771j111J1356
$$ 5712 192 -8616 -4860 3370 682 -3788 3283 8916 179 -7239 -972 2876 -4895 -6006 5350
453E350L066r798j852P564k855r918L457J0702j824p026M694N764p624p412N968
$$ 5350 8416 -1382 -3234 4330 1475 -8443 -4986 5716 3892 -3134 1560 7324 -300 -7712 -1744
468a744N350n363j743Q082K221p997k850N069l87n483K024P109j31n042K67K779
$$ -1744 3606 -1757 -3500 4582 6803 -1194 -4044 1025 638 -4845 -2821 4288 4157 -885 -618 2161
484B161k713m177J993M705N3k392J019K201k216m418L20L994N70k428J708L902
$$ 2161 -552 -4729 -2736 1969 2022 -370 649 2850 634 -3784 -3464 530 1100 -1328 380 4282
500D282k276n727P38M595j837l652M512N372m603n489M328L267o597k811Q477
$$ 4282 2006 -3721 -2983 1612 -225 -3877 635 6007 1404 -4085 243 3510 -3087 -5898 2579
515B579L503p555j632P568j087r484J333R497j475p345M048O878o082p491N422
$$ 2579 6082 -1473 -3105 4463 3376 -6108 -4775 4722 3247 -4098 -50 6828 746 -6745 -1323
530a323N393n766k645P957K607p689k130N684j120o314K389P168j374m857K187
$$ -1323 4070 -1696 -4341 3616 6223 -1466 -3596 2088 968 -5346 -2957 4211 2837 -2020 167
545A67L113m174l876L315L672j570j332K195Q80k770k689L25K037J157j64R11
$$ 167 3280 -894 -4770 -1455 2217 647 -685 1510 2390 -380 -3069 -2744 -707 450 286 1197
561A197K232n58m285k006K470M73k448K110N322j088n045J356L219m645m081O265
$$ 1197 3429 2871 -1414 -3420 -950 -477 -2925 -815 4507 3419 -1626 -270 2949 -1696 -5777 488
577D88N078n598k991O747N92r928j380R926J166p605K918R147m278j0424K581
$$ 488 5566 -32 -3023 3724 4316 -5612 -6992 2934 4100 -3505 -587 8560 4282 -6142 -3561
592c561O438n292m886Q135O298o070l443N831m24q252K05P644l57n196L028M829
$$ -3561 2877 -2415 -7301 834 7132 1062 -2381 3450 3026 -5226 -5021 2623 2266 -2930 98 4927
608D927m652n817L148M303k329j337M463K505l320l602m91M9m98M3J505L375K442
$$ 4927 275 -5542 -2394 1909 -420 -1757 2706 5211 1891 -1711 -2202 -2153 -2651 -2608 -1103 2272 4714
625D714j846l276M17R09l267j805M320L044l218r94L560j295n360J599N615j691
$$ 4714 2868 -408 9 918 -2349 -4154 166 3210 -8 -1002 2558 1263 -4097 -2498 3117 1426
641A426l393N005L386p724n269O035K477p155K16J0478J657q607k83O784l521
$$ 1426 -1967 3038 6424 -1300 -6569 -534 1943 -5212 -4996 5482 7139 -1468 -1751 5033 1512
656A512q575K900P268k580l952M914L045n795k485N006N12m396K109N284k712
$$ 1512 -7063 -4163 3105 525 -3427 1487 4532 -1263 -3748 1258 1770 -2626 -517 4767 2055
671B055n495K054K965l922k668M910M142k061j619J865Pl044j972L33J258J669
$$ 2055 -3440 -1386 1579 -2343 -5011 -101 4041 1980 361 2226 2233 -811 -2783 -2450 -1192 477
687D77M56j004O42J990j520l411J129L330j173k499K215J907l341k156K663N57
$$ 477 933 -71 571 2561 1041 -2370 -1241 2089 916 -1583 632 2539 -802 -2958 -295 262
703B62k393K040M131k228l738K982K089n821k939O230K828n790p99P044N06p256
$$ 262 -2131 -91 4040 1812 -1926 1056 3145 -2676 -5615 615 3443 -2347 -3146 3898 4404 -2852
719b852m63N911q23n128J895M526k338l330K498J590l061j32L800m16l268J673
$$ -2852 -3315 2596 1773 -3355 -1460 3066 728 -2602 -104 1486 -1575 -1707 2093 1677 -1591 82
735H2L040l023l621K700K979k563j969L175K193k480j942J394J001r21p97J44
$$ 82 3122 99 -3522 -822 2157 -406 -2375 800 2993 513 -1429 -35 966 45 -752 -608
751f08P43Q55m53j485K33J784l58k027O77K138o42j905O29J018j071l22J354l93
$$ -608 135 990 537 -948 -715 1069 711 -1316 -639 1499 857 -1048 -419 599 -472 -794 560 167
769A67j293J490J397k483j515L172J322l921j140M482J064m633p14M507L71m226
$$ 167 -1126 364 1761 -722 -2237 935 2257 -1664 -2804 1678 2742 -1891 -2605 1902 2273 -1953
785a953N2L745m25l124Q38K279j132j308J504M96j816K39J959q51k116J301K220
$$ -1953 -1901 1844 1419 -1705 -867 1412 280 -1028 476 972 -844 -605 1354 503 -1613 -312 1908
802A908j526k093J624K034j637k101J301J966q64j606M76J452j67j324l08J045
$$ 1908 382 -1711 -87 1947 310 -1791 -490 1476 612 -994 -518 934 767 -557 -865 180
818A80N55q98p39P69Q44n72o96L70M25l06L4K66m66k51P59P7j416N8J957J43k182
$$ 180 735 -163 -902 -133 711 139 -557 -187 238 -68 -34 232 -234 -485 274 351 -1065 -1007 950 1093 -1089
839a089J17K560j74k781p9K546k44k426L88K423k11j765M37J434n50j029M36L80
$$ -1089 -972 1588 1414 -1367 -1446 1100 856 -1570 -1182 1241 1030 -735 -298 1136 586 -443 -7 373
857C73p72j33Q18j21q84N79J138m32j082O18J243p13j719J74J446k80j637K08
$$ 373 -399 -532 286 165 -719 -140 998 566 -516 102 1345 632 -1087 -913 533 253 -1384 -1176
875a176K002L17j583j8J854m3k161m50J507j27j575M06J698k96j050J052J098
$$ -1176 826 1143 -440 -458 1396 1353 -808 -1258 249 122 -1453 -1047 651 355 -695 357 1455
892A455j334q68J417K29k066k61K089j85k285O38K712k94k054R23K112j228k393
$$ 1455 121 -747 670 899 -1167 -1428 661 476 -1809 -1171 1541 1247 -807 116 2228 1000 -1393
909a393O20J418j145j318J266J470m76l99Q98K64r16m68K69k11n39N6L74J3k15
$$ -1393 -773 645 -500 -1818 -552 918 442 43 941 1205 289 -179 90 -121 -660 -604 -230 -217 -432
928d32J59O69M05l80l10N58L25j264j170P99P08j210n42K183J347j639p68J877
$$ -432 -273 396 801 421 111 669 994 -270 -1440 -641 67 -1143 -1685 498 1845 206 -562 1315
946A315K22k612n73K157j42k198P29K416p67j905J447J794j659j309K009P82k592
$$ 1315 1537 -1075 -1648 509 367 -1831 -1102 1314 547 -1358 89 1883 224 -1085 924 1706 -886
963h86q65K090J48k196N54K653j27j838P89J535j291j894O59R97q91n20J182O74
$$ -886 -1751 339 487 -1709 -1155 1498 1371 -467 322 1857 566 -1328 -669 328 -563 -1083 99 773
981G73o31k44N55L8l87m0M4j25m7k33l55J88L87k84J6J025L83r48k91Q43n74j521
$$ 773 142 -102 453 491 104 64 108 -17 -64 -297 -652 -464 -77 -361 -345 680 1063 115 -176 667 93 -1428
1003a428M45J552n17j242J354J420j455j246J589P68j971m97K070J98k145J38
$$ -1428 -983 569 52 -1190 164 1584 129 -1117 472 1240 -731 -1228 842 1040 -1105 -967
1019i67J980o64j691J201J749j209j277J442O63j895o13J671J84j498M11J697
$$ -967 1013 349 -1342 -141 1608 399 -878 564 1227 -668 -1281 390 574 -924 -513 1184
1035A184m60j384N94Q98r77p01R48M90q30j86P04q8n96K46L76k47j18M06j50l03
$$ 1184 724 -660 -66 832 -145 -846 102 592 -238 -424 280 192 -404 -158 218 -29 -147 259 109 -194
1055a94J21P0m16lO73p5m22M10L68p55l70Q10J31r28K04J110l68j021O37Q20r97
$$ -194 -73 -3 -419 -422 251 176 -246 164 532 -223 -593 217 348 -580 -376 734 366 -655 -18 802 -195
1076a95p32J217O46j304k39J413j72j484L63J412o89j129R49J019j190p11J201
$$ -195 -927 290 936 -368 -607 806 634 -850 -487 925 236 -893 56 1075 -115 -826 375
1093C75L31j347o2J434j82j217M25J032p95r08R11O80r48l84R94J60r24L4P96
$$ 375 706 -641 -703 731 549 -668 -243 789 -6 -914 -3 677 -271 -655 339 499 -425 -391 405
1112D05k69o76L73N62l75l61M02J07l62qK78Nr8R8j3j31J26O7l34M4M40j90l67
$$ 405 136 -540 -167 395 20 -341 61 168 -194 -202 76 81 -17 81 68 -63 63 130 -204 -160 280 90 -277
1135b77M07M27o30m39P78K81r03j12J068j20j141L45J138o02j092P87J008r89
$$ -277 130 557 -73 -512 266 547 -356 -468 600 480 -661 -316 822 220 -872 -85 923 -66
1153f6q50J209O00j391l88J400K06j417J15J362l71j277N53J120p30r61Q24P97
$$ -66 -916 293 893 -498 -886 514 720 -697 -582 780 409 -868 -315 805 75 -886 -62 735
1171G35q76n55Q75L48q16k59P73J89o49n1N15L6m34l3L15J55l32j93L27L15l05
$$ 735 -141 -696 179 527 -289 -548 225 414 -235 -286 229 265 -169 -202 113 268 -64 -257 70 385 80
1192H0m30L73M57m78n10O29N33p68n19R12M54j093l09J227J11j377J02J441l32
$$ 80 -350 23 480 2 -508 121 654 -114 -633 279 733 -360 -669 558 669 -708 -606 835 503
1211E03j433N45J340p94j207R75J104j151r19J240P24j252n62J291L47j339o3
$$ 503 -930 -385 955 161 -1046 -71 1033 -118 -1037 203 927 -325 -887 404 751 -588 -651
1228f51J218rj134J27R53k17p98K69O80k22n91K04N13j21m49%M73M8m86q9N40
$$ -651 567 558 -576 -449 504 287 -511 -242 438 216 -375 -171 342 221 -228 -228 245 293 -193 -282 258
1249B58K16p21k34Q66J89r54j17J080pj214J59J272m14j280O04J237q04j097J012
$$ 258 474 -247 -481 385 574 -380 -497 583 576 -638 -479 793 379 -901 -297 940 136 -961 51
1268E1R50j190q23J319N91j399l52J413J18j408J32J319l24j199M86R83n26p88
$$ 51 1001 -189 -1012 307 898 -501 -853 560 678 -730 -598 721 397 -802 -316 667 141 -647
1286f47N81N87o12m07O00K31m30j02K82M9j73k1K6M9J15q6k25K84K79m41l46N92
$$ -647 -66 521 -91 -498 102 333 -97 -199 83 132 -41 -62 -36 13 128 42 -183 101 380 -61 -407 185
1308A85K85p66j15R16l3j026J58J131m07j115N93J055p97r27R85P21j159n31J216
$$ 185 470 -296 -411 505 472 -554 -396 735 328 -787 -194 861 64 -863 122 843 -316 -847 369
1327C69L57j255pJ153k32j079M52Q78o43o80P69M88p99k02P87k5o93J61N73l91
$$ 369 726 -529 -536 617 385 -694 -242 636 -7 -687 82 570 -229 -431 356 331 -362 -201 372 -19
1347a9l04M23J14m96J62M62l57k96N40J57p24N8Q19l35q16N46P54p21n90R35M05
$$ -19 -323 100 214 -282 -120 342 -15 -311 229 386 -338 -280 539 204 -612 -66 688 -33 -623 312 717
1368G17j095j94J114j32j065L65J081o37r03Q07P23j039m59J055K34j072K4J044
$$ 717 -378 -572 542 410 -655 -290 791 154 -749 58 781 -258 -717 338 572 -500 -476 568
1386E68k86r27M76O99n47m19O52J38p17P1N89l07m35N45K98o84M6P88l50p49M29
$$ 568 282 -645 -169 530 -17 -436 216 354 -363 -292 297 -10 -445 100 398 -286 -240 548 198 -551 -122
1407a22O79p65m51R82K55j033M2J134l26j104O51R82j010q07J142N19j338k38
$$ -122 557 -208 -659 323 578 -455 -413 721 395 -709 -58 924 -86 -893 249 768 -570 -808
1425h08J458O0j334L46J275o58j205P45Q38j010n80J117L26r69K5J020k71q29
$$ -808 650 710 -624 -278 997 339 -866 -121 717 -293 -873 244 570 -399 -374 646 375 -454
1443d54M44N57o97l87O63L8o95J95O82k84l45O67J65p13j2N98n04p04O53N42p99
$$ -454 -10 547 -150 -537 126 164 -531 -336 346 62 -283 384 549 -164 -176 422 -82 -786 -133 409 -390
1464c90j40J141J02j143K21J171o51j209P75R21j171p45J367N11j253m0J534j79
$$ -390 -530 611 713 -430 -209 962 311 -898 -123 798 -373 -1118 249 760 -493 -533 1001 822
1482H22j413M03J179r36j224R50Q28j081l52J346L12j139J17J018m42j037M16
$$ 822 -591 -188 991 55 -1169 -219 609 -472 -824 522 834 -305 -188 830 388 -649 -233
1499b33O25p60l50P59K21o18K78O70k94m24M88N5p92p4N60l43m87O74N90o11j11
$$ -233 392 -368 -718 41 262 -356 -78 592 298 -126 362 417 -375 -449 111 -232 -719 -45 545 -66 -177
1520a77R09o5j025J46P95o83r32Q63P41r54l86J324L05j210R5J213m36j319M61
$$ -177 732 667 -358 -212 583 -100 -1032 -169 572 -382 -768 556 861 -349 -254 959 523 -796 -335
1539c35R38q86p95J116O72r78j75J258k4j202J99Q13o39q27O64O10p67k19R24
$$ -335 603 -283 -1078 38 710 -268 -443 815 791 -411 -212 601 -38 -865 -201 409 -358 -577 347
1558C47J49p19K06O13m41n62M29J93o76n5O45q4m36N21N10n56k91O35o9q51J38
$$ 347 496 -223 -17 596 155 -407 22 215 -461 -516 129 45 -391 130 640 84 -207 428 359 -492 -354
1579c54O95m26o06P23O03p11k87R48qr72J29Q56n06q45N89O72p26l94R94K81r13
$$ -354 341 -85 -691 32 635 -76 -363 585 577 -395 -266 590 84 -761 -172 500 -226 -620 374 655 -258
1600b58k4Q81k90r19M02O68o55m54P77L70p42o2P37q9p40L04N20m93m36N61K91
$$ -258 -282 599 309 -610 -208 460 -195 -649 128 498 -244 -306 431 342 -398 -94 426 -67 -503 58 349
1621C49o89kO74j16n56L85M37n35l36N05J19o21J31N98k27m88M17L89n41k53O24
$$ 349 -340 -342 332 216 -340 45 482 -53 -389 116 235 -386 -255 343 116 -372 45 434 -107 -360 264
1642B64M0o81J65O01l16n04M90L67n67j95O16Q1p09J21O35l20n65N10M00n68k67
$$ 264 304 -377 -212 389 73 -431 59 426 -141 -336 280 361 -348 -227 408 88 -477 33 433 -135 -402
1663d02O68N5o53Q0N79k65m99M17M24m82k59N30R8n66K4N89k40m60L40L70m55
$$ -402 266 321 -332 -252 327 62 -437 -20 404 -78 -337 193 291 -275 -251 338 98 -362 -22 348 -107
1684a07k06N10P9n34Q7M95k23m38L04L30m27k04N04R1m66J03M36k51l69K86L21
$$ -107 -313 197 276 -258 -171 324 101 -337 -33 297 -130 -334 170 261 -205 -102 334 83 -286 0 321
1705C21m78j50M69L8m46J13M63k49l91L50K52l67k14M47K1m72J49M06k03l12L12
$$ 321 -157 -307 162 200 -246 -133 330 81 -310 40 292 -75 -289 158 179 -293 -144 262 59 -253 59
1726E9K27m11p8L71m2m08J54L43k02k91L26K42m12n2L97n5m33J63L61k60l20L79
$$ 59 286 -125 -203 168 126 -282 -128 215 13 -278 48 290 -122 -174 223 168 -265 -102 259 -1 -321 58
1748E8K32m38p6M40Lm70J80L54k63l08L31K58l94j28L95K8m09Q6L86k36k44K17
$$ 58 290 -148 -224 216 219 -251 -71 283 20 -288 43 301 -93 -221 174 202 -207 -121 265 29 -215 2
1770BK14k73j48L12M2k74K2K62j32k30K40J20k49m1K58n9k45J43J78j77j27K58
$$ 2 216 -57 -205 107 149 -125 -103 159 27 -203 37 157 -92 -133 125 66 -179 -36 142 -35 -162 96
1792I6L1k87J9K88j13k27K19K08l01j04L18M8l60L1L40r5l60K14L06k84k15L37
$$ 96 127 -160 -141 147 34 -193 26 234 -67 -171 147 195 -165 -134 206 111 -249 -35 271 -13 -228 109
1814A09J20l57m3L23k0l83J56L22k04k30K14J65k41n3K08L4l08J20J86j29j25
$$ 109 229 -128 -171 152 132 -251 -95 227 23 -207 7 172 -69 -122 86 120 -188 -68 118 -11 -136
1835a36J66R8j86l3J89k3j84J01J27j69q9K25K8k34M1K12j27j82K14J30k42o8
$$ -136 30 128 -58 -91 98 75 -109 -8 119 -50 -139 86 114 -120 -79 133 6 -176 38 168 -74 -142
1857a42K59L7k93O8K18r6j93J81J68k70j25K86N8k79K0K77r1k48J60K08k30j09
$$ -142 117 154 -139 -71 147 51 -142 39 207 -63 -188 98 156 -123 -103 174 83 -165 -5 203 -27 -136
1879a36K17O8k81K7K36p6k26J42J64k04o2K31L6k66L0K54j27k21J94J70j95j11
$$ -136 81 149 -132 -105 131 55 -171 -29 135 -69 -131 100 136 -130 -100 154 27 -194 0 170 -25 -136
1901a36K63L8l02M8K57j41j92J89J39k06j03K47Qk42N6K15j40j43J35J68k16m9
$$ -136 127 165 -137 -89 168 27 -165 24 163 -43 -146 101 109 -133 -77 138 -2 -145 -10 158 -58 -107
1923a07J92Nk21Q5J99j26j60J70R3k38k3K34l0k10J45J49j83j73K66P5k69j2K77
$$ -107 85 90 -131 -46 153 27 -133 37 130 -108 -131 103 73 -137 8 157 -26 -199 67 142 -127 -139 138
1946A38m0k54J17K54k17j94K39J15k87k8L13j2l04P7K72j69k13J97J85k57n5K46
$$ 138 98 -156 -39 215 -2 -196 43 158 -129 -157 156 144 -160 -83 189 20 -193 4 189 -68 -123 123
1968A23qk42Q8K00j11j86J36J33k11j2K05j6k15R3J49j26j19K08%j85L6K06j17
$$ 123 115 -127 -39 161 50 -136 0 133 -78 -90 115 99 -116 -23 126 0 -119 89 89 -96 -60 146 29
1991B9k07J93J15j81r1K46K3k72K4K96j69j89J98J65k35j07K57O7l30J8L14q1
$$ 29 -178 15 130 -51 -142 104 127 -145 -121 175 6 -183 15 180 -55 -162 95 162 -168 -150 164 83
2013H3l03K04K55k48j95K57J31k77n6K85p2k39J41K36j77k08K05J64k15q4K37
$$ 83 -220 -16 239 -9 -204 53 184 -93 -149 136 64 -175 -34 202 25 -183 22 186 -29 -113 124
2034A24j1k31O1J47j13j12J70Q2j91J6J99j05j96J40J10j67n6K17J2k34Q4K16
$$ 124 113 -118 -57 90 -23 -135 35 117 -74 -58 141 36 -160 -20 90 -77 -133 84 96 -138 -54 162
2056A62j43j73J84J63k78r4K67mk95R0L47j69k53K63J66k64j71K98K5l40O9L31
$$ 162 19 -154 30 193 -85 -179 88 84 -211 -121 226 57 -196 67 233 -31 -202 96 121 -219 -150 181
2078A81j05k75J79K82k49j75K36Q6k56n8K69m0k22R3J74j33r7K00P6k01k1J74
$$ 181 76 -199 -20 262 13 -162 74 160 -96 -154 115 75 -147 -54 120 -13 -110 90 166 -35 -56 118
2100A18r6j84R4J41j73PK13jj85N5J47j70j64K25R9k78K6K24n7k22J48K37j75
$$ 118 22 -162 -68 73 -100 -93 120 119 -66 -11 136 -34 -198 27 126 -152 -126 98 41 -181 -33 204 29
2123B9j83K11J14k44j17K86l7k80J00L21q9k52K15J58k40j80K24J11l06K7K85
$$ 29 -154 57 171 -73 -190 96 59 -221 -121 200 111 -141 74 232 -8 -188 36 147 -159 -132 153
2144A53j7k55J28J76j86j57K18P9k06kJ58q3j81J40J42j49l0K06Kj83L4J22j39
$$ 153 136 -119 9 185 -1 -158 60 139 -67 -69 89 6 -175 -35 107 -42 -72 134 136 -47 -13 109 -30
2167c0j65J98O2j44J2K03l9k26J20J35j22j34K02M3k16m4K73l8k50J30K11j46
$$ -30 -195 3 65 -79 -67 136 97 -129 -9 126 4 -130 72 115 -101 -145 128 90 -160 -30 181 35
2189C5j48J89P4k30o8K00M8k15N8K11j08j47J40R6j86q6J98K4j45MJ63p7j24J07
$$ 35 -113 76 150 -80 -148 52 100 -115 -57 154 46 -101 39 135 -51 -137 61 85 -60 -56 107 30 -94 13
2213A3J01j49o0J64Nj74O3J28j19q9J26P9j56j3J85p5j08K8J48j26o7J85J6j80
$$ 13 114 -35 -95 69 74 -100 -37 91 -28 -117 9 88 -68 -81 104 29 -79 -51 97 -29 -96 89 105 -75
2237g5l0K07l4j85O4J40q3j11J29O2r6n4J40lj58P0J10r2j22J12J04j27jJ01r
$$ -75 -105 102 68 -117 -53 87 4 -107 22 84 -12 -66 74 71 -87 -17 93 1 -121 -9 95 -32 -33 68 59
2262E9j09K4J03q3l6Q5N9j55J0J01l6q4M2R6n3q0R1K1r8j7J33n1j16P3J13j10
$$ 59 -50 -26 77 -6 -42 43 102 -53 -43 58 22 -62 -20 76 23 -57 34 55 -43 -60 73 22 -94 -21 92 -18
2288a8o4J02K5j11J2J06J4j25O3Q3j10m9Q5M1r1RR2Pj07L3R6q7k9M5J2m9kO3l8
$$ -18 -82 20 45 -66 -54 52 66 -59 4 87 -23 -72 13 54 -37 -28 64 71 -36 -3 93 6 -23 22 34 -15 -17 46 8
2317Hn8O3K6qo3R1Jq5RJ3l7o6Q2J6J2RP5m0r4MQ5p8n1Q7K8o5k2P4km5QP4j2n2
$$ 8 -50 13 39 31 -32 59 60 -25 -16 -3 -40 -106 -24 -8 4 13 88 48 -46 -42 43 -35 -86 1 29 -36 -58 16 14 -31 -23 51 39 -13
2351a3J0O0j47PM9K0%J1J03K8p1k8J3r2k0N4l2M4J4N6kn0J2J5l0OK4nn2j0J8n6
$$ -13 -3 57 -90 -83 -34 -14 -14 -3 100 128 57 29 42 -50 -70 -16 -48 -4 10 66 64 14 26 41 11 17 41 36 -16 -26 -8 -64
2383f4J3P8loO6Ln3p2j9Nm4K2P7K0j0K0L7l4n2j6J4J0j2J2Lm3k2O3K6l0P0J6J1
$$ -64 -51 27 24 18 84 87 34 -38 -57 -52 -96 -74 3 23 13 33 70 36 -16 -32 -18 -8 -20 -8 -5 -48 -70 -7 19 -11 59 75 86
2416H6m4k0p3krJ8%P9L0K3k4k7l8k4mk7N6n7Q4j3JOk3N8m5J1PK1n7l4Ojl2rJ06
$$ 86 42 22 -51 -53 -62 -44 -44 35 65 88 64 37 -1 -25 -29 -56 0 -57 27 14 15 21 -2 56 11 22 29 50 -7 -41 -35 -36 -68 -77 29
2451B9K1k3L7k6l9p6K6K4mK7K4pJ0Qm9J7MJ8nkrKl6k0J4L7j4N9N0j5o9k0j1l3
$$ 29 50 27 64 38 -1 -77 -51 -27 -31 -4 20 13 23 31 -18 -1 3 21 16 14 5 7 -29 -49 -35 2 -12 47 97 82 13 -7 -18 -51
2485e1kK1N4l3N1K7m1k3l4M7l0kJ9J7k5j5PJ0k3K4L0l4J3Ok5j1j0j4L4pM2nJ6
$$ -51 -53 -32 22 -11 40 67 26 3 -31 16 -14 -16 3 20 -5 -20 -13 -3 -26 -2 28 -6 7 13 -12 -23 -33 -47 -13 -20 22 17 33
2518C3l0J5m7j6O5lk0%K9l8%%J3j2j2K3O4m3kJ1pl7QN7pn1j0L7j0m0M8Rl4K3l7
$$ 33 3 18 -29 -45 20 17 -3 -3 26 -12 -12 -12 1 -11 -23 0 64 21 19 30 23 -14 -6 51 44 -7 -17 20 10 -30 18 27 -7 16 -21
2553b1N8n0l6M3L2m0j5K6K4j8j8J8J5j6oL3Kp2N4m6j7K7RK5M3m8J8l2J8k6RJ1
$$ -21 37 -13 -49 -6 26 -14 -29 -3 21 3 -15 3 18 2 -4 29 31 -41 13 -33 -50 -23 -14 11 54 6 24 -8 10 -16 -7 4
2585DMOk0M5rl3j3J5MJ9QJ2m2k6k6P9m3j6N0M9n0j3J1l0jk8K8L7pj4J9L0r6mM2
$$ 4 8 14 -6 39 30 -3 -16 -1 3 22 30 42 0 -26 -52 27 -16 -32 18 67 17 4 15 -15 -16 -44 -16 21 14 0 19 49 -47 -51 -9
2620iK8j7lN6rp4JK6k6%nJ17po5m5K7lm7M1M8j0J1lNm7l1j1M0J1M7Poj8n9k9L8
$$ -9 19 2 -1 55 46 -28 -27 -1 -27 -27 -32 85 78 13 -32 -5 -8 -55 -14 34 24 35 32 37 -10 -41 -52 -12 -1 46 53 47 29 -30 -59 -21
2656b1%OM2K6K0o6l3Kk5m1Q7O4k5j0j6Jm1l8J6P8oNOko0j9L0K1p9P7O2k5k3l2
$$ -21 -21 -15 27 53 73 7 -26 -24 -49 -90 -3 61 36 26 10 11 -30 -68 -52 26 20 25 31 29 -31 -50 -20 1 -78 -1 61 36 13 -19
2690a9J8l9n5K2J07K6nrk8m1l8L4j9J6P0KJl0l0m8K1K8%M5K1Kn8k3kJ2%k8Q2L4
$$ -19 -1 -40 -95 -73 34 60 55 46 18 -23 -61 -27 -46 -30 40 42 43 13 -17 -65 -44 -16 -16 29 50 52 -6 -29 -31 -19 -19 -47 35 69
2724F9o5kK2l0m6J2Q1p6L8N0l1n4NrJ6j8pJ12nn3l8M6rp6K1J03o1j6M2K8n6l6
$$ 69 4 2 24 -6 -52 -40 41 -35 3 53 22 -32 -27 -36 -20 -38 -45 67 62 9 -29 17 8 -68 -47 56 -5 -21 21 49 -7 -43
2756d3J3RNL6Qoj1J0l2l1J4L3J5k9M9J5q5K7Jk4K1J2J0l2PL6pq6mP4%o6O1M2m0
$$ -43 -30 -21 -16 20 28 22 11 21 -11 -42 -28 5 20 -9 40 55 -30 -3 -2 -26 -5 7 17 -15 -8 28 21 -65 -69 5 5 -61 0 42 2
2791Bn5L1L1n5MM8L7o3%P4m6n5N5L4l9k3M8Qo3jK5On3L3M3k7qJ2Rk7j1L6k1RJ7
$$ 2 -53 -22 9 -46 -42 6 43 -20 -20 54 8 -47 8 42 3 -20 28 36 -27 -28 -3 3 -50 -17 26 -1 -9 3 12 -15 -26 10 -11 -2 15
2826A5j8l4L9K8j6o8L4Q5q7l0P0N6p0n6O7J4p6L2M8m6m9P6M1j08J6N3j8l5mJ16
$$ 15 -3 -37 2 30 14 -54 -20 65 -22 -52 18 74 4 -52 15 29 -47 -15 33 -13 -62 14 55 -53 -37 16 -2 -37 -41 75
2856G5n2j00Q1O1o6n9O1M9n5J1K7Ro9L0M4q4K8L3K4m7l0O2m3k0K6L5l3l1P9k5
$$ 75 23 -77 4 65 -1 -60 1 50 -5 6 33 42 -27 3 47 -37 -9 24 48 1 -29 33 -10 -30 -4 31 -2 -33 46 21
2886B1n0J0K2k5j9N6J3k8m2J36l6j03J0J16p1p6N3P1n5j16J25K2r2K9P3Ko4lO8
$$ 21 -29 -19 3 -22 -41 15 28 0 -42 94 58 -45 -35 81 10 -66 -13 58 3 -113 12 34 -58 -29 44 46 -18 -21 47
2915D7o0j00J00N6q9K3J03k3o2j6O2j0o6j7P6k3K0JJ0p3P3pl1J5P8m4q9K1L8m0
$$ 47 -13 -113 -13 43 -46 -23 80 57 -5 -21 41 31 -35 -52 24 1 21 22 32 -41 32 25 -6 9 87 43 -46 -25 13 -27
2945b7p9R3R2q8k0J02J1j08qM0op2M6R0n8m2J18K0j28k4J26Oj25J0Q3k1j57J19
$$ -27 -106 -13 79 -9 -29 73 84 -24 -32 8 2 -70 -24 66 8 -34 84 104 -24 -48 78 84 -41 -31 52 31 -126 -7
2973gM7m4j8J00k9j4j5ml2o9N5K7k6LJ07Qj13K0O3q2l0P3qo5L3N9n9n0R5L9n6
$$ -7 40 -4 -22 78 49 35 20 16 -16 -85 -30 -3 -29 -26 81 89 -24 -4 59 -23 -53 20 12 -53 -20 39 -20 -70 25 64 8
3004Hk4R5j3j18l4Q4k7p0O1J28n2m3L0O6j03o3Q5ro6N1Q2n2m9L6P7p4m5J18k6
$$ 8 -16 79 66 -52 -86 -2 -29 -99 -38 90 38 -5 25 91 -12 -75 10 1 -65 -14 68 16 -33 3 80 6 -39 79 53
3033E3p3L4J7o2k5L1N6n3N3M2k5o1NJ4o5j8P7NkpR4m0j26P7N5l2n8O5J7q7rJ04
$$ 53 -20 14 31 -31 -56 -25 31 -22 31 73 48 -13 -8 6 -59 -77 0 5 3 -4 90 50 -76 1 56 24 -34 31 48 -39 -48 56
3065E6n5q0Q7Q3o7n9N9J4j08QJ00rp7M0O9Oj39Q4K3q0J7N0J7p6M8Mjj7L7K1p5
$$ 56 1 -79 8 91 24 -35 24 38 -70 -62 38 29 -48 -8 61 67 -72 12 35 -45 -28 22 39 -37 11 15 14 -3 34 55 -20
3096b0J8N9j3j09P2K9o3m1R2K2m0l2P1o2m8O1Q1r0o5R2M6r8k0J21j8j05K8O8l0
$$ -20 -2 57 44 -65 7 36 -27 -68 24 46 6 -26 45 -17 -65 -4 77 -13 -78 14 60 -38 -58 63 45 -60 -32 36 6
3125Fn7P1K6q5K5O0ln9NN7o5n3Q5K6o0jN4K5j04L9N4m2m6M3J2m4j5Q8l8l0L5M4
$$ 6 -51 20 46 -39 -14 46 43 -16 -11 46 -19 -72 13 39 -21 -22 32 57 -47 -8 46 4 -42 1 13 -31 -46 42 4 -26 9 53
3157E3p4%J4K8o0l1Q6k0o6O8N8o2l5M6M3q2K0L9kj03M6O6n2l7P0N3q3l1P6Pq8
$$ 53 -21 -21 -7 21 -39 -70 16 -4 -70 -2 56 -6 -41 5 48 -34 -14 25 23 -80 -34 32 -20 -57 13 66 -17 -48 28 35 -53
3188e3J7O4m0j6N0L8m1m7N6oq0K5P3m7j9L1K8m7j4N4%p9L6O7k0n4K7J5k9m8R2
$$ -53 -36 28 -12 -28 22 60 19 -28 28 22 -58 -33 40 -7 -26 5 33 -14 -28 26 26 -53 -17 50 30 -24 3 18 -11 -59 33
3219C3L0q0nQ0n0o5M2L7l7m6J08k0q2M4K1Rq2N4M7l1l1O6k3k1j5M9m0j7L9J6m5
$$ 33 63 -17 -22 58 8 -57 -15 22 -15 -61 47 27 -55 -11 10 19 -63 -9 38 7 -24 42 19 -2 -17 32 -8 -25 14 30 -15
3250a5j6N5Np2L1N7k8l3P8J3q9nP5k8o4K8M6Jo3K0N3r3K1L4J7p1N6%j8m7N9K8
$$ -15 -31 24 29 -43 -12 45 17 -16 62 75 -14 -19 56 28 -36 -8 38 39 -24 -4 49 -44 -23 11 28 -43 13 13 -5 -52 7 35
3282C5o9LO0Kl5k0N6l9n7O0K5m7kN0k6J2m6N8j9j4J9nkj5M1rm0JN2j8n1O0L5o5
$$ 35 -34 -31 29 31 -4 -24 32 -7 -64 -4 21 -26 -28 22 -4 8 -38 20 1 -13 6 1 -1 -16 25 16 -24 -23 29 11 -40 20 55 -10
3316a0n5R1m6J4NL2orj0L8r0K5M6m4J7J2P3m5q4L2O9p3J6J2L8q8K2M0j1q8P7N1
$$ -10 -65 26 -20 -6 -1 31 25 16 6 44 -46 -21 25 -19 -2 10 83 38 -46 -14 55 -18 -2 10 48 -40 -18 22 11 -77 0 51
3348E1o0k8P4qq7L0M3ql6L9M2n7l8N8J7o7J7L9J1m4PO3o4m3Q4l6l8L3N5k9n7M6
$$ 51 -9 -37 37 29 -58 -28 15 7 -29 10 52 -5 -43 15 32 -35 -18 21 32 -12 -5 58 -6 -49 35 -1 -39 -6 49 20 -37 9
3380IK6m7l5M3K8o2J6N6k2l7L9M3o4j5O4K0j03K4L0J3o5L9M4m7m7O5J2p3L8M8
$$ 9 35 -12 -47 -4 24 -38 -22 34 12 -25 14 57 -7 -22 42 62 -41 -17 13 26 -39 0 44 -3 -50 15 27 -46 -8 40
3410D0m8l4J2N9q0M0J1%m6K9L8l9lJ2L6m4%K8J1p5N2K5On9K4O7o3k6N9j6k4PJ6
$$ 40 -8 -42 -30 29 -51 -11 0 0 -46 -17 21 -18 -21 -9 27 -17 -17 11 22 -53 -1 24 30 -29 -5 62 -1 -27 32 16 -8 -1 15
3443A5k1rK8L5n8k4L0ml4JP2l6m8O4K0m4m5Q3k9k8M3Rjo1L7K0l2l6Q2K1p8K3K5
$$ 15 -6 -15 13 48 -10 -34 -4 -8 -42 -41 31 -5 -53 11 31 -13 -58 25 -4 -32 11 20 19 -42 -5 15 -17 -53 29 50 -28 -5 20
3476B0j7k7lN2l5j3L7J6q7K7O2l7p9J02M3j00M4L3kq0M7N3p5m8P7J5k2k8M6J1
$$ 20 3 -24 -27 25 -10 -23 14 30 -57 -30 32 -5 -84 18 61 -39 5 38 36 -44 3 56 -19 -67 10 25 3 -25 21 32
3506C2r1K4P8n6k3O7Nn9j9N2Nl7LN3k9l0LK6m8K5O1j9k6K3K0j8q7M5L2n0J3M0
$$ 32 -59 -35 43 -13 -36 31 36 -23 -42 10 15 -22 -19 34 5 -25 -22 4 -44 -19 42 23 -3 20 40 22 -65 -20 12 -38 -25 15
3538A5Ql0m2N5j7j9O4j4k7K1K8j1o7OO0m4l9Q7K0p6k0M6J2n1J9M7l9j0K0mj9%
$$ 15 23 -7 -49 6 -11 -30 34 20 -7 14 42 31 -36 -30 30 -14 -53 34 54 -22 -42 4 16 -35 -16 31 -8 -18 2 -2 -21 -21
3570b1J9jk1JN8k8m1M8%j2k3M8j5o8M6L0k9l7L2M4l6j2P6k5o2L3K6m0k3L4M6r4
$$ -21 -2 -3 -24 -23 35 7 -34 14 14 2 -21 27 12 -56 -10 20 -9 -46 -14 30 -6 -18 58 33 -29 4 30 -10 -33 1 47 -47
3602d7K6N7j4n7J3Q1o4kJ6K2n1J7K4m1j8K7N8l8k4JO1r5K2N6J2o2KM2k4k9M0k
$$ -47 -21 36 22 -35 -22 59 -5 -7 9 31 -20 -3 21 -20 -38 -11 47 9 -15 -14 47 -48 -26 30 42 -20 -18 24 0 -29 11 9
3634Il2L2OJ5n5kM1n3K3M1kl7mN4j2n6k0J04n5l6N3K1l6NK5l2m2M2L6l6j6M7J1
$$ 9 -23 9 15 30 -25 -27 14 -39 -16 25 23 -14 -18 36 24 -32 -52 52 -3 -39 14 35 -1 4 29 -3 -45 -3 33 -3 -19 28 39
3667C9n4kN1k0m8O1J5l5m2O0J8o6j0P6k8m7N1L5p6lM5qo4K0N3Pq6L7N6l8l2N4
$$ 39 -15 -17 34 14 -34 27 42 7 -35 25 43 -23 -33 43 15 -32 19 54 -22 -25 20 12 -52 -32 21 28 -58 -21 35 -3 -35 19
3699A9j2nj6K2qm7L5M3k6m3O2K8j03L0M8om4PM6J1o0NM9o4K9L4k2m2OL6l5m3Q1
$$ 19 7 2 -14 8 0 -47 -12 31 5 -38 24 52 -51 -21 27 21 -23 -16 30 41 -19 -14 35 -29 0 34 12 -30 -24 12 -23 -66 15
3732A5M2p4pP1lq0M6L6o4j2M4M2q5J6J3j6m8N2N3o1nL7Rm6l4Q2Qo8J5M7no7M9
$$ 15 57 -17 -24 47 44 -36 10 46 -18 -30 14 56 -29 -13 0 -16 -64 -12 41 -20 -25 12 21 -25 -59 23 31 -37 -22 25 20 -47 2
3765BK3n9PM3Kn0L1L8o0j7L9J8k2k4N6Oq0M5J6k0k8L8kk1QM8j5o4N2M2m6LOj9
$$ 2 25 -34 -27 16 18 -32 -1 37 -23 -40 -1 17 -5 -29 27 33 -47 -2 14 -6 -34 4 2 -19 -11 37 22 -42 10 52 6 9 15 -4
3799dk3L3J3j9l7N5L0o0j1L1L8p4KO0n7k7O7Ql9LM0K5q7J2L7j2n5K8O2m5k4K7
$$ -4 -27 6 19 0 -37 18 48 -12 -23 8 46 -28 -26 34 -23 -50 17 25 -14 -11 29 54 -33 -21 16 4 -51 -23 39 -6 -30 -3
3831cK2l6K7L5m7mK5nm5k9P7mm3J7K1j5mJ9Jk9l1N4J6k2nJ5K3n2j6M4l1J8J6j7
$$ -3 19 -17 10 45 -2 -6 19 14 -31 -60 17 13 -30 -13 8 -7 -11 8 9 -20 -51 3 19 -3 -8 7 30 -22 -38 6 -25 -7 9 -8
3865hj9k5Q8n6j5J8N8m9J4Rl9Oj4N5l3l0L9L6j9k3L4Jm1pM6k8k7J2O6m6l6L4L3
$$ -8 -27 -52 36 -20 -35 -17 41 -8 6 15 -24 -18 -32 23 -10 -40 -1 35 16 -7 27 28 -13 -20 26 -2 -29 -17 49 3 -33 1 34
3898C4m5K3M8j9o6J9J4m3l7P0J2l1M6L5l5rKj4k2J3L1k2MJ0Mm5J0j0K6Km5P5j
$$ 34 -11 12 60 41 -25 -6 8 -35 -72 -2 10 -21 25 60 25 16 18 4 -18 -5 26 4 8 18 22 -23 -13 -23 3 5 -40 35 34
3931C4m5k7M1k3k0L6P3n2lLm0l9M7RRl0K6O1n4l7K9k8oK8N0pm8J6kk8j5K1K6j9
$$ 34 -11 -38 3 -20 -40 -4 69 17 14 17 -23 -62 -15 -6 3 -27 -1 60 6 -31 -2 -30 -36 -8 42 35 -13 3 1 -27 -42 -21 5 -14
3965a4L0K8l7j6k9J4l1Q4lJj3Npj3o4L8M5n1N4JJ5o3pL4on0N4M0Mo3j4N8n0K4
$$ -14 16 44 7 -9 -38 -24 -55 29 26 27 14 19 12 -1 -65 -27 18 -33 21 22 37 -26 -33 1 -5 -55 -1 39 43 -20 -34 24 -26 -2
3999bK7KJ7m7K9n6l0J7M4k7K2J9rNLk9l6jL3M3k1Oj8J5l6J0J4Mj0L0J0l1MjRl4
$$ -2 25 27 44 -3 26 -30 -60 -43 1 -26 -4 15 6 11 14 -15 -51 -52 -19 24 3 9 -9 6 -30 -20 -6 -2 -12 18 28 -3 1 0 9 -25
4035b5RO9k3p5N6J1n5MM9m3PK7J6l6Mj7Qoj6N4j0j8j6J8Mk4KL3K6l6M6n2Rj1j7
$$ -25 -16 53 30 -45 11 22 -33 -29 20 -23 -16 11 27 -9 -5 -22 -14 -20 -36 18 8 -10 -26 -8 -4 -28 -26 7 33 -3 43 -9 0 -11 -28
4070b8J2j6M8KJ9m0kk2j5L5L9k6LJ5j5l4MK2m0K5M3K0l0l8L4Nn9k9J07Mk0lRo7
$$ -28 -16 -32 16 18 37 -3 -5 -27 -42 -7 32 6 9 24 9 -25 -21 1 -39 -14 29 49 19 -19 15 20 -39 -68 39 43 23 20 29 -38
4104c8l5K6N7pJN4mo9l9J6K9j9L2J5J5l4Ll0pK3K5j6L2M2o2l0L2j6k5RO1j1k6
$$ -38 -73 -47 10 3 4 58 54 -15 -54 -38 -9 -28 4 19 34 0 3 -27 -34 -11 14 -2 30 72 10 -20 12 -4 -29 -20 41 30 4
4137D%N0p5o1O3O8l6nL0Rp0l4N4rj1QO7mm9pM5n0n8M6L7K4l4K0K8o9j7N3j7Mp
$$ 4 4 54 -21 -82 -19 49 13 8 38 47 -23 -57 -3 -12 -23 -15 52 48 -1 -8 37 -13 -71 -25 12 36 2 22 50 -19 -36 17 0 4 -3
4172cN4rk1l4j3K2mk3N3Pj1j7j0oOqM4Lk0nJ2J1p1J6L2M3n3K5K2j9m9j6M1Ql5
$$ -3 51 42 21 -13 -26 -4 -8 -31 22 29 18 1 -9 -15 -9 -17 27 30 10 5 17 28 -43 -27 5 48 -5 20 42 23 -26 -42 -1 7 -28
4207b8J4O2nn0RK1l3k8L6L0m2l6O8Ok2l9J6N8n8mL3M9p8jL1l5J5k2J3M2j4k7L7
$$ -28 -14 48 43 -7 2 23 -10 -38 -2 28 -14 -50 18 24 2 -37 -21 37 -21 -25 8 57 -21 -22 9 -26 -11 -33 -20 22 8 -19 18
4240A8l2%Mj2J3J7k0L5l1j0k3L9L1m7oN5k1n9O3J0j1m9M0K0J9o7KP1m2n3M0J3
$$ 18 -14 -14 -10 -22 -9 8 -12 23 -8 -18 -41 -2 29 -18 -24 31 10 -49 14 24 13 -36 4 24 43 -24 -22 49 7 -46 -6 7
4272GKk3L5Lql0K6j1ok3N4l0J5j9PJ8m8RK6K3l9j0L3J7j5k6MJ9k8jK3K9j8k7J6
$$ 7 9 -14 21 24 16 -14 12 1 -5 -28 26 -4 11 -8 -1 17 -31 -22 4 27 -12 -22 11 28 13 -13 -9 10 -18 -19 4 33 15 -12 4
4307Djml0M9mk7K7J4j7l8LO1l4k9L6J0j1m2J7L7l5rL3M1j8l5j2J2k5J1K8Nj1J1
$$ 4 3 -1 -31 18 14 -13 14 28 11 -27 -24 37 3 -26 10 20 9 -33 -16 21 -14 -23 10 51 33 -2 -14 -2 -27 -16 12 17 6 17
4341A7k1J2k5oK7MrJ6k2k3Lj4J9K7QK6j2O%n4K5k7pLN3j2kRpj2l8mQ9n3KK6Lm4
$$ 17 -4 8 -17 -23 4 8 -1 15 -7 -30 -27 -41 -22 5 13 39 27 33 33 -21 4 -23 -30 -27 26 14 12 21 14 2 -36 -40 49 -4 -2 24 27 -17
4379a7j6L4k3L2j9L9Jm0l4K4K4m6L9L8K0m8j6N7m0pm5M9j0K1Nn5J5j4J6N3k1j0
$$ -17 -33 1 -22 10 -9 30 31 -9 -43 -19 5 -41 -2 36 56 8 -8 49 9 2 -43 6 -4 17 22 -33 -18 -32 -16 37 16 6
4411FNPk4k7%K0k0K6MOJ6l0k0j0M0l7J4mK4L0j8j9MrL9L5k9Rm1j7m3NL0L0K4J8
$$ 6 11 18 -6 -33 -33 -13 -33 -7 -3 3 19 -11 -31 -41 -1 -38 -24 -28 -4 26 8 -11 -7 -16 23 58 29 38 -3 -20 -63 -58 -28 2 26 44
4447D4RLm5l6j2M0j7LJ3j0k2QJ8k8LL4M6k0j7j8k9nj0K0oL4M7j4k7jqk8JLK1K1
$$ 44 53 56 11 -25 -37 3 -14 -11 2 -8 -30 -22 -4 -32 -29 5 51 31 14 -4 -33 -38 -48 -28 -34 0 47 33 6 5 -3 -31 -30 -27 -6 15
4483A5j0K9j1o0K4J0j1K8J5nk6k9%j2J6K6M4qqK4n8l5J1j8LL7K2K8%l4pml3L8
$$ 15 5 34 23 -37 -13 -3 -14 14 29 24 -2 -31 -31 -43 -27 -1 43 35 27 51 -7 -42 -31 -49 -46 -9 13 41 41 7 0 -4 -37 1
4517AK3J3k8j5Pl7k1K9J2J3O2l8L2p4k0qnL9J1L2ok1k4J3j8JJ3K6NJ5k9l3j8K6
$$ 1 24 37 9 -6 1 -36 -57 -28 -16 -3 59 21 53 -21 -41 -49 -54 -15 -4 28 22 1 -23 -10 -28 -27 -14 12 17 32 3 -30 -48 -22
4551b2k1L8J7L2j6Pl0l5l2K1N2rj3K7M4m6n0K2Ll0L4M1ol1%l9J7l5N6LMlJ4j6
$$ -22 -43 -5 12 44 28 35 5 -30 -62 -41 11 2 -11 16 60 14 -36 -14 -11 -41 -7 34 28 -3 -3 -42 -25 -60 -4 -1 3 0 14 -2
4585bl5J4LM1m2pO3jl2k9k2J2K9K2j9L2lkm7J5Qj1KL7J7n4rL9l1k2K2J2M0m9M9
$$ -2 -37 -23 -20 21 -21 -28 35 34 2 -27 -49 -37 -8 14 -5 27 24 22 -25 -10 -2 -13 -11 26 43 -11 -20 19 -12 -34 -12 0 40 -9 40
4620D0l6j9k5L9O7j01K0L2K7p5L9lm9QN7Mj0m7M1k1n4L9L6no5O7j2j6LnJ8ROJ8
$$ 40 4 -15 -40 -1 66 -35 -15 17 44 -31 8 5 -44 -36 21 25 15 -32 9 -12 -66 -27 9 4 -61 6 -6 -22 -19 -24 -6 3 9 27
4654B7j6j4L1m7mk3N8j4K5J5ok1k9M1k2n5K5Q0m4j0K6Nk9l9M0M0o3l4Q4j4q3N4
$$ 27 11 -3 28 -19 -23 -46 12 -2 23 38 32 11 -18 23 1 -54 -29 51 7 -3 23 28 -1 -40 0 40 -23 -57 27 13 -70 -16
4686a6J4j9oN4kl1l7L9On2JM7%m1L4L1j1o2L9J2k5J7J9mj5MQn3N6K4l7j5N5nn5
$$ -16 -2 -21 -27 27 25 -6 -43 -4 2 -50 -49 -2 -2 -43 -9 22 11 -51 -12 0 -25 -8 11 7 -8 -4 4 -49 7 31 -6 -21 34 29 -26
4721b6L8J1k8l5M4K0l5QK5ml4K9j0K5o3K0L1J1p6N5K5o3k5Q5J3p1J8M1j2n6K7
$$ -26 12 23 -5 -40 4 24 -11 -3 22 18 -16 13 3 28 -35 -15 16 27 -49 6 31 -32 -57 28 41 -30 -12 29 17 -39 -12
4752a2K6l1k5M5K2l5pM2pl9J2J5pjpMk8L7J4k0l7N2J1k8KL4m2k3O3J1o5pK5L0
$$ -12 14 -17 -42 3 25 -10 -17 25 18 -21 -9 6 -1 -2 -9 -5 -33 4 18 -2 -39 13 24 -4 -2 32 -10 -33 30 41 -24 -31 -6 24
4786B4l0o0O8Nj7pP3k7m5J7njk2L8Jl3j7P5k5p1O7J6n9j6N6N1o5J3j8Mj4K6Lj7
$$ 24 -6 -66 2 7 -10 -17 56 29 -16 1 -4 -5 -27 11 12 -21 -38 37 12 -59 8 24 -35 -51 5 56 -9 4 -14 -10 -24 2 5 -12
4820a2k7N0j7j5J2K9l5%L5j8j8oL0nk4KL8on6Q4j6o2J1L2J7l9L5K4m1l3J6J5l9
$$ -12 -39 11 -6 -21 -9 20 -15 -15 20 2 -16 -22 8 3 -21 -19 19 13 -43 41 25 -37 -26 6 23 -16 19 43 2 -31 -15 0 -39
4853c9K2M1j2ok4L5j4m3%N8k8J0KJ0j7j7L6n6lK5K9nj6J9j6n3L3K8n4%Q5Mo6k
$$ -39 -17 24 12 6 -18 17 3 -40 -40 18 -10 0 2 12 -5 -22 14 -42 -45 -20 9 4 -12 7 -9 -62 -29 -1 -55 -55 30 34 -32 -34
4887c4M3k3j7J8O8m7k0K0K1n5J2M2J6q4L2N2o0j8K2J6n7J9O3Qk6j4j6Ol7O1Op
$$ -34 9 -14 -31 -13 55 8 -12 8 29 -26 -14 28 44 -40 -8 44 -16 -34 -12 4 -53 -34 29 37 11 -3 -19 -13 -50 11 17 10
4919A0Nk5L6o7ML3Ll6K2M2m7kj4M2n3M1L9k0jjj5m7jO3j5m3L0O0l7m7K6L5m2J
$$ 10 15 -10 26 -41 -37 -4 -1 -37 -15 27 -20 -22 -36 6 -47 -6 33 13 12 11 -4 -51 -52 11 -4 -47 -17 43 6 -41 -15 20 -22 -21
4953b1M6j3k8M2J9q4K5K1Kl6MO4j3o6jO9k5o4N5M2k3l6J9J9q0J8N7rk6J3K1j6
$$ -21 25 12 -16 26 45 -39 -14 7 9 -27 -23 41 28 -38 -39 30 5 -59 -4 38 15 -21 -2 17 -63 -45 12 3 -23 -10 11 -5
4985ej7M9j3m2K1LJ3JJ8k4m1K7L6qm6K1L4j7o6N9nk6L4K8K4q4L0Qk0m9M7L1j3
$$ -5 -22 27 14 -28 -7 -4 9 10 28 4 -37 -10 26 18 -28 -7 27 10 -56 3 -2 -28 6 34 58 -26 4 12 -8 -57 -10 21 8
5018Hk5O0n0l0j0N7k4lO2j9n2K0N4j5p0L7M1k9k0L0Mm7jK4J4n8K8N2k1rP%m7K8
$$ 8 -17 43 -7 -37 -47 10 -14 -17 45 26 -26 -6 48 33 -37 0 41 12 -8 22 26 -21 -22 2 16 -42 -14 38 17 8 15 15 -32 -4
5052dLJ7l4JL0n1mM5K2o5L3N1l0n7M2M4p2J5M5k7k2QO3k3m8kO8n8j2M5jl9j8N3
$$ -4 -1 16 -18 -17 13 -38 -42 3 25 -40 -7 44 14 -43 -1 43 -29 -14 31 4 -18 -10 53 30 -18 -20 48 -10 -22 23 22 -17 -35 18
5086A8j6o8N9N8l3k7QL4o7j1N1J3m0K8J1k5MMJm0K9J3km7K5N0l8k4N9l8j3K1K3
$$ 18 2 -66 -7 51 18 -9 -1 33 -34 -45 6 19 -21 7 18 -7 -3 1 2 -38 -9 4 2 -45 -20 30 -8 -32 27 -11 -24 -3 20
5119B0J3n8J3jK3m5L3K9n3NJ8kj8J8J4j4mN5k6n1L5jl1kkO6l2k4L0Kl4l2P6k8
$$ 20 33 -25 -12 -13 10 -35 -2 27 -26 -21 -3 -5 -23 -5 9 -5 -9 46 20 -31 4 3 -28 -30 -32 34 2 -22 8 10 -24 -56 20 -8
5153hj4M2nno8P5k1k9j3O9j6m4P5l1j2j5J9nmK7K5nn5K4j4l8K6K7J2m2L5J2j5
$$ -8 -22 20 15 10 -58 17 -4 -33 -46 23 7 -37 38 7 -5 -20 -1 -6 -10 17 42 37 -18 6 -8 -46 -20 7 19 -23 12 24 9
5186In1L3nJj6M2j6k8K0K2j0l2K2Npl0O5L0r7K2M3k7m5N5lOqj0L8m2nPJ6mQjn
$$ 9 -42 -9 -14 -13 -29 13 -3 -31 -11 11 1 -31 -9 -4 -11 -41 24 54 -43 -21 22 -5 -50 5 2 8 0 -10 28 -14 -19 -12 4 0 8 7 2
5223BnjM3k4l6M0Mo0L7K8l5j9K8k6J3J6rK1n2N2Jm1j0N0j3k9L8J5n8K5PJ6k1k
$$ 2 -3 -4 39 15 -21 19 23 -37 0 28 -7 -26 2 -24 -11 5 -4 17 -35 17 18 -23 -33 17 4 -25 13 28 -30 -5 2 18 -3 -5
5257eK0Km9MM6j8j4N2J4m7j5J7jk0j7M9j5k2M2nql9N0k5k1mM7l7%J8K5j7qJ4L
$$ -5 15 17 -32 -28 18 0 -14 38 52 5 -10 7 6 -14 -31 18 3 -19 23 18 10 -29 21 -4 -25 -29 18 -19 -19 -1 24 7 -1 13 16
5292A6m2RLL0m4M0Qm2j4M4qj9L6J5l7l8L2mk3L1Mlk7RL5qj4J0J2pk2L6j8k1J4
$$ 16 -26 -17 -14 16 -28 12 20 -22 -36 8 0 -19 17 32 -5 -43 -11 -15 -38 -7 -3 -6 -33 -24 11 3 -11 -1 11 4 -18 18 0 -21 -7
5327gRokLqNj2J4LrM4j0m6j3Q0j1l6nK6l8j4K3MJ6l6M1Ll9j2L9l2J7k6L8nk3J7
$$ -7 2 -4 -6 -3 -11 -6 -18 -4 -1 -10 34 24 -22 -35 45 34 -2 -7 19 -19 -33 -10 -6 10 -26 15 18 -21 -33 6 -26 -9 -35 3 -2 -25 -8
5364hK2n7J4N3%m0MK1l5K4NNk5lL0J4l1KPj2k5Q7k5m1K3K7m3K4%mj1m1K1K4j5
$$ -8 14 -43 -29 24 24 -16 -12 9 -26 -2 3 8 -17 -20 10 24 -7 -5 2 -10 -35 52 27 -14 9 36 -7 17 17 13 2 -39 -18 6 -9
5399ijL2m2rJ4L9j9l4JO2m3q%KK1j9K6On6L1J8j7j6j0O4j8n0M3mj2J4jj3oL7N
$$ -9 -10 22 -20 -29 -15 24 5 -29 -28 34 -9 -17 -17 -15 6 -13 13 19 -37 -6 12 -5 -21 -31 33 15 -35 8 4 -8 6 5 -8 -14 23 28
5435B8k8qK1j8k8ON0m3M1j9Kj5j4M0k7PK2Ll9L3k0N5n5J9Pom0QL7k0k6N5l9pK6
$$ 28 0 -8 13 -5 -33 -27 23 -20 21 2 4 -11 -25 15 -12 -5 17 20 -19 14 -6 49 -6 13 20 14 -26 -18 19 -1 -27 28 -11 -18 8
5470HK4j0k9J1J8k0m0L2J1k0PRQl4N2j6l9OJ3K9m2K5jl%k1O2l2%K1kj9j3J3Qm6
$$ 8 32 22 -7 4 22 2 -38 -6 5 -15 -8 1 9 -25 27 11 -28 -22 -9 20 -22 3 2 -1 -1 -22 40 8 8 29 27 8 -5 8 16 -30
5506c0O1k5j0k8O4l2lqJ1%k5L2l9K9k6N6k1k2JJ1j5J6PJ5m2J4j5L5k3j1K9rk2
$$ -30 31 6 -4 -32 32 0 -3 -11 0 0 -25 7 -32 -3 -29 27 6 -16 -15 -4 -19 -3 4 19 -23 -9 -24 11 -12 -23 6 -3 -25
5539b5K3j1MRk4K7pKjj1K3Rnok5K8oj9J3j%NMMqLM%j5RLJ3j8N4m2m7J4N2m5K1
$$ -25 -2 -13 -9 0 -24 3 -4 -2 -3 -14 9 18 13 7 -18 10 4 -15 -2 -3 -3 2 6 10 2 5 9 9 -6 3 6 19 1 55 13 -34 -20 32 -13 8
5579Hm1K7j4k0O0rrrK6ml6K0jl1J7K5Mm0L7L8m0k6K3rj0J6J9ll5J3%J0jrNj2J4
$$ 8 -33 -6 -20 -40 20 11 2 -7 19 15 -21 -1 -2 -33 -16 9 13 -27 10 48 8 -18 5 -4 -14 2 21 18 -17 -4 -4 6 5 -4 1 -11 3
5616CJ3Ko2M0J6j5JJQj7k4N5K1o6NL2Nm3M8j9m2QL9kk4%J4nJ3nj5Jj5K9j6L8m6
$$ 3 16 18 -44 -4 12 -3 -2 -1 7 -10 -34 21 42 -24 -19 13 18 -25 23 4 -38 -30 9 7 -17 -17 -3 -8 5 0 -15 -14 -29 0 -16 22 -24
5653b4M8m6J9L7l0k0jJ2j2K9m5M3mLk7QMRJ3JrJ8M0r6N0j5MLl2K3j3L5m1L6j3
$$ -24 24 -22 -3 34 4 -16 -17 -5 -17 12 -33 10 6 9 -18 -10 -6 3 16 17 8 26 66 -30 20 5 9 12 -20 3 -10 25 -16 20 7
5688Gj7j4J6JJJ9Rm0J9LJ7k5j5J1J1J8j2jj9j3J7Kj3LJ4J4j4mlokM9k0l6J8j8
$$ 7 -10 -24 -8 -7 -6 13 22 -18 1 4 21 -4 -19 -8 3 21 9 8 -11 -24 -7 -5 -18 -15 -1 13 -1 -5 -8 -14 -16 33 13 -23 -5 -23
5724b3j5K3N0n0QNL7Ro9M2m1L3j0J0j9J5qJ2k1L4m1jjjN1m9QJ1j0J8%J3rJm9K9
$$ -23 -38 -15 35 -15 -7 -2 35 44 -25 17 -24 9 -1 9 -10 5 -3 9 -12 22 -19 -20 -21 -22 29 -20 -12 -1 -11 7 7 20 11 12 -37 -8
5760hK3k1j5J0pk0L5K1j5k3R%lJ3Mlk3L7JrK6k8J5k9j9L7k5lL6K4l6J3j4K7rj2
$$ -8 15 -6 -21 -11 -18 -38 -3 18 3 -20 -11 -11 -14 -1 3 0 -23 14 15 6 32 4 19 -10 -29 8 -17 -20 16 40 4 17 3 30 21 9
5796IK8l7KK6j4kml0L1m3L1Nmk4J7L8m4K1mpOL0l1jk2K5k2J0Ok5L8qrQOk4MKj
$$ 9 37 0 2 28 14 12 8 -22 9 -34 -3 2 -2 -26 -9 29 -15 6 2 -5 1 31 0 -1 -23 2 -20 -10 -4 -29 9 1 -8 0 6 -18 -14 -12 -13
5835a3oK7k6LK1J9l4K6K6k9k2lJ3J6j3kj4JJK6k5KK1k5J7k2LJ4J7k0J6Rm0QJ2
$$ -13 -19 8 -18 -15 6 25 -9 17 43 14 -8 -11 2 18 5 3 -11 -10 -9 17 -8 -6 15 -10 7 -15 -12 2 19 -1 15 24 -16 -8 4
5870DMk4L9j6j4j1L2nj3nK6k8J4l0O3k9j5PL9j3k6Pj8M1j5rrMk9L1Roj0J5J6j8
$$ 4 8 -16 23 7 -7 -18 14 9 -4 -9 17 -11 3 -27 36 7 -8 -1 38 25 -1 6 -12 29 14 5 -4 0 -29 2 11 5 -5 10 26 8
5906HoK3k3Jk1K0j9J4ROllk2K4K1k8j3lMJ1qK8j6j7J4lJ2k7L3k7J5nKK1n0K7j7
$$ 8 2 25 2 3 -18 2 -17 -3 6 12 9 6 -16 8 29 1 -12 -15 -11 0 -8 20 4 -13 1 -2 10 -17 16 -11 4 -1 1 22 -28 -1 -18
5943a8rLL3jk2K0nk4J1k1M7j9K6j5k4K6l4M6k2J8k7PJ6lJ6m5L6l7J0L3j6lj4q
$$ -18 -27 -24 9 8 -14 6 1 -23 -12 -33 14 -5 21 6 -18 8 -26 20 -2 16 -11 -4 12 9 25 -20 16 -21 -11 22 6 3 -11 -19
5977a9J1j7OK4l5K6j4L8qmj1RJ0j8j5RJ8l6J5K5j0m2N8j5Koj7L9m7K6k9K8K1j3
$$ -19 -8 -25 -19 5 -30 -4 -18 20 12 8 -3 6 16 -2 -17 -8 10 -26 -11 14 4 -38 20 5 7 1 -16 23 -24 2 -27 1 22 9
6011Ij1J9l0J4K1k4loJ1LK8m1Lj1J8jrJ2qJ1J4Pl0k1L6j4mJ8Mpqj2K9j7ppJ2k
$$ 9 -2 17 -13 1 22 -2 -5 -11 0 3 31 -10 -7 -18 0 -1 -10 2 -6 5 19 26 -4 -25 11 -3 -7 11 15 8 0 -12 17 0 -7 -14 -2 -4
6049dk6M0%jj6MjK4k0J1m%M1n4J0l2L1m5N4j1K5k5J9j4k9M1j9PJ7k6NJkQ%j7L0
$$ -4 -30 10 10 9 -7 -3 -4 20 0 11 7 7 48 -6 4 -28 3 -42 12 1 26 1 20 6 -23 18 -1 6 23 -3 2 3 1 9 9 -8 22
6086B2j4k5K5k2K3kk1K7j5mOk5L2Jj3pNRljpJ2KmJ3m1L4rnM3l4k7OJ2RQk2j5K6
$$ 22 8 -17 8 -14 9 7 -14 13 -2 -6 0 -25 7 8 -5 -12 -7 2 -1 -2 -9 3 5 1 14 -27 7 -2 -7 36 2 -25 -19 -7 2 10 -12 -27 -1
6125aJ1j0kJ8Mj5kJ0k3qJJ9Oj5J%J4k6J2L8rl5NNJ5mk1K8k1K1j3l4J3J0QKnJ3
$$ -1 10 0 -2 16 20 5 3 13 -10 -18 -17 2 8 -7 -6 -6 8 -18 -6 32 23 -12 -7 -2 13 9 -12 16 -5 16 3 -31 -18 -8 0 2 -3 10
6163A0l4L7j0J0Jo3M1j1MK3J2k4lK3l9NQlJ3JJ7pl5M4Rk2k3K8j5J4j1oj8L1k5
$$ 10 -24 13 3 13 14 -49 -8 -19 -15 8 20 -4 -7 16 -23 -18 -10 -13 0 1 18 11 -24 20 29 7 -16 12 -3 11 0 -6 -24 7 -18
6198a8K1K4k4Km0K1K0K6m5J2nJ6oJ7Qk7%k0K0k4M1k5k5K3JJ8j4rJ3k1J1J2j2J3
$$ -18 3 27 3 5 -35 -14 6 32 -13 -1 -6 10 4 21 29 2 2 -18 2 -22 19 -6 -31 -8 -7 11 -3 -12 1 -20 -9 3 -9 4
6232Dj8KJ5J2j6J6l2L2l4qJ8J2J0rLJ8k5Nk3k5L9j3%J5pJ2%J7j6j9ML5pJ6l4l
$$ 4 -14 -12 3 15 -1 15 -17 15 -19 -27 -9 3 13 4 7 25 0 5 -18 -43 -4 -17 -17 -2 -9 3 3 20 4 -15 -11 24 17 33 -1 -4
6268drrL8j2LPj7KM3k2k2pK6m8J3M6m5K1JOk7L7l9J0J1J5rk3K1m7L1L0k2PJ7j1
$$ -4 -13 -22 16 4 7 14 -3 -1 42 20 -2 -9 17 -31 -18 28 -17 4 5 11 -16 21 -18 -8 3 18 9 -14 7 -40 -9 21 -1 6 23 12
6304A2j3j4J0K0Kjm0J3%RK1m4J8K4j1j9j9L6Njl1K0j4J2mJ0NJPj0mj4L6j7qMj4
$$ 12 -1 -15 -5 15 17 16 -24 -11 -11 -2 19 -25 -7 17 6 -13 -32 4 9 8 -23 -3 -17 -5 -9 1 6 7 14 4 0 -14 22 5 -3 1 -13
6341a3OJ6j9kJ2pnK7rKm0LK0J0J1m4K3l4L5mK3j2j1K2l3K8J1j1lK2l0L0m0jLK4
$$ -13 -7 9 -10 -12 0 -7 -12 15 6 8 -32 -29 -9 1 12 -32 -9 -43 -8 -12 11 -1 -12 10 -23 5 16 5 2 24 -6 24 -16 -17 -14 10
6377A0rK7l6Qk3J8J5j3LK3j7j5j5L6J0j9okk0L9j0jrL7l1JJ9pqk1PkLjL2l0j1
$$ 10 1 28 -8 0 -23 -5 10 -3 0 23 6 -9 -24 12 22 3 -3 -5 -25 14 4 3 -6 31 0 1 20 13 5 -16 -9 -11 -8 -9 23 -7 -18
6414a8N2j2k4%qj4j2M5k6rL6KLj6j5J3mLJj6M7j1jQk1kPkj6j1L2Nj2J5k1M1m4
$$ -18 34 22 -2 -2 -10 -24 -36 9 -17 -26 10 12 15 -1 -16 -3 -7 -4 -3 -19 28 17 16 24 3 1 8 6 -10 -21 11 16 4 19 -2 39 -5
6451eK0j3rJ8j3j0j6J2K3j4oJ3j5PJ1nk3J6OJ7j7%K9j3mJ4k5j0Rj4J9j1j3kJ2
$$ -5 15 2 -7 11 -2 -12 -28 -16 7 -7 -13 0 -15 -8 3 -2 -25 -9 -3 14 -3 -3 26 13 9 23 -2 -12 -3 -17 2 -9 -22 -24 -12
6486a2j0PK7lj5kqK5okM2l1l6O0k7j7Oj2J7J5l4K9%qMj8l1O4l7qK3j6OJ0kmpq
$$ -12 -22 -15 12 9 -6 -8 -16 9 3 1 43 12 -24 36 9 -8 -2 -14 3 18 -16 13 13 5 9 -9 -40 24 -13 -21 2 -14 -8 2 0 -4 -11 -19
6524a9J9Rl3K4J4j3OljNk4j6J8J0K3k5N1k7j3j5j9K3kk2J2M1l9QROj0k1K1j9P3
$$ -19 0 9 -24 0 14 1 7 4 3 8 -16 -32 -14 -4 19 -6 45 18 5 -10 -29 -6 -8 -30 -18 23 -16 -8 1 7 -3 -24 -3 -22 51
6559E1k6k4j0oK0j6RJ8j6Lj5kJ0K4l0K2kj2KoPj1jL2l4Pk4K2J4j4J0k4J5Mj3J3
$$ 51 25 1 -9 -15 5 -11 -2 16 0 3 -12 -14 -4 20 -10 12 10 -2 0 -6 1 -10 -11 21 -13 -6 -30 -8 6 -8 2 -22 -7 -3 -16 -3
6595cJ6k3%MKJ7l5PJ6mPJ5j5qo%J2k4L7k8M0k2j6QK5m0kK1j9J5j1M5l1L8j5k9
$$ -3 13 -10 -10 -6 -4 13 -22 -15 1 -3 4 19 4 -4 -10 -10 2 -22 15 -13 27 5 -11 -3 22 -18 -20 1 -18 -3 -14 31 0 38 23 -6
6631fQPj3j6J1qL7k4j6L0l4K6KNj0Jj4L8l4MM3j1l8K0j7J2l0J7QnqJ4J6l0K1l0
$$ -6 2 9 -4 -20 -9 -17 20 -4 -20 10 -24 2 4 9 -1 0 -14 24 -10 -6 37 26 -12 8 -9 3 -27 -10 -2 -7 -15 -1 15 -15 6 -24
6667b4J5MK1Jl0%J1OJ9m3J1J3k0L4J3m3mjNK0k2K2J1J1k2l3RM0k0lpK0j2QJl6
$$ -24 -9 -5 16 17 -13 -13 -2 4 23 -20 -9 4 -16 18 31 -12 -16 -17 -12 8 -14 8 19 30 8 -25 -16 24 4 1 -6 14 2 10 11 -25
6703b5K1K8j6l1L1j9K9l4J2j2jJ9l0L1%j6J5L2k4K1l2j1LJ3pK2Kopj1j5K1Mk4
$$ -25 -4 24 8 -23 8 -11 18 -16 -4 -16 -17 2 -28 3 3 -13 2 34 10 31 -1 -12 -9 4 -3 19 21 15 8 -3 -18 3 7 -17
6737a7L0l6K3L0m7K0JoQk5RJ0rL4J0l3K1J5j9j9K8j5nk2J2OJ0k2oK4lJ%Lj0Lm
$$ -17 13 -23 0 30 -17 3 4 -2 6 -19 -10 0 -9 25 35 2 23 38 19 0 28 13 8 -14 -2 4 14 -8 -14 10 7 8 8 11 1 4 0
6774@Ok4K5j0K1k6j0L4j9Pkm7O9j3r%J4lj2j0K4km0K2J5Nj6J2mlK0j1l6N9l4j3
$$ 0 6 -18 7 -3 18 -8 -18 16 -3 4 2 -45 24 11 2 2 16 13 1 -9 15 13 -27 -5 10 15 -1 11 7 4 24 13 -23 36 2 -11
6810a1JNJ3jk6J0J6nRorj5K5pj3J4Jl3L7J2n0N7m0mL5k8K1mj0K6k7J8Lk3j4L6
$$ -11 -10 -5 8 7 -19 -9 7 2 11 5 -4 -19 6 -1 -14 0 1 -32 5 17 -33 24 -16 -20 15 -13 8 4 -6 20 -7 11 14 -9 -23 13
6846A3Om1L9j6J1k4L4k6K2l4J4LK6m2K6qk4L8plkj5K6k1k1J7jjMPk3KQnJ5K1k1
$$ 13 19 -22 17 1 12 -12 22 -4 18 -16 -2 1 27 -15 11 3 -21 17 10 7 5 -10 16 -5 -26 -9 -10 -11 -7 0 -23 -21 -13 -18 -3 18 -3
6883cpj4J3K4lj1k6L7mJ7j8J8m0J5Mj8nL0k0j7L2J2k2J1KK2l8LK3k2Lk0L5k2K3
$$ -3 -10 -24 -11 13 10 -1 -27 10 6 23 5 23 -17 -2 2 -16 -21 9 -11 -28 4 16 -6 5 7 29 -9 -6 17 -5 -2 -22 13 -9 14
6918A4l2L2Mj4nJ9l8%J2L8l7K9j0K1l1Kj5j0K9k8J3J9j7L3n0J2j1K3qK0j9j1j0
$$ 14 -18 14 18 4 -1 18 -20 -20 -8 30 -7 22 12 33 2 4 -11 -21 8 -20 -7 12 -5 28 -22 -10 -21 2 -6 14 -5 -16 -26
6951b6OM0l9L3k8J5K3j3mjk2J5oj8M4ml2J0LqJ9k8JJ9J3jj7J4k3J7Qnk1J1L9l5
$$ -26 -20 20 -19 14 -14 1 24 11 7 6 -16 -1 -7 -25 19 15 -17 -7 -4 -12 7 -21 -20 -1 12 11 -6 8 -15 2 10 5 -16 -5 34 -1
6987aROm6pK8moK4nJ6Kl5J1j1pL7j1JkJ6k2k8L1mqJ6jPorL1j8oNQl4M2j5j9nM0
$$ -1 8 14 -32 -39 -11 -15 -21 3 -2 14 16 -19 -8 -19 -26 11 0 1 -1 15 -7 -35 -4 -8 -16 0 -1 6 0 -9 22 4 -2 3 11 -23 19 4 -15 -20 20
7028B0k1j7ML0j2J3k8L2Lk4JjOkj5K4rj0j2J7J5lJ2j7jlJ0m8M9m5QK3j3KNMnJ5
$$ 20 -1 -18 -14 16 4 17 -11 21 24 0 1 0 6 4 -11 13 4 -6 -18 -1 14 11 23 6 5 2 12 -36 13 -32 -24 -1 -14 -12 -7 -3 -8 7
7066Gj2K2k6KL6l3pJ5j1Rk4k4K7RL3l5K9j8rkJ4j9LJ6R%J0k4J2pL2k5J1j9pkm
$$ 7 -5 17 -9 -7 29 -4 -11 4 -7 2 -22 -46 -19 -10 23 -12 17 -1 -10 -12 2 -17 -14 2 11 11 21 -3 9 2 34 9 20 1 -6 -8 -12
7103a2JJJ4Nk0MRM%k0K9k9KNK5l4J4o%Qj%o%J8k4L0qjL3n2K0qK0l5OK5j1Lj4K5
$$ -12 -11 -10 4 9 -11 -7 2 6 6 -14 15 -14 -12 -7 18 -16 -2 -8 -8 0 -1 -1 -7 -7 11 -13 17 9 8 41 -11 9 1 21 -14 -8 17 6 9 -5 20
7144B0k5J6Nj7k1J8nJ6j4K8k8JK7J3kl0J2k0K9m5L5jk1j5J0L3k5J1K2m4J1K4k
$$ 20 -5 11 16 -1 -22 -4 -9 7 -7 21 -7 -6 21 34 32 2 14 -6 23 -22 13 12 -9 -24 -14 19 -6 5 27 -17 -6 18 16
7177A6l2j0PK2j2K0k4j2J8RKLj2NJ2Ql4j2K0L4o1K8Jj8M0k3k1M3oj6J4jJ1k2K0
$$ 16 -16 -26 -19 3 -9 11 -13 -25 -7 2 4 7 -5 0 12 20 -14 -26 -6 28 -33 -5 -4 -22 18 -5 -26 17 11 -5 9 8 19 -3 17
7212A7j6kQqNJj9NMJ2OLk%j3k8K6JMk6j6M7j0OPj5K3j7Jk3M4k2Pj2K1k0QoQJ1
$$ 17 1 -1 7 -1 4 5 -14 -9 -5 7 13 16 14 14 1 -27 -1 0 4 -22 -38 9 -1 5 12 -3 20 3 4 -19 25 3 10 -2 19 -1 7 1 9 20
7252B0j6j3j0KL6jj3J1l0PJ0J2Rqj9K1pj8J3k7M0j7qJ6%k3K5j8l1K9L7nk3oJ3
$$ 20 4 -9 -19 -17 19 18 5 16 -14 -7 3 15 24 16 -3 18 11 -7 6 -21 19 2 -6 10 10 -13 12 -6 -37 -8 29 24 1 -5 8
7287Hj1j8K6j0J2j7J2j6lJ7J6k0j9jL2m3N4k1k3KK9J2m0J4K6rj5K7j0j1qk8K9
$$ 8 -3 -21 5 -5 7 -10 2 -14 -17 0 16 -4 -23 -24 8 -35 19 -2 -25 -23 6 18 -22 -8 18 9 -6 21 11 0 -8 -36 -7
7320gK0J2k8j3J9k1pM0j7J2k2oN1j6l7J8JK3%k3qJ2k4L4%KoJ1k0Nj6j2N2m3J4
$$ -7 13 25 -3 -16 3 -18 -25 15 -2 10 -12 -18 33 17 -20 -2 -1 22 22 -1 -9 3 -21 13 13 15 9 20 0 5 -11 -23 29 -14 0
7355@K3n8O0k7Qj0j0J5qJ8l5K3mK2j1j3NJ0oj8L4qpmj5L8k3J8l2K0k0J8k2L3K2
$$ 0 23 -35 25 -2 6 -4 -14 1 -7 11 -24 -1 -5 17 6 -7 -2 8 2 -16 18 10 3 -1 -16 22 -1 17 -15 5 -15 3 -19 14 36
7390C6o2M4l0L3k9%LNMNj4j3L6j8JK5k1Ol7M1qqj6M2k2m2K8k5M6l6ML8k2J1j0
$$ 36 -26 18 -12 21 -8 -8 -5 0 4 9 -5 -18 18 0 1 26 5 11 -26 15 7 -1 -17 25 3 -39 -11 -36 10 -26 -22 16 -6 5 -5
7425ej1J6mJ3j3PjK4rk8%NOJ1Ml3OK0rj9J4Nj5LrK7JNkJ4j9j8J3mMj9L7j6oK1
$$ -5 -16 0 -4 9 -4 3 2 26 17 -11 -11 -6 0 11 15 -18 -12 8 -1 -20 -6 -1 -16 -13 -22 5 6 11 9 23 4 -14 -1 -5 -1 -20 17 1 -5 16
7465A6k5NK1l8K2RKk8J8Ok1K1l7K5j6J7OJ0j9K5m9L0qRM0m8J%J5K0l1J4rPnJ2
$$ 16 -9 -4 17 -21 1 10 12 -16 2 8 -13 8 -29 -4 -20 -3 3 13 -6 19 -30 0 -8 1 41 -7 -6 -6 9 29 -2 12 3 10 5 17
7501A7m2K6j9J7j4p%K9JrkRj6K7Pm2J3M%jj0J2j5K6pJ2k9K2kmqkJ2lMj3mJ3J4
$$ 17 -25 1 -18 -1 -15 -22 -22 7 8 -1 -3 6 -10 17 24 -18 -5 -1 -1 -2 -12 0 -15 11 4 16 -13 9 7 3 -5 -7 5 2 6 -7 -11 2 16
7540A6k4K2j5MLl0K3j1J2J2j5k5K1PK5j7k7M4k7L0j5%mloJ1j2jk7L7L6m4qoL0
$$ 16 -8 14 -1 3 6 -24 -1 -12 0 12 -3 -28 -7 0 25 8 -19 25 -2 28 13 13 9 6 0 11 -1 -2 -29 8 44 0 -8 -14 16
7575A6l0Kj2MJ4K1nN%j4nK2l2j9M7kl0J4JJ2olkJ9j7MmRj1MPj3j9M5l1NJ4j6j
$$ 16 -14 -12 -24 -20 -6 15 10 15 15 1 -4 18 -14 -33 14 12 -18 -4 -3 9 3 0 -2 17 0 4 0 9 -2 2 9 -4 -23 22 -9 -4 10 -6 -7
7614gj4L5j2j9N9K1n4Lj4j2J8L7l5Ll0K4pj2L8J6n2M6l5Ql6M8l1LOJ7l1JjK8L
$$ -7 -21 14 2 -17 42 63 9 12 -2 -14 4 41 6 9 -21 3 -4 -16 22 38 -14 32 -3 5 -31 17 -14 -11 -5 12 -19 -18 -19 9 12
7649A2Ql4lL0j5j3J0J1l0K8POLl0L9m7M1pk2j0MOK8l4RqL4ml5J0nJ2J0k7L0m2
$$ 12 20 -14 -17 13 -2 -15 -5 6 -24 4 11 17 20 -10 29 -18 23 16 -6 -16 -12 -6 22 -12 -3 -11 23 19 -16 -6 -11 1 11 -16 14 -28
7685b8M7j3l4L4jmlmj1M1Qk9k8M0k3MK9l8NK7j4nj3L0l1j5K4Jj6J3K1j6K0pJl4
$$ -28 19 6 -28 6 5 1 -2 -6 -17 24 32 3 -25 15 -8 -4 25 -13 -8 19 5 0 -13 17 -14 -29 -5 -4 -20 -7 14 -2 18 11 12 -22
7721b2R%K5rk0oJ3ppL2qQjk1oK0l7J0K5nQpJ4j6Nj1L6Lj7mmL4l4%j0J9oj1K9k0
$$ -22 -13 -13 12 3 -17 -23 -10 -17 -24 8 0 8 7 -14 -20 0 -37 -27 -2 -7 1 -6 8 -8 -3 -14 22 25 8 4 0 34 0 0 -10 9 3 -8 21 1
7761AQk6J3Nj0J8L3m2Qoj1J6j1k4oK7ok9L9J7j3KOj2j9J5nJ8pJ3j9j6J9k9K1J
$$ 1 9 -17 -4 1 -9 9 42 0 8 2 -9 7 -4 -28 -34 -7 -13 -42 -3 14 1 3 9 -3 -22 -7 -12 6 -1 12 -7 -23 -4 -33 -12 -11
7797a1Mojj9N6k6j3K2km1O7j2l1k2K2L0j6J4j1Qk5J9j7J9j6J3k2MpMM6m9j3N2
$$ -11 -7 -13 -14 -33 23 -3 -16 6 4 -37 30 18 -13 -35 -13 17 1 15 4 12 -13 6 -11 8 -8 5 -17 -13 -20 -16 30 -19 -32 20
7831B0k5lKK5j8J0j4lK2k2K3k0rK2mJ1j0pk3M0j5J7l1J3K8l8J8MJ3j8j9llL0J7
$$ 20 -5 -8 -6 19 1 11 -3 -6 16 -6 17 -3 -12 10 6 17 7 0 -23 17 2 19 -12 1 29 -9 9 13 26 8 -11 -14 -17 13 30
7866C0rlk8J1jJ3j1J0KK1l0k6N2o2J4K9J4l5OJ6j1oQj3j1pRM4m5L7j5nOKk0nJ8
$$ 30 21 18 -10 1 0 13 2 12 14 35 5 -21 31 -31 -17 12 26 -9 -3 13 2 -4 4 -9 -20 -27 -18 26 -19 18 3 -2 4 6 -14 -19 -1
7903aj0m%L3j1oJL1k7jj4K4j7K0kj4k0J5K1j3ooK1l8K0LO%%k5nL7l5J3QP%oJ1
$$ -1 -11 -15 -15 18 7 1 2 33 6 5 -9 15 -2 18 16 2 -18 -3 18 5 -1 -7 14 -24 -4 -1 5 5 5 -20 -25 12 -23 -10 -2 5 5 -1 10
7942A0k1lK6ok2Rl2L9j9M6m2j3K8j2k3N3l9K2J2j8nJ7mj8Pj0qK6mnqJ5nJ8k3q
$$ 10 -11 -14 12 6 -16 -7 -39 0 -19 27 -15 -28 0 -12 -35 18 -21 1 13 -5 -10 7 3 -15 -8 -18 -26 0 -4 -9 -17 -2 -7 11 -12 -20
7978b0lL3Mk9j7N8j8j7LL1j3k8K0j8J2j5M1k1MPk7J2j3lPjljJ4J5k9k8L9l4M4
$$ -20 -23 10 14 -15 -32 26 8 -9 -6 25 12 -16 4 -14 -2 -17 24 3 7 14 -13 -1 -14 -17 -10 -11 -14 -15 -1 14 -15 -43 -4 -38 6
8013FLj8J9j2l0J1RqK0pJ2j3J5j7L3km9OkK8jk6pK8k2J2K7k5J0mjrK4k1j8M1j1
$$ 6 9 -9 10 -2 -32 -21 -12 -20 0 -7 5 -8 7 -10 23 21 -28 -22 -24 4 3 -23 -30 -2 -24 -12 15 -10 0 -4 -5 -14 10 -11 -29 12 1
8050AJ8k6oJ9j4K2jj0j7J1kk3J9Pj1L2l5LL1k2K2l8L1k4%K1j7qK3rjnJ8j3j5L3
$$ 1 19 -7 -13 6 -8 14 13 3 -14 -3 -5 -28 -9 -2 -13 19 -16 -13 18 -4 18 -20 11 -13 -13 8 -9 -17 6 -3 -4 -9 9 -4 -19 14
8086A4JNj6j0mLPrnL1k5rQJ6Ok6J3RpK0k4lL1m3qJ3J4j1l2L0j2K4l8K6j7K2N0
$$ 14 15 20 4 -6 -10 -7 0 -9 -14 17 -8 -17 -9 7 13 -13 0 9 2 22 -2 -5 26 -17 -25 -12 2 -9 -41 -11 -23 1 -37 -11 -28 -6 44
8123D4rk5n3M8j8j0nK1k9M6k8N1p6K5J6Qk3Pj8MJ9rJ2j4K3mK7l9J3j6K9l8J7K7
$$ 44 35 10 -43 5 -13 -23 -28 -7 -36 10 -18 33 -43 -18 -2 6 -17 -10 -28 -24 -5 -14 -2 -16 7 3 30 -9 4 -12 17 -21 -4 23
8157B3J3p5RL5nmNJ4k1kj5L6j2Kj4K4j6k3M1k4J1mrM1n2K7j4L1j4j6J1j0Mj9
$$ 23 36 -39 -30 5 0 -4 1 15 -6 -8 -23 13 1 3 -11 13 -3 -26 15 -9 2 -2 -11 30 -22 5 -9 22 8 -8 3 -7 -3 -22
8191b2
$$ Imaginary data points
##PAGE= N=2
##DATA TABLE= (X++(I..I)), XYDATA
0@%%%%%%%%JrJ6j6J6j8K6l2L8m6N6o5P3q8J04j20J37j55J77k02K29k61K94l29
$$ 0 0 0 0 0 0 0 0 0 1 -8 8 -8 8 -10 16 -16 22 -24 32 -33 40 -48 56 -64 73 -82 95 -107 122 -139 155 -174
32a74L70m16M65n17N76o41P11p88Q73r68J071j186J316j459J616j795K003k242
$$ -174 196 -220 245 -272 304 -337 374 -414 459 -509 562 -624 692 -767 849 -946 1057 -1185
50a185K520k848L247l741M367n197O357q103J1059j7324N1808p2787p3440J59760
$$ -1185 1335 -1513 1734 -2007 2360 -2837 3520 -4583 6476 -10848 40960 -31827 -105267 54493
64E4493P188j41663K235J53200j6636j15848L1735R6979o0904p8760O2163O0340
$$ 54493 61681 -79982 -77747 75453 58817 -57031 -25296 71683 10779 -67981 -5818 54522
76E4522o5807k8266O9331J0288p7851m963O3101j915m8336J9502N1061p565m3197
$$ 54522 -11285 -39551 29780 40068 -37783 -42746 20355 18440 -29896 -10394 40667 33102 -10095
89a0095r718J7140P491j7704j9586K1615M9244o929n6927N708O0856k0638p6487
$$ -10095 -19813 -2673 4818 -12886 -32472 -10857 38387 31458 -25469 -19761 41095 20457 -56030
102e6030K6657Q4649l0044p7435M3090O6359o3302o0798P3903M8402p6045j7760
$$ -56030 -29373 55276 25232 -52203 -9113 57246 -6056 -66854 7049 55451 -20594 -38354
114c8354R2260l796j05017J4356R4395m3985r2319P1025R8190p5157q1687Q5405
$$ -38354 53906 50110 -54907 -40551 53844 9859 -82460 -11435 86755 11598 -70089 15316
126A5316O1867j00594n4515R7250L9512q7191j6979Q1235Q28p2063Q241N3748
$$ 15316 77183 -23411 -77926 19324 58836 -28355 -45334 35901 36729 -35334 -27093 26655
138B6655j8625l3131L2483K2431l5528j2259K8667o279l0425J3960K9551r811
$$ 26655 8030 -25101 7382 29813 -5715 -17974 10693 4414 -26011 -12051 17500 7689
150G689j4555J3035N285j2900k628l59p915J1821J8439j8624j9622L0134J8451
$$ 7689 -6866 6169 11454 -1446 -4074 -4433 -12348 -527 17912 -712 -20334 9800 28251
163B8251m4256j9258N2879J7336n4878p423N7899l499o0391R470N2846j9894m1685
$$ 28251 -16005 -35263 17616 34952 -19926 -27349 30550 27051 -33340 -23870 28976 9082 -32603
176c2603L4292L4634m1153k2653M4655M683n1888Q495N4911j8453n0646L0533
$$ -32603 1689 36323 -4830 -27483 17172 21855 -30033 -21538 33373 14920 -35726 -5193
188e193M5189m1051m0287M5354L1574m5664j8946M5820P674m3231O82L4346j1195
$$ -5193 39996 -1055 -41342 4012 35586 -10078 -29024 16796 24470 -18761 -18079 16267 5072
201E072k4198K2152J7251k6740p801K7864m746l1104J2744L1368j6109k4638K1634
$$ 5072 -19126 3026 20277 -6463 -14264 13600 8854 -22250 -9506 21862 5753 -18885 2749
214B749J8540k5540j4849K2266P055j7770K832J5873p383j0135R853M69j5177
$$ 2749 21289 -4251 -19100 3166 10221 -7549 -4717 11156 3773 -6362 3491 3960 -11217
227a1217N880J8094q964j4711J4671J0814k0408r596J9425M166j6395N224J6611
$$ -11217 -5337 12757 3793 -10918 3753 14567 -5841 -15437 3988 8154 -8241 -3017 13594
240A3594r838j3021J2199L091j9745L121K4854o527k2661J5371K1686k4401k3085
$$ 13594 3756 -9265 2934 6025 -13720 -10599 14255 7728 -14933 438 22124 -2277 -25362
253b5362K6647J8450k8662r940L3886N708l4298j557K8954q396k6755J6612K6051
$$ -25362 1285 19735 -8927 -18867 15019 20727 -13571 -15128 13826 5430 -21325 -4713 21338
266B1338j8129j8200K2487R598k9525p366K9378K832k6112O107K7873r082k6775
$$ 21338 3209 -14991 7496 17094 -12431 -19797 9581 12413 -13699 -7592 20281 11199 -15576
279a5576Q375J9388j2432j5254J5252J4744j1314r426Q528K829r912k475P245
$$ -15576 -7201 12187 -245 -15499 -247 14497 3183 -6243 2285 5114 -4798 -7273 -28
292b8K739j525J050R15j421k023l379j800M397L415l587J121Q342k959j3327J740
$$ -28 2711 1186 2236 3151 1730 -293 -3672 -5472 -1075 2340 -1247 -126 8216 5257 -8070 -6330
308f330J2091o121j2405J2397J6685j3133j5589J4751J0958k1254j1108K3656
$$ -6330 5761 -360 -12765 -368 16317 3184 -12405 2346 13304 -7950 -19058 4598
320D598J0557k1388l589K3833j202k6781J549K3093o009j9735J2863K0930j3776
$$ 4598 15155 -6233 -9822 14011 12809 -13972 -12423 10670 4661 -15074 -2211 18719 4943
333D943j8264J3858J1824j8617j0231K0395J0235j6801m706J6783L87j9265k069
$$ 4943 -13321 537 12361 -6256 -16487 3908 14143 -2658 -7364 9419 9806 -9459 -11528
346a1528J5741R11j1477L665J2877k821j2345r3P284k597o875L999R643k9p414
$$ -11528 4213 5124 -6353 -2688 10189 7368 -4977 -5070 2214 -383 -7258 -3259 6384 6355 -1059
361a059p33M836k852q351J960J0507R73p615K107Q390n486j2788L349J1412l928
$$ -1059 -1792 3044 192 -8159 -6199 4308 5281 -2334 -227 8163 2677 -10111 -6762 4650 722
376G22q177R755J1162j0643j2293Q338P023j2129n105J6218P369j3496l786J2622
$$ 722 -7455 2300 13462 2819 -9474 -1136 5887 -6242 -11347 4871 12240 -1256 -5042 7580
390G580j722j6726J038J5886r46j1151O660J2133r049j3990O152R193p876n733
$$ 7580 5858 -10868 -9830 6056 5110 -6041 619 12752 3703 -10287 -4135 5058 -2818 -8551
404h551J2169P964j0209o713P325J411j0365j598J1130L876o626m07O237k502
$$ -8551 3618 11582 1373 -5340 1985 3396 -6969 -8567 2563 6439 -187 -594 5643 3141
418C141r482q26P327J593l781K375O328j948q194j551M768m37m414L463Q427p79
$$ 3141 -6341 -7167 160 1753 -2028 347 6675 4727 -3467 -5018 -250 -687 -5101 -1638 6789 6010
434F010p697k11M548m130o846N254R363k442o139M635M369q721p085P527O136
$$ 6010 -1687 -1898 2650 -1480 -8326 -3072 6291 3849 -2290 2345 6714 -2007 -9092 -1565 4571
449D571o273j811R930J882j1218l207Q122n65q400L852J1005k355r079K760N655
$$ 4571 -1702 -3513 6417 8299 -2919 -6126 1996 1431 -6969 -3117 7888 5533 -3546 -786 4869
464D869o689o704P184O980n094l266O629J481q670k980O410J477m756J818O590
$$ 4869 -1820 -8524 -1340 5640 546 -2720 3909 5390 -3280 -6260 150 1627 -3129 -1311 5279
479E279j205o509l50L543j626l198K955M896p96l602J04J839j998l327J568M681
$$ 5279 4074 -2435 -2785 758 -868 -4066 -1111 3785 2989 -613 -509 1330 -668 -3995 -2427 2254
495B254N86l004M35K784k422n167J524N463q21l812L349M380m936n852M201M430
$$ 2254 2840 -164 271 3055 633 -4534 -3010 2453 1632 -2180 1169 5549 613 -5239 -1038 3392
511C392n196k702P877L311q194l003P275Rq545J519R922j180q494K555O801n461
$$ 3392 -1804 -4506 3371 6682 -1512 -4515 2760 2769 -5776 -4257 5665 4485 -4009 -1454 5347 -114
527a14p340N918O820n203l796O867K309q254k746O527O53n664K267P070j877o303
$$ -114 -7454 -1536 5284 81 -3715 3152 5461 -2793 -5539 988 1641 -4023 -1756 5314 3437 -2866
543b866J429L630l342l290M114M152k272k507J571O58k789j770J844K838R11p75
$$ -2866 -1437 2193 -1149 -4439 -325 3827 1555 -952 619 1277 -1512 -3282 -1438 1400 2311 1536
559A536l01O86j262l763r01L581J854j880J213L946j907n745P25L907k903l298
$$ 1536 1235 1921 659 -3104 -4005 -424 1430 -450 763 4709 2802 -2943 -2218 1689 -1214 -4512
575d512N840M868n964m415N719J487q431o43J0547J785q552O70P820m355j0390
$$ -4512 1328 6196 232 -4183 1536 3023 -5408 -6051 4496 6281 -2271 -1601 6219 1864 -8526
590h526L269Q724l303m936P355N797p488n455N335J079p085O42Q470J29o364J547
$$ -8526 -5257 3467 164 -4772 2583 8380 892 -4563 772 1851 -5234 -4592 3878 4007 -2357 -810
606h10M704m169n470M208N563k290k564L258J453m683l616J177K010O59R11J692
$$ -810 3894 -275 -5745 -1537 4026 1736 -828 2430 3883 -800 -4416 -3239 -1229 -570 341 2033
622B033J858K47l212l711M91J999j634r69M347K781l788k317L054k94m473J706
$$ 2033 3891 4138 926 -2785 -2294 -295 -1929 -2898 1449 4230 442 -1875 1179 885 -3588 -1882
638a882N879j426m601K964K826o934m626P084M542n856m84R153N85j0216j719
$$ -1882 3997 2571 -2030 934 3760 -3174 -7800 -716 3826 -2030 -2514 6639 7224 -2992 -4711
653d711P088j929p629L663Q546k206n474L683L186n639k865N458J737m559Q72
$$ -4711 2377 448 -7181 -3518 5028 2822 -2652 1031 4217 -1422 -4287 1171 2908 -1651 -779
668g79M675k826n670K200M346k637k251M969L663l592l330J366J90k779r58K080
$$ -779 3896 1070 -4600 -2400 1946 -691 -2942 2027 5690 2098 -1232 134 324 -2455 -3413 -1333
684a333K096J138j46j369j22J226j340k875J322L596j090k981J569K067k899k076
$$ -1333 763 1901 1755 386 264 1490 150 -2725 -1403 2193 1103 -1878 -309 1758 -1141 -3217
700c217L213J730k214R10L224k437m395K230K739m423k282O424L275n778j790
$$ -3217 -4 1726 -488 422 3646 1209 -3186 -956 1783 -2640 -4922 1502 4777 -1001 -2791
715b791O337M06p431o50O590q9n441J504M871k143l999K396K502k663p01L516
$$ -2791 3546 3952 -3479 -4129 2461 2372 -3069 -1565 3306 1163 -2836 -440 2062 -601 -1302 2214
731B214j53l663Q72K948k514l303K977L453k397k365K926J959l026k196J822J413
$$ 2214 2061 -1602 -730 2218 -296 -3599 -622 2831 434 -1931 995 2954 -72 -2268 -446 967
747I67j074q30O02P55L93o01j258L13J665k55j871M96K079o50k146N76J490p96
$$ 967 -107 -937 -335 420 813 212 -1046 -733 932 677 -1194 -698 1381 731 -1415 -839 651 -145
765a45o22J256L4j312Q88J344k028j485K814J465l547j172M293J072m558r21M567
$$ -145 -767 489 523 -789 99 1443 -585 -2070 744 2209 -1338 -2510 1783 2855 -1703 -2624 1943
782A943N44m400j25L993k27l416O59K676r95j805J337Q69j680j43J930n62k070
$$ 1943 2487 -1913 -2038 1955 1728 -1688 -1029 1647 652 -1153 184 1053 -627 -770 1160 598 -1472
799a472J148K179j511k179J603K058j705k070J544K009j051j789O52J491l28j390
$$ -1472 -324 1855 344 -1835 -232 1826 121 -1949 -405 1604 553 -1236 -584 907 579 -811
815h11r3J172M49r37o53Q42Q00o72p79N03N51k89k37K64k45k92O47J62j032K9
$$ -811 -904 268 717 -220 -873 -31 769 97 -682 -179 372 83 -154 110 -135 -427 220 382 -650 -621
835f21J780L3k086pK295j74k746K3K686n6k375M27K470l30k091K77J528n98j295
$$ -621 1159 1192 -894 -901 1394 1220 -1526 -1503 1183 1127 -1248 -821 1649 1319 -772 -495 1033 435 -860
854h60M30P03o01j79Q51O5p57L68R66n39j150M70J078q02j551M46J618j89j383
$$ -860 -430 273 -328 -507 344 409 -348 20 986 447 -703 -233 845 43 -1508 -1062 556 367 -1016
873a016M23J902J06j849k42J552j29k134k59J838K89j390L82J805l04j343O42
$$ -1016 -593 1309 1415 -434 -676 876 747 -1387 -1646 192 481 -909 -527 1278 974 -369 273
890B73R65j280j131J302M62j753j61K146J62k039N24K570m16k464M82J899j264
$$ 273 1238 -42 -1173 129 591 -1162 -1323 823 985 -1054 -530 2040 1624 -840 -358 1541 277
907B77k421Q82J949p12j157J382J515p87r46N11Q9j082m83N36J31l50K02O17J01
$$ 277 -2144 -1262 687 -25 -1182 200 1715 928 -18 493 582 -500 -983 -447 -316 -666 -464 153 254
926B54j88J68M21R1o07m29K27J93j023p97J090J163p59m39J869R87j984j272J586
$$ 254 66 234 655 746 139 -290 -63 130 -893 -1690 -600 563 -196 -635 1234 2221 237 -1035 551
945E51L05k413m09K466L50k021N92K409p37k139J132J749j647j595J716R09k386
$$ 551 856 -1557 -1966 500 850 -1171 -579 1830 1093 -1046 86 1835 188 -1407 309 1218 -1168
962a168q84K478O59j996L92K586l90k371K72J501j208j886J031J540o31n67J145
$$ -1168 -2052 426 1085 -911 -519 2067 1677 -694 -422 1079 -129 -2015 -984 556 -75 -642 503
979E03O69r83m52N21%n20o3J77r3q3m9p4L09M78j25j03O58J15j133m65P66j89
$$ 503 1172 189 -263 258 258 -262 -325 -148 -241 -324 -373 -447 -138 340 215 112 770 885 -248 -713 53 -136
1001a36j123O10J639l30j279R61J257j451j418J464R43j749o68K055L47k101J3
$$ -136 -1259 -649 990 660 -619 342 1599 148 -1270 194 1137 -612 -1280 775 1122 -979 -966
1018i66K039l64j776R82J749j272j608J250R17j691o55J821N15j544J53J606m89
$$ -966 1073 709 -1067 -85 1664 392 -1216 34 951 -740 -1395 426 941 -603 -450 1156 667
1035F67j576M41J094p94p74J006O41q95l66P95J0o59K30N10k26k78L38l4m45J21
$$ 667 -909 -468 626 -168 -942 64 705 -190 -556 239 249 -410 -180 330 104 -174 164 130 -315 -194
1055a94K54l04P1O11o6n36K35L79o58l85Q10K44q27Q1J040l19j095M91Q93q14
$$ -194 60 -244 -173 438 372 -164 71 450 -208 -593 217 461 -366 -285 755 436 -659 -168 725 -89
1075h9p90J151P06j238m73J337K9j477K68J480n46j264P90J091j112q64J232N17
$$ -89 -879 272 978 -260 -733 604 633 -844 -576 904 358 -906 -116 975 -137 -1001 231 748
1093G48j298j72J427p6j351K67J144o36r83Q90P94q83n17R68K81j000l3Q44j78
$$ 748 -550 -722 705 629 -722 -455 689 53 -930 -40 754 -129 -646 322 603 -397 -430 414 236
1112B36p21L58O49m25m47M10K21l86m0L71l3k20O5N7j60R2J16k51QL78j05m00
$$ 236 -485 -127 522 97 -350 60 281 -105 -145 226 193 -27 38 95 -65 27 143 -108 -100 278 173 -227
1134b27K88L60n36m22O70M30q78j71R29Q0j172K02J170m73j135O82J078r44r03
$$ -227 61 421 -115 -537 133 563 -315 -486 443 523 -649 -447 723 250 -885 -203 875 -69 -972
1153i72J146O95j307m83J422K70j430j5J378k36j321M69J231o57j034P88Q62q18
$$ -972 174 869 -438 -921 501 771 -659 -674 704 468 -853 -384 847 190 -844 -56 806 -12
1171a2o72Q56M77q70k80Q23J83p16j21N86N8m58q9M21O6l13j59L02K72l18l59
$$ -12 -684 172 649 -221 -501 322 505 -211 -332 254 312 -146 -235 186 252 -61 -220 82 354 36 -323
1192c23K96M26m30m98N85N42p51n43R02M85j034l85J155K26j284m0J426k03j460
$$ -323 -27 399 -31 -529 56 598 -153 -696 206 691 -343 -728 427 653 -631 -671 755 552 -908
1211i08M21J424o58j306Q84J168j046j058J200Q54j233o59J305M26j307j72J259
$$ -908 -487 937 279 -1027 -143 1025 -21 -1079 121 975 -258 -917 388 814 -493 -665 594
1228E94L8j191O8J079j74q98K55P45k76n95J98N42j34n11M5M81J1m50j30N19J71
$$ 594 632 -559 -491 588 414 -484 -229 516 240 -355 -157 385 251 -260 -215 266 277 -173 -303 216 387
1249C87o36k28P83K31q73j90R93M8j148R4J215k74j257M74J288o83j203Q67J066
$$ 387 -249 -477 306 537 -336 -526 467 515 -633 -539 676 402 -855 -381 907 224 -979 -112 954
1268I54j110q85J282P10j363m87J420K50j419QJ380k36j236L65J109m89q81N53
$$ 954 -156 -1041 241 951 -412 -899 521 771 -648 -640 740 504 -732 -367 742 253 -628 -75
1286g5O47n75m69N79L20m71j68L48N8k24QM2M1L5o9j75J94K29l58l12N26K92o37
$$ -75 572 -3 -472 107 427 -44 -212 136 194 -30 -22 20 61 96 27 -148 46 275 -83 -395 131 423 -214
1309b14k47Q52R4j022Q6J080k69j132M90J054o66j001Q89Q51j046o81J196M39
$$ -214 -461 391 485 -537 -451 629 360 -772 -282 772 106 -895 -6 845 -201 -882 314 753
1327G53j213j36J171j10j150L80R92n54q04P20N64p89l03P91O7p71J60N97k32
$$ 753 -460 -596 575 465 -685 -305 687 133 -671 49 613 -176 -479 312 379 -392 -232 365 133
1346A33m56L94K29m76K3M81k48l82M67K13o74l4P60j76q22M41P95o24o97Q30M76
$$ 133 -323 71 300 -176 -153 328 80 -302 165 378 -296 -330 430 254 -568 -127 668 44 -653 177 653
1367F53j056k92J139N7j109K32J085m89j032P62P79r01o12J039L55j059q5J084
$$ 653 -403 -695 444 501 -608 -376 709 220 -812 -50 729 -172 -784 255 610 -449 -534 550
1385E50j90r49L92P58m92n64O28K70p17j6O97k20n09M76L86o68j37P17k25p62
$$ 550 360 -589 -197 561 69 -495 133 403 -314 -330 367 147 -362 114 500 -168 -305 412 187 -575
1405e75M14P32o15n30Q76L50r93j30J136k29j122M43J033q36r30J103P07j234
$$ -575 -161 571 -44 -574 302 652 -341 -471 665 436 -686 -243 790 -46 -976 127 834 -400
1423d00l67J473J01j417J38J299n65j303P09J029q50o66J094M98j058j31R92j82
$$ -400 -767 706 807 -610 -472 827 262 -1041 -332 697 -153 -819 275 773 -285 -416 576 394
1441C94r68L28O78n68m95O92K69o41J32P22k51m97M38J93p29j34O46k47o17O15
$$ 394 -574 -246 432 -136 -631 61 330 -311 -179 543 292 -205 233 426 -303 -437 209 -38 -655 -40
1461d0O39o40l02R91J27j202j9J113m54j244P00J088r39p65J292O96j290k96J389
$$ -40 599 -41 -343 648 775 -427 -446 667 213 -1031 -331 757 -182 -947 345 1041 -249 -545 844
1480H44j27j545K23J262p34j143J010J083r55n29J269L19j285k02J043l32j094
$$ 844 717 -828 -605 657 -77 -1220 -210 873 -82 -611 658 977 -308 -510 533 201 -893
1497h93M53Q07n37m16Q20L63o36L9O14l67n86L25J77o51q0P20p9m18N76O10o68
$$ -893 -440 367 -170 -586 234 597 -39 0 614 247 -339 -14 163 -488 -568 152 73 -345 231 841 173
1518A73l75P34m3j086M8Q76l92q57Q57Q58q04n14J157L09j303j50J118l38j321
$$ 173 -202 532 489 -597 -549 327 -65 -922 -65 793 -11 -525 632 941 -362 -512 606 268 -1053
1537a053M72J154o36q26J117P83j002m46J079rj290N0R68m10q08P10P93o69l84
$$ -1053 -581 573 -63 -889 228 1011 9 -437 642 633 -657 -607 361 -49 -857 -147 646 -23 -407
1556d07R00J70q69j0O17l50o79M52L87n21n7P34L5n43L25M74o08m53N38M3p31
$$ -407 493 663 -206 -216 401 51 -628 -176 211 -310 -367 367 402 -141 184 658 50 -403 135 178 -553
1577e53J23Q19k72n91N97O48p39m14P71J26j021j6R23l07q42N78Q14o38n16Q99
$$ -553 -430 389 117 -474 123 771 32 -382 389 515 -506 -522 401 94 -748 -170 644 6 -510 389
1597C89L33j013j69Q63j67r52L37Q69n05n15P18M36p38k28P27m9q11K48O35m15
$$ 389 722 -291 -460 403 236 -716 -379 490 -15 -530 188 624 -114 -342 385 336 -475 -227 408 -7
1617gn01N72L63o03j01P06j14o17K39M70m50m12N25K16n36M6O07j63n40K93M22
$$ -7 -508 64 427 -176 -277 429 315 -302 -63 407 -43 -455 70 286 -250 -204 403 240 -300 -7 415
1638D15m85l56O00J59o55L8O39k30n13L89M50n24l28O46J04o64OO46j81o04M30
$$ 415 -70 -426 174 333 -322 -284 355 125 -388 1 451 -73 -401 245 349 -315 -309 337 156 -448 -18
1659a8M65n25l32N78J69o68PO42j52n75L49M80m52l56N49J40n79pN72j04n43K94
$$ -18 447 -78 -410 168 337 -331 -324 318 166 -409 -60 420 -32 -388 161 301 -278 -285 287 183 -360 -66
1681f6M67m09l00M69J83n42l2N23j29m90K97L61l67k62M64J36m92%M53j55m68
$$ -66 401 -8 -308 161 344 -198 -230 293 164 -326 -29 332 -35 -297 167 303 -189 -189 264 109 -359
1702c59L08L58l93k28M71R5m62M1M45j78m29K94L12l90k19M36J10m31N8M49j67
$$ -359 -51 307 -86 -314 157 252 -210 -169 276 98 -331 -37 275 -115 -334 102 212 -219 -161 288 121
1723A21l88K73K80l55k09L90O8m17Q7M30j79l28K90J99l17j56L82K1m30J21M11
$$ 121 -267 6 286 -69 -278 112 180 -237 -150 280 101 -227 63 262 -55 -211 171 192 -238 -117 294
1744B94k17l37L38K10l97j25M42J2m55J01L73k02l26L10K80l60k14M32L7l89K4
$$ 294 77 -260 78 288 -109 -234 208 220 -235 -134 239 37 -289 21 301 -59 -273 159 196 -193 -169
1765a69L56j44l27K42K68k62j85L10Q7l36O8K54j25k25J68J79k30p3K36K7k59
$$ -169 187 43 -284 -42 226 -36 -221 89 176 -160 -92 162 37 -188 -20 159 -71 -144 92 119 -140
1786a40Q3K53j80j73K40P3k76j5L29j09k90K09K40k90j69L02J14l28l6L63n5l46
$$ -140 -57 196 16 -157 83 156 -120 -135 194 85 -205 4 244 -46 -215 87 201 -127 -163 200 145 -201
1808b01J64K84k27k67K92J98l49j26L82Pl52P5L42j44k83K05J78k17j56K76L5
$$ -201 -37 247 20 -247 45 243 -106 -232 150 157 -195 -120 222 78 -205 0 178 -39 -195 81 116
1829A16k77N0K43q9j94J97Q1j80n1J97j6j90O5J73j33j05K21L5k21%J99n7k11
$$ 116 -161 -111 132 43 -151 46 127 -53 -104 93 77 -113 -48 125 -8 -113 108 143 -78 -78 121 64 -147
1852a47J82J71k46j02K38N7k84M9K56j20k42J77K04k10j94K95O4k58j9K81r0k29
$$ -147 35 206 -40 -142 96 153 -131 -82 174 54 -188 -11 193 -17 -211 84 148 -110 -129 152 62 -167
1874a67J33J90j66j53K09Q6k49m5K97o7k34J50J89j63j43K00O5k19k4K63j02k23
$$ -167 -34 156 -10 -163 46 132 -117 -162 135 68 -166 -16 173 10 -133 67 132 -87 -111 152 50 -173
1896a73J60J92j87j43K49N6k75J2K40p4k10J61J70k03j13K00P5k61M0K00o6j88
$$ -173 -13 179 -8 -151 98 154 -121 -109 131 57 -153 8 178 -25 -138 62 137 -124 -84 116 50 -138
1918a38J22J81j95j32K30M6k19M4J73q5j81J70J12k00m7K44m4k31J05K01j57j57
$$ -138 -16 165 -30 -162 68 114 -105 -61 112 27 -154 16 128 -72 -119 125 81 -150 -45 156 -1 -158
1940a58K02R0k40l3K83l8k97J37K57j92k02K27J43k76o6K81J3k82P9K58j55j96
$$ -158 44 134 -106 -139 144 106 -191 -54 203 11 -191 36 179 -97 -163 118 131 -151 -72 186 31 -165
1962a65J69J83k08j23K37M2k73N9K41r8k07J27J93k02j11K35j2k22Q0J87j17j34
$$ -165 4 187 -21 -144 93 135 -138 -79 162 64 -143 -16 177 -25 -136 99 87 -135 -55 132 15 -119
1984a19J42P9k05LK16o1j81J01J80k11q2K30M4k52K1K62j01k66J82K35k65j69
$$ -119 23 102 -103 -100 116 55 -126 -25 155 -56 -138 92 136 -116 -95 167 66 -200 -18 217 -48 -217
2006b17K93R9l30kL19n0l01J58K53k09k06K39J56k87o4K77J0k96Q4K71j41k58
$$ -217 76 175 -155 -157 162 112 -189 -31 222 13 -193 46 202 -85 -149 128 138 -158 -74 197 56 -202
2028b02K13J58k43o2K07K9k48M9J93r9j14J92O7j75p5K28p1j77J10J14j60n3K29
$$ -202 11 169 -74 -136 71 100 -148 -99 94 -5 -119 73 140 -35 -110 118 47 -130 -20 94 -66 -119 110
2051A10Kk13L7K05j01k15J69J86k63j05K86N1l10Q9K87j06k77J79K34k96j83K80
$$ 110 112 -101 -64 141 40 -175 -6 180 -83 -188 98 149 -161 -72 215 109 -168 11 245 -51 -234 46
2073D6J01k87K7L04nl33J24K67k18k46K49J46k71r0L24m6k31Q2K07j13j83J99
$$ 46 147 -140 -113 191 186 -147 -23 244 26 -220 29 175 -96 -186 138 92 -139 -57 150 37 -146 53
2095E3J03k05m1J54o3j43R7J28q4m1J60mk09K3J63j12j66J67J42j95l1K43qk60
$$ 53 156 -49 -90 64 1 -142 -45 83 -1 -42 118 114 -95 -72 91 -21 -187 -20 122 -73 -104 139 131 -129
2119a29P9K83k21k04K21J51k78j02K90O3k83J01K86j18k79J44J72k22k11L13Q5
$$ -129 -50 233 12 -192 29 180 -98 -200 90 153 -130 -29 257 139 -140 4 176 -46 -257 56 141
2140A41k57qK85k8k54R9K10j92j51K15O7k05n2K09n8j14O9J66j12r8J65j1j63
$$ 141 -116 -124 161 133 -121 -22 188 -4 -155 60 127 -78 -130 79 21 -93 -24 142 30 -68 97 86 -77
2163g7J0J38j06p6J36Q9j19p2K11k4k23P5J54j29j38J63J18j83q2K36Qk32J04
$$ -77 -67 71 -35 -111 25 114 -5 -77 134 110 -113 -38 116 -13 -151 12 130 -53 -135 101 109 -123 -19
2186a9J99j12k15J66J16k18p5K35K2j64j3K33p6k13J34J17j73j01K00Q3j80j2
$$ -19 180 68 -147 19 135 -83 -158 77 99 -65 -78 155 79 -134 0 117 -56 -157 43 126 -54 -66
2208f6J57o0j19P8J18j57k0J47%j54J6J43p8j11J14J44j69m7J96r6j13N6R9q1
$$ -66 91 31 -88 -10 108 -49 -69 78 78 -76 -60 83 5 -106 8 152 -17 -64 132 36 -77 -21 78 -3
2232cq2J42Q2j99j5J66l8j57N3J52o2j37J28Q4j63l0J54j3j41M8J06m4j33J15
$$ -3 -85 57 139 -60 -75 91 53 -104 -51 101 39 -98 30 114 -49 -79 75 62 -79 -31 75 31 -102 13
2256A3N3j08n0J10K7r3oJ16m2q5P3O0j12l1J12j2q9K4J23p3j14J29K2q9j4J50
$$ 13 66 -42 -92 18 45 -48 -54 62 20 -65 8 68 -44 -75 37 25 -64 -40 83 10 -104 25 47 -42 -56 94
2282I4n2q3L7R3q2q7R1O1j04j7J42kj12%P2n3j08J00P0r8J0P0k6p7J9R0r2J7J6
$$ 94 42 -41 -4 89 7 -80 11 72 -32 -49 93 91 -21 -21 51 -2 -110 -10 60 -38 -28 42 16 -61 -42 48 -44 -27 -11
2311a1P7q9j4O7k7n6J5Q1m9mJ6M4j31N2J0Kk4N9N6n6j7K8j1j16L3Q2k8l5R1L6
$$ -11 66 -23 -37 30 3 -53 -38 43 -6 -10 6 50 -81 -29 -19 -17 -41 18 74 18 1 29 18 -98 -65 17 -11 -46 45 81
2341H1p6k8O2K1j14K8P9j9p5J5L4l3p7J10M5J1j0K0l4p4l1M8l2n4R4K6R%M9k0
$$ 81 5 -23 39 60 -54 -26 53 34 -41 -26 8 -25 -102 8 53 64 54 74 40 -34 -65 -17 -49 -103 -9 17 26 26 75 55
2371E5q0MJ5j0JNJJl3L6kPN0M2l0Kj3q9o8L6L5MK2J06Lo4KJ1o9rJ1L1j5k5K4M1
$$ 55 -25 -21 -6 -16 -15 -10 -9 -8 -41 -5 -7 0 50 92 62 64 51 -38 -106 -70 -35 -31 -9 97 100 36 38 49 -20 -29 -18 13 -2 -27 -3 38
2407C8m1J4K8K5k7J8M6r7p2K5j2JL4L2N2K5j6Ln2p7Nj9j5O9L2k1K2llk7J5O3k8
$$ 38 -3 11 39 64 37 55 101 4 -68 -43 -55 -54 -20 12 64 89 73 76 24 -53 -48 -67 -82 -13 19 -2 20 17 14 -13 2 65 37
2440C7k7Qoo9OK0J8K1K4N1Ro6k0L7r0l3N7J9L6MK5mj8j8l3j7J5MK1JOl3k2kM1
$$ 37 10 18 12 -57 -51 -31 -13 8 32 83 92 26 6 43 -47 -80 -23 -4 32 36 61 57 39 21 -12 -29 -14 -10 11 12 18 -15 -37 -39 2
2475BK6KJ1K9n7m9jJ7k2%N6K1nOjl5k8jK2kQK3nm9MJ5Jj2J0M9pk0k3qJPK9l6J
$$ 2 28 30 41 70 13 -36 -37 -20 -42 -42 14 35 30 36 35 0 -28 -29 -7 -9 -1 22 17 -32 -28 -13 -12 -24 -14 35 28 8 -15 -23 -22 -15 14 -22 -21
2514b1K7K6j9M7m9j4jlK1J3j7L5m4j1j8N1%k7K6rl6L2j5K3k4k3O2M7j05OM4j5
$$ -21 6 32 13 60 11 -3 -4 -7 14 27 10 45 1 -10 -28 23 23 -4 22 13 -23 9 -6 17 -7 -30 32 79 -26 -20 24 9
2546Il7lJ5K0k5J5M8o1NK8%k7j0K5Rm9K5M8ok1pJ4j5j5pM3rRj4K7L1n7n5J7M1
$$ 9 -28 -31 -16 4 -21 -6 42 -19 -14 14 14 -13 -23 2 11 -38 -13 35 29 8 1 15 0 -15 -22 21 12 21 7 34 65 8 -47 -30 11
2581A1k1OL6j3nl0J5qmLM7Nm8mK4k8k5mN6j3qN6j9k1l8Kj3KK6K5L4j9n0OK1m2
$$ 11 -10 -4 32 19 14 -16 -1 -9 -13 -10 37 42 -6 -10 14 -14 -39 -43 13 0 -8 48 29 8 -30 -28 -41 -39 -13 12 46 27 -23 -17 4 -38
2617c8J1M8K3l6J1nmn8k2Q0j4L2lM3kp5j8pRk2L8N9km9JJ2l7j0lP9j5NM9n0m4
$$ -38 -27 21 44 8 19 14 10 -48 -70 10 -4 28 25 68 66 -9 -27 -34 -25 -47 -9 50 48 -1 0 12 -25 -35 -38 41 26 31 80 30 -14
2652a4m0K3K4K1LM4k6l1m5k7L5m4N1M2K2pj6k7J0n2l7Q8R0l4o0N0l8n6nL1L2K4
$$ -14 -54 -31 -7 14 17 61 35 4 -41 -68 -33 -77 -26 16 38 31 15 -12 -2 -54 -91 -3 87 53 -7 43 5 -51 -56 -25 7 31
2684C1kN4l0n7l0K5LoJ0O5j0j4l7L5o3j3K3L5K5j3QNn7k2K1pJ6M9JLQp6k4J9J6
$$ 31 29 83 53 -4 -34 -9 -6 -12 -2 63 53 39 2 37 -26 -39 -16 19 44 31 39 44 -13 -35 -14 -21 -5 44 45 48 56 -20 -44 -25 -9
2719iqnQ9k9l2k2Jjo3O6N1rm0K6Nm8n0N8M7k6J0M7k5o2JL6m1rO1N4l1j8j5L0l5
$$ -9 -17 -22 67 38 6 -16 -15 -16 -79 -13 38 29 -11 15 20 -28 -78 -20 27 1 11 58 33 -29 -28 8 -33 -42 19 73 42 24 9 39 4
2754Dn9L6M5K5m3L5l4j7K8k6j8J2M3k4pQpk5l1P0j3o3Q5J0m7k1O1k4m7MP3Kp6
$$ 4 -55 -19 26 51 8 43 9 -8 20 -6 -24 -12 31 7 0 8 1 -24 -55 15 2 -61 24 34 -13 -34 27 3 -44 -40 33 35 -41
2787d1K3P4o1p1Q0N6n5o3J02J9p1nL6l0j2M2Qj1l8K0J8l6pL3nmj2N8l8l7L5K8
$$ -41 -18 56 -5 -76 4 60 5 -58 44 63 -8 -13 23 -7 -19 23 31 20 -18 2 20 -16 -23 10 5 1 -11 47 9 -28 7 35
2819C5m3j7L3rOJ6Jm8J4K4k2l5N0M8n8m7Q5pn0k8M2M0n2l4R4Np6J0N8p4k2J05
$$ 35 -8 -25 8 -1 5 21 22 -26 -12 12 -10 -45 5 53 -5 -52 33 26 -24 -52 -10 30 -22 -56 38 43 -33 -23 35 -39 -61 44
2851D4k1p4K2J09o7m8K6L9k5q3P1O1l7l7L6L7n5j8L3jj7L8%n0k6O1qp7P5N8o7
$$ 44 23 -51 -29 80 13 -35 -9 30 5 -78 -7 54 17 -20 16 53 -2 -20 13 12 -5 33 33 -17 -43 18 10 -67 8 66 -1
2882a%qL2p4JP1p3%R8K8r0k2J28o8r3M6Q5m8r7R1N9o6r4R0P8n6n0R5J1r4j4Q5
$$ -1 -1 -9 23 -51 -50 21 -52 -52 46 74 -16 -38 90 22 -71 -25 60 12 -85 6 65 -1 -95 -5 73 17 -33 62 73 -21 -35 50
2914E0q4n8J15L8o5JQ6rj06J3M7l6m5J6O0k8l4M6Mj7J8J3p5M1M7k4r5N2L1k6m1
$$ 50 -34 -92 23 61 -4 -3 83 74 -32 -19 28 -8 -53 -37 23 -5 -39 7 11 -6 12 25 -50 -9 38 14 -81 -29 2 -24 -65
2945f5P2P5m5q0Q1k4m7j0L7k2n4J03M7m7m1O5Mj05pJ02l8n1l0J31o5n3M1R2n1
$$ -65 7 82 37 -43 38 14 -33 -43 -6 -28 -82 21 68 21 -20 45 49 -56 -63 39 1 -50 -80 51 -14 -67 -26 66 15
2974A5k9P7k6o4k9N5j4o7Q9K5Pj2P3kj18k1P0j8o4P4K3m6j8P1k1o1O4O4j10l2
$$ 15 -14 63 37 -27 -56 -1 -15 -82 7 32 39 27 100 98 -20 -41 29 11 -53 21 44 -2 -20 51 30 -31 33 97 -13 -45
3004d5J08k6j56K1J44l1n8P4J06o5r3L8M2j05m8R4L2r1N2P4m8o2P2K1o8m0Q0K4
$$ -45 63 37 -119 -98 46 15 -43 31 137 72 -21 17 59 -46 -94 0 32 -59 -7 67 19 -43 29 50 -18 -58 22 46
3032D6j01k8P1L3o4M3M9rQJ0m4p4jO6l5j2M4O5r9L5N3l1j04NJ04m9l9O1K7p3l3
$$ 46 -55 -83 -12 21 -43 0 49 40 48 58 14 -60 -61 5 -30 -42 2 67 -32 3 56 25 -79 -74 30 -19 -58 3 30 -43 -76
3063g6J03k5l8M9R0n9j01Q1J2j05nR2N6j03NJ00n7r6N6M3k0l5N8J8q2L7L7l0n
$$ -76 27 2 -36 13 103 44 -57 24 36 -69 -74 18 74 -29 -24 76 19 -77 -21 22 2 -33 25 43 -39 -2 35 5 0
3092@MO1p1J0L7j4q2J9P7l6n0P0L5n3k7M7pj08P4P0k9p5Q7J4o5m4P4oo0J9Q4k8
$$ 0 4 65 -6 4 41 27 -55 -36 41 5 -45 25 60 7 -20 27 20 -88 -14 56 27 -48 39 53 -12 -56 18 12 -48 -29 55 27
3124B7q7N4O8p2m0Q6J1p3j0R3n1o3P0K9o3%N0K7p9j2Q6k5q7P4K4m1k3M8rm4J9
$$ 27 -60 -6 62 -10 -50 36 47 -26 -36 57 6 -57 13 42 -21 -21 29 56 -23 -35 51 26 -61 13 37 -4 -27 21 12 -32 -13
3155a3O7n5m5P4Lp8JO9K2n6JK4J2o7N8J5n5k5P4J1o0J6M2j7n2L3K6n8LN7J9j08
$$ -13 54 -1 -46 28 31 -47 -46 23 45 -11 -10 14 26 -41 17 32 -23 -48 26 37 -23 -7 35 18 -34 -1 25 -33 -30 27 46 -62
3187f2KJ20l7n9P1K1j9n6O8l1p1J6R1l4o5P6Nl5l5N6J2n9K3L1mo7J3L2l1NO9j9
$$ -62 -60 60 23 -36 35 56 37 -19 49 18 -53 -37 54 20 -45 31 36 1 -34 22 34 -25 -2 29 25 -42 -29 3 -28 -23 46 27
3219B7p1K7N4k6q1P5M4q5LL6N7o9m5P3k2l8M4L2k1l2L2j0k9PL0pk0K5L3n4j4K5
$$ 27 -44 -17 37 11 -70 5 49 -36 -33 3 60 -9 -54 19 -3 -41 3 35 14 -18 14 4 -25 -18 12 5 -15 10 43 -11 -25 0
3251@K5m7j8Q9l6l8L9K6n4l9Q6ql7%P4k3m9J9J5n4l2R1M6q9PO5m3o9L4K5Qm5O3
$$ 0 25 -22 -40 49 13 -25 14 40 -14 -53 33 25 -12 -12 62 39 -10 9 24 -30 -62 29 75 -14 -7 58 15 -54 -20 5 13 -32 31
3284C1L1q2oP4k8o5O0L9p1OL3j8Oj7L1k0mrM6n6j3M9K7n8MP2m4n3O5J2n2k2N9
$$ 31 62 -20 -26 48 20 -45 15 54 -17 -11 22 4 10 -7 24 4 0 -9 37 -19 -32 17 44 -14 -10 62 18 -35 30 42 -10 -32 27
3317B7rl9J9P3m8q5R4Op4J7O0k2o0M4N9m4n3K8M7o0j3L9L1p7L1K8Mn0L1M1o2j2
$$ 27 18 -21 -2 71 23 -62 32 38 -36 -19 41 19 -41 3 62 18 -35 -7 40 -20 -33 6 37 -40 -9 19 23 -27 4 45 -17 -29
3349b9N6oq8M1N7m4nK4M8l7n0N2K3o7PP3k6n4L6J3m3%K6L0q5O1K3k5m3K6L6l2
$$ -29 27 21 -67 -26 31 -13 -18 6 54 17 -33 19 42 -25 -18 55 29 -25 11 24 -19 -19 7 37 -48 13 36 11 -32 -6 30 -2
3381bl5O6ml1J0M9l6k1PL0l4k2N2K6q5K8L6j8o1M5K0l8l1R0J3p9K6K4ro0M9J5
$$ -2 -37 29 25 -6 4 53 17 -4 3 33 -1 -23 29 55 -30 -2 34 16 -45 0 20 -18 -49 41 54 -25 1 25 16 -44 5 20
3413B0j3l2L3J5k4j3M8k3l9L4M2o2NJ0K6m4j3M9j7l2M6n%m4L1lrL5j9Pk1K7J2
$$ 20 7 -25 8 23 -1 -14 34 11 -28 6 48 -14 -9 1 27 -17 -30 19 2 -30 16 11 11 -33 -2 -5 -14 21 2 9 -12 15 27
3446B7l0m5P0ml8kN5%o4K6K7m2%L4Pp2L3N2j7l3J0L8l2qJ5K4o0J7N2m7m0Q0K0
$$ 27 -3 -48 22 18 -20 -22 33 33 -31 -5 22 -20 -20 14 21 -51 -18 34 17 -16 -6 32 0 -8 7 31 -29 -12 40 -7 -47 33 53
3479E3o3m0Q7k6m4J5L6k3k4N7K4m6n0N2Lm1MN7j4o3N9Ll2j3M8j1rj3M5j7n9L5
$$ 53 -10 -50 37 11 -33 -18 18 -5 -29 28 52 6 -44 8 11 -30 -26 31 17 -46 13 16 -16 -29 19 8 -1 -14 31 14 -45 -10
3511a0M3l4k0M7qm4nO2m1m0M1M6n9j0N6J3q0L0M8m7j4M2K4n1K6K6m0k7KQ5o5l9
$$ -10 33 -1 -21 26 18 -26 -31 31 -10 -50 -9 37 -22 -32 24 37 -43 -13 35 -12 -26 16 40 -11 15 41 1 -26 -24 61 -4 -43
3543d3O5Lo0LJK5k9M4J2plJ5Lp5J8L0M8q0K0P0n7l7J2K4ql1M6L1l9k8O4l9m3M9
$$ -43 22 25 -35 -32 -31 -6 -35 9 21 14 11 26 29 -46 -28 2 50 -30 -10 60 3 -34 -22 2 -6 -37 9 40 1 -27 37 -2 -45 4
3577DJ3j4l7P7Rr6K7M5l9k2M1N3o0j5M0j4n9K7M2l5l6Q4N1j12JN8l1k6L2L1k9
$$ 4 17 3 -34 43 52 -44 -17 28 -11 -33 8 61 1 -14 26 12 -47 -20 22 -13 -49 35 86 -26 -25 33 2 -24 8 39 10
3608A0m9J7L9m0k3P6Pn0j0O4j6l5J0K0m6j8N5Nk1l4O5k0m9K5P3n8j5K0kk1jP5
$$ 10 -39 -22 17 -23 -46 30 37 -13 -23 41 25 -10 0 20 -26 -44 11 16 -5 -39 26 6 -43 -18 55 -3 -18 2 0 -21 -22 53
3640E3n4k2K5O5q6J9L8J1r5NP1l9k4M2L9l8k3NJ9m5K2K6qo3N0N1o6jN0k9l0NM2
$$ 53 -1 -23 2 67 -19 0 38 49 -46 -41 30 -9 -33 9 48 10 -13 -8 11 -34 -12 14 6 -57 -7 44 -22 -23 27 -2 -32 -27 15
3673A5Lp4M4L1k9k7N7j0n8L8N5o6k8M9L4k7l8P5jq7J0J16o2m5OQ5q4l9J07p2k8
$$ 15 18 -56 -12 19 -10 -37 20 10 -48 -10 45 -21 -49 0 34 7 -31 44 43 -44 -34 82 20 -25 -19 66 -18 -57 50 -22 -50
3704e0R2Km2l4N2J9k7k9L4K0r4N2L6j1m2K8L1j9l4K5K2n5K8Rl2j1K6N2o9pL8k0
$$ -50 42 44 2 -32 20 39 12 -17 17 37 -57 -5 31 20 -22 6 37 18 -16 9 31 -24 4 13 -19 -30 -4 48 -21 -28 10 -10
3736a0k5L3N4n3l5M2L7o3j4M9j4mj9O2m1j4QK7m3j4O0J0n7J2M6k9k3K3M1o7J1
$$ -10 -35 -2 52 -1 -36 6 43 -20 -34 15 1 -3 -22 40 -1 -15 -7 20 -23 -37 23 33 -24 -12 34 5 -18 5 46 -21 -10
3767a0N0mm3jJ9j9n2M1P2p0K7K3l3k8L7MJk5L7J3m2K8j2k5j9N0pm3qP1K5p3k9
$$ -10 40 36 -7 -8 11 -8 -60 -19 53 -17 10 33 0 -28 9 13 14 -11 26 39 -3 25 13 -12 -31 19 12 -31 -39 32 57 -16 -45
3800d5Q8k9m4K4L2J5o5J6L3m0j7O8Ln8J4P2p5J5OL0q7K4M4Pl3RK9j4l9j0M8l6
$$ -45 43 14 -30 -6 26 41 -24 -8 25 -15 -32 36 39 -19 -5 67 -8 7 13 43 -44 -20 24 31 -2 7 36 22 -17 -27 21 -15
3832a5kM9n8j5JM4k0j8O0Qk4k6O3k2n3PM7n0k5O0L9p4J7N7l0o1M1N5n9J1PJ5l6
$$ -15 -17 32 -26 -41 -40 4 -16 -34 26 34 10 -16 47 25 -28 -21 26 -24 -49 11 50 -24 -7 50 20 -41 0 55 -4 7 14 29 -7
3865gqM6k9pJ7M3n6k2N3j4m2j5O8mk9L7L7n8m5P4l5l3qN3Mm5M5J2j0n3K5L2pl3
$$ -7 -15 31 2 -5 12 55 -1 -23 30 16 -26 -41 27 23 -6 31 68 10 -35 39 4 -29 -37 16 20 -25 20 32 22 -31 -6 26 19 -14
3899a4N4mo9lK3qNM5J0m8J4M4m0l6j5M3n9LQ4%l5K4J9m2l7N0L5l3j2N6j7p2J2
$$ -14 40 36 -33 -36 -13 -21 -16 29 39 -9 5 49 9 -27 -42 1 -58 -55 29 29 -6 18 37 -5 -42 8 43 10 -2 54 37 -35 -23
3932b3L6K2m3O9kl6m0JJ4p8O1K9K2l6K3K2n8k8K4J7qK9K8n7QrK8m5k9R3j1kk1
$$ -23 13 35 -8 61 59 23 -17 -16 -2 -80 -19 10 32 -4 19 41 -17 -45 -21 -4 -12 17 45 -12 -4 -13 15 -30 -59 34 23 21 0
3965@jk2k2ML7nJL1K0k8k2Lm3KM9M7nl5mj4k3kN1Nj7J7K2j1n7J5K5k9OL3J5n5
$$ 0 -1 -23 -45 -41 -4 -9 -8 23 43 15 -7 -4 -47 -45 4 51 46 11 7 -7 -30 -32 19 24 7 24 46 35 -22 -7 18 -11 -5 28 43 -12
4001a2LM1l1k1K4nJ0J8J0j5j3m2L1j8oJ1M2Mk2J1n7J0M6ok1KL0Jp1K8PJ4l0K3
$$ -12 -9 32 1 -20 4 -1 9 27 37 22 9 -33 -2 -20 -26 -15 27 31 9 20 -37 -27 19 13 -8 -6 24 25 -46 -18 -11 3 -27 -4
4035dO7o9%J3j1l5K4L8j1m5K9N2n3k5L1K2k3k2L5M2m8m6N9l4L1k0J9K4l6j9nj2
$$ -4 63 -6 -6 7 -4 -39 -15 23 12 -33 -4 48 -5 -30 1 23 0 -22 13 55 7 -39 20 -14 17 -3 16 40 4 -15 -20 -32
4067c2J9J0%K1k5lJ8k9j2K4l7Q0j0k5J7Mm1j1J0P3n7kN4m0on4P7j8m5M1M2L7q0
$$ -32 -13 -3 -3 18 -7 -10 8 -21 -33 -9 -46 34 24 -1 16 20 -21 -32 -22 51 -6 -8 46 6 0 -54 23 5 -40 1 43 80 0
4100@l9M9k6l8N2N2n1K0L2k4o1J8K1K2j3J3k1Nl3k0OL3l5N4JRl4l2J5J8qnK2L9
$$ 0 -39 10 -16 -54 -2 50 -1 19 51 27 -34 -16 5 27 14 27 6 11 -22 -42 -36 -3 -38 16 17 26 -8 -40 -25 -7 -15 -20 2 41
4134D1l2k9lJ9k6k8M4N6j7rMj9l0j0J7O6o0L9M4j6n5n3O7k0k2M5M6m2lk9L5m2
$$ 41 9 -20 -23 -4 -30 -58 -14 42 25 16 20 1 -29 -39 -22 44 -16 23 67 51 -4 -57 10 -10 -32 13 59 17 14 -15 20 -22
4166b2l5M4K8Kq%Mm3K8njK0QJ4j9j6k3JM3k9k6O1Lnl9MK3l2rN2K6l9j2QK0m4j4
$$ -22 -57 -13 15 17 9 9 13 -30 -2 -7 -8 12 20 34 15 -1 -24 -23 20 -9 -35 26 29 24 -15 -11 12 -20 -29 23 49 10 -2 6 26 -18 -32
4203c2K6J6j2K3L5k0l8j0K5Jl9j4J16o7k0L9k5Kk5L5K1k1j2K1Mm8K0J0Kj0k3K5
$$ -32 -6 10 -2 21 56 36 -2 -12 13 14 -25 -39 77 10 -10 29 4 6 -19 16 37 16 4 25 29 -19 1 11 13 3 -20 5
4235EJ2rl0L3m2j7L5K8J1k1m6N0kOl2J2J1J1j3k7L2j6k9L6J8m9pP9k5l5J9M8p1
$$ 5 17 8 -22 11 -31 -48 -13 15 26 5 -41 9 7 13 -19 -7 4 15 2 -25 7 -9 -38 -2 16 -33 -40 39 14 -21 -2 46 -25
4268b5oK6K3l0l9M6L9l4mJM4n2l9P8K6o4j0K4K3l8j9M9lj7nJ4J9l6k1J7K0Ok3
$$ -25 -31 -5 18 -12 -51 -5 34 0 -4 -3 41 -11 -50 28 54 -10 -20 4 27 -11 -30 19 16 -1 -6 8 27 -9 -30 -13 7 13 -10
4301a0K9k3J4%l8K4pj3P8k9l8j9J4J6m3M2M4j3o2L7Nj7k8QO7m8j8N0Kj0o3O7k6
$$ -10 19 -4 10 10 -28 -4 -11 -24 54 25 -13 -32 -18 -2 -45 -3 41 28 -34 3 8 -9 -37 -29 38 -10 -28 22 24 14 -49 18 -8
4334hK0PJ2Ll7j6k0M3J2l2J7j6PjK3rn3L3K3Rl2K7J6jn5L1J6qk8K8K3j2l7K2R
$$ -8 12 19 31 34 -3 -19 -39 4 16 -16 1 -15 -8 -9 14 5 -48 -15 8 17 -15 12 28 27 -28 3 19 11 -17 11 34 22 -15 7 16
4369A6j1j0nK4j7J3k1J6ml8J2M7QLl3Pkk4QpL8qK9l3k0%MK0m5M5nRl8L4K1m6p
$$ 16 5 -5 -10 14 -3 10 -11 5 1 -37 -25 22 30 33 0 7 5 -19 -11 -18 20 12 41 8 -12 -12 -8 12 -33 12 7 16 -22 12 33 -13 -20
4406b0J5M5Nk7l8J5Pm3PK1K1K2Kl1qnKPpJJ7Kolk3nJ1%L2K8po4Jml9L9O5J3n1
$$ -20 -5 40 45 18 -20 -5 2 -41 -34 -13 8 30 32 1 -7 -12 -10 -3 -10 -9 8 10 4 1 -22 -27 -16 -16 16 44 37 -27 -26 -30 -69 -30 35 48 -3
4445cN2l2k0l6l0O8k7L0J8Kj9l1MK2j9j7O7L8n0o0L1J3n4L2K4L6LJk6m9Nj8K9
$$ -3 49 17 -3 -39 -69 -1 -28 2 20 22 3 -28 -24 -2 -21 -38 29 67 17 -43 -12 1 -53 -21 3 39 42 43 17 -32 -27 -45 -16
4478a6qM8pj6QRk9qRL0k2K1Pk6pl1KPM3L7K0j9m0j7no6M1L1J4j6O0On5j3l0K9
$$ -16 -24 24 17 1 9 18 -11 -19 -10 20 -2 19 26 0 -7 -38 -36 -29 14 51 71 52 12 -5 -10 -76 -35 -4 10 -6 54 60 5 -8 -38 -9
4514ik9M2J5J4n4J7Kl1M4K8jMj9j1%l1j9J5K4j6M2Mk9K1j1j0k3J2L4j0K2rk0n1
$$ -9 -38 4 19 33 -21 -4 -2 -33 11 39 38 42 23 12 12 -19 -38 -23 1 -15 27 31 2 23 12 2 -21 -9 25 15 37 28 8 -43
4548d3L9nQj3N4jk5l3j6Pj6L0Q1l2m4L4Nl9n9M4OK3rO6j0o9j2K8J1m3O0M4p1J
$$ -43 -4 -9 -1 -14 40 39 14 -19 -35 -28 -44 -14 67 35 -9 25 30 -9 -68 -24 -18 5 -4 62 52 -17 -29 -1 10 -33 27 71 0 1
4582Aj7L1n2KM2J9Ql7M0n3j7J7J3oM0oJ9l1kk6J5oJ9J1j0jM6o3JL6l3lMN3j3n5
$$ 1 -16 15 -37 -35 7 26 34 -3 37 -16 -33 -16 -3 -9 31 25 44 13 11 -15 0 -6 13 24 14 13 59 -4 -3 33 0 -3 1 54 41 -14
4618a4L5pk5jL7M5q2L8K9n4l5K3K6mk8M2Ln4J6PK5o4P2K1m8l1M1J0j6n1P0ok0
$$ -14 21 14 -11 -12 25 70 -12 26 55 1 -34 -11 15 11 -17 25 28 -26 -10 -3 22 -42 30 51 3 -28 13 23 7 -44 26 20 0
4651@J3J4J0n2lJ5j4qL6L8m3LK0l3j3J0J4k6ML0j1o2L8M9m4j9N5rl4mL2j6k4K9
$$ 0 13 27 37 -15 -18 -3 -17 -25 11 49 6 9 29 -4 -17 -7 7 -19 -15 15 4 -58 -20 29 -15 -34 21 12 -22 -26 6 -10 -34 -5
4685eN7k1m4J01j1q6j3L9L4n7k5O3l3j7K0nj0J3JL9j5l3K5j2j4K3K3l0OJ8l4K4
$$ -5 52 31 -13 88 77 -9 -22 17 51 -6 -31 32 -1 -18 2 -3 -13 0 1 40 25 -8 17 5 -9 14 37 7 13 31 -3 21
4717B1l1K5k1MK0j3j0J7Kl8j0L0K5l5OM7k1n9K4N0pq5O7K9m4k8O2jn2L0K3J1r0
$$ 21 -10 15 -6 -2 18 5 -5 12 14 -24 -34 -4 21 -14 -8 39 18 -41 -17 33 26 -59 8 37 -7 -35 27 26 -26 4 27 38 -52
4750e2L4K5Rn2O9l7Nk4K8Ol4J7L0j7J6k4J2k8jK5J7n1M0J7l3k0N6k4l6M2Pj0l8
$$ -52 -18 7 16 -36 33 -4 1 -23 5 11 -23 -6 24 7 23 -1 11 -17 -18 7 24 -27 13 30 -3 -23 33 9 -27 15 22 12 -26
4783b6N2mm7pJ3M5l7qM8j0m3J8M9o7jK9L1o8K2K8j9m0N9j1nj0M8j9m2j2M1j7n
$$ -26 26 22 -25 -32 -19 26 -11 -19 29 19 -24 -6 43 -24 -25 4 35 -33 -11 17 -2 -42 17 6 1 -9 39 20 -22 -34 7 -10 -15
4816a5%L9l2JK3j3j4pJ6M1l2K5J6o6pL6k6j2L2K3j0l9N7lm9qK4Oj7QO7o4ok4M1
$$ -15 -15 24 -8 -7 16 3 -11 -18 -2 39 7 32 48 -18 -25 11 -15 -27 5 28 18 -21 36 33 -16 -24 0 6 -11 -3 64 0 -6 -30 11
4851A1k4k4P3J4p6K1J2qo2K9N0j6%MK0l9PK8l4NM4Ro6JPoj2K8RL8m8N4k3o7L1
$$ 11 -13 -37 36 50 -26 -5 7 -1 -63 -34 16 0 0 4 24 -15 -8 20 -14 -9 35 44 -22 -21 -14 -20 -32 -4 5 43 -5 49 26 -41 -10
4886a0J8J2m5N5K8m3j9k3M4n1l6R9k2k1qN0j6n8N0Oj0m3Q0qn0k5O2j6ql6P5j5
$$ -10 8 20 -25 30 58 15 -4 -27 17 -34 -70 29 7 -14 -22 28 12 -46 4 10 0 -43 37 29 -21 -46 16 0 -8 -44 31 16
4918A6l9M1Po7J0N4j7k6O4%lo2k0M5l3J4M3k3k4PM2o5L5ML8m6K4L0m8m3K8M2l3
$$ 16 -23 18 25 -42 -32 22 5 -21 43 43 40 -22 -42 3 -30 -16 27 4 -20 -13 29 -36 -1 3 41 -5 19 49 1 -42 -14 28 -5
4951el1J01k8r3M0J8J4n7M9L4o7JN2np8M1K0k8K1PK8j9o4L5Ro6M2M5Mk8K1Jj8
$$ -5 -36 65 37 -56 -16 2 16 -41 8 42 -25 -24 28 23 -55 -14 6 -22 -1 6 34 15 -49 -14 -5 -71 -29 16 20 -8 13 14 -4
4984dl1N0jn7M8M0m9lRM0n9QK8K7o1kN3k3k5K2Ok8K1L3pn3K1J6l1%J9K0n3K1K1
$$ -4 -35 15 14 -43 5 45 -4 -7 2 42 -17 -9 19 46 -15 -17 36 13 -12 10 16 -12 9 42 35 -18 3 19 -12 -12 7 27 -26 -5 16
5019A6po1J6M6j9k8N1Nl9pL3l5JK9J5k7rJ6K4m7k6Q7k3qoK6j0n8N5Ol1mK4L0l4
$$ 16 9 -52 -36 10 -9 -37 14 19 -20 -27 6 -29 -28 1 16 -11 -20 -4 20 -27 -53 34 11 3 -3 23 13 -45 10 16 -15 -19 5 35 1
5054AJ0ql2K1L8mj9%L6k8n1L7lJ8k7N2k1n2L5%k1j1JO8k3j9K2j0l8JL2K0j1kK7
$$ 1 11 3 -29 -8 30 26 7 7 43 15 -36 1 -2 16 -11 41 20 -32 3 3 -18 -29 -28 40 17 -2 20 10 -28 -27 5 25 14 12 39
5089C9o1JK0J2k4k8N6K5m8%M8l0k1O3m0n3L3N2l3l8K0M6j4m7J9N1l8NJ5k9k1K6
$$ 39 -22 -21 -1 11 -13 -41 15 40 -8 -8 40 10 -11 52 12 -41 -8 44 11 -27 -7 39 25 -22 -3 48 10 15 30 1 -20 6
5121FmJ2j7J5%m8JO2o3L2PM0l9m7M2j6l7J1O8j9k3J1L1l0nL1J7n9MK1K8l9OJ9
$$ 6 2 14 -3 12 12 -36 -35 27 -36 -4 3 43 4 -43 -1 -17 -54 -43 25 6 -17 -6 25 -5 -10 21 38 -21 -17 4 32 -7 -1 18
5155A8ll1L2K6m4MK4k7Pk1L2j2qJ9kl8J8Oj0J5j8L9kl5mM7n3K3J1j0jJ6npj3k
$$ 18 15 -16 16 42 -2 2 26 -1 6 -15 17 5 -3 16 14 -24 -6 0 -10 5 -13 26 24 -11 -15 32 -21 2 13 3 2 18 13 6 -7 -9
5191iL5m0jM1k4j8oN0qk5L6j2k3NOj7k7M4K3l4j3L9J8m4j6L7K1m4J7L3n0k6O7
$$ -9 26 -14 -15 26 2 -16 -22 28 20 -5 31 19 -4 1 7 -10 -37 7 30 -4 -17 22 40 -4 -20 17 38 -6 11 44 -6 -32 35
5224C5k4j6LJ5J3k4K2j6Nj8K8Kn4M9l0K3k6K0M1m3k8P1Ko9pJ5L8p2L4L0l8RM7
$$ 35 11 -5 -2 13 26 2 24 8 13 -5 23 25 -29 20 -10 13 -13 7 48 5 -23 48 50 -19 -26 -11 27 -45 -11 19 -19 -10 37
5257C7m8j6nL5J7k9j5N9k4l9L8Nm1K6J7j4m1M2L6j7o4K9M5j6j1jKOMK1k0j1Jn
$$ 37 -11 -27 -32 3 20 -9 -24 35 11 -28 10 15 -26 0 17 3 -38 4 40 23 -41 -12 33 17 6 5 7 13 17 38 18 7 8 3
5291Cjj1K9k4l9N3J0m0oQ1m6m5K8L8j8k6jL0j5j0J7L4l5lL9k9l6kL1l3KL8J6l4
$$ 3 2 -9 20 -4 -43 10 20 -20 -26 55 9 -36 -8 30 12 -14 -15 15 0 -10 7 41 6 3 42 13 -23 -25 6 -27 -25 13 29 -5
5325eJ2L1k3j1k1K7l2K2QJ0k7L8Ll2Nrl5K8Qj3L8n7K6K7oj8L4k7J7j7K6Lo6j0
$$ -5 7 38 15 4 -17 10 -22 0 8 18 -9 29 32 0 5 -4 -39 -11 -3 -16 22 -35 -9 18 12 -6 28 1 18 1 27 30 -36 -46
5359d6M4nk1M1J3k9K9mRn4K5JKm0J5O3n8J3K2Nk1pJ3J2l9K3Jj2k1L0J9Kk2kkR
$$ -46 -2 -7 -28 13 26 -3 26 22 31 -23 2 3 5 -35 -20 43 -15 -2 20 25 4 -3 10 22 -17 6 7 -5 -26 4 23 25 3 1 -1 8
5395HRk5nKJ3jk0RK4j4qQL5l5j7L5j4l4K7J3Ln5N9qmqlL2l4%M1k9k3K3Nj9Kkk1
$$ 8 17 -8 -13 -11 2 1 -19 -10 14 0 -8 0 35 0 -17 18 4 -30 -3 10 13 -42 17 9 5 -3 -6 26 -8 -8 33 4 -19 4 9 -10 -8 -10 -31
5434c1J4k8M0nJ8pJ7rk8KL3pKJJ7j3k9L1nm4N7j4l3K2K2k1j0OJ2mj9OM1m3pN6
$$ -31 -17 -45 -5 -10 8 1 18 9 -19 -17 16 9 11 12 29 16 -13 18 13 -31 26 12 -21 1 23 2 -8 -2 10 6 -13 -7 34 -9 -16 40
5470D0n8OQPMj9K3k5KOL6j3k9LL5qn3J6L6Jj0Pj5krJ9l0J5KL3m5J0K1j1J1j9K0
$$ 40 -18 -12 -4 3 7 -12 11 -14 -12 -6 30 17 -12 -9 26 18 -35 -19 17 18 8 15 0 -2 -11 8 -22 -7 -5 28 -17 -7 14 3 14 -5 15
5507A5j8j9K4j5qlJ6J6k3K6J2k6PkK2n0J1J9kk1J5J4l1lJ5Lk4NM7j7l6O8m1Ql5
$$ 15 -3 -22 2 -13 -21 -24 -8 8 -15 11 23 -3 4 2 24 -26 -15 4 2 -19 -4 10 -21 -24 -9 -6 -30 -25 22 5 -31 37 -4 4 -31
5542c1M1qOj6j0L5j7QJkj5M2k5ml4N6l2k2J7M2l3rLmk1M6k4J5l2K1J5jJ7l7K9
$$ -31 10 2 8 -8 -18 17 0 8 9 7 -8 34 9 5 -29 27 -5 -27 -10 32 -1 -10 -7 -11 -32 14 -10 5 -27 -6 9 8 25 -12 17
5577A7n6L0NJj3J3Mk3N3r%l5J0j2k0K9KK1Mk4J9k4L2j1k6PrK5Qrj4J0j1J0j4K8
$$ 17 -39 -9 -4 -3 -16 -3 1 -22 31 22 22 -13 -3 -15 -35 -6 -4 17 21 -3 16 -8 24 13 -13 -6 -15 10 18 9 -5 5 -6 4 -10 18
5613A8j5QL6l5j6L2k3K8l9K7l0K3pj3K2j9j4K5j6J9j5J1QPj8J5l3PMK6l7LJ4K4
$$ 18 3 11 47 12 -4 28 5 33 -6 21 -9 14 7 -6 16 -3 -17 8 -8 11 -4 7 15 22 4 19 -14 -7 -3 23 -14 -11 3 27
5647B7m5M2pk0QL1l6pJ5Pj1j2J0K2l8nK8nlQnj1nK6kJol4M0j8J0L4m3LlK7l1J8
$$ 27 -18 24 17 -3 5 36 0 -7 8 15 4 -8 2 24 -14 -19 9 4 1 9 4 -7 -12 14 12 13 7 -27 13 -5 5 39 -4 -1 -4 23 -8 10
5685A0jj7KLM7k3PjPj7k3k6K9j6J2L5k3l%K5j4mj5Qj3J8K3l2m2L8K7Rjj0J4j0
$$ 10 9 -8 -6 -3 44 21 28 27 34 17 -6 -32 -3 -19 -7 28 5 2 2 27 13 9 -6 2 -11 7 30 -2 -44 -6 21 30 29 19 33 23
5721B3qj5J9j3rNj5K1Qk3K2m2M6qk3L0l3J7Pk2J8LQj2oK8j3jj4J2qK1k7J5K1n7
$$ 23 15 0 19 6 -3 2 -13 8 16 -7 15 -27 19 11 -12 18 -15 2 9 -13 5 8 16 4 -2 26 13 12 -2 10 2 23 -4 11 32 -25
5757b5LNK3k4J3J8J0j3k3L4jk1J8rk6K5J8j3k6J1K2j7J0l4N1l0J7J0j0j0Lk7j2
$$ -25 -22 -17 6 -18 -5 13 23 10 -13 21 20 -1 17 8 -18 7 25 12 -14 -3 19 2 12 -22 29 -1 16 26 16 6 9 -18 -30
5790c0K2J2l3J8K5j7jqKJ8J8k1oJ2nKMk5NJ3Pk7K1j2K6Nj6j8Oj3M5Nj6kj3mNJ7
$$ -30 -8 4 -29 -11 14 -3 -4 -12 -10 8 26 5 -1 11 6 8 12 -13 -8 5 12 -15 6 -6 20 25 9 -9 -3 -16 29 34 18 16 3 -1 4 21
5828B1%j2K6m6nOrL1PqknkJ6pj2K0oj1J0J1k5MJ3J3l6LOjoJ3j2rJ8j4ojJ6K0k
$$ 21 21 9 35 -11 -16 -10 -19 12 19 11 9 4 2 18 11 -1 19 13 2 12 23 -2 2 15 28 -8 -5 1 0 -6 7 -5 -14 4 -10 -16 -17 -1 19 17
5868A7rRm2K7j8J5J3j6M6j1j6mOk6L2%omkj7kK4lj5j1J4m6M6J5j7pj6O2m6M2m0
$$ 17 8 17 -25 2 -16 -1 12 -4 42 31 15 11 17 -9 23 23 17 13 11 -6 -8 16 13 -2 -13 1 -45 1 16 -1 -8 -24 38 -8 34 -6
5904fj3L1JPj0lj0Q%l4K8QJ9l3K2J4qj7mK3k8K6l6J1kj2K7j1J1jk0K0j7JpJ0J4
$$ -6 -19 12 13 20 10 7 -3 5 5 -29 -1 7 26 -7 15 29 21 4 0 23 -5 21 -15 -4 -6 -18 9 -2 9 8 -12 8 -9 -8 -15 -5 9
5941Ik2K2J2pj0Kj3L6j5j9J0K9l2j9L0j1J8k5%j0J2J9j9L1l4k3M0j3k0J6K4l1
$$ 9 -13 9 21 14 4 6 -7 29 14 -5 5 34 2 -17 13 2 20 -5 -5 -15 -3 16 -3 28 -6 -29 11 -2 -22 -6 18 -13
5973a3M4l6MK2m5L2l6M7l5J4J9k0Nj7MkK2k3L1j9kJ3l3L8J3j4QmKJ0j8j0j0K5
$$ -13 31 -5 -1 21 -24 8 -28 19 -16 -2 17 -3 2 -15 -11 -13 9 -14 17 -2 -4 9 -24 14 27 13 21 17 19 29 11 1 -9 16
6007A6Qk8K5j5k6K5j3LrK4k5nM3m0L0j0J0j7rJNj2L9j1J7m2M1l2k4K8j6PJ7kK7
$$ 16 24 -4 21 6 -20 5 -8 -5 -14 10 -15 -20 23 -17 13 3 13 -4 -13 -12 -7 -19 20 9 26 -16 25 -7 -31 -3 -19 -12 5 3 30
6042C0j4k4K3k0J3J3m6M1Qmk4J6k1K0K5m2K2j4k6N9l2j1L8l0pJ5j2j6K6n%Qmk
$$ 30 16 -8 15 -5 8 21 -25 16 24 20 -4 12 -9 11 36 -6 16 2 -24 35 3 -8 30 0 -7 8 -4 -20 6 1 1 9 5 3
6076CJrOKMMJ7n3K7jK0k8m3N2J1j4Jk6L9npJ1j3L7l9J4Mk9K1Rk1pJ0K5j6Ok3M2
$$ 3 4 -5 1 3 7 11 28 -25 2 1 21 -7 -50 2 13 -1 0 -26 13 8 1 12 -1 36 -3 11 15 -14 7 16 -5 -12 -2 23 7 13 -10 32
6114C2l8RM5m2PNnnJ3j3k7L1j8QMNnj1K8l4K2lj1RnL6l5Pj7J3J7j6kjJ3j0qJ7
$$ 32 -6 3 48 6 13 18 13 8 21 8 -19 12 -6 2 6 11 6 -5 23 -11 11 8 -3 6 1 37 2 9 -8 5 22 6 4 3 16 6 -2 15
6152A5ROk1k0Nk4L6j6K9mj1Oj5j2K1qJ0K1k3mJ1lj0L3j3l6J1%K1kllj2K5k0K5
$$ 15 24 30 9 -11 -6 -30 6 -10 19 15 4 10 -5 -17 4 -4 6 27 4 0 11 8 -2 31 18 -18 -7 -7 14 12 9 6 -6 19 -1 24
$$ [...]
8191g
##END NTUPLES=NMR FID
##END=
