##TITLE=1H_AM A509
 CDCl3, 8 sc, 
 26.7.2019
##JCAMPDX= 6.0         $$ Bruker NMR JCAMP-DX V2.0
##DATA TYPE= NMR FID
##DATA CLASS= NTUPLES
##ORIGIN= UXNMR, Bruker Analytische Messtechnik GmbH
##OWNER= root
$$ XWIN-NMR		Version 3.5
$$ Fri Jul 26 14:47:23 2019 Russian Standard Time (UT+4h)  she@DPX200
##.OBSERVE FREQUENCY= 200.13155
##.OBSERVE NUCLEUS= ^1H
##.DELAY= (6, 6)
##.ACQUISITION MODE= SIMULTANEOUS
##.ACQUISITION SCHEME= undefined
##.AVERAGES= 8
##.DIGITISER RES= 18
##SPECTROMETER/DATA SYSTEM= spect
##.PULSE SEQUENCE= zg30
##.SOLVENT NAME= CDCl3
##.SHIFT REFERENCE= (INTERNAL, CDCl3, 0, 15.7039)
##AUDIT TRAIL= $$ (NUMBER, WHEN, WHO, WHERE, WHAT)
$$ ##TITLE= Audit trail, XWIN-NMR		Version 3.5
$$ ##JCAMPDX= 5.01
$$ ##ORIGIN= Bruker BioSpin GmbH
$$ ##OWNER= she
$$ F:/spectra/data/she/nmr/H-F/1/audita.txt
$$ ##AUDIT TRAIL=  $$ (NUMBER, WHEN, WHO, WHERE, WHAT)
(   1,<2019-07-26 14:46:35.95 +0400>,<she>,<DPX200>,
      <created by zg, POWCHK disabled, PULCHK disabled
       configuration hash MD5:
       00 E9 B6 7A A2 85 ED C7 34 08 36 98 17 FE 4E 26
       data hash MD5: 16K
       CA 03 7A 1C 2F E4 4C 66 BE 4D B0 45 1A A4 0B 10>)
$$ ##END=
$$ 
$$ hash MD5
$$ DB 42 D3 EC 98 DA 43 BB 2C DC B2 CF EC 40 65 5E
##$RELAX= 
##$RELAX= 
##$RELAX= 
##$RELAX= 
##$RELAX= 
##$RELAX= 
$$ Bruker specific parameters
$$ --------------------------
##$DU= <F:/spectra>
##$EXPNO= 1
##$NAME= <H-F>
##$PROCNO= 1
##$TYPE= <nmr>
##$USER= <she>
##$AMP= (0..31)
100 100 100 100 100 100 100 100 100 100 100 100 100 100 100 100 100 100 
100 100 100 100 100 100 100 100 100 100 100 100 100 100 
##$AQSEQ= 0
##$AQ_mod= 1
##$AUNM= <au_zg>
##$AUTOPOS= <>
##$BF1= 200.13
##$BF2= 200.13
##$BF3= 200.13
##$BF4= 200.13
##$BF5= 200.13
##$BF6= 200.13
##$BF7= 200.13
##$BF8= 200.13
##$BYTORDA= 1
##$CFDGTYP= 0
##$CFRGTYP= 5
##$CHEMSTR= <none>
##$CNST= (0..31)
1 1 145 1 1 1 1 1 1 1 1 1 1 1 1 1 1 1 1 1 1 1 1 1 1 1 1 1 1 1 1 1 
##$CPDPRG= <>
##$CPDPRG1= <>
##$CPDPRG2= <>
##$CPDPRG3= <>
##$CPDPRG4= <mlev>
##$CPDPRG5= <mlev>
##$CPDPRG6= <mlev>
##$CPDPRG7= <mlev>
##$CPDPRG8= <mlev>
##$CPDPRGB= <>
##$CPDPRGT= <>
##$D= (0..31)
0 1.2 0 0 0 0 0 0 0 0 0 0.03 0 0 0 0 0 0 0 0 0 0 0 0 0 0 0 0 0 0 0 0 
##$DATE= 1564137995
##$DBL= (0..7)
120 120 120 120 120 120 120 120 
##$DBP= (0..7)
150 150 150 150 150 150 150 150 
##$DBP07= 0
##$DBPNAM0= <>
##$DBPNAM1= <>
##$DBPNAM2= <>
##$DBPNAM3= <>
##$DBPNAM4= <>
##$DBPNAM5= <>
##$DBPNAM6= <>
##$DBPNAM7= <>
##$DBPOAL= (0..7)
0.5 0.5 0.5 0.5 0.5 0.5 0.5 0.5 
##$DBPOFFS= (0..7)
0 0 0 0 0 0 0 0 
##$DE= 6
##$DECBNUC= <off>
##$DECIM= 24
##$DECNUC= <off>
##$DECSTAT= 4
##$DIGMOD= 1
##$DIGTYP= 9
##$DL= (0..7)
0 120 120 120 120 120 120 120 
##$DP= (0..7)
150 150 150 150 150 150 150 150 
##$DP07= 0
##$DPNAME0= <>
##$DPNAME1= <>
##$DPNAME2= <>
##$DPNAME3= <>
##$DPNAME4= <>
##$DPNAME5= <>
##$DPNAME6= <>
##$DPNAME7= <>
##$DPOAL= (0..7)
0.5 0.5 0.5 0.5 0.5 0.5 0.5 0.5 
##$DPOFFS= (0..7)
0 0 0 0 0 0 0 0 
##$DQDMODE= 0
##$DR= 18
##$DS= 0
##$DSLIST= <SSSSSSSSSSSSSSS>
##$DSPFIRM= 0
$$ [...]
##$SUBNAM2= <"">
##$SUBNAM3= <"">
##$SUBNAM4= <"">
##$SUBNAM5= <"">
##$SUBNAM6= <"">
##$SUBNAM7= <"">
##$SUBNAM8= <"">
##$SUBNAM9= <"">
##$SW= 24.9336996594482
##$SWIBOX= (0..15)
0 0 2 0 0 0 0 0 0 0 0 0 0 0 0 0 
##$SW_h= 4990.01996007984
##$TD= 16384
##$TD0= 1
##$TE= 0
##$TE2= 300
##$TE3= 300
##$TEG= 300
##$TL= (0..7)
0 120 120 120 120 120 120 120 
##$TP= (0..7)
150 150 150 150 150 150 150 150 
##$TP07= 0
##$TPNAME0= <>
##$TPNAME1= <>
##$TPNAME2= <>
##$TPNAME3= <>
##$TPNAME4= <>
##$TPNAME5= <>
##$TPNAME6= <>
##$TPNAME7= <>
##$TPOAL= (0..7)
0.5 0.5 0.5 0.5 0.5 0.5 0.5 0.5 
##$TPOFFS= (0..7)
0 0 0 0 0 0 0 0 
##$TUNHIN= 0
##$TUNHOUT= 0
##$TUNXOUT= 0
##$USERA1= <user>
##$USERA2= <user>
##$USERA3= <user>
##$USERA4= <user>
##$USERA5= <user>
##$V9= 5
##$VALIST= <valist>
##$VCLIST= <CCCCCCCCCCCCCCC>
##$VD= 0
##$VDLIST= <DDDDDDDDDDDDDDD>
##$VPLIST= <PPPPPPPPPPPPPPP>
##$VTLIST= <TTTTTTTTTTTTTTT>
##$WBST= 1024
##$WBSW= 4
##$XGAIN= (0..3)
0 0 0 0 
##$XL= 0
##$YL= 0
##$YMAX_a= 14681
##$YMIN_a= -12302
##$ZGOPTNS= <>
##$ZL1= 120
##$ZL2= 120
##$ZL3= 120
##$ZL4= 120
##$ABSF1= 10
##$ABSF2= 0
##$ABSG= 5
##$ABSL= 3
##$ALPHA= 0
##$AQORDER= 0
##$ASSFAC= 0
##$ASSFACI= 0
##$ASSFACX= 0
##$ASSWID= 0
##$AUNMP= <proc_1d>
##$AZFE= 0.1
##$AZFW= 0.1
##$BCFW= 1
##$BC_mod= 2
##$BYTORDP= 1
##$COROFFS= 0
##$CY= 11.3945322036743
##$DATMOD= 1
##$DC= 2
##$DFILT= <>
##$DTYPP= 0
##$F1P= 20.1537800932815
##$F2P= 0.134698688090026
##$FCOR= 0.5
##$FTSIZE= 0
##$FT_mod= 4
##$GAMMA= 1
##$GB= 0.15
##$INTBC= 1
##$INTSCL= 1
##$ISEN= 128
##$LB= 0.24
##$LEV0= 0
##$LPBIN= 0
##$MAXI= 10000
##$MC2= 0
##$MEAN= 0
##$ME_mod= 0
##$MI= 1.114404
##$NCOEF= 0
##$NC_proc= 0
##$NLEV= 6
##$NOISF1= 3.799351
##$NOISF2= 2.8
##$NSP= 1
##$NTH_PI= 0
##$NZP= 0
##$OFFSET= 15.70392
##$PC= 1
##$PHC0= -9134.224
##$PHC1= 16.40097
##$PH_mod= 1
##$PKNL= yes
##$PPARMOD= 0
##$PSCAL= 0
##$PSIGN= 0
##$REVERSE= no
##$SF= 200.130013532006
##$SI= 16384
##$SIGF1= 3
##$SIGF2= 2
##$SINO= 400
##$SIOLD= 16384
##$SREGLST= <1H.CDCl3>
##$SSB= 0
##$STSI= 0
##$STSR= 0
##$SW_p= 3612.71676300578
##$SYMM= 0
##$S_DEV= 0
##$TDeff= 0
##$TDoff= 0
##$TI= <>
##$TILT= no
##$TM1= 0
##$TM2= 0
##$TOPLEV= 0
##$USERP1= <user>
##$USERP2= <user>
##$USERP3= <user>
##$USERP4= <user>
##$USERP5= <user>
##$WDW= 1
##$XDIM= 8192
##$YMAX_p= 0
##$YMIN_p= 0
$$ End of Bruker specific parameters
$$ ---------------------------------
##NTUPLES= NMR FID
##VAR_NAME=  TIME,          FID/REAL,        FID/IMAG
##SYMBOL=    X,             R,               I
##VAR_TYPE=  INDEPENDENT,   DEPENDENT,       DEPENDENT
##VAR_FORM=  AFFN,          ASDF,            ASDF
##VAR_DIM=   8192,          8192,            8192
##UNITS=     SECONDS,       ARBITRARY UNITS, ARBITRARY UNITS
##FACTOR=    0.0002004,     1,               1
##FIRST=     0,             0,               0
##LAST=      1.6414764,     0,               0
##MIN=       0,             -12302,          0
##MAX=       1.6414764,     14681,           0
$$ Real data points
##PAGE= N=1
##DATA TABLE= (X++(R..R)), XYDATA
$$ [...]
1479a885J765J848l86k036j098J096J709J37j252q36N63P91j98p04J84R05J52
1496G55j210r87P69J772M68j638j744M19K029J126j172j842j81J445J023o17r83
1513e68NP67P1p92k39J001Q95o60j685l95J669J683n13k133j011J367J877M8j585
1532a98j036P03J127Qp94j99O81K91p99q23O61J482K85j616j495O20K061Q89j399
1551D49j874KJ659J112o69j314j68Q46M54n69m21N63P70n07j298k80J518J373
1569A646o45k011p82J459J874m0j768j189Q23J471K21r95o31N64N73m34p16M24
1587a56J139K15j377j200O76J891O83j500j780J36J856J136q97j561k29J105O95
1604H32m82o56K27O41k53r41j75J148J042o47j782n97J481J785k76j911j142R98
$$ plain form
1479 -1885 -120 1728 1342 -694 -1792 -696 1013 1150 -102 -938 -375 416 218 -486 -302 603 755
1496 755 -455 -1442 -673 1099 1567 -71 -1815 -1396 633 1759 587 -1255 -1436 9 1032 415 -568
1513 -568 -563 204 275 -517 -756 245 1140 480 -1205 -1600 69 1752 1239 -894 -1905 -538 1339 1387 -198
1532 -198 -1234 -531 596 604 -190 -389 292 583 -216 -1039 -378 1104 1389 -227 -1722 -1102 959 1848 449
1551 449 -1425 -1423 236 1348 679 -635 -803 43 497 -72 -493 70 840 333 -965 -1245 273 1646
1569 1646 1001 -1010 -1792 -333 1541 1501 -267 -1456 -633 838 1059 64 -567 -3 570 136 -580 -156
1587 -156 983 1198 -179 -1379 -703 1188 1871 371 -1409 -1273 583 1719 822 -739 -968 137 832
1604 832 350 -306 -79 562 309 -632 -807 341 1383 736 -1046 -1643 -162 1623 1347 -564 -1706 -708
1622g08J690K12j257q83M99Q56q0p09L7Q31K58j030r67O42J682N04j559j655M09
1641a228J960J037j135j705j63J331R80n15r58m9O90J34p00k48Q10Q61n85j508
1659i91l51J435J473m43j868r74J109J740K10j460j111N24J128K03p63l69N70
1676F2L68o51p40M70J280L45j305j423M60J877R12j204j831p6J558J184o38j317
1694f69j98Q97M57n21m52M80O95l57j162k71J282J249n11j833p91J326J711j6
1712A316j647j150P02J397K49r08o45L84N40k22o30J74R58K78j118j126N10J675
1730G37P05j323j690P4J700J131p45j499l16J007Q58l96p31R3O80m4q25l06J026
1749A36J035n20j597n79J332J623j43j733j083Q95J566L11j149q85M21Q51ro34
$$ plain form
1622 -708 982 1194 -63 -946 -447 409 329 -380 -343 488 746 -284 -1251 -609 1073 1577 18 -1637 -1228
1641 -1228 732 1769 634 -1071 -1234 97 1077 562 -396 -445 245 379 -321 -569 241 1102 517 -991
1659 -991 -1342 93 1566 1123 -745 -1719 -610 1130 1340 -120 -1231 -707 421 624 -139 -508 62
1676 62 430 -221 -961 -491 789 1134 -171 -1594 -1134 743 1655 451 -1380 -1456 102 1286 648 -669
1694 -669 -867 30 487 -34 -486 -6 689 332 -830 -1101 181 1430 919 -914 -1705 -379 1332 1316
1712 1316 -331 -1481 -779 618 867 -41 -686 -302 238 16 -614 -440 518 796 -322 -1448 -938 737
1730 737 1442 119 -1571 -1497 203 1334 589 -910 -1226 -219 639 243 -488 -395 285 241 -584 -890 136
1749 136 1171 651 -946 -1525 -193 1430 1287 -446 -1529 -634 932 1243 94 -791 -370 481 472 -162
1767a62m6O97K72q61q49N02J435M84j280j496K46J724J064r46j607k77J233J015
1785A148l64j029j33O40K82n60l19O31P82l66j308m54J203J440k33j728j001R85
1803c84J685K30j354j079M89J085K17p02m01M51M32n13p12L34J112L75j145j333
1821a213L44J630Q59j078j613k02J386J059m91j212l48P19N49l66n16K80N97k25
1839A59j014l19J016J166l57j573q49J057J595J62j473j159N40J322M03q51p38
1856i13L66O39j62o25J03Q74L41r51j040L82J517P32j069j569n4J581J112o04
1874F60j408l81R67Q04k91o85N8N56j6o40k79P89R23l62j362o13J087J484j2j531
1894b52j073O93J451L87r59r20K30Q13J92n48j92N11L57o24p99K85J259N92j068
$$ plain form
1767 -162 -208 489 761 -100 -949 -447 988 1472 192 -1304 -1058 666 1730 784 -823 -1100 133 1148
1785 1148 784 -245 -378 262 544 -16 -335 296 1078 712 -596 -1050 153 1593 1360 -368 -1369 -384
1803 -384 1301 1531 177 -902 -413 672 889 187 -214 237 669 156 -556 -222 890 1265 120 -1213
1821 -1213 -869 761 1620 542 -1071 -1273 113 1172 681 -531 -879 -160 389 23 -493 -213 384 159
1839 159 -855 -1174 -158 1008 651 -922 -1771 -714 881 1043 -430 -1589 -1049 273 676 -175 -913
1856 -913 -547 92 -70 -695 -592 282 623 -328 -1368 -986 531 1263 194 -1375 -1429 152 1264 660
1874 660 -748 -1129 -162 642 351 -334 -276 280 264 -376 -655 134 1057 695 -667 -1280 -193 1291 1279 -252
1894 -252 -1325 -632 819 1206 247 -673 -443 370 562 14 -178 333 690 66 -733 -448 811 1403 335
1913C35j451J15J583J028q07j547l12J133J004l35r50k30O11K99m71m18N09P13
1931H09l36j138m42J070J274k44j534r44Q29J534K34j202j057L49J053K85o52
1948a12m67L39M36l61o40K29R51L65r45j145K10J447R26q97j542k40J303J123
1966I80m02j178l55P48O01k82m94K15N81p3q42l07Q85J072k47j415p66R94J523
1985A238J60j367j096N43J231M06p65o91K64N58kn44L0O78K61p20r28K61J340
2004H57O68r67j433j18J391J084n64j326m16Q31Q14k22p18j10N53J31n94l36O43
2023A68Q50l03j298n47R57J386jj445j044O14J391L63r42r48K21Q18J75n53k35
2042c73M59L05n40p38K72J103M71r51j279O1J387R23o65j427l68J006R52k24r14
$$ plain form
1913 335 -1116 -1001 582 1610 803 -744 -1056 77 1081 746 -204 -434 177 476 5 -413 96 809
1931 809 473 -665 -1107 -37 1237 993 -541 -1485 -656 878 1112 -90 -1147 -798 255 540 -112
1948 -112 -579 -240 196 -165 -805 -576 375 740 -205 -1350 -1140 307 1233 336 -1206 -1446 -143 980
1966 980 578 -600 -955 -207 394 112 -382 -167 414 341 -501 -808 77 1149 902 -513 -1279 -285 1238
1985 1238 1398 31 -1065 -522 709 1115 350 -341 -77 481 479 -65 -35 643 904 184 -744 -483 857
2004 857 1525 558 -875 -993 398 1482 918 -408 -824 7 821 599 -119 -229 324 455 -139 -475 168
2023 168 1018 715 -583 -1130 -173 1213 1212 -233 -1277 -663 728 1091 149 -799 -578 240 415 -138 -373
2042 -373 86 391 -149 -887 -615 488 959 8 -1271 -1210 177 1100 435 -992 -1360 -354 598 374 -540
2061e40k89M92L79l18l79L66O23j94r44m62Q68J203p4j364r38P48J441L78j104
2080a08j051L03J083L58o22m58K92M89k29n95J47Q82M07q29j068J89J387Q26q01
2099F02j425k19J175J054l04j104m17O54O21k15m94R5M59j2p15l43P29R60j87
2118I14j277p34P49J429J98j209j060L42J173M65o94p86J88N72O0m81p4N51L10
2137F36n83q76J81J198O65q32j356j38J256J057m78j284m24Q31Q20k09o73j28
2155c37M54J30m30l14N15P17k05j052n86Q24J241M3j268r80N20J264M60q77q98
2174g79J44P42L10m70l03L26L74l50o52J08R65N30p51j185j6J223J018n57j337
2193f60l85Q91R99j55q31l86N39M28k50m13K62N70m7q79m33P64J063j5j225r12
$$ plain form
2061 -540 -829 -337 42 -276 -655 -289 334 140 -804 -1266 -398 805 731 -633 -1571 -823 618 996 -108
2080 -108 -1159 -856 227 585 -37 -495 -203 286 57 -538 -391 491 898 69 -999 -810 577 1403 602
2099 602 -823 -1042 133 1187 883 -221 -638 16 637 422 -72 23 482 470 -245 -588 141 1101 914
2118 914 -363 -1097 -348 1081 1279 70 -990 -648 525 990 296 -490 -302 270 330 -151 -225 326 636
2137 636 53 -823 -642 556 1221 389 -967 -1105 151 1208 730 -554 -978 -147 673 464 -209 -337
2155 -337 117 247 -183 -497 18 735 530 -522 -1108 -284 957 1000 -268 -1248 -728 536 996 119 -779
2174 -779 -635 107 417 -53 -356 -30 344 -6 -658 -550 415 945 194 -991 -1007 216 1234 677 -660
2193 -660 -1045 -154 845 690 -141 -527 12 440 190 -223 39 609 562 -317 -750 14 1077 1062 -163 -1075
2213a075O49J312L52r62j023J75R61L97m89n65J71M20j58m68L0O65L85p07r83
2232i13R2J102Q34o73j338l14J020J010k56j046m85N46O88j43n11k7M18Q3o00
2251e13l92O17Q74p3j145p55O92J317K65j131j002L09J148M41o06p40J13N76R9
2270I4l66j31M58L31m69p52J35J037O08o61j216j67J119R98l00j190m67O97Q30
2289E88j2o24k84L88K85l46l32L59O96n9r16n37O64J144J69j121r49L94J245M89
2309A241p58r15P2P96L24m31l57K86L78k86n87N6Q63M56o56j090q8J137Q74m40
2329H75j294m17Q15R11j20q46m09L93M27j61l96J16M35pp15m61N94R29K8j077
2349c80q95M89J202M04q64j032Q5R22M79m47o00J09M17mm30n5N47M20m96q87K2
$$ plain form
2213 -1075 -426 886 1238 276 -747 -572 389 786 297 -268 -97 323 165 -303 -273 392 777 70 -913
2232 -913 -821 281 1115 442 -896 -1210 -190 820 564 -482 -967 -421 267 124 -387 -414 4 87 -513
2251 -513 -905 -288 586 513 -632 -1387 -695 622 887 -244 -1246 -937 211 652 46 -694 -581 -5 94
2270 94 -272 -403 55 386 -83 -835 -700 337 945 284 -932 -1099 20 1018 718 -472 -939 -242 588
2289 588 576 -48 -332 56 341 -5 -337 22 718 659 -257 -794 -130 1014 1183 62 -887 -493 752 1241
2309 1241 483 -432 -360 436 760 329 -28 258 636 350 -237 -181 682 1138 482 -608 -696 441 1315 875
2329 875 -419 -836 -21 890 770 -76 -485 -92 335 174 -222 -106 329 322 -393 -854 -260 669 697 -380
2349 -380 -1275 -786 416 820 -44 -1076 -991 -69 410 -37 -637 -528 -111 -115 -545 -600 -53 367 -129 -1016 -994
2370i94J041P73n35j195l49R43J030j50j001m39N04O69n2m53j06M17J76m84l33
2389e38M94P61j3r73o52N49J180L29r32j008K04J038N35n16p29qN58K22l65j91
2409e5L93L28l73o60jR01O40n63j141k21R46J008k45j120n31N89Q60Qo86l17L58
2430A18K66k73l55K80N51l3q01n58N29J043J52r85r68L19J076M87o62q97rO37
2450h3M04l60l72J23L23j60n00l6O93M30m60r94j35R56Q59l11j152m91P30R55
2470D19l0p69m19L42M94n5l79L9N05N0o12m40N44R49O6r42q07M21J182M81p98
2491B41r41P2Q85M79l82n26N4M23N5l82m5M94L54m19p67l9Q93P26m15j086l99
2512g25P95R74m6r31n67M18O67M4m70j88L23J55l52l65L06O91M7q64o69L93J067
$$ plain form
2370 -994 47 820 285 -910 -1259 -316 714 564 -437 -876 -372 297 245 -208 -314 103 279 -205 -538
2389 -538 -44 717 704 -269 -921 -372 808 1137 205 -803 -599 439 974 458 -271 -279 279 501 136 -55
2409 -55 338 666 293 -367 -368 533 1173 610 -531 -752 194 1202 957 -163 -694 -105 755 763 77 -240 118
2430 118 384 111 -244 36 587 554 -247 -805 -276 767 919 -66 -1034 -715 361 848 186 -711 -720 -83
2450 -83 321 -39 -411 -288 35 -125 -625 -661 32 462 2 -992 -1127 -171 688 377 -775 -1266 -536 419
2470 419 389 -380 -799 -457 37 -18 -397 -358 147 197 -415 -855 -311 638 704 -238 -1045 -624 558 1039 241
2491 241 -700 -628 257 736 354 -172 -118 305 360 -22 -67 427 781 362 -405 -444 449 1175 760 -326 -725
2512 -725 70 1044 998 67 -500 -82 585 629 159 -29 294 449 97 -268 38 729 776 -88 -757 -364 703
2533G03L70q54r87Q5R91N37n04p54n6N16K63l25k46K46L13k73o19l4P60N94n01
2554B25j012k90Q98Q78j88j025n30N28Q18Nn79l21K62L10j72k91J46N06M6o60
2574d46n37M54R51K43q75q61K04J045N43n58q79n6P08M27k63l85P4L69p8m23n9
2595d02O21M77l81q88j58Q33Q35k14j020n15O49R10N5p32m57L00M97rl46m7L74
2616C82Q7m52m16L63P69J42q16p67K76J041M58o82q97o6P97N11k95o27j7L49J53
2637B93l17k06M03L58k77p62j12P62P51l37j064l97P19R06k1q69n50L58O66O8
2657C72m51k15K86J74l06l38K44O61M4p26o09L26R73L16p19r14O4Q79N50l89p25
2678e03j27M76L14k22k80J69L16j70n18r4O25N92l30r18l21P43Q91n1r34n90M75
$$ plain form
2533 703 1073 219 -768 -683 308 845 341 -413 -469 47 310 -15 -261 -15 298 25 -594 -628 132 726 225
2554 225 -787 -1077 -179 699 511 -514 -1044 -516 302 307 -272 -593 -331 -21 -193 -484 -338 168 214 -446
2574 -446 -983 -529 422 665 -210 -1071 -867 178 721 163 -716 -772 -64 363 100 -285 -211 158 80 -343 -402
2595 -402 219 696 315 -573 -731 102 937 723 -297 -812 -163 747 802 70 -387 -87 410 401 55 8 382
2616 382 469 17 -399 -36 733 875 59 -708 -432 609 1067 385 -512 -578 219 730 435 -192 -209 140 293
2637 293 -24 -230 173 531 254 -508 -620 142 893 556 -508 -905 -186 720 699 -170 -720 -362 304 372
2657 372 -79 -294 -8 166 -140 -478 -234 427 471 -255 -864 -538 435 751 32 -882 -818 61 611 222 -503
2678 -503 -630 -154 160 -62 -342 -173 143 -27 -545 -639 -14 578 248 -670 -991 -248 643 592 -342 -932 -457
2699d57Q45R7n58m08K88L50r1l17J12M61P6n42n19L52Q97K89p78q40J84R69N35
2720I45n15q20r5O09M68k54l97L1L39j9l84o7M59M49l22p97j73P23P63j79r45
2741a81n12N03Q91R6o51n13K09N15O1l45j23L29J12l57m15K65P31J80p57p37K00
2762d99R72M82n99r01o2P32N40k93n90p6L66J44k79j79K95L81k82o51j21O73O44
2783F97l06r08m60O36Q69L1p96n87L05O34J33m05k87J71K57k16l16J76N53J37
2803C18o15o35K56R11M08o57q94J5Q55O05l71p29j06N00L59k18k66J05L21m9m83
2824c70j01N35N78k60q41l11O96Q31l3q52n77M31P42J59m71m09J60L42j8k50J0
2845iL62R8m60m56K55P73K45o10q10O6Q49N59m09q33j57N48M81j87m44m9L19N5
$$ plain form
2699 -457 388 485 -73 -481 -193 157 66 -251 -139 322 398 -144 -663 -311 586 875 97 -743 -559 410 945
2720 945 430 -390 -485 124 592 338 -59 -28 311 292 -92 -159 300 749 427 -370 -543 180 943 764 -181
2741 -181 -693 -190 701 797 146 -367 -158 357 418 73 -50 279 391 34 -381 -116 615 795 38 -699 -499
2762 -499 473 955 356 -545 -607 125 665 372 -218 -294 72 216 -63 -242 53 434 152 -499 -620 53 697
2783 697 391 -517 -977 -341 528 559 -237 -824 -519 115 248 -157 -444 -273 -16 -232 -548 -372 181 318
2803 318 -297 -932 -676 235 643 -14 -908 -893 -38 567 196 -533 -639 -139 220 2 -264 -159 162 113 -370
2824 -370 -471 64 642 382 -459 -770 -74 757 724 -128 -705 -274 468 627 156 -253 -93 249 231 -19 -9
2845 -9 353 451 -9 -465 -210 563 808 198 -612 -546 303 862 453 -380 -537 11 492 305 -139 -188 131 186
2867A86l51j59M11M16k14p52k43O54P59j36q86n30M67Q46J55o67n30K51M82N1
2887B10l29j13K75J38l48l52K51O05K06o49o57J61Q67M79n08q57j06O76N44j91
2907C02n69j21L07K23j58j93J81L60j58n41j83N96O31j46q26m19N18Q52J05p24
2927C7n68K64O65K03m05k99J70K85j41k93J10M87J78n27n90K13Q05L65n73q18
2947d32j9P27N70k82p01j81L94L61j69k95M6K31l9m24j47M48M66k21p38l75N65
2968b15P39M1q25n91K96P43J86m88m81J48L78Kk73o7L41J37l70m74J67P34L17
2989D45n75p49M4Q01N33l66p63j59N37M92j27m05q7K89J12k16j56L28M01j71o05
3010c97k53N48P13o2p87m80M10Q17J58n46n18J30N30J54k97j61J67K39k46l26
$$ plain form
2867 186 -165 -324 87 503 289 -463 -706 -52 707 571 -315 -845 -378 468 623 -44 -574 -323 159 210
2887 210 -119 -232 43 181 -167 -519 -268 337 543 -106 -763 -602 265 744 236 -621 -727 -51 493 302
2907 302 -267 -388 -81 142 -16 -209 -28 332 174 -367 -550 46 677 531 -295 -714 -196 656 761 37
2927 37 -531 -267 398 601 196 -103 67 352 211 -82 28 515 693 166 -424 -211 594 959 386 -432
2947 -432 -451 276 846 564 -137 -318 76 437 268 -27 19 250 211 -213 -360 88 554 333 -405 -780 -215
2968 -215 524 565 -260 -851 -555 188 374 -114 -595 -447 -69 -67 -340 -407 -66 71 -299 -773 -606 128 445
2989 445 -130 -879 -835 -34 499 133 -630 -789 -252 240 113 -292 -379 -90 22 -194 -350 -22 379 208 -397
3010 -397 -650 -102 611 549 -238 -718 -308 509 667 121 -397 -267 263 417 120 -41 126 365 119 -207
3030b07J65N45K35n47o59J25Q12M91m48p94j67O33N87j91n77j61L49K45k15k11
3050A0J50L13j31m70k10N08N85j59p63m50M61P90P4o51n88J85O26J67l97l13Q6
3071a77K65j04k80O6L57J62m53n23J33O82M14m81p74j18O90N72k32o70k44L96
3091c19M16r4l30nK89Jl26j85M19M96j32p05l29N07P71M0p32n04L12O90K10m37
3113E3m13J17M16L8k61m0L15J57l24l97J38O45K70m87o70j6P32N31k97p39k03
3134d35M60M86p7m31j23K54J46k20j66K08L51j36n42k79M89O44l5p25n24L48P55
3155D48J78n64n15J19M60J83l02k01J75J60j65l04R9M48K19m70o05J05O92M34
3175E94l67p54j58N72N35j52n05j97K83K52j17k11J00K61n4m02k07M33N20q4o60
$$ plain form
3030 -207 -42 503 738 191 -468 -343 469 960 512 -282 -449 184 771 580 3 -158 191 436 221 10
3050 10 160 473 342 -128 -338 170 755 596 -167 -617 -156 634 708 57 -531 -346 280 447 50 -263 -177
3071 -177 88 -16 -296 -230 127 289 -164 -687 -554 128 542 61 -713 -831 -141 431 199 -471 -715 -319
3091 -319 97 3 -327 -332 -43 -42 -368 -553 -134 362 230 -475 -804 -297 474 514 -218 -722 -410 280 490 53
3113 53 -360 -243 173 211 -50 -90 225 382 58 -339 -201 444 714 227 -443 -459 273 804 507 -232 -435
3134 -435 25 511 434 3 -120 134 280 60 -106 102 453 317 -225 -504 -15 629 594 -131 -655 -307 448
3155 448 626 62 -453 -334 126 309 7 -194 -19 141 -24 -328 -229 219 438 -32 -637 -532 160 594
3175 594 227 -527 -685 -113 422 270 -235 -432 -149 103 -14 -225 -125 136 82 -320 -527 -94 426 342 -318
3196c18m04L90P36J56o02n36J37O50K02l38l42J41K76m6k48L6L43J99l44n07J30
3217b89O57L86m57o84q7O43N34j93o03k50L63L85p4k84j9J95M8k92j05K71M17
3238E62j38n78l00L96O58O1o33n70K30O33K58m31m16M2L18J21k39j43K28J52k12
3259am11J20N25K82m66o25m2O68N11k83o82k48M78M64p8m24j22K39J49j71j75
3280b92K04L03n5m85k52M18O06j9o51m55K84O87J90m34n26Q6M50K04k21k37J08
3301h7K29j40k62N0M07K43l81n55O3N90M66l10p01j91N08N40p1n29k09K71L10
3322B41q6k59J01K09k0l36j73L41M91q2n89l86L52O80J28n51m96J27N47K08k66
3343A81l36M9K69qk15l5K90J61l01m03M7N69L46l51o60j12N30N56j49o38k11L08
$$ plain form
3196 -318 -722 -332 404 560 -42 -578 -441 209 411 73 -269 -128 148 102 -146 -110 233 432 88 -419 -289
3217 -289 368 754 297 -387 -474 169 703 510 -93 -343 20 405 331 47 28 223 271 -21 -126 145 562
3238 562 424 -154 -454 -58 600 661 28 -542 -312 321 579 148 -268 -226 92 213 -26 -169 59 211 -1
3259 -1 -412 -292 233 515 49 -576 -618 50 561 278 -404 -652 -174 290 212 -212 -334 -95 54 -117 -292
3280 -292 -88 215 160 -325 -577 -159 447 428 -223 -678 -394 293 483 49 -477 -391 59 263 42 -195 -87
3301 -87 142 2 -260 -210 197 440 59 -496 -433 157 623 313 -388 -579 -71 469 398 -131 -340 -69 241
3322 241 155 -104 -3 206 186 -150 -323 18 509 427 -162 -548 -196 484 612 61 -435 -308 239 447 181
3343 181 -155 -106 163 155 -60 -95 195 356 55 -348 -301 268 614 263 -397 -509 21 577 428 -210 -421 -113
3365a13L93m1k82j12K13Q7k07j73K11L90n6n07l31L52O26R6n81n25K01O18K72
3386E31m04m39M6L46J05j62j61J79J66j95l42M8M83K51l50n75o7N75M73k23o12
3407c27k23L65M80o7l85j92K01J78j04j74J26K71m3m06k33L33N24L3n90m52K46
3428d39O27K56m51n06N6M55K21k39k18R6J66p7k04J3L79K09l16m92L1N56M37k78
3450B82o01k15N04M78p8m36k29K29L06m9j97RJ88J7k64j66K82M37n5m76l81K72
3472a43O07K01m89n05R1M79K85k51l46J0K44P5k10n2K28J52k02l91NM91L40k84
3494C35o34j35N28M71q7n91k38K91L89m5k81j16K04O0k01j46J71L62o8m50l26
3515e07L10N12J54n27m96J46N40K55l33m02k0L18J63j81j37R5J62j30k59j1M09
$$ plain form
3365 -113 280 239 -43 -155 58 145 -62 -235 -24 366 310 -197 -528 -176 450 546 -35 -560 -359 259 531
3386 531 127 -312 -266 80 185 23 -138 41 207 12 -330 -282 201 452 102 -473 -540 35 508 285 -327
3407 -327 -550 -185 295 228 -157 -349 -148 30 -74 -248 -122 149 106 -300 -533 -200 324 357 -233 -685 -439
3428 -439 188 444 -7 -513 -457 -2 219 -20 -238 -142 24 -53 -257 -244 135 344 28 -464 -433 123 560 282
3450 282 -319 -534 -30 448 370 -66 -295 -66 240 191 -6 3 191 208 -56 -222 60 497 442 -34 -415 -143
3472 -143 464 665 176 -329 -238 241 526 275 -71 -61 183 258 48 -4 224 376 174 -217 -212 279 619 335
3494 335 -299 -434 94 565 478 -113 -351 -60 329 284 3 -113 91 151 -50 -196 -25 337 269 -181 -507
3515 -507 -197 315 469 -58 -554 -408 132 387 54 -348 -368 -50 113 -68 -205 -110 52 -78 -337 -348 61
3536F1K90k96n47n9N05M71j68n64k72L95M60Nm08j47J54J99m8j51M5K77J2l35
3558a21k46K71M96Q4n46m07K17N88K26m01m14j2M13J95j57k76N7K07o2j85k5L00
3580B02K00k74m15l2M82L74k22n88k04L97M77l9m43k34J96K98l5j97n6J72M3k32
3602a30k04K19M07j5m65l65K51N44J81m37m94R1M47K72k28l69J3K69R4j90n9J74
3624FJ54j89l38RM31L31k67n23j47M41M80o7n18k49K34L98J9k79j18J76J14j29
3646c1j52J31K87J3l93k68K51N19J36m39m95J52N19K82k66m37j7L21J91j53j40
3667A1Q9J63q7k50OL27K71k66m72p6M45M23j31n15k54K70M39L3l71k02J49K09
3689B11n8j79M7J76lk54k41K04M05P6m43m16J54N18K31l16m85k3L86K53j79k71
$$ plain form
3536 61 351 55 -492 -551 -46 425 257 -307 -579 -184 276 281 -127 -274 -120 79 31 -120 -75 202 214 -121
3558 -121 -367 -96 400 484 -62 -469 -252 336 562 161 -253 -265 148 343 186 -90 -33 174 112 -73 -98 202
3580 202 402 128 -287 -319 163 537 315 -273 -477 -80 397 358 -85 -319 -123 175 140 -57 -113 59 102 -130
3602 -130 -334 -115 292 277 -188 -553 -302 242 423 -14 -508 -417 30 302 74 -295 -282 -13 81 -109 -168 6
3624 6 160 -29 -367 -358 73 404 137 -386 -533 -92 388 321 -197 -446 -212 186 205 -74 -192 -16 98 -31
3646 -31 -183 -52 235 248 -145 -413 -162 357 493 54 -441 -289 230 512 246 -191 -208 113 304 151 11
3667 11 100 263 176 -74 -68 259 530 264 -208 -284 161 584 453 -62 -316 -46 393 426 55 -147 2 211
3689 211 153 -26 21 197 194 -60 -301 -97 308 384 -59 -475 -321 197 428 112 -373 -396 -10 243 64 -207
3711b07OJ83J0j92k1K32J90k05l92n9M40L61j54n44j97L88M36qm12k58J91L26
3733A14j5j87n6J57Q6k18j85K34L44J6m04l13J96N07J89l91m42K7M39K76j97l43
3755a66k3K10J39j19j38J40J58j25k94j6L89K90j89n02j74M18M54p6m67k50K02
3776a39L98K8k70j21J08J54q9j60R6K55L1l42k50K09M25J13l70m49J26M44K67
3797D64k57l72o7K99J57j29j61K9J48n1k09k4K71K12j74m35q4L70L98r2m78k68
3819d53K67M21N0l28k29J44K24l5j70K9J64N8k37k01J75L87Q4m02l64J35M81K36
3841D36l04m02l5L74K37j62k29k7J78L7j22p4J81J63j60l26l3L50L29j30m55k37
3863d11L14M17J5l63k90J64K74L7j77j21J35Q8j62j28J06K94O0l59l22J47M49
$$ plain form
3711 -207 -201 -18 -8 -200 -221 11 201 -4 -396 -455 -15 346 192 -352 -549 -161 275 267 -145 -403 -212 114
3733 114 99 -88 -144 13 99 -119 -304 -70 274 290 -114 -427 -231 276 465 74 -368 -341 98 374 177 -166
3755 -166 -189 21 160 41 -97 43 201 76 -218 -234 155 445 256 -246 -420 -2 452 376 -91 -341 -139
3776 -139 259 287 17 -104 4 158 69 -91 5 260 291 -51 -301 -92 333 446 76 -373 -247 197 464
3797 464 207 -165 -232 67 224 95 -66 -37 111 60 -149 -173 98 310 136 -299 -383 -13 385 293 -185 -453
3819 -453 -186 235 285 -43 -272 -128 96 61 -109 -80 84 142 -95 -296 -121 266 350 -52 -416 -281 200 436
3841 436 132 -270 -305 69 306 144 -85 -112 66 103 -19 -93 88 251 91 -235 -268 82 411 281 -174 -411
3863 -411 -97 320 335 -28 -318 -154 120 157 -20 -141 -6 82 -80 -208 -102 192 252 -107 -429 -282 167
3884A67K11l28m62RM26K82j69l57k8K04J17q0j18J10J44r6k61oK92K68j41m32
3906b48j76L48M09j7m09k63J86L54P6k42j50R8J23l5j51O7J90N4k45k85J76L96
3928B56J45l41m11L2M55K55j65m14p3K57J94q0j77L3J17qj84l5K51J98j35l96
3950b26j06L63L98r9m21k69K36M08P6l22k58J53J89jj10k2J42L3k16j73J44L49
3972B68N2l21l32P8M30K23k53l84o1L10K59j05k72n9J39R6j20p9J48J60j28k92
3994b43n8L13L27j00m49k21K75M27M8l57k98J55K81Q9k09p0P7R3q0j45Q4K48N8
4017B45k63l11J07M48J81k99l75%L14L13j77l12n4J84J31m3j38O8J28o7k57k4
4039b01K67K28j02l87j78L07M01k6l88k78J60L62O5k12j92R6J29j8j37K8K12L7
$$ plain form
3884 167 378 50 -412 -403 23 305 136 -221 -249 -45 72 -8 -126 -16 128 32 -229 -235 57 325 184 -248
3906 -248 -424 -76 333 316 -93 -356 -170 184 260 18 -132 -34 89 54 -97 -30 160 214 -31 -316 -140 256
3928 256 401 60 -351 -319 136 391 226 -188 -261 -4 190 110 -67 -34 83 75 -109 -144 107 305 170 -226
3950 -226 -332 31 429 330 -91 -360 -124 284 360 38 -220 -67 122 121 11 -11 131 164 -52 -225 -81 268
3972 268 320 -1 -333 -255 175 398 145 -239 -300 10 269 164 -108 -167 -28 68 -52 -131 17 177 49 -243
3994 -243 -301 12 339 239 -210 -431 -156 271 319 -38 -336 -181 100 189 -20 -90 -13 80 0 -145 -61 187 245
4017 245 -18 -329 -222 226 407 108 -267 -267 47 360 183 -129 -183 1 132 89 -49 19 147 80 -177 -201
4039 -201 66 294 192 -195 -373 -66 335 309 -79 -357 -197 165 230 18 -174 -78 51 33 -104 -76 136 173
4061A73k30k23J31L70J49l40l45L0M06K61k02l68n3K35K15o5k05pJ33K5j65k2
4083i7J85J70j04l05j09K70L63p2l69k47J68L93Q5k87k27O3K12N2j48o6J44M0
4105A14j52j80J11L13Q1k89l51J13L80K19k23m09m0L05K35j07k32k9J23Q5j33
4126f6n3J19J48r7k75n7K73K77r3l67k25K44L90M4l15k60Q7L01N1j54j13O2Q2
4149Cp9j13O5K24P4k29k81R1L58K04k75l65k5L59K57j36k86j05K19J49o2j37N5
4172c5J29n2j71o9K37K72j15l64j36K54M05k2l29k85J52L41P1k16j78N8J81j9
4194A09j24K2J49M9j76k24J38L17J02k81l16jL77K42j62l42r0K41J86q0j86j0
4216f0J30J1j12m0J00J91q7l22q0K58K92k7l85k44K15L38Q3k74k19Q3K11M8j41
$$ plain form
4061 173 -57 -280 -149 221 370 30 -315 -285 121 382 180 -188 -241 -6 209 144 -61 -68 65 90 -75 -97
4083 -97 88 258 154 -151 -260 10 373 301 -68 -315 -147 246 331 44 -183 -120 92 144 -4 -70 74 114
4105 114 -38 -218 -107 206 287 -2 -353 -240 140 359 136 -273 -313 -8 227 120 -112 -141 -18 67 -66
4126 -66 -119 0 148 51 -224 -281 -8 269 176 -191 -416 -172 218 262 -53 -313 -226 75 126 -28 -141 -79 3
4149 3 -76 -189 -124 100 174 -55 -336 -245 113 317 42 -323 -348 11 268 132 -154 -259 -40 109 47 -90 -35
4172 -35 94 42 -129 -198 39 311 196 -168 -304 -50 355 333 4 -281 -129 212 283 67 -111 -53 128 109
4194 109 -15 7 156 205 29 -195 -57 260 362 81 -235 -236 141 383 221 -121 -211 30 216 136 -50 -60
4216 -60 70 81 -31 -71 29 220 133 -189 -269 -11 281 254 -131 -375 -160 178 261 -13 -232 -149 62 110 -31
4239c1n9P8O1j00j75J15K40R3k64k80P3L25K40k36l42o3K68K77r9k24o5J05J08
4262D5o0q9Q4J25n5k06q1K49K51o9l28j96K19L50O7k94k65J37K34J10j82j13Q5
4285A8Q8l8j37N8K04O4k38k24Q3L42J45k25l33l3L15K65j39k79q4J90J51q9j25
4308b1K2R5k0j44l7J44J94p0k92j63K23L19J3k89k78J26L05Q1j68k41O2J40L4
4331C5j17l3J20P2j34j95P0K95J08k35k88rL42K24j36l22p2K11J83n3j50l4J22
4354DK0j16j6J15J63j08k74m9K39K68j8l44k19J98K85Q9k31k06M4K01N8j02q0
4377g9J16J5q1j16N9K23R8j86k87L6L47J78j85l04n7K39K59q6k27r1J40J33p6
4400F8q4O7Q9m8j65q5K15K46l6l34k01K09L15N4k94k19R4K38Q3j20j68M5R7j2
$$ plain form
4239 -31 -90 -12 49 -51 -226 -111 129 222 -42 -322 -249 76 316 80 -262 -325 -57 220 121 -103 -168 -63 45
4262 45 -15 -104 -20 105 50 -156 -237 12 263 194 -134 -330 -111 239 306 12 -253 -116 118 228 46 -67 18
4285 18 106 68 -69 -11 193 257 19 -205 -122 220 365 140 -193 -226 89 354 215 -64 -148 42 193 104 -21
4308 -21 1 96 76 -68 -105 39 233 163 -129 -292 -69 250 263 -26 -304 -178 127 208 40 -201 -139 1 35
4331 35 -82 -115 5 77 -57 -252 -182 113 221 -14 -302 -311 31 255 119 -203 -275 -64 119 66 -84 -118 4
4354 4 24 -92 -108 7 170 62 -212 -261 -22 246 228 -116 -335 -137 148 237 6 -200 -156 45 103 1 -79
4377 -79 37 52 -29 -145 -86 137 235 49 -238 -202 145 323 138 -166 -223 16 275 189 -38 -129 11 144 68
4400 68 -16 51 140 92 -73 -158 57 303 267 -67 -268 -59 256 310 16 -203 -109 129 212 92 -76 -31 66 54
4424E4j08LJ60O7k04k07P4K81J42j87l02o2L01K69j30k86q3J54J59l2j43oJ05
4447A9J1j30p0J88J55m9k93j06K08L16nl39j83J03L04R4j73j80K7J40K8q6m1R6
4471C4O3j20j75P5K53J08j95k49m9K80K29j16k94r1J87K23m6j84o4R6P5o1q7Q5
4495b3J35l6k29j00K09K62k9k93k05J67K85Q8j86k58N2K16O0j39m5M6J05p1j04
4518i3M1J82Q4j94k46Q8K32K00j26l41m3K20K26n9k06r6J32R0l5q3L4J15m0j69
4542h7m9J51J92o5k38j31J40K82P6k55k38P6K32P7j13j58K6J21lq8OJ24P3j48
4566Cj72J9K54J72j87k79p5K94K05o8k60r0J44J63l1j01l4Q8%r1o4J37J67m3k46
4591i5j59J72K82K6k58k16P3K74R5j37j84rJ46M7n9p2P6M8o5j48L7J99J28j85
$$ plain form
4424 54 -54 -51 109 176 -28 -235 -161 120 262 75 -227 -289 12 281 151 -135 -218 -64 95 63 -80 -86 19
4447 19 30 -100 -170 18 173 124 -169 -275 -67 249 244 -95 -278 -175 129 223 50 -130 -103 37 65 -21 -62 34
4471 34 97 -23 -198 -123 130 238 43 -206 -255 25 254 138 -156 -247 -60 163 117 -67 -131 -35 40 -21 -108 -23
4495 -23 112 76 -153 -253 -44 218 189 -104 -309 -142 143 231 45 -213 -161 55 115 -24 -69 -23 82 11 -93
4518 -93 -52 130 214 20 -226 -138 94 294 168 -173 -216 4 230 171 -35 -131 1 91 56 -27 7 122 82 -87
4542 -87 -136 15 207 142 -96 -227 -87 195 271 16 -222 -146 86 163 50 -108 -82 39 36 -52 -46 78 151 3
4566 3 -169 -150 104 276 89 -190 -265 29 234 166 -94 -184 -40 123 92 -9 -43 45 45 -46 -110 27 194 151 -95
4591 -95 -254 -82 200 226 -32 -248 -175 99 194 57 -127 -136 10 57 -2 -74 2 50 -15 -163 -126 73 201 16
4615A6k70K0K67J98r9k82j02J91J93k3j54p5J06L9m2n0R5R8k8j82q9J46K37J9
4639B29k75j81J18K48J09j90k13M1J71P9q0j02N1N8j1j20J0J47R3j70k02J0K71
4662I1J41j29k59p4J84K55o3k25q7J16Q1Rr2lR8Oj31q7J71J77j5k67j42J24L03
4687A82K7j94j94M0K34J08j63j28J0R8J7n1j4J17J5q3j60J7K37J55j86k32l5J86
4711CK20l9k50j00R8J77k0j11l2O6M3r0p3R6J98o3k13j30J41K46M3k30k01P7K37
4736I3Q0j19j94K2J29O4q2m2M9P8r4j15K4J65J17j19k43PK22J92q7k50p8J46J68
4761A33j8j13q5L6J14n2o7N3R5J5j99j02J79J86Qk18k05J03K64Q8j69j99j1J86
4785B2J08r5r6L8P5k7j00K4J15J03j18j93j0K16J88j01k74n6J78J87rj86j00R9
$$ plain form
4615 16 -254 -234 33 231 132 -150 -252 -61 132 109 -45 -120 -14 25 -17 -67 28 126 98 -84 -173 -27 210 229
4639 229 -46 -227 -109 139 248 58 -155 -114 57 136 56 -46 5 63 52 -68 -58 89 182 12 -190 -180 91
4662 91 232 103 -156 -230 -46 209 146 -79 -166 -50 31 40 -52 -55 43 49 -82 -169 2 179 164 -103 -245 -121 182
4687 182 209 15 -179 -139 95 203 40 -88 -78 20 37 -14 -28 89 104 21 -139 -122 115 270 84 -148 -183 3
4711 3 223 184 -66 -166 -68 109 89 -22 -54 12 55 -35 -108 -12 186 123 -90 -220 -79 167 210 -20 -221 -144 93
4736 93 173 54 -140 -118 11 75 -7 -49 0 78 -16 -131 -107 58 175 56 -187 -180 42 234 147 -103 -181 -35 133
4761 133 115 2 -83 -47 67 15 -52 1 96 111 -88 -190 -11 175 183 -35 -240 -137 127 215 46 -153 -164 22
4785 22 130 35 -61 -23 52 25 -75 -51 64 167 49 -144 -154 62 250 149 -125 -181 -3 184 175 -11 -111 -12
4809a2Q7Nq3J0O1K3r6r1J16J60lk26j27J36K21O0k01k12J2J92J41r7j48%P8L7
4835D3p6o1J18O7r2j66J6J91J40j18k68j6K01J98n9k23q9J18J26Jj07m0O0M4n6
4860d8o8Q8J14nj89j01J24K02M2j73k02P8J94J30j51j85J1J48O6o3l3J0R2o2q9
4885g0j2J50R5q0k40j4K09J59o6j86j32J68J44J7j25j13Q3R0k5p4K4J17m4j26
4909e1p4R2K13K7k27j44O8K32R8j84j38j7J21J27r9q2J1P1%p5l0J11Q9j18j27
4934a06m4J83J36p3k11q7J60J78Jj83j01P9J19lr0j9N7L2j02n7Q3J56j6j67j53
4959b28J20K02Q3j62k28M3K15Q3r3j25j9R6L4o9j8N5N5l7j33j7J96J30j34j89
4983a40m6J76J72j0j82j10O5J67K0j11m8N5N6p1l9P0J01j2j47j11J15J86N2j71
$$ plain form
4809 -12 75 80 -3 7 68 91 -5 -96 20 180 177 -49 -176 -40 181 241 40 -172 -160 32 173 76 -72 -72 6 43
4835 43 -33 -94 24 91 -1 -167 -151 40 180 62 -206 -222 -21 177 118 -105 -194 -76 50 51 -56 -96 -36 8 -48
4860 -48 -116 -28 86 81 -108 -209 -85 117 159 -14 -216 -138 56 186 35 -150 -139 9 75 12 -21 -11 81 19 -70
4885 -70 -82 68 163 83 -157 -171 38 197 131 -55 -187 -19 125 142 17 -96 -13 77 52 -22 2 119 75 -51
4909 -51 -125 -33 180 207 -20 -164 -96 136 234 50 -88 -105 16 143 44 -38 -27 44 44 -31 -61 50 139 21 -106
4934 -106 -150 33 169 96 -115 -202 -42 136 137 -46 -147 -68 51 48 -42 -61 -4 28 -74 -131 -48 108 92 -75 -228
4959 -228 -108 94 177 15 -213 -170 45 128 35 -90 -109 -13 21 -48 -66 -11 44 7 -126 -143 53 183 49 -140
4983 -140 -186 -10 162 152 -30 -140 -75 92 112 1 -47 8 64 -7 -46 24 125 113 -34 -145 -30 156 208 37
5007C7j93K3K12J09r6j69j7J33N8p1m2O4J5j6j09J8J23R1p7k24j5J80J73o4k18
5032g5r0R6J72J3j43o8M0J09k5o3J0J01m5o6r2P6J63L7j90j55N8K11J07j33j82
5057a34k8J65J01o6j05j0R2j2n9PP4O9p4j66lJ52J73q7k00o8J24J71K5j66j16
5082a41R7R2J7o0l7O3K1p2m2N1J24L6j73j61R9K07O4j47j78LJ76J08n5j71J5L6
5108b8R3q1JL2N7m3j19k6J34J34n6k17m6J22J93oj77j18J12J40%r2n8K7O9m0m4
5135c7OJ28J2j52r8P5J73L3j51j49L0J72J02p2j54k4R4J02o2o8K1N7l5q9QJ09
5161C1J07r3j54l7J38J69m5j82j31J20J68oj00o5J3J30k7p4L3N7K3j12p3N8J67
5186A15L0j50j69O9K14P1r0k04MJ20J13k7j20j3N8K8p3nO4O4m0j37m2J37J40m7
$$ plain form
5007 37 -156 -133 79 188 92 -77 -94 39 97 26 -16 48 63 47 -62 -44 79 170 93 -131 -146 34 207 143 -75
5032 -75 -165 -69 103 116 -27 -95 -55 54 29 -34 -24 77 32 -34 -126 -50 113 150 -40 -195 -137 74 181 48 -134
5057 -134 -162 3 104 38 -67 -77 15 3 -56 -49 25 94 20 -146 -149 3 176 89 -111 -179 -55 116 141 -25 -141
5082 -141 -44 48 65 5 -32 31 52 -20 -62 -11 113 149 -24 -185 -86 121 185 38 -140 -137 39 147 92 -79 -64 -28
5108 -28 65 -16 -15 17 74 31 -88 -114 20 154 98 -119 -165 -43 150 144 -33 -151 -39 101 101 9 -49 -22 47 7 -37
5135 -37 -31 97 109 -43 -141 -66 107 140 -11 -160 -130 42 144 72 -82 -106 -12 90 28 -40 -19 38 3 -86 -78 31
5161 31 138 45 -109 -146 -8 161 116 -66 -197 -77 91 85 -15 -80 -67 63 36 -38 -5 52 75 -37 -110 -52 115
5186 115 145 -5 -174 -105 109 180 90 -114 -110 10 123 96 -24 -37 21 49 -24 -29 35 99 59 -78 -120 17 157 110
5212A10j73j06J18J54J6j56r4K3J25N5r1l0N3Kk9o1L7J03L8j45j13M6K00Q0j71
5237ij38KJ46J21n4j49k7J25K8nq3N1N2k6r0n4J23J26l9j81n6J02J77pj36j17
5263a18M6J68J1q9p2L3N0j5m3K4M8K9r2r5N3J65O2j52j23l5K09J02j02j57%R4
5289AQ1l4r8K7K8K9j00J1J00O1k5j70n3J46J54o5j32j16Q9J58L1r6j13M2R4jk7
5316B2k8O8jp9n8M2J15L1j05j23J8J65Q6q9j65j9J16R3l6j02rM5L2n1k6O2P4m9
5344B9j35k0J10J32n4j53p1J16J43J0j50o7L6J20K5p4n9M8M5l6m5L7Q6M6j46r6
5370a23M4J74O4r1j75k2J27J30m8j01n8R7N8k8p4K3M7k2p8j9J08J05o7j46n8J13
5396b0J36Oj29j56J12J25Jo8p4L2O3j3l7LP3Rp5r6K7J70P0j48j35J4J64J01q6
$$ plain form
5212 110 -63 -169 -51 103 119 -37 -131 -108 17 72 -19 -49 4 6 -23 -84 -47 56 94 -51 -164 -118 82 162 -9
5237 -9 -147 -145 1 122 68 -81 -108 17 45 40 -43 8 60 34 -56 -110 13 139 100 -81 -137 -35 142 135 -1 -118
5263 -118 -72 96 107 18 -54 -21 29 14 -29 -5 43 72 -20 -115 -62 103 165 13 -110 -145 64 166 64 -93 -93 1
5289 1 82 48 -50 -23 5 34 -66 -55 45 106 81 -89 -142 4 158 93 -39 -155 -66 92 123 27 -86 -44 50 49 22
5316 22 -6 62 61 -18 -76 -34 81 112 7 -116 -98 67 153 64 -101 -120 -4 89 53 -49 -58 -13 19 -32 -58 4 78 29
5344 29 -106 -126 -16 116 62 -91 -162 -46 97 107 -43 -110 -74 46 71 -3 -62 -14 31 -5 -50 -13 73 119 -27 -123
5370 -123 -79 95 159 68 -107 -129 -2 128 80 -21 -79 18 76 48 -26 -3 44 22 -56 -75 33 138 71 -75 -133 -20
5396 -20 116 122 -7 -163 -51 74 75 7 -67 -35 28 15 -22 -19 54 63 -12 -108 -81 89 159 11 -124 -110 54 155 69
5423F9j30k0Q1Q2m3n8kN8Mm2m2O2J01q2j08l7R1J65m7j17j21O5J65K2j14r0N5
5450c3M8L5n0l8N0M1n8o8lJ28K2r1j33K2J58Q2p8j45j3R7R9n4p9oN2J3j1m1N4
5479@L9rr5k4R3J08k1j74n6J07J44J4j27p8K0J18L4p9m7L0M0l0o2J9J17Or8j10
5507a21L7J45Q5j12j33l6J50J03n2r7k4L4P5k5o2qP3k6m5k6P0R8m8j07n0O4J49
5534A11Rj38q3J4J50L6n5q9L4L4K7m0k0L3N2q7m4K5J27L2r7j32K6J41Q0n5j62
5561g1k0R7N6jp6k6N7Kj8m1N6L6j4j16l4P8J36Pj81q1P8J44K0j07p5K5O9K9l9
5590a0mK6J2n9m7M1J09K1r3p8k6J74N1n3j64k8J21R3j4r2MPO6m2j5L6K9k5j02
5619f2j6R7R7k1j46m6O0J27M8j53q9M4J23Rn2n4PL7Rn5J4J08Qq6r9K4J30L2n0
$$ plain form
5423 69 -61 -81 0 82 39 -19 -21 37 41 -1 -43 19 120 38 -70 -107 -16 149 102 -15 -136 -71 94 116 2 -88 -33
5450 -33 15 50 0 -38 12 53 -5 -73 -76 52 74 -17 -150 -128 30 112 34 -111 -124 -27 72 18 -61 -67 -15 -2 -13 -54 0
5479 0 39 30 -65 -89 4 112 91 -83 -139 -32 112 126 -1 -79 -59 59 93 14 -33 -3 37 7 -55 -36 81 87 -11 -121
5507 -121 -84 61 146 34 -99 -135 15 118 66 -31 -55 -21 54 29 -33 -41 32 6 -39 -65 5 103 55 -52 -102 -38 111
5534 111 120 -18 -101 -87 63 99 44 -45 -11 23 50 10 -10 23 75 -12 -56 -31 96 128 31 -101 -75 66 146 91 -71
5561 -71 -91 6 62 61 -15 -41 16 18 0 -41 15 51 37 -79 -113 -35 101 108 -73 -154 -76 68 88 -19 -94 -69 0 29 -10
5590 -10 -14 12 24 -35 -82 -41 68 89 -4 -82 -108 66 117 64 -100 -128 -7 86 72 -20 -16 -9 57 15 0 36 65 40 -62
5619 -62 -78 19 116 95 -51 -97 -37 90 138 -15 -104 -60 63 72 20 -34 -27 10 19 -36 -22 86 94 8 -91 -67 63 95 45
5648D5j31m0J46Q5l3j27k3P0O6n0ok5P0j3q6j9Q5P3k9j22j9Q3R0J6j36j00N8J31
5676E9J7m4r9K5M8J9m9QK9Jn0q0L7J19M0q0j00j3J13J06o1j12m2Q8P4Kq9KK2J6
5706Fm7k3N2P5k9p6n8Q3J30k6j16n9L1J11N4p2p6j6J16J4l7l5L1oj4n9N3P9L7
5735A23q4p0k8J05O7l3j28l4J03R8l4r6l7M7M0k4l3L4M4k9o8k7M9J06j5j07o9
5762a00K9J67Oj01r5K0Q3M5l9n9J9K6jl2nQ4Ol5j24K9J28N7p1j34oJ22N8lj24
5791e0j6M6M6rl3NK1Km2m7Q0O3m7p0o9R3J14Pr5j04J8J12N9o2q2M3K5J1j4pJ3
5822A1K2j5q0J3J04K3m4j29K5O8J11m3j16j0N8Q7m6l7j5K6J6qm6K1P9n2p1pL8
5851a7J28j2r5r9O1R1N6q5j01K3Q3N2n9k8lNJ5n0QO6J1n1q4jJ20P9r2p6k2M4J17
$$ plain form
5648 45 -86 -126 20 105 72 -55 -78 -8 58 8 2 -23 47 34 -52 -71 14 87 58 -64 -83 0 90 106 -30 -130 -72 59
5676 59 76 32 -67 -42 6 25 -24 -16 13 14 -36 -116 -79 40 80 0 -100 -113 0 106 45 -67 -109 -21 53 55 -34 -32 -10 6
5706 6 -41 -64 -12 63 34 -42 -100 -17 113 87 -29 -88 -57 54 108 36 -40 -56 60 74 37 2 33 27 13 -46 7 86 123
5735 123 39 -31 -59 46 113 80 -48 -82 21 119 85 -11 -48 -1 39 15 -18 16 60 31 -37 -64 -15 91 76 -31 -100
5762 -100 -71 96 102 1 -94 -74 9 54 15 -44 -25 1 0 -32 -37 47 53 18 -106 -77 51 108 37 -97 -103 19 77 74 -50
5791 -50 -66 -20 26 17 -16 -11 10 12 -30 -77 3 66 19 -51 -120 -27 87 94 -1 -105 -87 25 84 22 -60 -17 8 19 5 -2 11
5822 11 33 18 -62 -49 55 78 34 -95 -70 -2 109 66 -50 -60 -2 85 39 2 -13 13 29 21 -25 -4 75 23 -48 -55 -17
5851 -17 111 99 4 -95 -34 57 113 28 -73 -50 33 85 26 -2 -5 0 15 -35 -27 39 50 -1 -85 -86 34 113 21 -55 -77 -33 84
5882H4m6l9p4L6O1jn1qO4k1l1n8O5J03rj01n7J2J31M5j09r7K6J11M0o4n6J0N6
5911B2J8n0%K9M4o5m0J3Q8M4o8j03k2Q4J17o0p7k8O1M7Mn7j9M3ql0l4P4M8j0j02
5942c7o0P0J02jq7p9j6J51L5p1p8J2O5km8LN0J7l5n0j2Q1M7o2r1oJ09P1l4r4j6
5973f6K5Q8lo5l8M1M3m3k0L0P0k0r0j2O4P5Rj07r5N0J33%o3o0j6P6M1l9j1MLp
6005cl8MQ2J9o9o1jJ04M9j2j21j3O2O8K8r6m4M5L0j6k7L4L2j5n1k3L6O1J1r7m5
6036f7M5J10J6o5j01K9P2L7k3o4J5J6j2j7J4K8J6l2q8M4O3M1k6r7k9M0J29n3q8
6065d7l8L2P7Km5j9K5J0l5j4M2K5J1q6n8O0J09j4m3p3j1J04M5n2p3%N5L6l9%J
6096a3N8m2n1MP8O7o9q1j8Q9O6j7j25k4O2P4J1m2n3K9RJ3k7J0O9l6p3k8N8O0K1
$$ plain form
5882 84 38 -1 -75 -39 22 21 -30 -38 26 5 -26 -84 -19 84 75 -26 -83 -71 60 105 -4 -101 -75 36 76 12 -44 -34 22
5911 22 40 -10 -10 19 63 -2 -42 -29 59 103 35 -68 -90 -6 111 51 -26 -54 7 54 58 1 -18 25 17 -13 -47 27 75 65 -37
5942 -37 -97 -27 75 74 -13 -92 -108 43 78 7 -71 -59 6 4 -44 -41 9 26 -9 -59 -71 10 57 -5 -96 -102 7 78 44 -50 -66
5973 -66 -41 47 44 -21 -59 -18 25 -18 -38 -8 62 42 -48 -60 4 79 88 -19 -114 -64 69 69 6 -54 -70 6 47 8 -3 1 4 -3
6005 -3 -41 -37 45 64 -5 -66 -67 37 86 74 -47 -60 2 70 98 2 -42 3 33 17 -10 24 56 41 -10 -33 3 64 75 -22 -67
6036 -67 -22 88 104 39 -62 -33 39 76 53 -11 4 20 8 -9 5 33 49 17 -71 -27 36 77 51 -46 -75 -35 94 41 -47
6065 -47 -85 -53 24 26 -19 -38 -13 -3 -38 -52 -10 15 26 -60 -118 -58 51 37 -6 -79 -90 14 59 7 -66 -66 -11 25 -14 -14 -13
6096 -13 45 3 -48 -44 34 101 32 -49 -67 22 88 71 -54 -78 -16 58 69 27 -26 3 12 25 -2 8 77 41 -32 -60 -2 58 79
6127G9o8j05M9J16L1j06m1j5Q3L4n1k0K0j%k8J3M9J9o1n1nR7P1n0j02j9O1O0o
6157E3p0k9O1K8l9J3l8M9lm1oM0O1k5p7o0L9R3K8n8q0qJ04J4m3n4qN8qj5jNL4
6190A7k0n0pQ0M1l2j18QP0O9j7q3n5P8O1l1k6mJ4%jk1L8M6k6o3k7K8J06or2l6
6222e9K1O9O5o6n2lL5J6rj6j1K6j5k9K0M7knp0m3R7O1k0r2l6N4O8nn4m8M9J8j7
6255fk4L1K9oo8j9O0M3K8r5m3J7R3N9j01m0NL7O1m0j5k2M6jk2m4O2L1k0q1NM7
6287GN4Jr2n3P2P4k4l2m7K1N1Mp1L0mJ9l6j9L4N7k1o0m4M4P5L6q7o1rR5K0Jp9
6320d4J0K4J3j5J8J2LPo2j2Q7N7o5o1l6O7O7j0q6j7nP6J7k6m2ML7ll6M0M3j6m6
6353@n4L0N2M2l1j04K8O0M5m9n9j1O3Jnm4M2Lqk0pN5L3l3r0l4Q2R7l9o7m3O4N1
$$ plain form
6127 79 11 -94 -45 71 102 -4 -45 -60 23 57 6 -14 6 5 5 -23 -10 39 58 -3 -54 -59 38 109 59 -43 -62 -1 59 53
6157 53 -17 -46 15 43 4 17 -21 28 25 -16 -22 18 79 54 -23 -83 -44 49 77 19 -61 -69 35 49 6 -48 -56 2 -6 -21 -22 -17 17
6190 17 -3 -53 -60 20 61 29 -89 -81 -11 58 41 -42 -97 -19 42 11 -15 -19 -5 -5 -6 -27 11 57 31 -32 -59 -31 75 69 -23 -59
6222 -59 -38 31 96 30 -22 -25 10 26 17 1 -10 16 1 -28 -8 39 37 32 -38 -81 16 77 57 -35 -71 -17 51 46 -8 -56 -7 11 -6
6255 -6 -30 1 30 24 -44 -63 -3 40 68 -27 -70 -53 40 99 -2 -42 -37 0 61 21 6 -16 30 29 7 -37 25 56 36 -45 -40 7
6287 7 61 62 -30 -83 -11 63 39 7 -40 -19 32 36 -35 -5 -9 10 -26 -45 -11 46 25 -35 -79 -35 40 76 -11 -72 -81 14 34 35 -44
6320 -44 -34 -10 3 -12 6 18 21 28 -34 -46 41 98 33 -28 -64 3 70 60 -26 -43 -48 28 45 19 -23 -19 18 15 -21 19 62 46 0
6353 0 -54 -24 28 70 39 -65 -37 23 68 19 -40 -51 12 13 8 -36 6 9 1 -19 -26 29 62 29 -61 -95 -13 84 45 -22 -65 -1 50
6386E0Pn4k6J6K4J9l1rL8pl3k7L0M7K6p7o6L2O4O2r3l3l1P9L1j0o6NK7K1l1qL7
6419A3K6n0n4rN7P4l4r1m4P4R3k0p6n3N0N5k2j7kM9j4Jm9M3M8k3o1j7K7O7K2k1
6451D2o6l7Q1O4m4n7JL9RJ%jj5Kk3k3N1N5j9o6o7Q3N8j9n0n7L3N2K0l9j0NJ5k2
6485dqk6N7J6o9m0L6R3ol0p3j8J04K2m5m4jL4K4qk2K0k2j0j1j4O6L7l4p0J7N0
6517B1K5Lo8m1K4R2k8m2l1J5L1L5o0lL4J5n7lK3M3J3q5k3MQ3L7m1q2j5J04K7m0
6549A0k4j6M0Jk1k1L4M6m6k9k0M1O9j5p4l7M3O0L5p6n0K6O7j3Jn5K1J4k7j8K3
6580a1O0ln7m6L6N0J7l6p0MO6L1j2o3k7O9j1K9m3M6nj3k5l1P1L3j6r3k4O2Q1l0
6612C9o7j6pN8K9m2k9K2MMj7NL3j3m4j4L0P0qj2j00L4O2N0n6n0NM0L1j9k8J7L0
$$ plain form
6386 50 57 3 -23 -7 17 36 5 -4 34 27 -6 -33 -3 44 70 -7 -73 -41 23 85 -8 -41 -72 7 38 28 -38 -33 -6 15 -16 -24 13
6419 13 39 -11 -65 -74 -17 57 23 -68 -112 -38 55 35 -41 -94 -44 11 -11 -28 -30 19 5 6 -43 0 48 25 -36 -53 -26 41 63 42
6451 42 -24 -61 20 84 40 -17 -16 23 32 33 33 32 17 19 -4 -27 24 79 60 -6 -73 10 68 49 -1 -58 -25 27 47 8 -2 3 18 -4
6485 -4 -12 -38 19 35 -34 -74 -38 55 49 19 -54 -72 32 54 9 -35 -36 -2 22 14 -8 12 -10 -20 -31 -45 21 58 24 -46 -29 21
6517 21 46 49 -19 -60 -36 56 28 -14 -45 -30 1 36 -24 -27 7 22 -35 -38 -15 28 41 -44 -67 -63 20 57 16 -66 -81 23 50 10
6549 10 -14 -30 10 11 -10 -31 3 49 3 -26 -46 -5 64 49 -25 -62 -19 41 76 0 -50 -24 43 30 31 -24 -3 11 -16 -34 -11
6580 -11 49 46 -11 -57 -21 29 46 10 -60 -56 10 41 29 -34 -61 8 -3 26 -17 29 24 11 -14 -45 26 59 43 -50 -74 -12 69 39
6612 39 -28 -44 -51 7 36 -6 -35 -13 -9 -5 -22 -17 16 3 -41 -55 -25 45 37 25 -75 -41 21 71 15 -35 -30 10 41 22 -6 11 41
6645D1k5n6J0N3N7o6k9l0M8P3m3m8l8M9N1Lo0l9K6L1kk2L0Qk0k7%K8K0J4n6l8
6677e7QO8L4n2l2%M0J6j5m0j7L9K1k7j9J0L5j4m1j5N9L4k9l9m8P9K9L2p5m8J5
6708d9P3j0n5J8M1Pm4K1j9K4J0m0l3L3M1L4m0p3J5M7L1Jp3mN5qk8J4KJ6rj9j6
6741c7K8M4Ln6k5J9O2K0n6l8K6N2Mk8k3JL0L2n7KK3J2m5j8J1O1J2n8l6j0P0N1
6773G6m9k9%K2L0m2Oj4K0j3m0qM1K5j5m2j3L5N8po9n3N2P2k3j9m8K2J6Ol0LK1
6806ij8j8rK9N7Ml4p6K2N2L9n5l4j2N5L4j8j7l8L8J9j6j6L4J2l4k0k7P1L4j5l3
6838An3M3M6J4l4o3M4K1N0o2k0KL8j9k7K5K1Qm4m5K0O9K7l3p4nL5P8j9o5l7M7
6870a1L2nOl0K6j7j5j0M7L6l5l5k2K8N8j0m9m6L7N3rj4n3L9K9k9j6J3J1qJpm9
$$ plain form
6645 41 16 -40 -30 23 80 14 -15 -45 3 76 33 -15 -53 -4 47 50 -10 -49 -23 8 6 -16 14 22 2 -25 -25 3 23 37 -19 -57
6677 -57 -49 19 53 1 -31 -31 9 25 10 -30 -47 -8 13 -14 -33 -23 12 -2 -43 -58 1 35 6 -33 -81 -2 27 59 -16 -64 -49
6708 -49 24 14 -41 -23 18 25 -19 2 -17 7 17 -23 -56 -23 18 52 12 -61 -46 1 32 33 -40 -44 11 3 -25 -11 -9 7 -2 -21 -37
6741 -37 -9 35 38 -18 -43 -24 38 58 2 -36 -10 42 46 18 -5 -4 26 58 1 3 26 38 -7 -25 -14 47 59 1 -35 -45 25 76
6773 76 27 -2 -2 20 50 8 14 0 20 7 -33 -41 0 25 10 -32 -45 -10 48 41 -28 -81 -29 43 20 1 -47 -25 -9 -3 -33 -30 -9
6806 -9 -27 -45 -54 -25 32 36 2 -74 -52 0 39 -16 -50 -62 -7 27 9 -8 -46 -8 11 -5 -21 13 25 -9 -29 -56 15 49 34 1
6838 1 -52 -9 37 51 17 -46 -2 19 69 7 -13 -11 27 8 -19 6 27 35 -9 -54 -34 35 62 29 -45 -50 -15 63 44 -21 -58 -11
6870 -11 21 16 22 -8 18 1 -14 -24 23 59 24 -11 -33 -5 53 43 -6 -52 -15 38 29 15 -38 1 30 1 -15 -2 9 1 2 -5 -54
6903e4O1N1o3o8L7N7J0k5l7k8O7J9oo1KM8Mj9m4N8j7K1o1QK8P7m5n0k0J1L1N7
6935D9n2k6J7J6J6l0Rj2N1m0l7M2M9Nm0p2M2M2L5l2n7pK3N0l4Nk7J4J7Lk1j1L8
6968B5om8K0K2Nk8l0l9N3K8L6n4k9J9K4L5j9l8JK9j2mj8L9J2m3k6J5L9K8j2n4
7000c0pM1K5j8j7KJK7llk8L4rk6k6N0M6l4m5k8K7Q2j1l2o6K5L9nj2l3J4L1mpk3
7035b3J5jkLm1N4J5m0k8oO4K8m1l6RL4L9l3k7K3J2j1k2pK0N3n6j2l5O4M9m0j6
7068Em3L4L6K3k9m8J7L0Lj2k3M3qk9j0LM0jk4l7NN6j8%o4L8J1K2j9m6L5K6rnj3
7103a1J6J3k5pj9N0Qkn7rL5L1J9l6m4K7M9oj9l5J7J8l4J0J2J6J4j9pmL5J7j6p8
7137d1MK7O2m2k3k1K7J9K1m1KJ5kj1l5M2NJ4m3l1M7L4jo0kQK7L5m0l4J5NMMO%
$$ plain form
6903 -54 7 58 -5 -73 -36 21 31 6 -31 -59 8 27 21 -40 -38 10 14 -5 -49 9 -8 13 -48 -40 -12 65 20 -30 -50 -39 -8 49
6935 49 -3 -29 -12 4 20 -10 -1 -13 38 -2 -39 3 52 57 17 -55 -13 29 64 32 -25 -32 -9 41 7 12 -15 -1 16 19 -2 -13 25
6968 25 19 -29 -9 13 18 -10 -40 -79 -26 2 38 -16 -45 -26 -2 33 14 -24 -23 6 -6 -10 -28 11 23 -20 -46 -31 8 36 24 -30
7000 -30 -37 4 29 11 -6 -4 -3 24 21 18 -10 24 15 -11 -37 13 59 25 -20 -48 -21 61 50 18 -48 -23 16 11 -1 -34 -20 11 7 0 -23
7035 -23 -8 -9 -11 -8 -49 5 20 -20 -48 -54 10 38 -3 -39 -30 4 43 10 -17 6 18 7 -15 -22 -2 51 -5 -17 -52 12 61 21 5
7068 5 -38 -4 32 55 26 -22 -5 25 28 16 -7 36 28 -1 -11 -8 32 31 7 -30 -25 31 13 13 -51 -13 -2 20 1 -45 -10 16 7 2 -11
7103 -11 5 18 -7 -14 -33 17 25 23 -34 -43 -8 23 42 6 -38 -11 38 32 13 -22 -5 13 -21 -11 1 17 31 12 5 1 36 53 37 -41
7137 -41 -37 -10 52 10 -13 -34 -7 12 33 -8 -6 9 7 -4 -39 3 8 22 -21 -52 -5 29 28 -32 -34 -26 1 36 -4 -38 -23 -18 -14 -10 -4 -4
7173dK4k8j6L2K5J2k8n5K5M2prj0l2K1K0K2l3knL2Pj3j3Jnlj2QM1K5r2l0N1J9
7208A0K8k9l1LJ2L2l0j4L0oj4Mj6J2K8m1k1nN1M1l0n7j2M0M0No3NNJ8L%QJ4rj5
7244dk8N3Lkk7n0N7L1J3k9n4RL8J4Qm3J9J1Ln2K5J3J8j4k1j9M3J8l8j9j0MP8l1
7278A7l5j0RRK6j3j6jJ1j9K6Jj5N3o7j0L9J4K0m1m8J5N3M2o0k8J9L3j0k9K0rK4
7311B0ll0jK4M2n3n1L7K0L4j6m8pJ8L5j5j7j4KL4rl6J0M7k6l9J6J3L3%n1j3J3
7344c1M3Rj0m2J7JN6k6m1J9Mj3RqJ0L3j2l5l4M3L3j1j5l6N2K1l0%k2nM9l2%K2
7378A8K9l0l2l2N0L7J2p7j4K5M0j4Kl5kN0J5k8k2j7L5mk5NoM3m9J4j2L5%Mm0j6
7412d1J6M6J1n4J0qL0Ml5MJ4Kkk2nN6k1k7jJ7J8K2k4n0K6L0J1Nm2%K7j1lj9M3
$$ plain form
7173 -4 20 -8 -24 8 33 45 17 -38 -13 29 22 13 3 -29 -8 12 34 1 -1 -6 26 33 20 7 8 3 0 -12 -4 37 62 -30 -60 -9 10
7208 10 38 9 -22 -19 -7 25 -5 -19 11 5 -9 -5 -21 -9 19 -22 -43 -48 3 44 14 -43 -55 -15 25 30 -33 -28 -23 -5 -2 -2 6 20 11 -4
7244 -4 -32 21 24 22 -5 -55 2 33 46 17 -37 -28 10 24 32 -11 8 19 22 -30 -5 8 26 12 -9 -28 15 33 -5 -24 -34 -30 48 17
7278 17 -18 -28 -19 -10 16 3 -13 -14 -3 -22 4 5 -10 43 -24 -34 5 19 39 -2 -50 -35 18 60 0 -28 -9 24 14 -15 5 -4 20
7311 20 17 -13 -14 10 52 -1 -52 -15 5 39 23 -25 -32 -14 21 6 -11 -25 -23 11 2 -34 -24 23 -3 -42 -26 -13 20 20 -31 -44 -31
7344 -31 12 21 11 -31 -14 -13 43 17 -24 -5 -1 -14 -5 -13 -3 30 18 -17 -51 -8 25 14 -1 -37 15 36 6 6 -16 -21 28 -4 -4 18
7378 18 47 17 -15 -47 3 40 52 -25 -39 -14 26 12 14 -21 -23 27 42 14 -8 -25 10 6 -19 -14 -20 23 -26 -12 -24 11 11 15 -25 -41
7412 -41 -25 21 32 -22 -12 -20 10 14 -21 -17 -3 -1 -3 -25 -30 26 5 -22 -23 -6 12 34 10 -40 -14 16 27 32 -10 -10 17 6 3 -16 27
7447B7nk5nj7K6Pj1m4PM8K2k3l3qJ4K8K8l9jqj6M0k2K9k0J0ml1K6L5n0L1n6M7
7481GK1j4j2j4RK1J8k0%k0K1j5k2J9L1Ml2j5k3K3N5l0l6K4JJ6L3m1m8K9LJ0k3
7514b0K2j1nRLj0K0j0j6k1oM4J7j3k9j2J7M8n5mqJ8kJ2pJ0K2%m1J3K4J9j2l6p
7549b7K1K4j0j9J2j6J4K1l2kJ9J1nk9j7M4Ok4l5L3L8J3l2k8J8L5j1k8k0kQM0j2
7582HpJ8m2K2j9J2J5K3l4jk6L4N2k4k8k4qK6J0Ml4J1L7l1J5mJ2Mk3m8M1L9ll1
7616dl7L7OM2l1j1rPNJ3k1qK4k3k4LM4j1k8j4%K7L3jl9j2RM1k0k2k4J5J1K3kq
7652ipkJ6l2K1K5k6rrRK3L1l8m7J7K7L0ml1LK3k2J3j1KL0j7lj6L6Pm7jj8L0J5
7688IJ8l5mJ5J0K2l1j5M%j3K4k5MJ8j9j5J4J4L3k7k9J2K7njm2J1J5L3k5mRjLk3
$$ plain form
7447 27 22 -3 -8 -25 1 8 -3 -47 -40 8 30 7 -26 -34 -20 8 36 -3 -4 -12 -28 12 -10 19 -1 9 5 -26 0 35 -15 16 -40 7
7481 7 28 14 2 -12 -3 18 36 16 16 -4 17 2 -20 -1 30 34 2 -13 -36 -13 42 12 -24 0 1 17 50 9 -39 -10 -7 3 -20
7514 -20 2 -9 -14 -5 -2 -12 8 -2 -18 -39 -45 -1 16 3 -26 -38 -21 27 -28 -32 -40 -22 -24 -12 -19 -9 13 13 -28 -15 9 28 16 -20 -27
7549 -27 -6 18 8 -11 1 -15 -1 20 -12 -14 5 16 11 -18 -35 9 15 -9 -44 -11 27 40 8 -20 -2 33 22 -6 -26 -28 -20 20 8
7582 8 1 19 -23 -1 -20 -8 7 30 -4 -5 -31 3 55 31 3 -21 -29 -3 7 11 -23 -12 25 -6 9 5 17 21 -2 -50 -9 30 27 -4
7616 -4 -41 -4 2 44 13 2 -7 0 5 18 -3 -11 13 -10 -34 -31 13 2 -26 -40 -40 -13 20 19 -20 -32 -23 18 -2 -24 -48 -33 -22 1 -1 -9
7652 -9 -16 -18 -2 -34 -13 12 -14 -23 -32 -23 0 31 -7 -54 -37 -10 20 16 -15 -12 11 -11 2 -9 -7 23 6 3 -13 23 30 -17 -18 -36 -6 9
7688 9 27 -8 -12 3 13 35 4 -11 -7 -7 -20 4 -21 -17 1 -18 -33 -19 -5 28 1 -28 -16 11 6 5 -37 -26 -11 22 -3 -7 2 1 4 -19
7724a9pL5j3Oml5M3K1l2qk0MN8qj9mj2K2OlMNk3pk5J3M5%l2njRJ3jm3J4MK1k0
7763a8k%LNLrj4K7Rj9l6N2MJl6JoL6j1Mk6M5k0K2j7NJ0mnKJ4j7K4j2k5NJ9K9k1
7802B2l6j0M3L1m4j2J5lMmlj4K7j4j5mL7J5k5m2j2M5pK4n1J0j0M8j3l3K2j2k3
7835d4M1Nk8J2OJ4k3jL4j7pk4J5K0Oml0L1qK4j4j6LJ3K9m5JJ7Lmk2qJ3J9J2l2
7871ij6LM2jj6NKKj2l3L9n1M4Mk8j5L0J6l4jpM6Lkl8j2K9J6lj5%lJ0mjkJ8j3%
7910gj1K1L7j5l1j9LL0j8J8m7K4L8mk2Ljj5J6j7K7Pnk0m0K4K5Qj3k4KLL8mk5O
7946hpK2k2k3M8Jk2Kk0J4L2j5j9k2J7J5J7k7j2ML7k2K4k2MJ3J3k7J0nQqoL0n0
7981b6L1oj1LK6K1m9K0k3NK7j5k1J7J7j7j8K6kk5J0j5j0L4MJ2ll1k4M2j7J3j7
$$ plain form
7724 -19 -26 9 -4 2 -2 -37 6 27 -5 -13 -33 -29 29 21 2 -2 -14 8 14 11 15 20 -3 -10 -35 -22 23 23 -9 -14 -15 -6 7 6 -37 -23 -19 2 -18
7763 -18 -20 -20 -17 -12 -9 -18 -32 -5 4 -15 -51 1 5 6 -30 -29 -35 1 -10 -6 -32 13 -7 15 -2 3 13 9 4 6 20 3 27 15 -10 -5 14 43 22
7802 22 -14 -24 19 50 6 -6 9 6 10 6 3 -11 16 2 -13 -17 20 35 10 -32 -44 1 -6 18 -33 -23 -33 15 2 -31 -9 -21 -44
7835 -44 -3 2 -26 -14 -8 6 -17 -18 16 -1 -8 -32 -17 3 9 5 -25 6 -2 22 8 -8 -5 8 37 -8 -7 10 13 9 -13 -21 -8 11 23 -9
7871 -9 -25 -22 20 19 3 8 10 12 0 -33 6 -45 -1 3 -25 -40 -10 6 -28 -29 -36 10 13 11 -27 -39 -10 6 3 -12 -12 -15 -5 -9 -10 -12 6 -7 -7
7910 -7 -18 3 40 25 -6 -25 -22 8 -10 8 -39 -15 23 19 -3 0 -1 -16 0 -17 10 17 12 -8 -48 -24 1 9 -4 -28 -26 -23 15 11 -14 -8
7946 -8 -15 7 -15 -38 10 11 -11 -9 -29 -15 17 2 -17 -39 -22 -7 10 -17 -29 -25 12 -10 14 -8 -4 9 22 -5 5 0 8 0 -6 24 -26
7981 -26 5 -1 -12 -9 17 38 -11 9 -14 -9 18 3 -18 -1 16 -1 -19 7 5 -20 -10 -25 -35 -1 3 15 12 -19 -43 -1 -18 -5 -22
8014b2j7J6OnLJ4K3k0l3J1L1K1jo4ML6J5j2j0JJ2j9K6l2K2J4k6nJOK1qk5pK6K3
8050B6mk2l2L7J9nj9k1qJ1K7olm2N0m7J8J6j3K2j9j7%L8jj2qk3J3M3k9MmNOoK4
8087A8kj2mNl8M4k2J0j2j6L8L6k3kk7J6oJ7l7J4Qk6J7mJ6kj4%JrK3J7l5rkMOK3
8125A1l3LoK0Mk8JJ0MkkLNQj1k3J0M2j0m8K2NJ7j0J6J5l1L6k3j5K8j9Mqj9J8J4
8162HMQn1%M4Pkk6KJ9K2l9J3j0lKpOJ7J3j9j4kjJ0nj4j6K1
$$ plain form
8014 -22 -39 -23 -17 -22 -19 -5 18 -2 -35 -24 7 28 27 -37 -33 3 18 6 -4 -3 9 -10 16 -16 6 20 -6 -11 -10 -4 17 9 -16 -23 3 26
8050 26 22 0 -32 5 24 19 0 -21 -29 -18 9 3 0 -42 8 -39 -21 -5 -18 4 -15 -32 -32 6 5 -7 -15 -38 -25 18 -11 -7 -11 -6 0 -6 18
8087 18 16 4 0 5 -33 11 -11 -1 -13 -29 9 45 22 20 -7 9 3 20 -17 -3 5 -21 -4 -8 8 6 -8 -8 -7 -16 7 24 -11 -20 -22 -18 -12 11
8125 11 -22 -19 -25 -5 -1 -29 -28 -18 -14 -16 -18 -15 -10 -2 -13 -36 -26 16 6 -42 -20 -15 2 -8 8 23 -8 28 5 -10 18 -1 3 -5 -24 -6 8
8162 8 12 20 -31 -31 13 20 18 -8 -6 13 35 -4 9 -1 -4 -2 -9 -3 14 27 8 -6 -8 -9 1 -4 -18 -34 -13
8191a3
$$ Imaginary data points
##PAGE= N=2
##DATA TABLE= (X++(I..I)), XYDATA
0@%%%%%%%%%%%%%%%%%%%oJ4j6J6j6J6j6J6k4L2l2L2l9M7m8N5o3O9p7Q5r4J04j16
42f1J28j42J58j74J92k15K40k68L03l45L94m52N29o34P80j004J401k304Q465M52
62G443j0181N710P530K359o270l756N28L274J08j728j349J876J047k693m681O28
78a55N788L400n321p931j117P224N808k965q422l557M587N818r49n529k367K778
94b910J897k599k677K243L864j536o228k736M827O291n20o958n260K475P148L198
110E19m711o565n0N875L139l225l487J882L220j540l819Q27N641K658m517o134
126a0287O64P511N381l381p664j837O284O107j034n184j842K992L063l12j703
141a242N58K511M69l082k233L351O091N79o621n100L995Q413J998o430n747K071
$$ plain form
0 0 0 0 0 0 0 0 0 0 0 0 0 0 0 0 0 0 0 0 0 -6 8 -8 8 -8 8 -8 8 -16 16 -16 16 -23 24 -24 31 -32 37 -40 45 -49 55 -61
42 -61 67 -75 83 -91 101 -114 126 -142 161 -184 210 -242 287 -347 433 -571 830 -1474 6991 7443
62 7443 -2738 2972 10502 12861 6591 2835 3363 6637 6745 5017 3668 5544 6591 3898 -783 -155
78 -155 5633 9033 3712 -4219 -5336 1888 7696 4731 -3691 -7248 -2661 3157 2208 -3321 -5688 -2910
94 -2910 -1013 -3612 -6289 -4046 -182 -1718 -7946 -10682 -5855 436 -84 -7042 -12302 -9827 -2679 519
110 519 -4192 -10757 -10807 -4932 -1793 -5018 -8505 -6623 -3403 -4943 -8762 -7935 -2294 364 -4153 -10287
126 -10287 -9623 -2112 3269 -112 -7776 -9613 -3329 2778 1744 -3440 -5282 -2290 773 461 -1242
141 -1242 -684 1827 2296 -786 -3019 332 6423 7002 381 -4719 -724 7689 9687 3257 -2490 -419
157d19O190K273l160l164P19K403J52j919l66K690J903k778m822oN913M279l736
174F152p546j746O054N712j867o630l065L425M208o92l748j026K374O44l212k107
190c070K980M020j411n896l016L698N858O72n584n434J135O094L262l629n284
205e605l4M040J669k505j723K064K109k082l760O05N110L104l642o061o33O084
221a260N317k071o486k442M279M944k68l894j645K176K077j046j695J214K991
236B191J47l903k799L165O005Q24n996m978K858O891K063m641m553R50M179J718
252D121j818j944O25J610m45k032pL144K223k683m944m02N506M404k555o319k231
269c747M498N074n79m852k641K410L116o39k561l6K339J93l299k087K861M278
$$ plain form
157 -419 5771 8044 4884 1720 2439 4842 4994 3075 2709 5399 7302 4524 -298 -304 5609 9888 6152
174 6152 -1394 -3140 2914 8626 6759 129 -2936 489 4697 4005 257 -769 1605 2249 -963 -3070
190 -3070 -90 3930 2519 -3377 -6393 -2695 3163 3835 -1749 -7183 -6048 46 3308 -321 -5605
205 -5605 -5639 -1599 70 -2435 -4158 -2094 15 -2067 -5827 -5222 -112 2992 -650 -6711 -7344 -1260
221 -1260 4057 1986 -4500 -6942 -2663 2281 2013 -1881 -3526 -1350 727 -319 -2014 -800 2191
236 2191 2338 -1565 -4364 -1199 4806 5630 -366 -5344 -2486 4405 6468 1827 -2726 -1776 2403 4121
252 4121 2303 359 984 2594 2149 117 110 3254 5477 2794 -2150 -2552 2954 7358 4803 -1516 -3747
269 -3747 751 5825 5246 394 -2247 163 3279 2640 79 43 2382 2575 -724 -2811 50 4328
285D328l90n256l723K551N701J705m496n168M36M957K738k712l849K46K830M46
301C44k400p32K631J792k594l855L50M732L231k762n532j417M599M828q94n074
317b753k482K690L720N3k590j006J545J153j377j514J458L250K48m022l218K532
333b313N701J384m903m750J534N514K268l119l761K20K939J346j440j352J031
348B99J523j045k686l5L672K685k527n107q45M782M384j647n353k243L311M107
364C275j26l469j787J745J920q48j746P74K458o9l344k076K620M285L72m366l781
381d163J599N035K309l237m470q9L938K366j939k651N59K093k83k250k02K896
397A511J870k399m001j78M321L503j934n093j927L585M333l89m012k200J901K608
$$ plain form
285 4328 3938 -1318 -5041 -2490 3211 4916 420 -4748 -4312 645 3383 671 -3178 -2932 -102 344
301 344 -2056 -2788 -157 1635 -959 -4814 -4464 268 3499 737 -4795 -6212 -1613 3215 2321 -2753
317 -2753 -5235 -2545 1175 1228 -1362 -2368 -823 330 -1047 -2561 -1103 2147 2395 -1627 -4845 -2313
333 -2313 3388 4772 -131 -4881 -3347 2167 4435 1316 -2445 -2225 714 2060 620 -732 299
348 299 1822 777 -1909 -1944 1728 4413 1886 -3221 -4066 716 5100 3453 -1900 -4143 -832 3275
364 3275 3149 -320 -2107 -362 1558 710 -1036 -262 2196 2127 -1217 -3293 -673 3612 3984 -382 -4163
381 -4163 -2564 2471 4780 1543 -2927 -3016 922 3288 1349 -1302 -743 1350 1067 -1183 -1385 1511
397 1511 3381 982 -3019 -3197 1124 4627 2693 -2400 -4327 -742 3591 3202 -810 -3010 -1109 1499
413A499k11j888k50J560L93k036j615J767L412L23m037l368J941N122J632l929
429C15m259O60M138K173j999k814j11J991Q09j273q66J401J616j293l089l58L703
446G44L154k025m917j484M000M262p90m478k295K277L369J21k542j193J501J181
462H85j318j561J266K740nl483k437K164M356J002l738l874P96M332K475k258
478A342l650k98K816J642j390j492Q99J533q33k222M2K954K140j908l914q77L684
495D68L768q90m436k319K586L826K58k995j849J322J867m14j545K91J848K78k468
512d04k091J694L802Q03l822l746J237M680J950l062l843N3L150J767j380k045
528a257N3J391J11j525m84J923J743j529l421o35L522L342j412m455j862K962
$$ plain form
413 1499 1288 -600 -850 710 1103 -933 -2548 -781 2631 2954 -1083 -4451 -2510 2612 4244 315
429 315 -3944 -3284 854 3027 1028 -1786 -1897 94 903 -370 -1236 165 1781 488 -2601 -2959 744
446 744 3898 1873 -3044 -4528 -528 3734 2944 -1534 -3829 -1552 1817 1938 -604 -1797 -296 885
462 885 -433 -1994 -728 2012 2007 -1476 -3913 -1749 2607 3609 -129 -4003 -3207 1125 3600 1342
478 1342 -2308 -2606 210 1852 462 -1030 -131 1402 569 -1653 -1611 1343 3483 1575 -2339 -3216 468
495 468 4236 3346 -1090 -3409 -823 3003 3261 266 -1583 -261 1606 1192 -353 -62 1786 2064 -404
512 -404 -2495 -801 3001 3804 -18 -3764 -2527 2153 4103 1041 -2802 -2749 401 2168 788 -1257
528 -1257 -1204 187 298 -1227 -1711 212 1955 426 -2995 -3630 -108 3234 1822 -2633 -4495 -1533
544a533L840ql373k157J396K542K07j733n36J376P44j587j572J373L048M13l266
561h26k851J486M223J729k985l773J6L690K462j612k907k78K127R52j335q84J391
578F25J448j234k571j66L108K484j539l948j425L073L729k48l720k375J791L080
594B112L70k144j237J033J108p61j286O79K102L60k560k456J344L831J412l226
610F81l786M44L973K264k070l301m24K322J540j004j507L50J237k85j896n18K242
627B62K240j376l728j133L143L542p46l994k138K126L360L69k508j813R14J761
643B81m5j264oJ510M73j962j721J401L197Q37k934l053P84L798K168k032l491
660b059m74K854K282r53k185j38J560M96j297n55J687J640j157k837o49K878K956
$$ plain form
544 -1533 2307 2299 -1074 -3231 -1835 707 914 -819 -1355 21 765 -822 -2394 -1021 2027 2440 -826
561 -826 -3677 -2191 2032 3761 776 -2997 -2981 709 3171 1559 -1348 -1626 501 1453 118 -766 625
578 625 2073 839 -1732 -1898 1210 3694 2155 -1793 -3218 -145 3584 3336 -384 -2759 -968 2112
594 2112 2482 338 -899 134 1242 481 -805 -126 1976 2336 -224 -2680 -1336 2495 3907 681
610 681 -3105 -2661 1312 3576 1506 -1795 -2219 103 1643 639 -868 -518 719 434 -1462 -1980 262
627 262 2502 1126 -2602 -3735 -592 2950 2204 -1790 -3928 -1802 1558 1927 -581 -2394 -1480 281
643 281 236 -1028 -1034 476 949 -1013 -2734 -1333 1864 2701 -233 -3286 -2502 1296 3464 1432 -2059
660 -2059 -2533 321 2603 1650 -535 -673 887 1383 86 -469 1218 2858 1701 -1136 -1785 1093 4049
677D049q45l786k013K414L643K39l095k264J241K418K10j649p31J084O46j286
693B75j441R14K432M82k762k774R81L693J584k669l619m4L146K049j379k543n56
710b231J537R52q21r16N66J127n56k095o09K323K418j063l626j517K604L442r3
727A442l329k247J361K822O73j892j415P75J264m22j235M13J923M78k197k079
743c665J195L377J265k607l181K72L419K323j494l002n45K235J742p49j439L07
759e47J290q4j473k89J965J875j030k888r49K618L148k61l305k152J773L287O73
776C651k282j851Q36J797J38j164k36J224N64j453j614Q89K716R09k549k978M89
793i14L516J922k079l280m62K506J831r20j967l66J105M56j014o58R84J313q58
$$ plain form
677 4049 3204 -582 -2595 -181 3462 3701 606 -1658 -417 2001 2211 562 -169 915 1561 275
693 275 -1166 -252 2180 2662 -100 -2874 -1893 1800 3384 715 -2904 -2948 198 2247 868 -1675 -2231
710 -2231 -694 258 -563 -1479 -913 214 -342 -2437 -3046 -723 1695 632 -2994 -4511 -1907 1535 1442
727 1442 -1887 -4134 -2773 49 722 -1170 -2585 -1810 -546 -968 -2203 -1790 133 611 -1586 -3665
743 -3665 -2470 907 2172 -435 -3616 -3344 75 2398 904 -2098 -2643 -408 1334 585 -854 -547
759 -547 743 659 -814 -1103 862 2737 1707 -1181 -2130 488 3636 3375 70 -2082 -309 2978 3651
776 3651 1369 -482 354 2151 2289 1125 889 2113 2677 1224 -390 499 3215 4124 1575 -1403 -914
793 -914 2602 4524 2445 -835 -1297 1209 3040 2120 153 -213 892 1348 334 -324 660 1973 1115
810A115k525q03K367K590q03l483j774K020L085K44k697k090Q22K105N63j389
826f53j004P53Q28q29j270N86K102O09k248k392Q10L234J643k197l185k22K835
843f00K302j045k597n63J698J238q03j052O86J254m70j857l93K131K105q65k996
860a827j335K284L114J03k962k093J291K703O43j706j315O61J161j81r81K29J442
877A231M55j652j785Q19K845J263k203k986J11L106K043j382k780o46J918J617
893A974n58j463r4J019J78j186o34J423J682p59k730j125K304K850l83l212j959
910b673J601K848N03k160j795N72J639K46j153m70J049N73j268j526P52K415P55
927A908k251k527M26K989J806j632k911o06K254K014o54j927m80J215P47q31o84
$$ plain form
810 1115 -1410 -2213 154 2744 1941 -1542 -3316 -1296 1789 2033 -664 -2754 -1932 173 736 -653
826 -653 -1657 -904 -76 -905 -2175 -1589 513 1122 -1126 -3518 -2708 526 2169 -28 -3213 -3435 -600
843 -600 1702 657 -1940 -2503 -805 433 -370 -1422 -736 518 48 -1809 -2202 -71 2034 1169 -1827
860 -1827 -3162 -878 2236 2339 -623 -2716 -1425 1278 1921 215 -1100 -439 722 541 -440 -211 1231
877 1231 1686 34 -1751 -932 1913 3176 973 -2013 -1902 1204 3247 1865 -915 -1561 357 1974
893 1974 1416 -47 -141 878 1056 -130 -764 659 2341 1582 -1148 -2273 31 2881 2498 -714 -2673
910 -2673 -1072 1776 2279 119 -1676 -1104 535 781 -372 -842 207 780 -488 -2014 -1262 1153 1908
927 1908 -343 -2870 -2444 545 2351 719 -2192 -2798 -544 1470 816 -1111 -1591 -376 371 -460 -1144
944a144R21J263n48k034o57K033K363m72k906j729J808L025M90k474k056Q42K210
961I35N89j352q90O66Q28n88j083M60J762N91j889k073N76K903J506j969k921
978a949k12K648J982j013k247o18J376J143m89r52K88R35j63j462o11J680J904
995B240o35k747j306J992K833Q2k712j995J056K489P27j608j484M92J262kj040
1012c56r7J287O01j515j741P22K530J060k003k665Q0K750J858j244k622o62J784
1029b33J628n35j478j63J002K00j043m86J266J355p10k213q59J900K415j86k686
1046h26j820J316K678O73j953j788N16J710L44r84n16P81O10r07j196N05K020
1063A163Q28j832k384K69K820J748j560k789m83K190J822o85j875m60J131P48
$$ plain form
944 -1144 -223 1040 492 -1542 -2199 -166 2197 1725 -1181 -2910 -1102 1923 2413 -61 -2117 -1275 935
961 935 1524 172 -718 -52 776 188 -895 -435 1327 1918 29 -2044 -1468 1435 2941 972 -1949
978 -1949 -2161 487 2469 1456 -791 -1409 -33 1110 621 -331 -43 892 729 -733 -1344 336 2240
995 2240 1605 -1142 -2448 -456 2377 2459 -253 -2248 -1192 1297 2024 416 -1068 -576 686 684 -356
1012 -356 -453 834 1435 -80 -1821 -1099 1431 2491 488 -2177 -2097 653 2511 1267 -1355 -2017 -233
1029 -233 1395 860 -618 -781 221 421 -622 -1108 158 1513 803 -1410 -2269 -369 2046 1860 -826
1046 -826 -2646 -1330 1348 2021 68 -1720 -1204 506 850 -134 -650 131 741 -166 -1362 -857 1163
1063 1163 1991 159 -2225 -1956 864 2612 1052 -1737 -2220 -30 1792 1107 -768 -1228 -97 651
1079F51o95p42O48J141m18j846o92J796K152n08k735j429J633K649L46k251j840
1096b140P26J956O24j154r84M59Q78l50r55K59J495N79j569j821N32K508J332
1113B375j638k555k59K315J950p39k205p35J387J305m53j043J43R73m2j316m98
1130a035J441J634n15k379j215J743K522J55k460j918J005K347O51j573j369M63
1146e03J176j0q94j22J045M71j201j437N17K172J028j723k447RK498J799j106
1163A272k432o67J664J519l87j361l07Q29M20p87n93R03J281m01k013r25J692
1180b93K308j67k539j674J264K462N44j825j676M61J556M49r69n95O41O30p52
1197a75j119M03J781O90j662k035L16K400J494j308k462m84J887J744m70j753
$$ plain form
1079 651 -44 -786 -138 1003 585 -1261 -1953 -157 1995 1487 -1248 -2677 -1044 1605 1951 -300 -2140
1096 -2140 -1414 542 1166 12 -972 -513 365 15 -940 -681 814 1393 -176 -1997 -1465 1043 2375
1113 2375 737 -1818 -2077 238 2188 1449 -756 -1491 -104 1201 748 -295 -152 821 779 -537 -1035
1130 -1035 406 2040 1525 -854 -2069 -326 2196 2351 -109 -2027 -1022 1325 1976 403 -966 -503
1146 -503 673 663 -231 -353 692 1163 -38 -1475 -958 1214 2242 519 -1928 -1919 579 2378 1272
1163 1272 -1160 -1827 -163 1356 969 -392 -699 130 550 -237 -830 73 1354 953 -1060 -1985 -293
1180 -293 2015 1848 -691 -2365 -1101 1361 1905 80 -1596 -1135 421 870 -99 -694 -53 577 -175
1197 -175 -1294 -891 890 1580 -82 -2117 -1801 599 2093 785 -1677 -2161 -274 1470 1000 -753
1213g53n62J032Q43n18o83M74R95l07j470n95J486J862l13k316j423J428K511
1230A691M74k101j837O47K032O16j181j025M57Q70k52r15J41J311N43j361j713
1247a603M24K266J234j517k474k44K209J740q47k035o32J260J138l77r63kP69
1264C46K2j028m94J150J430m26k085j056J519K292Q4k205j660Q45K111O96j339
1281B02j357K66J188K51q28k88Q94N77r81j331M45J935R31j527k221O9K247J661
1299B133j048k288o21J612J512m39j388l09R06M11p81n35Q33J117m48j755p30
1316a818J533J986j88k259j514J172K276N38j712j575M42J493M75q70o16N23N96
1333D82n03r54L08J485O86j384j809K10K209J435j225k309m70J884J684n20j676
$$ plain form
1213 -753 -1315 -283 560 42 -641 -167 828 521 -949 -1544 -58 1804 1491 -825 -2248 -820 1691
1230 1691 2165 64 -1773 -1126 906 1522 341 -684 -227 643 391 -524 -383 928 1471 110 -1603
1247 -1603 -1179 1087 2321 804 -1670 -1914 295 2035 1188 -847 -1479 -219 919 542 -421 -423 346
1264 346 368 -660 -1154 -4 1426 1000 -1085 -2141 -622 1670 1754 -451 -2111 -1266 845 1541 202
1281 202 -1155 -889 299 550 -278 -566 328 905 -76 -1407 -962 973 1904 377 -1844 -1775 472 2133
1299 2133 1085 -1203 -1824 -212 1300 861 -527 -836 70 481 -300 -835 -2 1115 667 -1088 -1818
1316 -1818 -285 1701 1513 -746 -2260 -1088 1188 1726 14 -1561 -1119 374 849 -21 -637 -114 482
1333 482 -21 -975 -667 818 1504 120 -1689 -1479 730 2165 940 -1369 -1839 45 1729 1209 -467
1350d67n63R80Q55m58o89L14Q86j55j304n95J309J714l71k144j252J347K279K88
1368A974j944j621O15J772O46j084j005L21Q39j15p79O2J059N20j151j490L87
1385i94K007J084j327k190k33J995J654o60j936p27J235J281l47j019p2Q00J29
1402F80r26n00R69J309l41j872r93J346K105J16k079j659Q60K037O01j337j390
1419a074L24J123K00p73l24P28M38q47j126L42J656P98j367j966k1K058J482r32
1437G19k087n99J430J433l56j244m23P53N04n05n66N68J007k27j474p74J304J873
1455A336o3k082j420J057K195N30j572j516L41J531N28q35p21M56O73l96r22J99
1473f81J427O16j258j706K17K045J286j158k096m24J692J596m50j614n93R14Q78
$$ plain form
1350 -467 -1030 -50 805 347 -342 -28 858 703 -601 -1196 113 1827 1456 -688 -1940 -593 1686 1974
1368 1974 30 -1591 -976 796 1442 358 -647 -326 513 398 -381 -319 740 1260 109 -1381 -994
1385 -994 1013 2097 770 -1420 -1653 342 1996 1336 -600 -1327 -92 1189 842 -177 -249 551 680
1402 680 -246 -746 223 1532 1191 -681 -1674 -328 1777 1893 -186 -1845 -985 1052 1653 316 -1074
1419 -1074 -750 373 573 -200 -524 204 642 -205 -1331 -989 667 1465 98 -1868 -1889 169 1651 719
1437 719 -1368 -1967 -537 896 540 -704 -1127 -374 130 -375 -941 -373 634 407 -1067 -1841 -537 1336
1455 1336 1273 -809 -2229 -1172 1023 1553 -19 -1535 -1194 337 865 30 -691 -235 438 42 -880 -681
1473 -681 746 1362 104 -1602 -1385 660 1946 788 -1308 -1732 -40 1556 1106 -508 -1101 -187 691
1490F91l30p11K20P61j05j056n43J114J474k14j845j175J135K056M07j717j627
1507a465M76J751P17r91j089K29Q70N5p50q1R15N23r74j322J76J844J089j236
1525G37k065k91J918J561p02j868o30J137J160k81r76j83O90J95p53m71P70J155
1543A103k79j677r14J264J905J23j865j511P30J894O57j212j284J56J132L85o80
1560g3m30N96N34n68j028K02J502Q56j186j799n5J892J456p69j988o66J391J481
1578A348k36j295m81P36N93m55n96M36R27j82j351o72J154J640p5j835j337Q77
1596h04J991M96j445j482K98J398N18p74p12K97O04k31p64O0J103N60j030j485
1614a402R1J788J237r75k015m71J539J551l78j551o53Q64R17k23p46L0P12J03
$$ plain form
1490 691 361 -350 -130 631 526 -530 -1073 41 1515 1301 -544 -1719 -584 1472 1879 162 -1465
1507 -1465 -989 762 1479 488 -601 -372 498 553 -197 -278 637 1160 186 -1136 -960 884 1973 737
1525 737 -1328 -1619 299 1860 1158 -710 -1340 -203 957 676 -300 -483 207 402 -351 -822 -52 1103
1543 1103 824 -853 -1767 -503 1402 1525 -340 -1851 -1121 773 1430 218 -1066 -910 222 607 -73
1560 -73 -503 93 627 59 -969 -767 735 1591 405 -1394 -1449 443 1899 1130 -858 -1524 -133 1348
1578 1348 1112 -183 -664 72 665 210 -386 50 977 795 -556 -1228 -74 1566 1491 -344 -1681 -804
1596 -804 1187 1683 238 -1244 -946 452 970 196 -516 -219 385 154 -610 -550 553 1113 83 -1402
1614 -1402 -1311 477 1714 739 -1276 -1747 -208 1343 965 -586 -1239 -375 542 319 -427 -397 315 418
1632D18r82n67R03J381j34j719j145J043K010L00j646j527N07J627O82r64j045
1649h58J70Q05J64o64j96P85N51q22j188J65J583R81j064j798k67J612J502m53
1667A008j718p32J006J206p9r42l10O03L47n67m97N96J086j50j417q51R77J790
1685A356K14j666j496O12J823P38j175j328J37J137M14o53n10M96N25m93r34J18
1703f85J316P71j028j693p5J685J359p09j855o38J257J363j92j185n76O50O14
1720C79k69n52K56P99p1j081o65R05J505O6j588j292P50J833O17j298j419J65
1738i60J343P05o91q22K06O81r3p18m5R77O47q66j388K0J613J172q47j833m96
1757a395J430J438k66j463p13P70R47j57p33o0O34R4p79n26P71J173q6j457j063
$$ plain form
1632 418 -564 -1131 -228 1153 1019 -700 -1845 -802 1208 1508 -138 -1665 -1158 469 1151 187 -858
1649 -858 -688 117 281 -383 -579 206 757 -65 -1253 -1088 495 1476 412 -1386 -1653 -41 1461 1008
1667 1008 -710 -1442 -436 770 691 -251 -561 42 389 -178 -675 -79 1007 857 -560 -1411 -434 1356
1685 1356 1570 -96 -1592 -980 843 1581 406 -922 -785 352 766 113 -397 99 624 131 -803 -685
1703 -685 631 1402 374 -1319 -1394 291 1650 941 -914 -1552 -295 1068 876 -309 -885 -235 379
1720 379 110 -442 -186 613 542 -539 -1204 -299 1206 1272 -316 -1608 -858 975 1592 294 -1125 -960
1738 -960 383 1088 397 -425 -219 462 369 -349 -394 583 1230 364 -1024 -1004 609 1781 934 -899 -1395
1757 -1395 35 1473 1207 -256 -969 -199 748 591 -142 -202 432 526 -253 -779 -8 1165 1079 -378 -1441
1776a441Q37J728M63j446j470L48J506P16q20j061M6Q43K28n66k71N84N04n91
1794A37j051J9J359R80q47j725l85J476J463m21j597p84R13J188m7r42l71N30
1812a05L82m52n71M93R13l0j254q62Q01J597K83j495j358M62J628O89r27j268
1830a074k5J038M93m72n40K88N17k40p83k8J114P26p59j476k06J456J342n02j645
1849g76p49J074J379j2j147o33N74P29k12n91J40P52O1r48o78P82J367J60j444
1868a72j280O08J710O44j187j397J19J284O59o58p66J23O23m5n64j12P67N66o39
1887B83j169j33J366J111n92j626o08J178J415j29j298p57O21R75j5o45k14N18
1905B81K30n78n41N41J081P0j229j066O49J626M96j277j416K28J446P30p54j052
$$ plain form
1776 -1441 -604 1124 1587 141 -1329 -981 525 1241 421 -640 -594 249 477 -89 -360 224 728 137
1794 137 -914 -895 464 1444 597 -1128 -1513 -37 1426 1005 -592 -1376 -463 725 678 -264 -635 -105
1812 -105 277 -175 -746 -253 660 630 -624 -1486 -685 912 1195 -300 -1658 -1196 432 1121 194 -1074
1830 -1074 -1099 -61 432 -40 -580 -292 225 -15 -798 -826 288 1014 255 -1221 -1427 29 1371 869 -776
1849 -776 -1525 -451 928 916 -231 -864 -290 439 227 -364 -224 528 589 -359 -1037 -255 1112 1272 -172
1868 -172 -1452 -844 866 1510 323 -1074 -955 329 988 330 -436 -313 310 265 -299 -411 356 922 283
1887 283 -886 -1019 347 1458 866 -760 -1368 -190 1225 1096 -202 -959 -338 637 622 -23 -237 281
1905 281 511 -67 -608 -67 1014 1084 -145 -1211 -562 1064 1560 283 -1133 -905 541 1271 517 -535
1923e35j2P94K84n16l37M96N13n07r79QJ185R05p47j529l96J301J331l06j469
1942e16p52P90J145J9q63m53M68M35l23n09L38Q03J9j032p74P01J378L63j285
1961d8j335L50J546P40q55j237m2R92N78m71n86K20N19j84o91o7R19P04o63j311
1981i22k60J314J229m40j566o73R54J277mj065n96M57O81r7n08K8N90Q5p70n99
2001h85O08J214J61j268j113M83J543O62j028j305K9J154P10m99q30LO20J14n28
2020a55j61N89N82n27j121j01J196J061n63j529n51J052J332j04j266p72N81R22
2038D65M1o98k49M50K64n55m97M53R29L7j090r45N88J400M69j107j304J22J300
2057G3P35n86j022j16P24L72l68l46L43M60k93q30m4R77Q60n01j392m26J159J322
$$ plain form
1923 -535 -547 247 531 15 -322 174 687 180 -799 -791 394 1299 552 -977 -1373 -72 1259 953 -516
1942 -516 -1268 -478 667 686 -177 -630 -162 273 -50 -559 -221 582 601 -431 -1205 -504 874 1237 -48
1961 -48 -1383 -1033 513 1253 398 -839 -881 111 689 218 -368 -148 371 187 -504 -571 348 1052 389 -922
1981 -922 -1182 132 1361 921 -645 -1318 -364 913 909 -156 -752 -295 386 289 -219 -191 399 484 -286 -885
2001 -885 -277 937 1098 -170 -1283 -800 743 1405 377 -928 -899 255 965 466 -364 -361 259 373 -155
2020 -155 -316 273 855 328 -793 -894 302 1363 800 -729 -1280 -228 1104 1000 -266 -1038 -457 465
2038 465 506 -192 -441 9 273 -282 -779 -326 603 640 -450 -1395 -807 593 1062 -45 -1349 -1227 73
2057 73 808 222 -800 -916 -192 180 -188 -534 -191 269 -24 -854 -898 79 939 438 -954 -1380 -221 1101
2077A101k06j366p36P06J143J32q34m44L98N00k15n09K42P52R2r12p53N84J323
2096I98L49j220j172L13J406P12p97j118j14R09N91m20n55J39M76r7n71j17P53
2115D65O73n44j171k61J111J141l17j378p21Q19J232J01j012o81M29O72om95r9
2134d2N05J42o42n79M69J049K16j103j105L63J404O49r31j311k7J080P11m87q26
2153d65k7N33J32m57k11N04M91m47r91j57J054R71m64j393n40R24J273o3j121
2172d54p43M87Q78J26n86l21L74L14l34m66K79Q65J63r41q64M23J331N56r67j228
2192a108O1J230Q02n33j003j64P40M65l53m19K58M77k09p01j57Q86P85m39j249
2211f31m41J009J209j45j227q04O29J068J74p82n07K89M77j25m12R4N84J22p04
$$ plain form
2077 1101 895 -471 -1207 -501 642 774 -60 -504 -106 394 179 -330 -88 664 756 -156 -909 -325 998
2096 998 1347 127 -1045 -732 674 1386 589 -529 -643 266 857 437 -118 21 497 400 -171 -288 465
2115 465 1138 594 -577 -838 273 1414 1097 -281 -1002 -183 1049 1150 138 -543 -114 558 552 57 -42
2134 -42 463 605 -37 -616 -147 902 1118 15 -1090 -727 677 1326 395 -916 -943 137 848 361 -465
2153 -465 -492 41 173 -284 -495 9 500 53 -938 -1095 -41 930 466 -927 -1467 -543 730 667 -454
2172 -454 -1197 -710 168 294 -292 -613 -239 75 -259 -725 -446 419 582 -359 -1223 -800 531 1087 120 -1108
2192 -1108 -1047 183 985 452 -551 -715 25 490 137 -282 -24 453 244 -457 -614 272 1057 618 -631
2211 -631 -1072 -63 1146 1001 -226 -1030 -401 667 841 59 -448 -159 318 193 -219 -125 459 581 -123
2230a23o84M24J133L52r65j161J79J269P26o44j097k22Q62O54l42o10J1M46M7
2249B55n19j63O27O31m24j078k90R65J107k51j314p10P57J168J08r39o63L33O93
2268B93L3n09j01M06J76m98n41L56R80K27r40r89K72J280O29p63j166j14R69P54
2288G54l43p74j69N11L11l10l06L34N47k75p92k38Q72R44l08j232n75Q30J204
2307I85Q4j071p73M07R01J60n68l82L33L29k69m59K22P51J39q46q06L62J191M92
2327A182q91j171J2J097P66m96r57j99O32M33k58l97J40L69j21n97j41O76P04
2346G83l16j109m76Q48J176p6j136p83M98J047K57p39n53J77N60l1m04PM99J97
2366D26o08o50L34J024M12q63j120J28J174P43n92j038k33P82O48k95n65m8M23
$$ plain form
2230 -123 -807 -383 750 1102 137 -1024 -845 424 1150 506 -591 -813 49 703 361 -249 -238 208 255
2249 255 -264 -427 200 831 407 -671 -961 4 1111 860 -454 -1164 -407 761 869 -70 -733 -400 293
2268 293 326 -183 -284 122 298 -200 -741 -385 595 822 -118 -1107 -835 445 1074 311 -855 -969 0 754
2288 754 411 -363 -532 -21 290 -20 -326 8 555 280 -512 -750 122 1066 758 -474 -1049 -219 985
2307 985 1069 -2 -775 -368 533 693 125 -257 76 405 136 -323 -101 650 789 -57 -863 -501 690 1182
2327 1182 291 -880 -868 229 995 499 -458 -657 -25 408 150 -247 -107 262 141 -456 -597 79 783
2346 783 467 -642 -1118 -270 906 830 -306 -1089 -591 456 713 -26 -579 -402 158 127 -277 -270 229 426
2366 426 -182 -832 -498 526 938 75 -1045 -917 257 1000 408 -630 -863 -81 567 272 -293 -341 82
2385H2P9m08j92N12N30k81r19l57Q85R89j71j139o57N65J094K38q07p24K54O72
2405B45J67m31k26L73K48l82n04K54Q37L23q14r19J49J175O82o80j136j54R13
2424A20P73l05p88j78M72L05k77l00K83M59k22p21k62P46Q39k47j100o26P08J108
2444G87J24r63p70L32Q01K71n07m39K15L27j71l84J02O20J95o34p61J99J070N34
2464I48o90j107j21J030P97l77r19k69N69N14j77m17M9L93j4n26k41O05P10k42
2484E15j000m97P88J057Rj043p76M58R54K68o08o00J71N04M3l78l5L95K21n06
2504f0n94K44Q85M11p10j011K9J038P30m33j024k86P08O93j84o01j22L70J62l04
2524e9k29L79N13j67q58l45P12R51n9j054p20N22J073K29p82p24K14O70J57m08
$$ plain form
2385 82 161 -247 -439 73 603 322 -597 -954 -69 920 749 -390 -1047 -482 612 850 43 -681 -427 245
2405 245 412 -19 -245 128 376 -6 -510 -256 581 904 90 -829 -680 495 1177 497 -639 -793 120
2424 120 893 588 -200 -378 94 399 122 -178 105 564 342 -379 -641 105 944 697 -403 -1029 -321 787
2444 787 911 -52 -822 -490 311 582 75 -364 -149 178 7 -377 -275 345 540 -94 -855 -656 414 948
2464 948 258 -849 -970 60 857 480 -439 -708 -139 375 198 -219 -170 223 209 -317 -558 47 757 515
2484 515 -485 -982 -194 863 872 -171 -947 -489 465 733 125 -475 -304 200 243 -135 -170 225 446 -60
2504 -60 -654 -410 475 886 176 -835 -806 232 962 529 -495 -781 -73 620 436 -165 -287 83 245 -59
2524 -59 -288 91 604 437 -421 -766 -54 897 838 -216 -936 -414 659 888 106 -618 -404 266 423 15
2544A5k58K69K61k98m69J64P52K80o93q83J23J024O03n48j017k38Q14P12j92p38
2564c17k74M35L55k01k97J63L81p6o52k57O40P71j20r94n97N97J062J96q53p94
2584h32K49Q40L08m85m43J68L38m3l84O5N16K71n52o99J23R66N57n96j057j30
2604h20R24P97l07q66l03M87N22j03m37nL26M8m24k32M65O04j29q79m77O06R61
2625G58J33q94p74L17R40L39o01n87N2N44J07l30j29L24K65m09n45J34P96M56
2645H96o48r57k8R48P36l99r94l25O36O74j20n89j74L43K14l01k59L21M53j46
2665B81p24l73O06Q61j5r40p07M37R72K89o78p00R8O22K62l05l11J67K80j87l85
2686d50P9O16K94m94p81j3R18O90m43j000k80P84P39j43p21k75M11M04j39l42
$$ plain form
2544 15 -243 26 287 -11 -480 -316 436 716 23 -860 -737 287 890 342 -675 -913 -99 613 421 -317
2564 -317 -591 -156 199 -2 -299 -136 245 169 -483 -740 -100 671 551 -443 -1040 -443 619 815 -38 -832
2584 -832 -583 257 565 80 -363 -195 143 100 -284 -219 297 568 16 -683 -560 406 963 367 -690 -820
2604 -820 104 901 594 -272 -575 -88 434 331 -106 -111 215 263 -161 -393 72 676 547 -332 -809 -203 758
2625 758 891 -3 -777 -460 480 819 218 -369 -317 227 334 4 -125 199 464 55 -490 -356 440 896
2645 896 248 -709 -737 211 947 548 -446 -771 -135 539 419 -170 -344 -1 213 -88 -347 -26 427 281
2665 281 -443 -816 -210 651 636 -304 -1011 -574 398 687 9 -691 -593 29 291 -14 -325 -158 122 -65 -450
2686 -450 -371 245 539 45 -736 -749 169 859 416 -584 -864 -80 659 516 -205 -480 -69 335 196 -146
2706a46J21M08n4n50k58M96P61p8q95o04N17R76K50q16p33K01P65L08m13m33P4
2727a03L53k0l18MM43J93m36o54J02Q35N27n24r38j87Q08P48k18p98l94M61N46
2748D30m4m71n3K67J12l37k70L85N75j13p81m88N08R67O8q24p67K46Q82L58n18
2769A32o52P1M68J57l05j72K73K33l38m82M8P31M00n26q83p4Q51O91l19q93l52
2790i41N94O31l3n72k06L16K25k11k25K08M51o5o08l55N22P89O6q21p24M16R45
2811D02L21o02p23P9O48K68k72l45J55L06j29l79L8N54L50m86p31k2Q61O19l66
2832E46r33l03O67P52j02o80l22L27M19r1k97K5L29K9m61k50M05O46j3p56n86
2853f49M10Q93K54o61p82J54P12L82l59m85LL84O5k95q9L73K75l89o01K2P57N28
$$ plain form
2706 -146 -25 383 329 -221 -479 17 778 700 -195 -799 -282 694 944 128 -605 -404 361 669 256 -177 -103
2727 -103 250 230 -88 -84 359 552 116 -538 -436 399 926 402 -536 -723 85 833 615 -183 -577 -116 430
2748 430 386 -85 -138 129 241 -96 -366 19 594 481 -300 -788 -280 687 755 -69 -836 -590 292 650 132
2769 132 -520 -449 19 176 -129 -301 -28 205 -133 -615 -567 164 564 38 -845 -919 -68 623 304 -589 -941
2790 -941 -347 284 251 -321 -527 -211 14 -197 -422 -214 237 172 -436 -791 -269 520 586 -235 -959 -543 402
2811 402 723 121 -602 -523 125 393 121 -224 -69 237 108 -271 -233 321 671 185 -546 -568 293 912 546
2832 546 -387 -690 -23 729 627 -53 -375 -48 371 280 -17 8 337 366 -95 -345 60 706 693 -63 -649
2853 -649 -239 654 908 247 -535 -381 331 713 354 -131 -128 256 321 26 -63 310 585 196 -405 -383 374 902
2875I02m51r00k44P38P37j71q19l78M14N60m9m23j31K78J11l42k35L06M70l5o79
2896c41m92M46Q36J70p47p45K13Q02L97m58o04j6M50K15k26k16K13K34j98m25
2916d92QO12M22m36p78j40P65P32k55q26l97N13O96nn21k87K73L04j36k52J20
2937h0M30nn72l55M20P50N8p68o29K85Q79L26n63o72L7N88L04k67l64J03K60m4
2959A21l75L9M43L23l90o32j14P36O21l13q63l13N77O93Qo67l48L03M01j3l14
2980g7l3L05N3l84k81L51N87O1p06n68K89R09K59o37p22N8P12L72l37m96rL27
3002C3J27k63j06L01K57l19n19KO31M91l57q23k29O78O88j31p19l90L73N41O6
3023C32l98k22K86J33k00k17K17M68oo00m16L38Q15K26o89o84J30P81M43m43o14
$$ plain form
2875 902 451 -449 -693 45 782 611 -208 -586 -172 388 339 -84 -215 63 174 -168 -403 -97 373 338 -341
2896 -341 -833 -387 449 619 -128 -873 -660 142 539 81 -523 -539 -89 126 -100 -316 -103 131 -67 -492
2916 -492 -484 128 550 114 -664 -804 -39 693 438 -388 -785 -272 424 419 -102 -389 -116 188 52 -200 -80
2937 -80 350 345 -227 -582 -162 588 646 -122 -751 -466 413 739 176 -496 -459 129 433 166 -198 -95 165 121
2959 121 -254 -215 228 551 161 -471 -585 151 772 459 -404 -717 -140 553 561 -106 -454 -151 250 237 -77
2980 -77 -110 195 248 -136 -417 -66 521 582 -124 -692 -403 506 765 128 -594 -536 176 548 211 -285 -294 33
3002 33 160 -103 -209 92 349 30 -489 -487 144 635 278 -545 -774 -96 592 461 -258 -648 -275 266 332
3023 332 -66 -288 -2 131 -69 -286 -69 399 393 -207 -623 -285 530 756 67 -617 -487 294 737 294 -320
3044c20lM64K39k26k35J35K82j89l97J4N31M21m26p14j30O58O54j91q08l54M29
3065a66O28N0n19l13J88L18j08k39Q0L01rm08l52L25O61J23o59o55K04Q11L97
3086F58n24o52l2N65L25k38l54KL01jk94n8M02L02l13o34q6P05N48k64q13l04
3108g59N56O42j2n96l46K50M31%k95q8K75M8k95k39K51N68N3o52m81K96P26K87
3130F20n36o73M5O50L95k75n10l0L63J44k07j45K28K64k04m54j8N27N00k97p19
3151c32k52N78O82k3p03m22L46N60Rl62j89J84K07j70k33J50L87L9n15m60L63
3172a56O75K15o24o26J02O83L89l65n72p9M32K18j87k33R2K02q1l43k7M15L57
3193D87k94o68j30N71O21j40p29l78L65O29M7m32l39J99L20o8j92OL04K3l83l05
$$ plain form
3044 -320 -323 141 380 154 -81 54 336 147 -250 -236 295 716 290 -424 -554 104 758 567 -241 -595 -166
3065 -166 462 512 -7 -320 -132 186 78 -161 -81 220 211 -197 -549 -224 437 560 -99 -754 -550 261 658
3086 658 134 -518 -550 15 340 102 -252 -250 51 50 -244 -302 100 402 89 -545 -631 74 622 358 -455 -759
3108 -759 -203 439 427 -169 -515 -265 166 166 -129 -217 58 106 -189 -428 -177 391 444 -208 -689 -393 333 620
3130 620 84 -589 -544 106 501 226 -284 -314 49 193 -14 -159 69 333 129 -325 -343 184 684 387 -332
3151 -332 -584 -6 676 653 -50 -472 -126 434 443 81 -108 76 283 113 -120 30 417 456 -59 -519 -156
3172 -156 519 734 110 -516 -414 269 658 293 -279 -358 74 292 105 -128 -36 166 85 -258 -285 130 487
3193 487 193 -475 -605 -34 587 447 -282 -660 -295 334 381 -51 -390 -191 129 61 -131 -125 179 202 -181 -486
3215d86K57O22J46o15n86J99P24L78m71o19o8N42L46j98l80kK54M2k47p9L06L00
3237C65k58n16p8N08N49j84p21l11M58O27J3n18l92K05M48L6k77j11J88J43k33
3258e9k77J59N13R8n26m93K38O81L26n24o56M5O11L87k56m79p0L15J86k09j36
3279a26J51K69j75m01n3M64M45k50o83k34N09O43m2o44m06K84N00J12l59k25J28
3300i3K29j13k07J04L15R6m41l66K06O54K03n05n85K5O50M41l33n49j17M02K93
3321C09j39k92O5K38o4k74p6L80L45k12o21j74N23O08j20o52l71L27N89O3m38
3342A4l21J54L32m6k10j3K41N2l36k71K15N48J01m86n64J54O49L31l72o08o7M62
3364d1L62j42l76m5K21J13k08j02K11K85j59m85j38M99N14j65o28l48L98O39K4
$$ plain form
3215 -486 -229 393 539 -76 -662 -463 261 639 168 -451 -519 23 369 171 -209 -211 43 85 -162 -241 65 365
3237 365 107 -409 -487 21 570 386 -335 -646 -188 439 452 -66 -458 -253 195 231 -46 -157 31 174 -59
3258 -59 -336 -177 336 434 -92 -585 -347 334 660 136 -520 -475 136 523 267 -212 -282 33 219 10 -126
3279 -126 25 294 119 -282 -335 129 574 324 -359 -593 -84 559 517 -127 -533 -249 251 363 4 -221 -93
3300 -93 136 23 -184 -80 235 331 -110 -476 -270 384 587 82 -503 -478 172 613 280 -269 -386 16 309
3321 309 170 -122 -57 181 117 -157 -233 147 492 280 -341 -515 8 616 496 -156 -527 -200 389 452 14
3342 14 -307 -153 179 133 -77 -90 151 203 -133 -404 -189 359 460 -26 -590 -436 213 544 172 -436 -503 -41
3364 -41 321 179 -197 -242 -21 92 -116 -218 -7 278 119 -366 -504 -5 509 344 -284 -632 -234 405 429
3385D29n25l67J86M29M2k50j35J85J23j81k31J53M06R8m67m29J75O22K69m27n69
3406d64pN10M01j88m62r4K76K05j21k09J70K09j15l55r1M24M02j69n83k56M26
3427i1O03J8n69m11K35N17J07l28k52J46K17n9k18P2L23L1l52l33J87N54J98m34
3449A61n82L4N89L75k64n19j36L93K61j20k31k7K09k9k36m3K68L00j37n58j65
3470d57M58N30n4o16l71K83O00Q9l88l69J42K86O2k08r1K19J05k49l06J98M65
3491C28J38m36n12Q2O12L58l55n64q7M33L91k06l39n5K21J00j60j19J90K24j51
3512I3m19r8L95M49j19n98l02L38N92O2m87l79J72L64J12k18j87J28J30j08j95
3533b75R6L30R9l48m21J24N60L06l52o00l1M95M35k14m29j20K51K55j36j65Q0
$$ plain form
3385 429 -96 -463 -277 152 194 -56 -191 -6 117 -64 -295 -142 264 362 -105 -534 -359 263 532 105 -464
3406 -464 -471 39 440 252 -210 -304 -28 177 56 -153 17 226 111 -244 -335 89 491 322 -261 -517 -91
3427 -91 512 530 -39 -450 -215 302 409 81 -171 -25 192 133 -85 -13 310 341 -11 -344 -157 397 595 161
3449 161 -421 -387 202 577 313 -206 -342 51 312 192 -39 -66 143 114 -122 -165 103 403 266 -292 -457
3470 -457 1 531 477 -139 -510 -227 373 462 74 -295 -153 133 195 -13 -104 115 220 -29 -335 -137 328
3491 328 466 30 -482 -400 212 570 215 -349 -436 -3 388 182 -157 -212 9 109 -51 -170 20 244 93
3512 93 -326 -424 -29 420 301 -297 -599 -261 331 393 -94 -473 -301 63 175 -43 -230 -102 28 -80 -275
3533 -275 -179 151 250 -98 -519 -395 165 471 119 -481 -512 -17 418 204 -225 -345 -94 161 25 -140 -60
3554f0J75m1l30m9L34L64j22n63k38M09N20L1n16l82K18M57J40l23k36J16J78
3575H2j2k08M9K54O3k69l07J29M99K26m00n27J2N59L82k58m61j54L53K99p0k80
3597c9lJ58M9k09o3K32K65r3m90j86L87N06m2n18m11K84N02J31l80l39J08K79
3619A28P2j81q0J58P5j97k25J06L95J30l52m72N1N44L36k75n48r9L56L81j18l51
3641a66r6K15J47j14j49J33K25o7l64j54L67M27j04m99l09L03N46J08m59l73J53
3662b30L76J35k32j74J03J53p7k03O8L42R5l34l73R2N26K44l39n11o6M50L66j30
3684B81m17j23K14K31o4j84K3J73m1k53r0K88L31j08m67k40L24N15M2m62l93J44
3706b76M75J62k85k94N9K59jj74k2J81J42k76k94Q3M83K09l57m68l3M97L76k14
$$ plain form
3554 -60 115 74 -256 -305 29 393 271 -292 -530 -121 399 430 -86 -468 -250 207 347 24 -212 -96 82
3575 82 70 -138 -89 165 228 -41 -348 -219 280 506 106 -421 -409 150 532 274 -187 -341 12 311 241 -39
3597 -39 -42 116 165 -44 -107 125 390 297 -193 -379 8 514 472 -46 -457 -173 329 460 80 -259 -151 128
3619 128 200 19 -61 97 172 -25 -250 -144 251 381 29 -443 -392 152 488 213 -335 -434 -78 303 185 -166
3641 -166 -262 -47 100 -14 -163 -30 195 128 -236 -390 -23 404 300 -199 -508 -205 341 449 -10 -383 -230
3662 -230 146 281 49 -125 -22 131 54 -149 -81 261 356 22 -351 -259 267 511 172 -339 -405 45 411 281
3684 281 -136 -259 -45 186 122 -62 -39 134 93 -160 -250 38 369 261 -206 -446 -122 393 435 -27 -420 -276
3706 -276 199 361 76 -218 -159 100 99 -75 -97 84 226 -50 -344 -261 222 431 74 -394 -427 70 446 232
3728B32m85j38L18K79q7k41n0J56M3j45j10J80K69j13l95j61L29M43k4m74l24
3749d98K24M48J63l39l18P4K69R5j43r1J25J10j51j92O0L95J58l07m29L4M72L39
3771D98k21m92j17L60L66j02l24j03J51J82q2j40J30J89p5l28j16L10L49m7m66
3792g8k89K65M70J02m04l38P4L64J29j92k15O8J33l1j85K0K52J20k62l57L6M64
3814A46K70k86m70j02L94L94j15m17j30J97K34m2j98K1J31J1k25j00K38L18q4
3835A85m24k48K81M76O9m22l70J30M39J40k41k78K5K52J4j41m9K20M6j74k70O1
3857b79M12J85k69m37m7M31L73j55m39j76K93L12k9k53q1J51P6j25q8J51K39n7
3879A88l32j98K79M27K1m20l28J65M77J56l14l05N3K91Q6j35j33J06J12j17j92
$$ plain form
3728 232 -253 -391 -73 206 119 -122 -172 -16 27 -118 -228 -48 221 108 -287 -448 -119 324 300 -174 -498
3749 -498 -274 174 337 -2 -320 -246 23 118 -25 -116 9 119 -32 -224 -164 231 389 82 -347 -313 159 498
3771 498 277 -215 -332 28 394 292 -32 -135 16 198 116 -24 106 295 220 -108 -224 86 435 388 -78
3792 -78 -367 -102 368 470 66 -272 -198 166 295 103 -112 -44 89 58 -127 -107 145 265 3 -354 -318 146
3814 146 416 130 -340 -442 -48 346 231 -186 -316 -119 115 73 -125 -104 27 38 -187 -287 -49 269 185
3835 185 -239 -487 -206 270 339 -83 -453 -323 116 256 15 -263 -238 14 28 -113 -162 58 104 -70 -340 -279
3857 -279 133 318 49 -388 -435 -4 369 214 -225 -401 -108 204 175 -78 -159 -8 68 -57 -145 6 245 188
3879 188 -144 -342 -63 364 385 -35 -363 -198 279 435 121 -184 -131 160 246 111 -22 84 196 79 -113
3900a13N1L00J60k73m07jM44L00k03m47j46L11L49o3k91j63J52J44m1j39P4J47
3922A45qk74j23K23L41j9m03k99J93M84J22l35l72N4L44J80j88k07M5J51Oj46
3944h6%K10J27k33l14K8M03K58k40m13j29L73L68j07l52j87J95K60l0k05OJ41
3966G3Kj88j02K00K44ml78k56K41M49N2l67l80J18L97J65j84l17K0K18O3j16n6
3989a06J45J05j78k19N1L49J91k38m05n5L89L63j20m39j56K41L31l1k30j01J15
4010BR9j09p4J08J98m4k68j86K28L71L3l74l43J52L94J96k82l28K7K35J53j24
4032F4j59O9J32q1j61K1K51J42k12l52J0L66K93j58m49j50L35L16j4k95j65J41
4054e6J71m3j85R6J31k2j89j48K27K88nl93k53J92M59O6l04l32N6L17J44j51k03
$$ plain form
3900 -113 -62 238 398 125 -282 -283 161 461 258 -189 -335 -24 325 262 -29 -192 -40 104 63 -76 -2 145
3922 145 137 -137 -260 -37 304 285 -118 -417 -224 260 382 47 -325 -271 73 253 65 -142 -97 54 60 -86
3944 -86 -86 124 251 18 -296 -268 135 393 153 -260 -389 -16 352 245 -107 -294 -99 161 131 -74 -68 73
3966 73 75 -113 -215 -15 229 225 -153 -409 -168 281 333 -34 -414 -296 101 266 82 -235 -215 3 66 -50 -106
3989 -106 39 144 -34 -253 -202 147 338 100 -305 -360 29 392 272 -167 -323 -82 249 218 -12 -113 2
4010 2 101 -8 -82 26 224 180 -88 -274 -46 325 358 -16 -359 -207 187 383 101 -227 -200 35 188 64
4032 64 -95 -26 106 25 -136 -115 136 278 66 -286 -276 90 383 225 -224 -374 -39 277 263 -32 -197 -56
4054 -56 115 72 -113 -17 114 92 -97 -245 -18 270 265 -128 -381 -189 270 336 32 -300 -244 73 217 66 -137
4077a37%J50K3j46NJ77R8j75k88K9L33K55j87m06j43L41L34n2l51j70J79K47j5
4100A01j83m9J32L4j57o9J48K51k0l44j71K01L81O8l32l40J12M04J34k08k53J8
4122a42J86Q7j12o4J31N5j18j92J1L20J33j51l55p5L49K84r5l96j53K16K94k6
4144A87j91j25J31P3k7j22O5J88m0k30j66J79L39M6l34l28J26M16J47k30l25J2
4166b09K46J54j32j49L6J27l0j36%K01J36j57l33m6L66K74j36l77j63K77L01J
4188B51k94j33J15J54l3j27K4J11K0j55j25J69K60ll17k43J60L84J23k86k99J0
4210b34L18J70j42k18rJ55J4r3k6J36J38j57k65L7L00K08j57l71r4K92L24q1l44
4233i9j61J69K25%j55o8J12L8r8j14J32J83Rk88k04K19L12M9k71k94M5L63J65
$$ plain form
4077 -137 -137 13 36 -110 -105 72 170 -5 -293 -264 69 324 137 -269 -412 -71 263 211 -140 -310 -131 116 101
4100 101 -82 -131 1 35 -122 -191 -43 208 188 -156 -327 -126 255 323 -9 -349 -237 167 301 93 -160 -142
4122 -142 44 131 19 -45 86 141 23 -169 -158 162 295 144 -211 -286 63 347 252 -144 -297 -81 213 187
4144 187 -4 -129 2 75 48 -74 -9 179 139 -91 -257 -78 261 307 -27 -355 -229 187 334 104 -221 -209
4166 -209 37 191 59 -90 -54 73 43 -93 -93 108 244 87 -246 -292 74 348 212 -165 -328 -51 250 251
4188 251 -43 -176 -61 93 60 -67 -43 68 88 -67 -192 -23 237 234 -83 -326 -166 218 341 55 -244 -234
4210 -234 84 254 112 -106 -115 40 54 -39 -65 71 209 52 -213 -176 124 332 175 -196 -290 2 326 245 -99
4233 -99 -260 -91 134 134 -21 -89 23 61 -37 -151 -19 164 173 -115 -319 -100 212 261 -10 -304 -259 104 269
4256B69j70k63j8J74J05q6p7M6P0m8j74J6K24J89j94k85p3L16K78q9l44j92K43
4279h3K91pk31j36J20J21o6q4Q4J38k8k28j44J87L34mk93k70R7L50J41k00k76
4302a87m1K66J12p5j26NQ2Jj27rK11Q6j56k71pK97K48j15l62j32K29L11m4k80
4326h4j22R9K06Kj40KQ6L2j57j04J36K14L4l04k13J51L77Q4k50l02kL07J53j23
4350H2k03KJ39L9j09j6J02R0j21k26KK71K15j45l50j15L07K85l9l11j53J52K27
4373A25Pj56m7P4O3p4o6O9J67J4k22j83J52L10R5k66l17Q5L21J68j92k26j9J82
4397F4J24j08r0L2J33q2j57LK00J71j86k65n2K59K67p8l23j78J77K54L4j95j40
4420a36P7J14k7j13K6J49j4j80j04J23K41L9k50k61J02L29J59k23k92j8K52J45
$$ plain form
4256 269 99 -164 -182 -8 97 11 -66 -20 50 2 -172 -156 68 257 63 -222 -295 21 299 210 -134 -326 -83
4279 -83 208 201 -30 -166 -46 75 9 -75 9 147 119 -109 -253 -66 268 264 -29 -299 -202 148 289 89 -187
4302 -187 -228 38 150 75 -51 -46 36 37 -90 -99 112 198 42 -229 -236 61 309 194 -168 -300 -71 240 196 -84
4326 -84 -206 -107 99 101 -39 -37 49 81 -76 -180 -44 170 204 -100 -313 -162 215 299 49 -253 -255 52 205 82
4350 82 -121 -119 20 59 -50 -66 36 126 5 -221 -219 52 267 122 -228 -343 -36 249 210 -101 -254 -102 125
4373 125 132 -24 -71 3 66 -8 -74 -5 162 176 -46 -229 -77 233 328 62 -255 -170 151 319 127 -99 -118 64
4397 64 188 80 -10 22 155 73 -84 -81 119 290 104 -161 -213 46 313 235 -88 -266 -89 165 199 4 -136
4420 -136 -59 55 28 -85 -59 90 76 -104 -208 -85 156 195 -55 -316 -214 115 274 51 -241 -259 -7 138
4442A38o5j63kJ04J0j05k9J78R5j35k44j9K64K28r6l40j13J88L09k4k49j58J34
4465i4J74%j26k3J15K1j60n9J46J78%k57j92J10L40Q6j90k97%K65J76j14j70l1
4489a02J10R3j21j9R7J01j18j45j8K09J88q8l40r1K59K78m5k72j58J47K15K0j65
4512C5q3Q1N5o4p2Q9J45j2k44j21J18K78O9k44k65M0L13J52j65k09m4J35J15n5
4536D7j10L4O8l6j25J7J66J21r3k83o7K42K42m0l00j60J62K48K6j92j17Q5J30
4559F5pj07j0J24K3j27j43J34K25O6k61k54J08K58J69j73k79mJ97J45o4j60RQ5
4583A9L1j07l5J38Q5r4k25l4K44K07r1k94j33J97K56Mk07j71Q9J58L9j06o4Q0
4607a4M9p2p6O3J82M2k30j89P7K96J57k26k64J3K63J47j06j79k9J01R0p0n3Q0
$$ plain form
4442 138 73 -90 -92 12 22 -83 -112 66 161 26 -218 -237 27 255 159 -181 -294 -106 203 179 -70 -228 -94
4465 -94 80 80 -46 -69 46 67 -93 -152 -6 172 172 -85 -277 -167 173 259 69 -228 -228 37 213 99 -71 -102
4489 -102 8 101 -20 -39 58 159 41 -104 -122 87 275 187 -153 -244 15 293 248 -24 -182 -35 180 200 35
4512 35 -48 33 88 24 -48 41 186 174 -70 -191 -73 205 274 30 -235 -195 118 270 105 -104 -148 -13 102 47
4536 47 -63 -29 39 3 -122 -105 61 182 89 -194 -261 -19 223 183 -117 -277 -115 133 159 -33 -150 -65 65
4559 65 58 -49 -59 65 88 -39 -182 -48 177 243 -18 -272 -164 94 263 90 -189 -193 4 149 85 -75 -66 19
4583 19 50 -57 -92 46 131 37 -188 -222 22 229 138 -156 -289 -92 164 168 -39 -210 -121 37 76 -30 -94 -14
4607 -14 35 -37 -113 -50 132 174 -56 -245 -168 128 285 59 -205 -192 71 218 112 -67 -96 5 95 25 -28 52
4631E2O5m6j73j1J84J75j16k87p6K02K69l4k38j80R3K18P4j71q5M0J03l1j19N1
4655d1J26L2j61j67J05K28J00k17k40J7K74J51j25k01l7J51J30q7q2KJ12j4j36
4678h0j9J52J35r7k03j07J97K76o2k57j77J44K58K2j76j19L4J19K8r3j1P5M6j35
4702e0r8J00J73N8j95k14M3K58J58j45k77j2J60J71n0j50k6Q6K8n4l9Q6J37p4
4726G4k11m1J75K16m7k53j50J69K70J7k08j56O9J42N6j03l4O5L2r2n3L3J67M2
4750A79j55j82M1K70J17j62k62m2K31J51n7j93m1J00P1l0o6J5Q9l8j52k4J61J64
4774A85p0k94o3J95K36pk25j50O7K11M1j32p9J1J19j3j11L3J33J5j71q8L1K41
4798A15R1j75k29PK33J62j04k03l1J26J15l4j17kR0l7o9l9J31J22p2k07n5J40
$$ plain form
4631 52 117 71 -102 -113 71 246 130 -157 -233 -31 238 204 -34 -214 -121 97 171 0 -85 -45 58 27 -92 -41
4655 -41 85 117 -44 -211 -106 122 222 5 -235 -218 56 207 82 -119 -156 -5 125 38 -44 -42 70 56 -80
4678 -80 -99 53 188 91 -112 -219 -22 254 192 -65 -242 -98 160 182 6 -113 -79 40 68 -25 -36 39 85 -50
4702 -50 -148 -48 125 183 -12 -226 -183 75 233 88 -189 -201 -41 130 80 -70 -96 -10 18 -36 -75 11 148 74
4726 74 -137 -178 -3 213 166 -87 -237 -68 202 219 11 -145 -76 66 122 19 -15 50 82 -10 -63 -30 137 179
4750 179 24 -158 -117 153 270 108 -154 -196 35 186 129 -64 -105 -5 66 36 -30 -15 74 36 -116 -140 21 185
4774 185 115 -179 -242 -47 189 182 -43 -193 -126 85 126 -6 -85 -74 45 32 -79 -46 87 102 -69 -157 -126 115
4798 115 206 31 -198 -191 42 204 100 -103 -134 -8 107 73 -44 -46 44 7 -62 -101 30 152 80 -127 -182 -42
4822d2K28k8k35j52J06K42O2j96j16L0J36L2q3k6Q4Qj05q3P6K07L5j85j62L7K08
4847G8J49j28k48k0J87J38o8j36k4O7N5n5n3R4O2m5j71l7J59K04m6k53j24J44
4871g1K27J1j62j49M2J70M5j00n9K5O3l4j10M9J44O1j77j61M7K21J17j28k43J1
4895a61J51J99q1j82l8R9Q9m2n5K4P1k4j26j7J54J24q5j98q2J36K15Qj92j44O0
4920i7J82M5q8r8K6P1J3p6K4M7M6j09j23O9J41J01j43k16QJ98J70q4j96r1J13
4945f7J42nr7k7M4M5q9k0N3J42o3j85n7J50J84Kk11j65J31J82P0j42j51L2J22
4970B0L2o5j6L9O3j05r5Q9J16O7j22j88J2K25Q8n2k12n0J47J76n7j31n8O4O9k7
4996B9o5O9Q4p0j24l2J16J93k5k21j38J42J98N3j54k03N0J68L8o4j02N8Q3o9o8
$$ plain form
4822 -42 186 158 -77 -229 -123 119 181 -15 -131 -101 35 67 -16 -42 42 50 -55 -138 -62 145 180 -5 -167 -130 78
4847 78 227 99 -149 -169 18 156 88 -48 -72 -5 50 -5 -58 36 98 53 -118 -155 4 208 162 -91 -215 -71
4871 -71 156 167 5 -144 -102 68 113 13 -46 -21 42 8 -102 -53 91 152 -25 -186 -139 82 199 71 -172 -161
4895 -161 -10 189 108 -74 -112 -13 76 34 -21 3 74 50 -76 -93 61 185 100 -98 -180 -44 171 179 -13 -157 -97
4920 -97 85 130 42 -56 -30 41 54 -22 2 49 95 -14 -137 -68 73 174 31 -185 -177 21 191 107 -89 -180 -67
4945 -67 75 70 -27 -54 -10 35 -54 -74 -21 121 58 -127 -184 -34 150 152 -59 -224 -93 89 159 17 -134 -102 20
4970 20 52 -13 -29 10 73 -32 -127 -38 78 145 23 -165 -153 72 160 108 -104 -154 -7 169 112 -19 -77 -13 56 29
4996 29 -36 33 117 47 -77 -109 7 200 175 -46 -184 -42 156 209 55 -148 -98 70 108 44 -58 0 83 14 -54
5021e4K6J10K4q9j46M0J82J09j18k24j4J59J48l6j83o8J01O5j0o4L1N7j8j05j5
5046i2R2J20k3j75j22J00K20L7k04j44M2J85O7j14p6J5O9Qn5k7J16M1r7j39O6
5071i0J71P0j27j85j0K06J12o4j88l7R0J55k8q8m5P8J8q1nO3R2k9j70m8J09K00
5097A69lk09j28R4J83Q8j52j20K5J14K8o8m9O1M0m4o0JJ12O1r8j68K5J77J30r0
5123A19j54r6J41J20pj37n0O1N3l7k6K7M7%j23p0J30J46k2j89j07J04J70L8j55
5148a7j27K0J24Q2n9j01L6M8k2o0K4Q2O0j07j31K4J56J15q9k03l4J60J47j7j65
5173e4n8N3J29j1j04J4M8om5n4R3J10k3j58r1Q9K02K1j37j75O4J63O7j19r0nJ09
5200C2K2p2%K7P4o6r1J0J35Q7r6j97pJ65J28o2j31p6P6J23j1n8n3M1N1n8n1O9
$$ plain form
5021 -54 -28 82 106 17 -129 -89 93 202 84 -140 -154 5 153 117 -66 -134 -33 32 22 -42 -11 46 28 -77 -92
5046 -92 0 120 97 -78 -200 -100 120 157 -47 -191 -149 36 103 -11 -87 -72 -3 5 -50 -77 39 80 -17 -156 -90
5071 -90 81 151 24 -161 -171 35 147 83 -105 -142 -52 103 75 -13 -58 20 38 -43 -48 15 107 78 -92 -140 -31 169
5097 169 166 -43 -171 -77 106 194 42 -78 -53 61 89 21 -28 33 73 29 -31 -30 82 143 45 -123 -98 79 209 119
5123 119 -35 -131 10 130 123 -14 -64 -3 50 13 -13 14 61 61 -62 -132 -2 144 122 -67 -174 -70 100 138 -17
5148 -17 -144 -124 0 82 23 -78 -42 6 -16 -76 -52 30 90 -17 -148 -124 32 147 58 -145 -179 -19 128 111 -54
5173 -54 -112 -59 70 59 -45 -31 17 11 -34 -88 5 115 92 -66 -157 -68 134 155 18 -157 -93 70 137 18 -72 -77 32
5200 32 54 -18 -18 9 83 17 -74 -64 71 158 62 -135 -142 23 151 89 -42 -118 -42 81 70 12 -41 0 51 -7 -58 11
5228A1P6J5j51o0R7J61J7j61j40N8J86L8j02j30RJ02K3j6n9J8Q4p3q4L9J19L4
5254A11p0j86K7J80R9q4j84n9J16J47qj08o1J4R1j8m2QO1k2r8l7P9J41Jj56j14
5281a72Q6J85L0j21j10mJ40P5o1r8K3O6J0p0NJ14J7p9j20%J40J19r1j80l9J62
5307B7J09j6j55n8Q8P6Oq5J1J2Ro7k6N1J17m7q0j24R4J52L4j48j30K7J75N1q5
5334A8p3JO7J8m3j8M0N3q0p7M2J33Q0j17j53k1J27J66o5j48o4Q6J14Kp0n9M8M2
5362D9l4l5K6O9Oj33m2J03R3K8j49j14N2J46P7j04j20k3J11O8n9n1K6L2k1o5J6
5389d8J14L8q6j34j3J50J23n5j44p9J20J35j9j46l4O9K8J6k7%O7k7p2m7O4J50
5415A43l7j37p1O6J52M2j03j35k3J54K7j4j04NN3j6j5j0P0Rq9m6n1J33J26o4j65
$$ plain form
5228 11 87 102 -49 -109 -12 149 166 5 -135 -77 109 147 45 -85 -76 26 49 33 -26 -8 76 3 -81 -42 77 111
5254 111 41 -145 -118 62 161 77 -107 -166 -50 97 89 -19 -80 -66 25 7 -35 -27 34 12 -86 -123 -44 97 98 -58 -172
5281 -172 -86 99 129 8 -102 -106 34 109 48 -50 -27 39 49 -21 -16 98 115 36 -84 -84 56 175 84 -96 -135 27
5307 27 136 120 -35 -93 -5 71 77 -8 3 15 24 -43 -69 -18 99 52 -28 -152 -58 94 128 -20 -150 -123 52 103 18
5334 18 -55 -54 13 31 -12 -30 10 63 -17 -94 -52 81 161 44 -109 -130 -3 163 98 -50 -114 -28 86 88 18 -41 7 49
5362 49 15 -20 6 75 81 -52 -94 9 102 130 -19 -133 -81 65 142 38 -82 -105 6 74 15 -36 -10 22 1 -64 -48
5389 -48 66 104 18 -116 -129 21 144 89 -55 -134 -14 121 102 -44 -78 -9 19 35 8 8 75 48 -24 -71 -7 143
5415 143 106 -31 -102 -36 116 158 55 -80 -103 51 78 64 -40 -35 18 2 -13 -23 47 56 -33 -79 -130 3 129 65 -100
5442a00m5J15J15mj55o2R6P0J1r3j2N4J2m4k5M9Q3J6j33q4Q1J58L1j28j58O6J47
5469F1O7r9r3kJ05K5o1k6K5L4pr1j9J55K9n9j26k9J20J16k2j78l8P4J20J2r8m5
5497e0M3K9k0j5K1M3lo8o6N6J46J3j39j16N7J28P5j00j38L2Q9M3k3n2QO8l7n1
5525b7LP8N0p3j08lJ27R6o6j27o8J16J32%j33m8M9M2ok6KM2rp5n6M5J06J4j36
5554e9r0Q9J33J4j20r1L4O5R1o6r1L5N3nk5j3N1L0l1j05k1J52O4m4j49l7R7J43
5582A04%j20j05P6J30l0m9j0K7K6n4k6N4N8kj16o0Q2J08M4j15j25J9J40R0j08
5608C8p9KL8O2j7o8K6L0j9o1j0Q2N7k9j33m8J41R6l7r6q3N7J39pr5n4K8O3J6p6
5638c7K4N5Lj07rM6J12J8j23q7L4J49N5p8j39J1P0P9m2p2K1L6j0k3j9P8K1n7j06
$$ plain form
5442 -100 -145 -30 85 81 -74 -136 -40 30 41 -52 -64 -10 2 -42 -67 -18 65 81 -52 -136 -55 103 134 6 -152 -86 61
5469 61 128 29 -64 -66 39 64 3 -23 2 36 29 -62 -81 74 103 44 -82 -111 9 125 103 -75 -113 -39 81 93 -5 -50
5497 -50 -7 22 2 -13 8 51 48 -20 -86 -30 116 129 -10 -126 -69 59 134 34 -104 -72 17 60 37 -15 -7 61 24 -27
5525 -27 -24 54 104 31 -77 -80 47 143 77 -50 -118 -2 130 130 -3 -51 -2 40 34 8 10 52 43 -32 -88 -43 63 77 -59
5554 -59 -149 -60 73 87 -33 -124 -90 -25 66 0 -91 -56 -3 -8 -33 -46 5 35 4 -101 -122 30 94 50 -99 -136 -39 104
5582 104 104 -16 -121 -45 85 55 6 -4 23 49 -5 -31 23 81 79 -37 -97 -15 93 137 22 -103 -84 56 146 38
5608 38 -41 -39 -1 61 44 -24 2 32 13 -48 -58 24 81 52 -81 -129 12 108 71 -25 -108 -51 88 81 -14 -68 -40 23 39 -37
5638 -37 -13 42 45 -62 -71 -25 87 105 -18 -105 -71 78 133 55 -84 -73 -3 76 34 -38 -17 19 9 -14 -33 45 66 9 -97
5667i7MJ06J22p6j40k4N7J37jj16p0M7Q1mo0J8J7L0o7k0M6O9kr7p3J7J59N5r2
5696B6r0j3J05O7l9r3PP8k7kk2K6L0j4q7J7Q3O8l3j38l3J12Q2mq2j05N6J07J4
5725I6p5o1M8K0k9k7L1O3jq5p3M0J19M1q9j10pJ59M9n3j12j6N7O0l6k7j5Q4m7
5754Dp6J0Q2P9q1j08j4J09Q9k1q8o8K7J11M3q6p8M8K3Qk9LN8k9k3p0N7R0Lq5q2
5785i4J2J17Q2j16q3j1Q4P1k1p3J2N1j3n1j6Q7J7rr8k2R6O4k1j26o6J03J05L9
5813A20j31o0OQ0L9m7jKL3l2l9J5R1Pq1p4L5J35K3m5j30k1J03Q3l9q1l4N4L5l7
$$ plain form
5667 -97 -93 13 135 59 -81 -105 -48 89 88 -28 -98 -51 30 26 -34 -16 1 31 -36 -56 -10 59 57 -40 -113 -96 63 118 26
5696 26 -64 -77 28 95 56 -37 -30 48 21 19 -3 23 53 39 -48 -31 52 120 87 -51 -84 28 110 106 24 -81 -25 82 96
5725 96 21 -40 8 28 -1 -28 3 66 65 -20 -93 -53 66 107 18 -92 -99 60 109 56 -56 -72 -15 45 9 -18 -33 51 4
5754 4 -72 -62 20 99 18 -90 -104 5 94 73 -15 -83 -56 55 98 12 -66 -18 5 13 -16 -13 45 16 -7 -77 -20 70 73 -12 -94
5785 -94 -82 35 117 1 -82 -93 -9 62 41 -32 -20 31 18 -33 -49 38 55 46 -52 -74 22 86 65 -61 -127 -24 81 120
5813 120 -11 -71 -65 15 54 7 6 8 41 9 -30 -15 76 83 2 -72 -37 98 121 76 -54 -75 28 111 72 -9 -43 11 46 9
$$ [...]
8191B6
##END NTUPLES=NMR FID
##END=
