##TITLE=1H_AM A508
 CDCl3, 8 sc, 
 26.7.2019
##JCAMPDX= 6.0         $$ Bruker NMR JCAMP-DX V2.0
##DATA TYPE= NMR FID
##DATA CLASS= NTUPLES
##ORIGIN= UXNMR, Bruker Analytische Messtechnik GmbH
##OWNER= root
$$ XWIN-NMR		Version 3.5
$$ Fri Jul 26 14:43:04 2019 Russian Standard Time (UT+4h)  she@DPX200
##.OBSERVE FREQUENCY= 200.13155
##.OBSERVE NUCLEUS= ^1H
##.DELAY= (6, 6)
##.ACQUISITION MODE= SIMULTANEOUS
##.ACQUISITION SCHEME= undefined
##.AVERAGES= 8
##.DIGITISER RES= 18
##SPECTROMETER/DATA SYSTEM= spect
##.PULSE SEQUENCE= zg30
##.SOLVENT NAME= CDCl3
##.SHIFT REFERENCE= (INTERNAL, CDCl3, 0, 15.7039)
##AUDIT TRAIL= $$ (NUMBER, WHEN, WHO, WHERE, WHAT)
$$ ##TITLE= Audit trail, XWIN-NMR		Version 3.5
$$ ##JCAMPDX= 5.01
$$ ##ORIGIN= Bruker BioSpin GmbH
$$ ##OWNER= she
$$ F:/spectra/data/she/nmr/H-F/1/audita.txt
$$ ##AUDIT TRAIL=  $$ (NUMBER, WHEN, WHO, WHERE, WHAT)
(   1,<2019-07-26 14:42:12.00 +0400>,<she>,<DPX200>,
      <created by zg, POWCHK disabled, PULCHK disabled
       configuration hash MD5:
       00 E9 B6 7A A2 85 ED C7 34 08 36 98 17 FE 4E 26
       data hash MD5: 16K
       BA 45 67 85 43 7E 67 0A D2 3A A3 CA 7A B9 A2 68>)
$$ ##END=
$$ 
$$ hash MD5
$$ 1C 55 87 93 C0 06 56 5F 08 DA C4 64 6B 85 0C B1
##$RELAX= 
##$RELAX= 
##$RELAX= 
##$RELAX= 
##$RELAX= 
##$RELAX= 
$$ Bruker specific parameters
$$ --------------------------
##$DU= <F:/spectra>
##$EXPNO= 1
##$NAME= <H-F>
##$PROCNO= 1
##$TYPE= <nmr>
##$USER= <she>
##$AMP= (0..31)
100 100 100 100 100 100 100 100 100 100 100 100 100 100 100 100 100 100 
100 100 100 100 100 100 100 100 100 100 100 100 100 100 
##$AQSEQ= 0
##$AQ_mod= 1
##$AUNM= <au_zg>
##$AUTOPOS= <>
##$BF1= 200.13
##$BF2= 200.13
##$BF3= 200.13
##$BF4= 200.13
##$BF5= 200.13
##$BF6= 200.13
##$BF7= 200.13
##$BF8= 200.13
##$BYTORDA= 1
##$CFDGTYP= 0
##$CFRGTYP= 5
##$CHEMSTR= <none>
##$CNST= (0..31)
1 1 145 1 1 1 1 1 1 1 1 1 1 1 1 1 1 1 1 1 1 1 1 1 1 1 1 1 1 1 1 1 
##$CPDPRG= <>
##$CPDPRG1= <>
##$CPDPRG2= <>
##$CPDPRG3= <>
##$CPDPRG4= <mlev>
##$CPDPRG5= <mlev>
##$CPDPRG6= <mlev>
##$CPDPRG7= <mlev>
##$CPDPRG8= <mlev>
##$CPDPRGB= <>
##$CPDPRGT= <>
##$D= (0..31)
0 1.2 0 0 0 0 0 0 0 0 0 0.03 0 0 0 0 0 0 0 0 0 0 0 0 0 0 0 0 0 0 0 0 
##$DATE= 1564137731
##$DBL= (0..7)
120 120 120 120 120 120 120 120 
##$DBP= (0..7)
150 150 150 150 150 150 150 150 
##$DBP07= 0
##$DBPNAM0= <>
##$DBPNAM1= <>
##$DBPNAM2= <>
##$DBPNAM3= <>
##$DBPNAM4= <>
##$DBPNAM5= <>
##$DBPNAM6= <>
##$DBPNAM7= <>
##$DBPOAL= (0..7)
0.5 0.5 0.5 0.5 0.5 0.5 0.5 0.5 
##$DBPOFFS= (0..7)
0 0 0 0 0 0 0 0 
##$DE= 6
##$DECBNUC= <off>
##$DECIM= 24
##$DECNUC= <off>
##$DECSTAT= 4
##$DIGMOD= 1
##$DIGTYP= 9
##$DL= (0..7)
0 120 120 120 120 120 120 120 
##$DP= (0..7)
150 150 150 150 150 150 150 150 
##$DP07= 0
##$DPNAME0= <>
##$DPNAME1= <>
##$DPNAME2= <>
##$DPNAME3= <>
##$DPNAME4= <>
##$DPNAME5= <>
##$DPNAME6= <>
##$DPNAME7= <>
##$DPOAL= (0..7)
0.5 0.5 0.5 0.5 0.5 0.5 0.5 0.5 
##$DPOFFS= (0..7)
0 0 0 0 0 0 0 0 
##$DQDMODE= 0
##$DR= 18
##$DS= 0
##$DSLIST= <SSSSSSSSSSSSSSS>
##$DSPFIRM= 0
$$ [...]
##$SUBNAM2= <"">
##$SUBNAM3= <"">
##$SUBNAM4= <"">
##$SUBNAM5= <"">
##$SUBNAM6= <"">
##$SUBNAM7= <"">
##$SUBNAM8= <"">
##$SUBNAM9= <"">
##$SW= 24.9336996594482
##$SWIBOX= (0..15)
0 0 2 0 0 0 0 0 0 0 0 0 0 0 0 0 
##$SW_h= 4990.01996007984
##$TD= 16384
##$TD0= 1
##$TE= 0
##$TE2= 300
##$TE3= 300
##$TEG= 300
##$TL= (0..7)
0 120 120 120 120 120 120 120 
##$TP= (0..7)
150 150 150 150 150 150 150 150 
##$TP07= 0
##$TPNAME0= <>
##$TPNAME1= <>
##$TPNAME2= <>
##$TPNAME3= <>
##$TPNAME4= <>
##$TPNAME5= <>
##$TPNAME6= <>
##$TPNAME7= <>
##$TPOAL= (0..7)
0.5 0.5 0.5 0.5 0.5 0.5 0.5 0.5 
##$TPOFFS= (0..7)
0 0 0 0 0 0 0 0 
##$TUNHIN= 0
##$TUNHOUT= 0
##$TUNXOUT= 0
##$USERA1= <user>
##$USERA2= <user>
##$USERA3= <user>
##$USERA4= <user>
##$USERA5= <user>
##$V9= 5
##$VALIST= <valist>
##$VCLIST= <CCCCCCCCCCCCCCC>
##$VD= 0
##$VDLIST= <DDDDDDDDDDDDDDD>
##$VPLIST= <PPPPPPPPPPPPPPP>
##$VTLIST= <TTTTTTTTTTTTTTT>
##$WBST= 1024
##$WBSW= 4
##$XGAIN= (0..3)
0 0 0 0 
##$XL= 0
##$YL= 0
##$YMAX_a= 6418
##$YMIN_a= -5188
##$ZGOPTNS= <>
##$ZL1= 120
##$ZL2= 120
##$ZL3= 120
##$ZL4= 120
##$ABSF1= 10
##$ABSF2= 0
##$ABSG= 5
##$ABSL= 3
##$ALPHA= 0
##$AQORDER= 0
##$ASSFAC= 0
##$ASSFACI= 0
##$ASSFACX= 0
##$ASSWID= 0
##$AUNMP= <proc_1d>
##$AZFE= 0.1
##$AZFW= 0.1
##$BCFW= 1
##$BC_mod= 2
##$BYTORDP= 1
##$COROFFS= 0
##$CY= 11.3945322036743
##$DATMOD= 1
##$DC= 2
##$DFILT= <>
##$DTYPP= 0
##$F1P= 20.1537800932815
##$F2P= 0.134698688090026
##$FCOR= 0.5
##$FTSIZE= 0
##$FT_mod= 4
##$GAMMA= 1
##$GB= 0.15
##$INTBC= 1
##$INTSCL= 1
##$ISEN= 128
##$LB= 0.24
##$LEV0= 0
##$LPBIN= 0
##$MAXI= 10000
##$MC2= 0
##$MEAN= 0
##$ME_mod= 0
##$MI= 1.114404
##$NCOEF= 0
##$NC_proc= 0
##$NLEV= 6
##$NOISF1= 3.799351
##$NOISF2= 2.8
##$NSP= 1
##$NTH_PI= 0
##$NZP= 0
##$OFFSET= 15.70392
##$PC= 1
##$PHC0= -9135.876
##$PHC1= 20.60097
##$PH_mod= 1
##$PKNL= yes
##$PPARMOD= 0
##$PSCAL= 0
##$PSIGN= 0
##$REVERSE= no
##$SF= 200.130013532006
##$SI= 16384
##$SIGF1= 3
##$SIGF2= 2
##$SINO= 400
##$SIOLD= 16384
##$SREGLST= <1H.CDCl3>
##$SSB= 0
##$STSI= 0
##$STSR= 0
##$SW_p= 3612.71676300578
##$SYMM= 0
##$S_DEV= 0
##$TDeff= 0
##$TDoff= 0
##$TI= <>
##$TILT= no
##$TM1= 0
##$TM2= 0
##$TOPLEV= 0
##$USERP1= <user>
##$USERP2= <user>
##$USERP3= <user>
##$USERP4= <user>
##$USERP5= <user>
##$WDW= 1
##$XDIM= 8192
##$YMAX_p= 0
##$YMIN_p= 0
$$ End of Bruker specific parameters
$$ ---------------------------------
##NTUPLES= NMR FID
##VAR_NAME=  TIME,          FID/REAL,        FID/IMAG
##SYMBOL=    X,             R,               I
##VAR_TYPE=  INDEPENDENT,   DEPENDENT,       DEPENDENT
##VAR_FORM=  AFFN,          ASDF,            ASDF
##VAR_DIM=   8192,          8192,            8192
##UNITS=     SECONDS,       ARBITRARY UNITS, ARBITRARY UNITS
##FACTOR=    0.0002004,     1,               1
##FIRST=     0,             0,               0
##LAST=      1.6414764,     0,               0
##MIN=       0,             -5188,           0
##MAX=       1.6414764,     6418,            0
$$ Real data points
##PAGE= N=1
##DATA TABLE= (X++(R..R)), XYDATA
$$ [...]
884fP19n16j143j53R86P55m56j017j33Q68O45n61q30J50R54K61p81p41N52J090
904F43P1j039p23O11J131J20r46p43M78J004J82q78n78N27Q42j11r20k70P98O87
924H86m62r75o9R23O75n46j017j41R00P50l99j022k08P54O70l69q21m6P82L92
944F57o13p11K82R06K45q53q09M39J107K82r94q38M27J076K15q53o59M06Q21P4
964F07p42m22M84P31j58r18k84Q12Q38m78j095k21R94P67m68j046j88Q04O40l72
984B85p80j26O63M30m08o96O7P87L33p02p71K85J037K66q36q70L13J110L22q16
1004a07p86K69R50K70p55n86M52P75l8p92l57O71P83k49r71l10Q51Q80l25j045
1024d20l50Q67Q35k97r92k45P85N74m09p25L3P04L04n68o51K31Q05K74o72q16
$$ y = [-6, 713, 197, -946, -1099, -113, 642, 186, -831, -964, -96, 549, -12, -842, -692, 262, 523, -258, -999, -447, 643, 714, -325, -1048, -437, 694, 814, -132, -875, -397, 607, 789, -89, -667, -140, 702, 591, -329, -599, 199, 886, 424, -551, -620, 303, 978, 432, -585, -726, 174, 924, 525, -497, -705, 49, 719, 350, -471, -517, 265, 657, 44, -667, -385, 521, 766, -87, -896, -457, 650, 932, -62, -900, -473, 603, 818, -35, -694, -288, 533, 607, -135, -557, -73, 658, 500, -418, -702, 110, 948, 470, -625, -846, 148, 915, 447, -599, -787, 17, 657, 285, -495, -621, 42, 472, 64, -632, -565, 222, 555, -147, -918, -633, 404, 670, -166, -1036, -723, 387, 709, -107, -893, -624, 326, 596, -159, -745, -293, 482, 444, -348, -705, -34, 749, 500, -471, -781, 70, 950, 625, -420, -770, 97, 932, 635, -357, -602, 183, 757, 348, -377, -344, 360, 664, 96, -555, -324, 481, 755, 83, -733]
1044g33K14R92L67p42q87J84R72L55p24o81K77P68J24o83m59M63P55j10q55l91
1064g94O82Q69j71j021m18P68R19j90r87m00P05P72k17q20j84P29N18m65p60J27
1084c38Q51L86p21p74K16R70L55p28p92J38Q65L90n81p55J07P70K90n93o31K98
1104b77P57j7p54m24N76P46j52q72m20N79R01r5q86n35N66Q37l2q57l66N86O32
1125D93k42p51q5P08N02n30p96O9R46M39o47r00J35R96M28o28q17J37Q20L04n62
1146A9n94J94O58J39o15m85M13P26j9q08n14O00Q85j00r07m95N90Q06m2p82m20
1167g51M77O65o9o64k80N32N80k71p76n3Q39N32n41q64KR44N97n74q82kQ71M94
1189H06m78p55Q8P94K76n82n39L32O67N9p20m44M72P96m5q25n36M79Q77K6q18
$$ y = [-733, -519, 473, 840, 98, -789, -605, 367, 722, -2, -683, -406, 362, 486, -197, -656, -193, 562, 452, -403, -794, -112, 757, 586, -435, -853, -85, 834, 644, -343, -743, -38, 734, 517, -303, -487, 242, 760, 295, -465, -338, 513, 899, 178, -596, -380, 590, 945, 217, -575, -437, 428, 818, 237, -518, -411, 359, 649, 56, -575, -277, 480, 463, -291, -715, -139, 607, 455, -417, -837, -258, 643, 548, -338, -873, -307, 530, 498, -359, -725, -139, 493, 251, -500, -585, 123, 625, 95, -701, -632, 314, 753, 106, -794, -659, 337, 765, 137, -680, -543, 277, 581, 19, -575, -381, 277, 416, -199, -684, -271, 455, 436, -372, -886, -286, 599, 499, -408, -903, -313, 493, 451, -331, -751, -274, 391, 322, -342, -622, -90, 490, 219, -557, -610, 229, 761, 220, -644, -642, 302, 899, 325, -557, -559, 312, 806, 328, -427, -339, 455, 731, 149, -390, -58, 609, 668, -52, -496, -24, 772, 727, -98, -634, -155, 722, 748, -70]
1210g0n53M38P83o8o87l36M59N16k04o43j39N84M95l56q01q9P34O24m01r36j52
1231h02Q45O38m19q55n6P80M08m79n99J47P02K11o36n39L77P92P9p86n73M70R04
1252F09O5q00n88M12Q01Q7o82m31L67O29r9o51k11N38N19l01o99j33P14N32m03
1273B75p83j38O89O22l04q15j89O27N73k95o88p3O50L83m91o01K26P64K02p14
1293h0n81L45R02J63p68o85L99Q83J66o93o15L85P05M2o54l37M51O01j94p13j83
1314d61O66N40l59q13j33P02O34l44q32k10O71N45k91o59j26N12M02l24n82N8
1334d04N96K95n14o26K27P90K46p19o74L08Q66K31o61o52K49P43J92n64m79L09
1354b41O09J4o50k88N32O24k51p51k38O86O60k98q60k22O51O64k88p54j63N61
$$ y = [-70, -623, -185, 598, 530, -157, -493, -34, 482, 278, -365, -504, 80, 575, 219, -582, -671, 63, 687, 286, -650, -802, 43, 681, 262, -593, -649, 131, 539, 60, -539, -392, 310, 521, -115, -654, -277, 515, 594, -192, -765, -295, 609, 674, -126, -714, -302, 499, 586, -96, -527, -160, 469, 370, -281, -492, 46, 565, 264, -435, -568, 146, 678, 275, -508, -646, 43, 665, 361, -454, -643, -16, 557, 262, -426, -499, 151, 534, 43, -558, -332, 432, 634, -80, -661, -316, 586, 749, -19, -704, -305, 578, 744, 51, -564, -179, 526, 568, -86, -423, 28, 629, 435, -278, -461, 205, 745, 386, -427, -560, 142, 776, 432, -400, -610, 61, 606, 315, -344, -470, 42, 444, 120, -462, -404, 192, 487, -27, -653, -426, 364, 610, -109, -783, -475, 391, 622, -39, -691, -442, 301, 493, -71, -550, -241, 368, 382, -268, -556, -24, 600, 349, -402, -640, 46, 706, 408, -452, -674, -23, 641, 353, -401, -564, -3]
1374cM65k91n78k4N43K90m57n43J34O91K32n91o07J57P87L23o32o93J76P91K68
1395D38n50o00K57O33J17n69l60L93N94p7o67l15N70O90j39q24l31O75P23j98
1415D60p92k75N93O23k33o44j09N48L72l63n06J04N89K98m98o45J74P54K87n68
1435A69o56J27P48L15n13n88J26O19K38m92m58K40N69K8n90l10M03O65j10p62
1455b32l48N39P45j20p65l70M82P00n3p21l00N13N57k62o31n8O18L69m41o73J54
1476b97P13L19n55o85J23P33L71n67o38R0O49K75m48n32J52N39J15m89m00L25
1496b07N48qo64l60M31O95o5p10m31M30O95mo53l87M30N55n0n84k17M72M41k32
1518A25o07k4O13M59m27p24P2P38M57m88p15J8P44L57m12n89J23N62K15m33m36
$$ y = [-3, 462, 171, -407, -431, 112, 402, -55, -598, -464, 227, 459, -132, -739, -582, 205, 528, -104, -797, -621, 170, 438, -112, -712, -455, 178, 295, -274, -634, -241, 353, 276, -391, -706, -136, 554, 415, -409, -740, -65, 658, 460, -332, -607, -14, 609, 376, -268, -377, 171, 543, 180, -326, -222, 367, 665, 167, -478, -304, 450, 737, 169, -487, -360, 388, 703, 190, -398, -272, 347, 585, 93, -365, -125, 444, 472, -118, -428, -25, 640, 530, -232, -580, -41, 704, 584, -181, -551, -69, 631, 578, -143, -443, 70, 627, 365, -266, -324, 294, 663, 222, -451, -297, 416, 735, 180, -505, -382, 351, 722, 155, -483, -393, 256, 531, 83, -449, -297, 242, 357, -132, -532, -207, 341, 333, -331, -691, -260, 435, 370, -340, -771, -341, 354, 350, -303, -690, -260, 295, 245, -339, -556, -84, 357, 125, -482, -506, 107, 566, 139, -585, -513, 225, 682, 194, -521, -503, 241, 598, 186, -403, -280, 282, 497, 64, -372]
1539c72K31N70N1n91l82L94O36k8o94m09M04O90qo60m19L90N95k6n33l30L58M63
1561C30j23n16j48M89L81k82o48n9O59M79l80p22r2O75N13l61o75k5O31L08l76
1582E8m97J03N88J19m78m03L19O00M8n88m66L77P16L5o59m85L73O37L6n67l60
1603d94L30M71k9n05k09L95M41k23n54r1N30M49l11o65j25O27N01k96o46j25N43
1624A4M98k66o04k2N30L24l94m80J78N86J75n70m54L24P08Q3o32n07L10P27Q8
1645F16n49m67K81N89K0n09l03L68M43j65n41j04M63M22l06n95r1N31M39k56o50
1666c64j58N40M55k07n87j30M51L71k72m84L1N12K01m02m72J80O47J90n74n45
1686f17K49P38J86n91n04K52O18J34n08l70L06M97l7m90k41M31M66j92o06j69
$$ y = [-372, -141, 429, 480, -111, -493, -99, 537, 509, -185, -594, -190, 500, 492, -168, -587, -197, 398, 372, -161, -491, -133, 330, 207, -309, -457, 32, 413, 131, -517, -576, 83, 562, 182, -540, -632, 43, 556, 195, -480, -505, 126, 434, 58, -439, -336, 252, 371, -107, -510, -191, 409, 457, -131, -597, -220, 496, 531, -128, -613, -240, 397, 433, -134, -494, -164, 307, 278, -227, -436, -41, 400, 177, -377, -468, 62, 511, 200, -465, -590, 37, 538, 242, -404, -529, 14, 512, 246, -358, -380, 150, 474, 80, -400, -222, 364, 539, -31, -485, -161, 547, 630, -2, -509, -199, 528, 616, 67, -400, -119, 470, 490, -19, -322, 46, 489, 324, -217, -321, 142, 564, 258, -337, -428, 103, 542, 286, -364, -522, 18, 473, 266, -321, -451, 0, 371, 99, -385, -354, 158, 359, -43, -515, -335, 312, 502, -72, -617, -368, 370, 556, -35, -539, -287, 331, 465, -43, -413, -107, 390, 353, -137, -378, 53, 519, 327, -279, -448]
1706d48N93M90k56p31j00N26N00k43n80j63M69L74k13m79p3M74K42l26m61R3N60
1727B48K03m68n06J62O37K16m90n65J70N98K48m51m82J27N87R7m61l16L22M77
1747C53q4n63j78M59N11j93o20k23N01N70j73o52k06M86M46j66n61r2M29K99k71
1768G2m16K8M58K16l65m73R8N66K39m52n70J10O31K53m31m91J05N02K03l74m09
1789e00K04M62O2m43l15L49N10n8n96k77M83N59p0o39k94M43N53o7n73j84L93
1810BM43j96m75j3M22L02l18m71P7N72K28m35n02J06N89K58l79n19L5N28K83l86
1832A51m38J35M38J16l78k95K09M64m0m89k68L50N20n5n62l08L26O00mn94l34
1853d56M06M85p9m83j82L85L76k23m75k0N19K69l57n19N1O15K78l75n49K7N78
$$ y = [-448, 145, 635, 379, -352, -452, 74, 574, 331, -249, -412, 57, 431, 218, -261, -334, 140, 382, 56, -405, -312, 248, 451, -17, -523, -361, 276, 492, 2, -563, -393, 205, 453, 2, -480, -353, 234, 331, -130, -446, -124, 353, 269, -294, -472, -13, 498, 305, -315, -538, -37, 533, 360, -292, -498, -12, 434, 268, -293, -385, 44, 343, 72, -344, -316, 142, 358, -7, -480, -382, 184, 423, -29, -599, -489, 142, 395, -36, -527, -422, 80, 283, -91, -500, -296, 166, 228, -215, -530, -181, 329, 271, -325, -602, -119, 440, 370, -269, -563, -120, 433, 366, -207, -391, 2, 445, 249, -226, -239, 183, 485, 167, -304, -227, 345, 573, 138, -364, -258, 331, 589, 210, -309, -274, 254, 537, 151, -287, -152, 286, 402, 24, -271, -62, 402, 362, -127, -395, -45, 475, 420, -142, -450, -124, 476, 472, -122, -456, -50, 435, 356, -127, -309, 76, 452, 229, -246, -266, 253, 522, 165, -354, -303, 312, 590, 215, -334, -307, 271]
1874B71K82l70m51N5M23J88l55l42J53L95P1m46k93K97M92n7n32k99K91N06K9
1895C08n21l23K82M85j3m49k79K79M20p4m49j32L87L53k53n05K9N17L21l10n98
1916e25J8N64L67l18n06NM92K94l50l90J26M28J28l52l39K22M96Qm78k85L03N15
1938D23K1n01l69K79N37K2m70k75K31M40m7l89j83L12L35j68m53r0M52L58k44
1959B21n51j02N27M12k57n54q4M92L51k44m79K0M15K25l03m16J48M60J05m59l19
1980c92K66N02P9n41l50K35N30Q9m53l52K12M17L9m07k40K53L69j32l79j43L58
2001d0L39k09n05o3M02L98k28m93j51M37L64j61m81j09L81L24j82m22K1M21J89
2022B32l55l71K06M82J40m35m15K44N51J77m75m15J92N35J31m19k87K06M23k1
$$ y = [271, 553, 183, -268, -213, 210, 398, 43, -299, -146, 249, 320, -126, -419, -122, 370, 313, -219, -518, -227, 279, 308, -213, -536, -254, 231, 218, -231, -510, -231, 189, 115, -334, -466, -79, 274, 21, -484, -455, 62, 383, 73, -525, -507, 57, 424, 106, -400, -395, 97, 391, 41, -349, -223, 205, 333, -19, -358, -136, 360, 368, -110, -395, -92, 423, 444, -57, -426, -147, 390, 412, -58, -333, -102, 338, 291, -98, -281, 31, 366, 198, -255, -345, 107, 465, 221, -330, -432, 95, 507, 250, -304, -388, 104, 455, 211, -268, -248, 167, 392, 89, -327, -179, 281, 386, -73, -392, -126, 376, 455, -86, -436, -201, 329, 418, -35, -387, -175, 242, 281, -126, -366, -113, 256, 124, -255, -398, -40, 299, 90, -415, -478, -76, 322, 94, -399, -550, -113, 251, 90, -391, -500, -119, 205, 23, -399, -378, 43, 232, -123, -494, -288, 194, 334, -101, -516, -272, 279, 456, -19, -434, -242, 293, 424, 5, -282, -76, 347, 326]
2042C26l93j64L47L39j17m75o7L42L99j80m91j29M25M11j75m73j55L60L08j44
2062B94l54p8L29K41k41l72M1M37J67l27m23J00N20J83m26m53J69M99J58l57l97
2083b90J14M39J24m06k96K67L92p8m65j64L75M14k17m75j50L95M10j36n09j86
2103d42L56L85j25m56j13L24K67j87l79KL74J74k89l44N6M53J66l27m31M9N18
2124C1K12l39m02N2M46J66l00l13J44L80O4l41k53K69M29o5m50k11L66M86r2m93
2146b14k06L33M77p2m78j45L21L48j06l86n2L51K05k13l66M4M37J87l28m36J00
2167a99M84K08l07m41N6M16K03k87l31L7L55J16k94k78J67L72Ol90k48K76M24
2188C45m1m46k75K66M80nm51k78K88M05m4m23j29L06K64j36m01lM08K07k82l98
$$ y = [326, -67, -231, 116, 455, 338, -137, -204, 138, 537, 357, -134, -263, 162, 573, 398, -75, -230, 130, 438, 294, -60, -138, 191, 432, 191, -181, -140, 297, 464, 137, -286, -186, 334, 517, 91, -362, -193, 306, 464, 107, -290, -176, 263, 387, -19, -315, -48, 344, 266, -199, -363, 12, 426, 209, -266, -416, -21, 389, 253, -256, -442, -86, 299, 174, -282, -395, -71, 196, 9, -370, -368, 6, 180, -109, -453, -397, 56, 222, -105, -536, -487, 31, 243, -96, -498, -446, 0, 166, -134, -447, -303, 77, 141, -200, -453, -184, 245, 180, -270, -481, -115, 371, 279, -214, -420, -87, 390, 318, -160, -305, 16, 364, 258, -128, -180, 171, 376, 163, -203, -159, 278, 465, 137, -299, -199, 285, 493, 186, -255, -199, 217, 420, 133, -198, -161, 194, 310, 16, -262, -95, 277, 283, -107, -355, -79, 345, 304, -142, -417, -151, 329, 324, -127, -405, -117, 288, 244, -179, -308, -2, 262, 126, -275, -278, 130, 337, 55, -343]
2210c43L0M45K27k70m26pM55K36k68l90L5L41J74k51k90J05L34O0l10k59K22L79
2232B29Ol81k98K58M48L6m24k93K40M28L1l74k20K17L60m9l73n9L07K77j74m03
2254b11j0M41K77k58m72NM50K96k33m32KL67K54k33l42M4L29J05k90k24J35L79
2276C79ll83k69K19M14L2m23k87J58M27L7l77k45J60L32K1l25j97K40K69j08l43
2298b72j15L31K72j66m43o3L97L16k01m74n7L86L03j83m03k5L93J48k28k81R5
2319b70L73N7l16k75J83M48N0l89l16K34M25P9l82l13K18L80K9l37j74J81K92
2340A77ll52r5K68K90j45l70p7L46L25j43m21j32L77L23j01l96r6L21K68j56l17
2362a09J2L21J64k41l07J23L89R9l55l16J65M30J25l62l31J01M48O2k99k75J46
$$ y = [-343, -313, 132, 359, 89, -337, -344, 111, 347, 79, -311, -276, 65, 239, -12, -302, -197, 137, 197, -113, -372, -150, 229, 235, -146, -444, -186, 262, 298, -126, -419, -179, 249, 280, -94, -314, -97, 263, 214, -159, -218, 89, 366, 192, -211, -221, 220, 497, 239, -233, -228, 222, 518, 285, -147, -145, 222, 476, 243, -99, -55, 274, 379, 89, -135, 0, 379, 376, -7, -276, -57, 357, 389, -34, -321, -163, 264, 301, -76, -321, -161, 171, 192, -133, -330, -90, 179, 71, -272, -387, -56, 216, 50, -393, -456, -59, 257, 56, -418, -475, -89, 214, 31, -372, -397, -4, 144, -84, -365, -270, 103, 160, -156, -431, -248, 200, 250, -139, -455, -221, 204, 283, -99, -412, -194, 186, 215, -122, -296, -115, 177, 174, -178, -273, -5, 285, 140, -230, -307, 39, 364, 221, -200, -332, 45, 368, 267, -129, -225, 96, 364, 208, -109, -97, 224, 388, 147, -160, -37, 352, 451, 96, -220, -55, 375, 500, 138, -193, -92, 356, 418, 119, -156, -10]
2383a0L22k4k88j67K19K76j15l29j14K62K83j09m22j68L14L53j27m21j36L02K79
2404A80j11l49p1K77J74j51l08J7L45J41k80l19P9M46J46l48l46J13M09K02l26
2425h0l12J13L71Q5k84k14J95K90k7k75j65K86L40j46l59j40L28L53j18l56j56
2446b71K72L18n7l23j07J95K56j11k66k2K97J50k15k91N0L63J67k51l59K0L95
2467B10K40k80l59K5L84J61k47l21J46K81N8k91j66J79L18n6l58j70K71L63r7
2488B91m05j97K80L50m1l87j83K77K51q2l04q4K44J60j46l04QL12J63k28l44K8
2510c41L51J86k33l86J5L83J91k39k93K4L11J20k50k15J03L38K8l25j86K31L47
2531A60j5l77j77K34L63J8l49k01K18L76l8l07j31K48K59j36k87j6L37J59j79
$$ y = [-10, 312, 288, 0, -167, 52, 328, 213, -116, -230, 32, 315, 206, -216, -384, -70, 283, 156, -265, -401, -99, 180, 69, -280, -351, -74, 100, -51, -359, -342, 3, 144, -136, -455, -376, 70, 216, -132, -478, -365, 44, 246, -80, -392, -279, 92, 177, -107, -321, -126, 164, 137, -138, -303, -17, 323, 177, -182, -322, 6, 359, 241, -115, -271, 1, 319, 262, -61, -168, 27, 283, 172, -94, -116, 181, 331, 116, -175, -125, 238, 405, 154, -205, -185, 210, 450, 170, -189, -164, 220, 381, 134, -187, -41, 240, 298, 7, -159, 20, 338, 282, -76, -246, 25, 388, 291, -114, -311, -31, 319, 278, -109, -292, -15, 236, 154, -150, -234, 10, 170, 24, -280, -272, 40, 203, -25, -369, -341, 10, 196, -37, -423, -408, -25, 166, -73, -366, -342, -31, 89, -161, -376, -273, 65, 93, -232, -418, -187, 160, 145, -232, -409, -175, 188, 206, -143, -344, -126, 250, 212, -95, -226, 22, 281, 145, -142, -158, 179, 338, 159]
2552A59l22L4L44K12k51l35K4L61K04k07l16RK88J46k11k64R0K81N9k54k14J49
2574a4L07j8k86k40J92L83K0l48k70K20L35Rl08j78J40K72Ll01j24K40K45j52
2596A27l10o2L48K11k18l38k1L38K52k04l53k1K80K02j56k77MK52J20k34k25J18
2618a67K78N2k95k19J71L02N4l12k60J39L77M1k54k46J12L00L9k71j70K13K26
2639A10n9k86o9K71K62j79l23n6L26K91j42l84m5L26K63j62k98k7K91J57j86k20
2661a39Q8K48R6k56k12J47L24K7k83k45J62L16R6l18k54J26L05O2k42j91J32K29
2683B18Qk40j28J84K07o2l19r4K74K90j34l73r5L06K66j31l30q2K82K10j02k95
2705a40k4K71J54k26k59J14L12Q5l11k60J56L36J00l04k86J36L13O6k46k28R3
$$ y = [159, -163, -129, 215, 427, 176, -159, -135, 226, 430, 223, -93, -84, 204, 350, 139, -125, -35, 246, 305, 51, -163, -14, 293, 275, -11, -251, -59, 324, 344, -4, -274, -54, 281, 290, -18, -196, -56, 216, 219, -82, -206, 34, 279, 127, -183, -245, 103, 314, 96, -242, -263, 75, 327, 123, -230, -251, 29, 231, 75, -202, -198, 54, 174, -60, -285, -167, 111, 163, -132, -351, -180, 122, 176, -136, -396, -257, 120, 161, -93, -339, -227, 73, 112, -159, -329, -116, 110, 51, -235, -304, -33, 229, 50, -273, -329, -3, 288, 146, -238, -283, 43, 306, 144, -154, -181, 110, 267, 81, -139, -51, 197, 293, 37, -175, -28, 296, 323, 40, -205, -43, 273, 369, 51, -203, -77, 228, 290, 48, -143, -11, 218, 226, -14, -142, 42, 249, 187, -132, -226, 48, 338, 204, -169, -264, 42, 308, 177, -153, -235, 47, 257, 155, -140, -164, 107, 261, 35, -224, -110, 202, 287, -24, -284, -128, 208, 308, 4, -282, -146, 167, 233, -13, -241, -148]
2726a48K73J6k43j30J77J91n4k68j26K54K38j08l35j02K57K83p6l27j43K28K72
2747A29p4l00p3K20J86j31k49J4K66J63k27k57O7L47J28k56k68N1L79J19k21k63
2769b50M9L40R2k46j80J53K25lk48j25K25K14k6l09j06K46K81p7l23j40K42K42
2791B76n0k61j25J97K42r4k50n7K32J64j52k66kL36J22k21k86M7L18J70k24k95
2813a79K3L12J21j98k38O4K70O4k33j59J06L05k0l05j35K26K59l5l43j42J92K95
2835B50n8k66j49J80K31o4k12r5J79J51j04k55J9K29J31j65k83L7K71J80j84l00
2857b77J8K63K02j81k72J7K55J12j61k28J04K55L2k25j73J64L17k4l26j76K13
2878i1L55m9k86j54J73L04m3k35j11J85J81n3k37m5K37J51j59k59MK77J62j84
$$ y = [-148, 125, 141, -102, -232, -55, 136, 82, -186, -312, -58, 180, 72, -263, -365, -108, 175, 99, -228, -371, -143, 129, 55, -245, -318, -98, 88, -43, -292, -278, -12, 151, -76, -333, -266, 81, 209, -47, -315, -264, 115, 234, 13, -250, -201, 139, 231, -15, -195, -42, 183, 180, -68, -193, 32, 246, 220, -89, -195, 51, 332, 255, -68, -208, 34, 276, 226, -35, -160, 37, 279, 185, -65, -122, 110, 274, 122, -144, -146, 190, 312, 91, -195, -148, 170, 340, 116, -179, -156, 156, 277, 79, -159, -95, 175, 239, 6, -153, -47, 258, 238, -67, -202, 24, 283, 248, -95, -237, -45, 250, 192, -74, -223, -43, 188, 124, -88, -183, -4, 147, 43, -212, -193, 36, 167, 2, -281, -244, 27, 207, 23, -277, -259, 4, 206, 25, -247, -230, 25, 137, -24, -252, -148, 107, 139, -86, -259, -95, 222, 198, -128, -304, -91, 264, 215, -71, -225, -52, 252, 209, -26, -137, 48, 229, 176, -61, -106, 131, 282, 123, -136, -132, 145, 307, 123]
2900A23l06nL06J71j54k86kK02J65j18k70L7K07R9j88k24J03K63N6k79k15J48
2922a67L20J6k65k40J61K84L9k78j87J64K47j1k39r2K08J73j17k72pK65J49j20
2944C1k71n0K83K18j62k77m5K61J80j30k23qK08J20j56j64P1J99O2k21j73J12
2966a35K86M2k17k18J06L05J11k57k39J37K46N2k19j07J29K00j1k68o7K42J93
2987C11j01k70n5K57K34j26l00n5K27K09j15k32n4K02J34j02j90J0J81R6k05j80
3009a24R4K54K8k25k38J12K67Q2k51k06N3K49P0k06k03J11K07Ok30r7J19K30q3
3032A9k32j12K03L05j50k98r7K33K56r7k83o9K26K06j26j98l4K36J08j44k10Q3
3054a75K57O2k05j93R7K76Q6k17k04O5K51J00j84j90O6K29O5k17j18J40J99k6
$$ y = [123, -183, -188, 118, 289, 135, -151, -153, 49, 214, 96, -174, -137, 70, 169, -19, -243, -140, 123, 179, -100, -315, -167, 153, 169, -96, -336, -175, 109, 148, -130, -317, -153, 94, 83, -156, -248, -40, 133, 16, -256, -263, 2, 151, 31, -240, -290, -7, 211, 49, -228, -273, -12, 168, 38, -185, -193, 15, 135, -21, -185, -114, 85, 147, -74, -247, -135, 151, 193, -24, -242, -136, 169, 280, 23, -216, -79, 167, 219, 0, -107, 22, 222, 211, -57, -124, 118, 311, 210, -60, -115, 142, 376, 250, -50, -105, 122, 331, 216, -16, -70, 132, 266, 164, -26, -16, 165, 261, 56, -124, -30, 224, 252, 27, -211, -99, 168, 250, -1, -207, -154, 95, 165, -41, -244, -133, 74, 80, -150, -247, -128, 102, 19, -213, -325, -122, 183, 33, -265, -362, -129, 127, 30, -253, -322, -96, 110, -16, -214, -248, -12, 96, -48, -258, -175, 82, 144, -61, -254, -157, 119, 205, -12, -216, -151, 100, 200, 16, -174, -108, 121, 186, -31, -149, -9, 190, 164]
3076A64k39j02J91K17l5l02q3J95K37jk93j13J48K58n6k26j04K13J31p4k39J1
3098a02K38J00j64k23O6K49J30k41k44O0K92J09j97k55O4K35P7j82j42O7J63M7
3120A47k13j00J37J95o6k21j21J70K44p7k50j08J41K24l9k02j34J77J93n4j89
3141a46p0J58J62j36j94J3K30J40j37k53L7K61J64j99k39K2K53J27j60k04O3K32
3163A24M0j52j39J06K13Nk48p8J53K33m2k48j34J73K33J1k58j06J22K17l4k01
3185a0q4J52J44q8j97jJ70J42j70j95j5K21J63k00j99l0K50J64j70k23J7J89J05
3208A35j51j77N1K19N2j79j68J18K45j0k51j40J53K27Rk18j63J39K05mj90j23
3230b21J75J36m7j74l2J47J39p7k31k6K34J49j21k60j9K14J78j25k47nJ86J68
$$ y = [164, -75, -177, 14, 231, 196, -106, -189, 6, 243, 242, -51, -164, -16, 242, 186, -40, -144, 69, 200, 126, -113, -102, 136, 236, 72, -151, -85, 164, 294, 53, -191, -131, 161, 270, 73, -182, -118, 117, 194, 12, -130, -63, 100, 147, -66, -166, -29, 166, 100, -121, -242, -72, 172, 95, -155, -263, -122, 102, 63, -139, -273, -96, 97, 43, -146, -216, -58, 104, -32, -226, -213, 17, 157, 20, -233, -196, 65, 229, 30, -209, -187, 66, 193, 33, -171, -108, 124, 164, 12, -127, -21, 192, 197, -51, -129, 24, 257, 215, -33, -167, 6, 239, 250, -8, -114, 8, 225, 191, -10, -94, 58, 202, 114, -83, -84, 86, 228, 58, -137, -152, 69, 232, 32, -167, -197, 53, 217, 47, -176, -159, 30, 135, -16, -193, -142, 77, 129, -50, -218, -100, 145, 135, -116, -256, -103, 124, 133, -85, -248, -109, 96, 92, -98, -221, -46, 90, 43, -131, -163, -16, 123, 46, -185, -211, 23, 172, 51, -209, -228, -14, 164, 39, -208, -213, -27, 141]
3252A41j01j84k2K11N9j40j65J12J80O9k03j75J62K24M4k41j62J01K68J4j87j62
3274a57J52J99l9j89m5J53J17p6j69l5J82J29j05k03l8K08J82j29k14n1J80J61
3296B13j02j91l3J51J09j13j77O0J80M8j69j59Q5K20L8j91j91O6K71N5k02j70
3318b02J06J70N4j89j33J38J86m4j95k1J40J72r0k52j9K23J56r9k46m5K11J97
3340B18j03k05n0J60J01n2j69J0J85K5j22j27K0K04P0j97j67P9K32N1k01j72N7
3363a53K01Q1j82j27O3J70K5j38j32J32J80o8j73q1J78J60p0k24n9J87J79o1k26
3386a38n2J94J49q2j95nJ43J27j14j56M7J79L7j22j68O9K15O3j58j85M6K29R6
3409B19j94j54O0J81L3j41j09R1J47J2j89q6J28J86l0k37o4J70J55k2k17q9J52
$$ y = [141, 40, -144, -166, 45, 104, -36, -201, -89, 91, 160, -43, -218, -56, 168, 212, -29, -191, -90, 178, 192, 5, -157, -5, 194, 155, -34, -79, 74, 191, 115, -54, -89, 93, 222, 117, -86, -124, 84, 266, 137, -77, -128, 52, 213, 111, -80, -113, 38, 147, 34, -143, -83, 97, 145, -24, -183, -98, 122, 160, -31, -222, -156, 115, 170, -32, -202, -96, 74, 128, -61, -194, -56, 130, 86, -109, -130, 10, 182, 92, -160, -179, 44, 200, 101, -145, -190, 21, 218, 115, -90, -140, 20, 121, 69, -100, -90, 95, 120, -2, -129, -109, 95, 165, -32, -199, -120, 112, 163, -38, -210, -153, 48, 129, -53, -180, -117, 53, 78, -60, -192, -60, 120, 52, -121, -202, -24, 136, 66, -158, -217, -30, 149, 88, -138, -190, 4, 153, 71, -124, -129, 14, 141, 27, -129, -82, 97, 134, 12, -156, -87, 128, 191, 33, -152, -106, 123, 219, 25, -129, -69, 112, 145, 4, -105, -14, 133, 145, -44, -130, -2, 184, 154, -83, -147, 23, 178, 156, -61, -150, 2]
3432BJ92n8j80q6J63J42q8j56MJ72Q3j40j55O1K09P6j82j62M7K22O3j89j56L9
3456g7J96M6j22j22M3J27L4j60r2J10J55n6j72j06J54J86m5k12j01J37J70nk01
3479a13r9J36J40m0j63l4J30J16p3j62MJ67J08j53k02M6K43J00j53j90L4K07R0
3502A39j29j61M9J72N1j67n3P5J26K6j94r2J32J81j8k02q1J32J64k4j82j01J05
3525e2J78l4j50q1J17J07k9j29j2J24J04j32j79L3J57J37j09k12JJ73J20r9j88
3548a55J2J79Q9j14j46N3J48K3j56r7J10J71j4j66j03J14J91nk05j09J36J61J
3571A18j79r3J30J27n1j29l6J24Q9o3j51j9J50J49j19k09J1J82J49j08k02QJ66
3594D4O9o7j53J6J46P1j36j01O8J61J7j47j22J18J72Nj73j32R8K28j5j55j33J02
$$ y = [2, 194, 136, -44, -130, 33, 175, 87, -69, -65, 107, 190, 50, -105, -44, 165, 241, 59, -103, -56, 166, 229, 40, -116, -77, 119, 165, 43, -79, -36, 91, 125, -35, -127, -17, 138, 82, -90, -196, -42, 144, 99, -113, -214, -77, 93, 88, -113, -212, -76, 64, 24, -139, -173, -43, 73, 0, -162, -158, 9, 117, -36, -238, -192, 51, 151, -2, -192, -158, 49, 139, 10, -151, -102, 70, 121, -46, -99, -24, 102, 128, -66, -158, -26, 155, 137, -65, -146, -14, 150, 126, -56, -157, -52, 126, 92, -58, -139, -22, 85, 56, -73, -85, 39, 143, 11, -168, -135, 22, 159, 50, -162, -161, 12, 132, 33, -155, -143, 36, 125, 11, -135, -82, 66, 89, -67, -164, -54, 117, 103, -63, -166, -52, 139, 134, -71, -180, -44, 117, 118, -61, -154, -24, 103, 52, -77, -113, 11, 100, 37, -114, -133, 17, 166, 47, -162, -151, 31, 180, 72, -130, -122, 44, 113, 46, -107, -91, 55, 126, -10, -111, -43, 118, 135, -12, -134, -16, 156, 161, -12, -144, -46, 182, 167, 12, -121, -19]
3618a9J60Mj69m8J08R3j4j44k8J43J05j00j46m2J74J14q1k17j3J48J23p5j42n2
3642a18J44P2j06r6J7J42L6j42j29P8J77L4j60j60P4K10M4j73j27O1J70L8j44
3665e8q8R1J46l2j52m3J33J09m4k02j7J80J22o8j87j9J47J44p3j82l8J56R3n9
3689E9j30k1J52N0j02r9K3J71M4j45j45O8J73O9j73j33M0J72P6j43j29L9J57K6
3713I9j23q6J08J32n2j41p7J44J46l5k47k7J55J57p2j75m5J33J42p6j47l6J53
3736C0Q8j02j18K2J33P8j36j29P6J13O1j16j32PK18J5j40j17M3J42L7r7j09N6
3760g7J25Kj20p3J04J71l2j62j04J28J62j6j78q8J52J42m5j30o6J07J38o6j35
3783f1qJ55O3r9j45M9J56N8j22j31J3J56P6j03j42JJ66P6r1j39N5P7P0j32r0Q6
$$ y = [-19, 141, 145, -24, -72, 36, 129, 115, -29, -57, 86, 191, 91, -55, -97, 77, 191, 110, -107, -120, 28, 151, 76, -66, -118, 26, 98, -8, -104, -87, 55, 91, -51, -180, -102, 75, 109, -51, -211, -137, 73, 117, -56, -183, -122, 48, 86, -58, -146, -55, 91, 59, -93, -136, -3, 106, 62, -140, -157, 23, 145, 77, -110, -129, 18, 162, 89, -93, -131, 25, 118, 59, -71, -92, 60, 110, 8, -91, -68, 103, 147, 2, -143, -75, 98, 167, -6, -139, -99, 73, 149, 6, -123, -84, 73, 99, -24, -110, -2, 130, 78, -63, -140, 4, 150, 115, -132, -159, -4, 153, 81, -94, -139, -6, 136, 60, -87, -123, 30, 118, 16, -102, -80, 53, 131, -5, -134, -58, 55, 116, 0, -132, -125, 93, 108, -32, -149, -106, 36, 73, -24, -133, -77, 48, 50, -70, -143, -39, 132, 100, -62, -166, -38, 124, 108, -70, -158, -6, 136, 91, -39, -105, 2, 140, 74, -61, -69, 86, 149, 50, -95, -46, 110, 168, 46, -85, -72, 84, 160, 57, -85, -84, 82, 158, 67, -72, -17, 60, 130, -2, -92, -6]
3809fJ23l0j35p9J16J17mj65j09J22J60l2j62q1J23J18m3p9o5R6R7r9j19J5J27
3834FQ5q9j55j2K05O4r7j74J3J77Q4p0j35jJ31M6q5j29P3Q8N2j25r7Q3J38pj54
3861h5n5Q4J34M4j92q8R5J22lj14n7Q5J18k2j41l3J25Q8r8j09kJ34J22j07j41
3886i6l6J97Q8j22j15K1J21N8o1j18QJ74j1j06q2O9J50j1j34p4Q4J29oj43p5N6
3912c5J44K5j36o7O6R7jj35k7P4J07n2j44l6J34R7o9j28k6J28J08o5j63k4J39
3937A1J05q8j02k0J32O0j14p9M2J26Kq1j08P4J41nj41r3R6J27L3j47r3Q0J26k0
3963F4q9n5N7R7k6q9n3J27P3n9j74kJ44J04p7j41o2J64J01p5j10n3J48O2m1j27
3989i2pJ28N4j00j08P1J25K4j23j01O7J45K1j29q1M8J47%r6q5N4J30rj30k1Q8
$$ y = [-6, 117, 87, -48, -127, -11, 106, 102, -63, -172, -50, 110, 78, -84, -165, -42, 76, 33, -46, -111, -15, 82, -17, -136, -121, 6, 91, 2, -153, -165, 40, 104, 7, -167, -154, 23, 107, 37, -98, -99, 32, 78, -7, -136, -63, 25, 77, -48, -145, -62, 76, 69, -85, -140, -56, 78, 122, -70, -158, -63, 59, 56, -58, -115, -30, 88, 66, -75, -108, 17, 105, 7, -102, -104, 30, 152, 45, -96, -132, 65, 153, 31, -84, -63, 58, 116, 55, -63, -55, 119, 108, 2, -80, -11, 139, 128, -6, -80, 4, 133, 127, -16, -91, -35, 109, 134, -2, -69, -3, 94, 93, -42, -69, 5, 112, 60, -84, -120, 14, 111, 42, -86, -112, 16, 124, 59, -104, -128, 11, 116, 28, -74, -94, 38, 98, -16, -95, -53, 73, 75, -6, -114, -40, 101, 96, -45, -138, -42, 85, 118, -29, -122, -42, 84, 64, -25, -80, -23, 74, 48, -41, -94, 33, 106, 47, -127, -129, 15, 119, 42, -99, -161, 3, 104, 29, -81, -134, 14, 76, 35, -92, -99, 29, 83, -17, -125, -54, 71, 95, -28, -129, -62, 83, 104, -25, -106, -58, 89, 89, -7, -92, -38, 92, 83, -47, -68, 20]
4015B0Q3m0j15pJ00Q4k4j61l2J03J52r8j12m3J09R6o3j04OP0N7o5j09L6J39qq9
4042a5j04N2J52K8j18j36M7J33Q3j40r4L9J24J4q8n7P7O2J4j23m8J30P7k4j68
4067h3j7J27R7l8j60n5J20Q6l0o7n4R4O3n9j00J3Q6L9n7j32P5Q9M2r6j22N3J22
4094C6N6q3j21J7R5O1j10q8P9Q4J3j12l6Q2Q1k1j19o3J22J06j4j35m4P9J31Qj52
4121d8k9Q9O7l2r0l5J34J0n5r0L9J18O2j36j12N2J14N1r4n9m3J38P1q6q4J6Q2
4148E0J4p9o5M4J05J3j46m3Q3J08qj50n7P6J62l0j29p3Q9P9L8j21l9Q0R6o0j01
4175f4j3J37L0q3q3NJ40O0q4j37J2J09J13j07j06K7O1Q9r7n7M7O3J4j01o5R3P6
4202G9nj09p7R4Q7K6j22q0P6P5K8j12l7O1O5k8o9n6J06Q3o0j32L4Q5P0m6j35L5
$$ y = [20, 103, 63, -52, -59, 41, 125, 101, -60, -92, 11, 163, 65, -47, -90, 19, 115, 52, -52, -46, 24, 81, 16, -93, -57, 82, 74, -15, -119, -67, 85, 113, -5, -141, -94, 39, 122, -18, -112, -73, 51, 65, -23, -80, -3, 59, 73, -50, -98, 32, 109, 85, -83, -100, 27, 124, 86, -74, -129, -9, 77, 47, -20, -74, 20, 83, 24, -76, -63, 23, 62, 5, -127, -52, 37, 79, -17, -139, -86, 36, 92, 9, -112, -95, 0, 61, -49, -137, -58, 26, 39, -73, -109, -27, 54, 33, -86, -149, -27, 79, 65, -70, -114, -35, 96, 104, -48, -77, 12, 79, 47, -43, -78, 56, 66, 11, -79, -40, 78, 140, 4, -108, -56, 58, 109, 15, -44, -87, 51, 122, 36, -48, -32, 50, 64, -15, -80, -36, 69, 82, -64, -107, -24, 84, 76, -74, -131, -55, 107, 77, -52, -125, -36, 43, 81, -40, -79, 1, 97, 37, -64, -77, 60, 90, 7, -76, -71, 69, 129, 45, -92, -80, 29, 142, 35, -71, -44, 17, 106, 9, -48, -1, 62, 76, -25, -90, 3, 79, 74, -35, -112, -18, 69, 95, -27, -107, -31, 44, 72, -40, -77, -16, 49, 21, -48, -104, 2, 85, 25, -107, -73, 12, 82, 36, -99, -64]
4230f4R7P2n9j20mJ18M7o4r7K4O8M7o1p8N5Q7j8q1n2M3J16Qq4j35Q0J11J9j16
4258d1m7L6J03Pr9n0P2P1m7p7k7Q2R9o6j31mJ36R1q4j34NR3J04p5j09K0R2L3o4
4287a1q0P2O9Qq7n4M7J18K6j35o4O8R4K6p9r6N2J10J3q8n0L6N3mp9m5Q3Q7m1j08
4317e9NO9Q8n1j15m3J28O4m8j09k5R3Q4n3r7J4N8O7r0o0jQ7O0r7q3L6J25K2j27
4346e8n3M8J16J9q0q5M1P8J7p0m8O1P6m7n6m3O7R9k1j28nP3R3m1j06m1R9P2j8
4375E9r2l1Q2K9m4o7J6P4M0p7p4N7J06K2r8r5M8J12K5r5p4N0O2K7o1n0N4M6rp1
4405b9l0M7J15k7j19l5R4P6k4q1k6M2Q7l3o1l0N6M5j6o8k0O9N9o1q8K2N0N5p9
4434a0p6K7Q1O7m6j39L0J01J5o5n9K1P1J7o3n5L7O6Jj10m6R1J00l0j05j9N4R8
$$ y = [-64, 33, 105, 46, -74, -78, 40, 87, 23, -74, -50, 18, 65, 4, -74, -19, 68, 50, -31, -83, -40, 76, 84, 0, -135, -55, 56, 75, -41, -88, -52, 51, 58, -41, -91, -19, 52, 5, -72, -99, -17, 82, 16, -115, -119, 17, 108, 24, -110, -105, -12, 92, 17, -92, -72, 20, 53, -11, -91, -19, 50, 58, -29, -83, -36, 82, 108, -27, -91, -23, 71, 97, 18, -78, -26, 84, 97, 9, -41, -5, 48, 44, -35, -80, 3, 90, 49, -59, -54, 15, 103, 52, -63, -106, 22, 86, 38, -71, -96, -3, 81, 28, -69, -55, 3, 70, -20, -80, -81, 6, 66, -31, -114, -78, 47, 69, -58, -111, -63, 53, 72, -8, -93, -52, 26, 43, -27, -75, -14, 62, 15, -41, -84, -17, 82, 61, -67, -72, 1, 94, 53, -53, -94, 5, 77, 59, -33, -64, 18, 47, 3, -64, -48, 26, 66, -11, -85, -28, 78, 100, 2, -93, -45, 67, 92, -3, -77, -27, 35, 62, 1, -49, 5, 51, 42, -29, -59, -12, 103, 76, -43, -78, 16, 92, 68, -13, -39, 3, 90, 57, -4, -34, 22, 67, 51, -17, -37, 32, 91, 30, -58, -36, 14, 69, -10, -86, -59, 22, 89, 43, -96, -66, 35, 50, -15, -74, -53, 18, 35, -28, -83, -46, 20, 21, -89, -135, -44, 56, 26, -79, -98, -44, 54]
4462E4k3q8l2Q6M7l7n2nL9M4j5r2J6O3O6n8j10L2R3P2j06p5L4Q5J1j7q5kO8L7
4492E0o5m0M1N9Qq7k5L2R6Qj11m2N9Q5J3j11m6N7P9j6o1j7J3R7n2n2k8O3N7n1
4522A3o4J4P1N9q9p1K0R4J9m6p4RO7L8o3m5K8N4Rn1n0M3N5qn2o5O5Q5Nr3n6M5
4554c4P6L4q1r2O5J01m3p5j4O8M6l6n3ML7O0n9n5j3Q3K9j6r7OR3K2m3n7%Q2J3
4585E1m7l1mO8Pq7m1M5R5J0p8q7O5O8J8q1m6K7N9K9p3m0M3N1j4p3LN8M7j4j01
4616g3kO2R6n6r8qO7Q1n7p2RP1L2l5p8J9P5K9r1k4J2J03J1q5m7L4N6M2q6p1K2
4647f2J21k7l0o0K9O3mm1m8L8P8k6q6NM0Q6l1q9l9Q5N3j6q1j8M5Q2n7o1k1R8j
4678B5k3n0K1P7J3q8q0O6J02J5j04l1K6N5J6n1m0L2O8ro0m4M9N3j3p8rL6R3k6
$$ y = [54, 31, -57, -89, -3, 44, 7, -45, -50, -11, 33, 18, -74, -58, 5, 71, 13, -97, -65, 28, 100, -6, -81, -47, 38, 49, 32, -53, -55, 13, 50, -15, -55, -14, 45, 53, -34, -59, -27, 69, 77, -34, -76, -17, 68, 81, -30, -76, -19, 60, 44, -17, -34, -21, 76, 24, -28, -56, 7, 64, 13, -51, -37, 34, 93, 4, -67, -47, 47, 66, 20, -54, -45, 22, 60, -3, -48, -20, 34, 43, -8, -58, -15, 40, 32, -20, -85, -20, 65, 70, -23, -79, -34, 42, 76, -5, -97, -32, 69, 26, -49, -63, 5, 51, 15, -38, -34, 3, 63, 4, -51, -64, 19, 48, 32, -65, -59, 34, 56, 13, -44, -44, 38, 51, 4, -27, -31, 37, 44, -43, -84, -39, 56, 66, -12, -99, -34, 34, 52, -29, -75, -48, 11, 40, -33, -73, -30, 21, 7, -66, -63, -5, 42, 28, -73, -75, -13, 83, 27, -71, -79, -12, 69, 12, -60, -51, 20, 52, 17, -61, -42, 33, 62, -29, -53, -41, 62, 73, -12, -59, -25, 31, 73, -13, -84, -62, 59, 32, 2, -58, -29, 34, 30, -11, -59, -21, 57, 31, -55, -50, -10, 76, 45, -44, -83, 2, 55, 39, -42, -60, -15, 67, 10, -51, -72, 26, 25, 2, -48, -27, 50, 63, -25, -105, -39, 63, 78, -26, -57, -31, 24, 40, -11, -51, -19, 49, 40, -20, -64, -15, 38, 25, -53, -62, -26, 67, 41]
4708D1q8pK8Q5l7n1m5O0O2l3o5k7Q2L2k4o2pQ7K5m3p5J2Q4K6n4n9K2N1M6o0l4
4739b8j1R5J0p8j7L1K5J2m7k5N4O2l2r5PO1L9mj04KM2M4j3o1k6N5N2k7n5qK8N2
4771D0k2q3J7P9ml4m7kJ02J7o5q0QJ04Ol6n9K1O3K5p7j2J7O1j0n1l2M2O3j4n8
4802b1l5P0M3qo3k9L0M6J4n1k6O9L2m0o0j6P7J1qr8L7K8Q1n6r3lP3M8k9o2qN7
4834A0M0n0n9O4JK9p5k1L7N0nn2m5L0P5K3q3j6K5Q0k8o9j9O0M2l2m5J2M6Mk4p3
4866f8K5Q1Ok8r3K1N6N1j8p4kN1K9j5o7J4N5J6l9m1J3O1%p6k0N9N8mp7p4P1P1
4898D2J8q8l2N4M7j1n2j4N5M0l8m4l3R5J8l4m7mO9K6k9o3PL9K1pn6J9M0J8m7k5
4930a6J1L2Ml9k8NP2J7m7q0K3R3l0o1n7R0L6on3k3K3P2l9m6k3K8O7k2n6l9Q9N4
$$ y = [41, -47, -54, -26, 59, 22, -29, -74, -14, 48, 15, -50, -77, 5, 37, 13, -49, -56, 31, 56, 13, -62, -50, 34, 60, 6, -53, -31, 20, 66, 6, -28, -39, 56, 66, -12, -29, 2, 27, 39, -8, -33, 21, 83, 51, -44, -37, 24, 63, 59, -45, -43, -1, 43, 30, -31, -57, -2, 50, 23, -32, -40, -12, 40, 18, -65, -48, 31, 27, -7, -54, -56, 46, 63, -2, -82, -74, 30, 36, 0, -59, -38, 25, 50, -27, -39, -22, 39, 29, -22, -54, -12, 51, 37, -21, -56, 14, 57, 49, -14, -43, -13, 33, 47, -4, -30, 39, 71, 31, -29, -45, 32, 43, 35, -63, -26, 2, 83, 27, -66, -69, 4, 52, 23, -39, -47, 10, 50, 0, -59, 5, 6, 35, -40, -61, -24, 26, 21, -31, -76, -46, 29, 52, -31, -47, -22, 58, 30, -39, -58, 2, 44, 12, -33, -21, 25, 29, 5, -68, -43, 38, 44, 16, -77, -56, 0, 51, 33, -41, -43, 8, 37, 22, -45, -31, 24, 40, 1, -40, -27, 34, 34, -42, -62, -3, 55, 51, -26, -100, -29, 42, 60, -28, -60, -6, 41, 30, -22, -36, 19, 59, 21, -23, -56, 39, 57, 23, -24, -28, 41, 67, 38, -25, -18, 21, 42, 35, -21, -2, 38, 56, 9, -16, -5, 27, 31, -8, -36, -31, 41, 58, 11, -69, -46, 47, 17, -44, -101, -11, 25, 19, -34, -57, -34, 38, -1, -47, -70, -42, 25, 3, -53, -92, -3, 51]
4962E1k2q8l6J00N9n1o8J6L7L6k4p1K8N8Pj7p3RQ6Km7o0M6M8K6o2j6j5P9Lm1o5
4994f5M3M6Jk9l3L2M2k1n2lM1M2Jq1qN7M8k2m3m6P5M4p2l5NN0M4n5o3M6M3L2o5
5027aoJ4J6M8n4o5L9M1J0l2l6J5M4J2l7n5L6M2j4j9m3J5P1Jq8j0L8L7Po9j3L3
5059b3N6j5l5l8N0M0m2m3j1N2L6o0p%P5ol6m8MN9L8n0p4L2O1K1n0l4J6Q4l7m4
5091b9k3N3M4qn3jK8K4K1n5l1K0L7Kl7pM0OJ5r1L2K2K0j7p6N7J8K7k9l5j8Q8P
5124E1k4o8j7N0M9l6j6jK3J4m9oNL2L1n5j0J1O8l9m4oK6M1j3k2m4M0N9k4m8nJ5
5157a2K5j0j8k1L7L6j4n8k0P7Qk9k2j7N4PRo2qM8J7k1n1K5RJ3l0l1K9N0km3k5
5190e0L4N6on2l8K6N0Ol2l1K5L5K6r3K8K5M3k3n7JN4L4o2k6NK8J6On3J7M9j4K6
$$ y = [51, 29, -59, -95, 5, 64, 13, -55, -39, -2, 34, 10, -61, -33, 25, 32, 15, -58, -49, 37, 39, -8, -68, -22, 26, 52, -10, -26, -41, 38, 41, 0, -65, -22, 24, 25, -4, -37, -5, 37, 16, -36, -39, 2, 44, 45, -36, -44, 13, 61, 39, -4, -50, 25, 69, -3, -38, -33, 17, 61, 6, -57, -11, 32, 64, -1, -7, 7, 23, 71, 17, -48, -9, 32, 42, 10, -26, -11, 33, 45, 8, -47, -11, 31, 17, -2, -45, -30, 41, 42, -46, -56, -18, 19, 26, -43, -56, -23, 33, 18, -17, -55, -5, 35, -7, -50, -61, -9, 27, -33, -40, -40, 35, 29, -7, -55, -51, 8, 46, -4, -78, -46, 15, 36, -14, -48, -32, 52, 15, -29, -52, 1, 45, 37, -16, -17, 11, 35, 56, 1, -30, -10, 27, 29, -8, -15, 25, 31, 46, -45, -13, 9, 29, 12, -64, -7, 11, 38, 9, -26, -44, 44, 51, 27, -41, -58, -8, 41, 5, -11, -12, 11, 25, -24, -30, -25, 7, 38, -17, -27, -16, 52, 13, -31, -37, -11, 30, 17, -5, -49, -9, 50, 26, -22, -27, -12, 13, 3, -15, -36, 1, 37, 23, -35, -55, 22, 30, 1, -21, -38, 16, 23, 32, -30, -38, 10, 27, 6, -45, -20, -11, 2, -28, -59, -30, 20, 18, -25, -50, -16, 40, 34, -18, -56, -30, 20, 26, -6, -37, -12, 23, 49, -44, -16, 9, 52, 29, -28, -27, 27, 61, -1, -27, -22, 6, 22, 28, -25, -8, 41, 27, 53]
5223E3o3j7N4Jm2j7J8K6L2n5j9J3L1K1p4k3N8OL7p5k1L1L8Qn7K1K2K1j3o0jK0
5255b6N3jo9pN8O6o3l5kJ2M1Ol2j4K2L9o9Qj1K7K4k8m7K1M0M6n3m8J2N1M1o0o0
5288e8L0N0Om3l2L3K1K5n2%L8K5n3rl6O4L8m0l2j7L7M4qo3mM0J5k6j9LK3L4n7
5321b3pM1kJ7l1l1J4M6L1o3l9K7L8K8p8J3lN5rn5j0K7K0kk2k2L8L7k6l8j5L9L8
5354C3j0m9qK4M0k3k4j2N1kk7k2J3L6L6p3k6M1J0L6m8k5PM2Ql4l9M0K9J2n6k6
5386d6K4L3J9l6m5M8L5j3n9MK7M0K3p4l0L5M2Ll6j2J5L0j6n7K0L8K3l8m4J6M7
5417A6N2n9o3L9M3J4n1k3MM6L0m1l9jN8j0ml1K1ORn3KK7M7j6k7m2K1N0Nk3k6K9
5451A0Rkn3L2kK2l1j6j1N6J1l3l4mO5K4k9n3J9J7M0l0k6k5N8mk0k1qN8Oql9K2
$$ y = [53, -10, -27, 27, 28, -14, -31, -13, 13, 45, -10, -29, -16, 15, 36, -38, -61, -3, 3, 40, -35, -56, -25, 13, 21, -36, -15, 7, 28, 15, -45, -46, -26, 27, 26, -43, -50, 8, 74, 11, -24, -26, -14, 27, 33, 1, -13, 9, 48, -21, -13, -24, 3, 27, -1, -48, -27, 13, 59, 6, -42, -30, 21, 62, 2, -58, -28, 22, 28, -15, -47, -14, 7, 32, -20, -20, 18, 43, -10, -19, -55, 9, 47, 7, -25, -42, -5, 39, 31, -32, -36, 4, 19, -7, -26, -23, 0, 34, -23, -30, 11, 9, 26, -5, -36, -22, 24, 55, -8, -47, -20, 18, 46, -32, -19, -22, 33, 24, -31, -41, -14, 6, 4, -18, -40, -2, 35, 9, -29, -44, -5, 33, 23, -26, -34, -10, 30, 7, -17, -29, 22, 20, -7, -29, -16, 20, 56, -17, -43, -2, 8, 44, -4, -29, -22, 20, 28, -6, -45, -5, 24, 36, -20, -46, -22, 11, 30, -6, -51, -3, 32, 19, -40, -36, -9, 31, 54, -20, -50, -15, 27, 30, -6, -18, -3, 27, 11, -46, -26, 12, 35, -3, -47, -31, 16, 68, 9, -54, -15, 28, 42, -9, -32, -28, 18, 48, 7, -32, -33, 25, 15, 11, -20, 1, 7, 16, -37, -35, -8, 39, 23, -4, -46, -25, 25, 30, 7, -19, 10, 19, 17, -36, -4, -6, 16, -15, -31, -42, 14, 25, -8, -42, -46, 19, 43, 14, -39, -20, -3, 37, 7, -19, -44, 14, 10, -10, -31, -39, 19, 25, 17, -22, 0]
5485@J3Rk3o8M6M6j7k5j6PM3jk6k1K1K3oj6j9L1K2k0l7OJ8N2l6m8K3J7K0j4j5
5518a1m3M7K3Mo9M0L3Jn1J5NL1J0m3j8L5K8on1KK7LJ0k6k6K6J8Rk5j1J3K5l4j8
5552b7j0K8L0jn4J4K1K3j8k4k6M7K2j3n4K6L5Lpl0k1K7M3k3o3L6N3k7j2k8K3J8
5584A1lk0KJ0K6j6k1RrL8j1l6KK3K5m5k0RL9K9j5m6%K8K3l0rRoK3Ql9lJM0k6n5
5621e5N9qK0j6k5mM5J2n2oJ2M4Kl4j7J1L9j4m2J2K5J3%j9j6K2RKj7k5M3KK5o9
5655b2J7K4Qj1j7j2PK6j7n1L4M3j5l3k0M0J3pj8k7J5J5J8om4K3OK3m0LmM2lj6
5689fj4NK0J1n3LL4Jlj5oK2NK3l2j5L8Ll7jj7N4Lm0Rj2M2lj7k4jL1L1m3k6K0K8
5726A8lk0k4mN6pk4ml6O4mk9oKRL8l6k5L5K3j8j3j2K6J0nk9nL9Kj5l1K6RJ9j7
$$ y = [0, 13, 22, -1, -69, -23, 23, 6, -19, -35, -28, 15, 14, -12, -33, -12, 11, 5, -11, -30, 1, 23, 3, -34, -28, -10, 42, 6, -42, -19, -2, 18, 4, -11, -54, -7, 16, 20, -49, -9, 24, 25, -26, -11, -6, 25, 35, -8, -26, 9, 37, 31, -20, -18, 9, 12, 22, -4, -30, -4, 14, 23, -2, -13, 0, 25, -9, -27, -37, -9, 21, 20, -34, -20, 1, 24, 6, -18, -44, 3, 25, 12, -42, -16, 19, 22, 15, -15, -36, -9, 34, 11, -52, -16, 37, 10, -2, -30, -7, 11, 8, -12, -10, 0, 26, 10, -11, -2, -11, 27, 16, -20, -18, 5, 30, -15, -35, -26, 13, 42, 27, -19, -19, 9, 32, 2, -7, 2, -4, 19, 27, -12, -15, -14, 26, 0, -55, 4, -4, 16, 0, -25, -29, 16, 28, -24, -30, -18, 26, 28, -6, -23, -12, 27, 13, -29, -17, 8, 21, 21, 2, -14, 8, 17, 19, 2, -23, 20, 22, 47, -22, -5, 19, 27, 16, -1, -13, -6, 20, 3, -48, -14, 29, 14, -19, -39, 1, 14, 7, -11, -38, -23, -8, 10, 4, -40, -17, -11, 12, -28, -25, -29, 13, 10, -6, -20, -15, 5, 16, -37, -34, 0, 1, -2, -17, -23, -1, 4, 27, -5, -20, 18, 21, -16, -17, -34, 20, 23, -17, -8, -20, 22, 19, 2, -22, -23, 8, 39, -4, -30, -10, 18, 15, -5, -29, -33, 23, 16, -8, -12, -48, 16, 12, -17, -23, -21, -12, 26, -10, -35, 0, 23, 5, -8, -20, 6, 16, 11, -18, -23, 16, 18, 3, -28, -2, 7, 26, 9]
5762Il3L1J1J9On9lL5NJ8l1mLPj3k0J1L5l1Qk8L4L9l1k0l7K3J5K6k4j6j1L8Kk8
5797a4k2L9J0k4k7J2K8kll2RL6J3k5l3MJ6N1n3j7j1M6K0qk5j1L3jk8j2J3M4j8
5830HJ9l3j0O9n4j4K9l4L9k8J0l7J4N1j9k8k1L3K1k7prL0K9l1l1L6pJ0nm2lK1
5863b1M1j0j5KopPmJ6J3J6n4RNK5qk9j0J7K2Kj6j4K8lKj2p%M0l9j1j1L4J0rk3
5900b0kOL0Qj4l0OL8k7Lk9M1Oj5m9L2L3Ll0k7J7M0k3mk7KL3L0j8l9NL6pl4OpN9
5937C2qj7k8QMJ5j1oj4L1Ok8oK2ONk9pJ7PKk9QJ0lnL%J3mjpj3J8J9j7l5J8J8J5
5977Im9lK7J9lk5K3j1J4%Kj5J0Rj0j0mOJ4K0l0J0k0L6Jl5J2J2jrrlJ0K5l2j3p
6014c0L6K0k9j8j7N1J1Kl7nL3jk1pOJ9j2k3k2M3J8ok5pJ0M4Ql6j8PK9j2%m0L6
$$ y = [9, -24, 7, 18, 37, 43, -16, -19, 16, 21, 39, 8, 4, 7, 14, 1, -19, -8, 27, -4, 4, -24, 10, 49, 18, -2, -39, -16, -1, 25, 1, -15, -26, 12, 14, -14, -36, 3, 13, -11, -38, -26, 2, 0, -3, -35, -26, 10, 23, -2, -35, -31, -15, 36, -17, -34, -45, 1, 21, 13, -12, -23, 10, 9, -19, -31, -18, 26, 8, 27, -6, -16, 53, -1, -15, 14, -20, 19, -9, 1, -36, -22, 29, 10, -18, -39, -6, 15, -12, -19, -28, 2, 31, 0, -31, 5, -2, 8, 3, -39, -42, -21, 20, 10, -5, -3, -9, -16, -9, -13, 3, 16, 32, -22, -13, -8, 17, 9, -20, -30, -13, 9, 11, -5, -19, 9, 6, 8, -4, -11, -11, 29, -10, -21, -32, 2, 12, 3, -20, -22, -16, 14, 22, 8, -22, -16, 22, -5, -2, -31, 10, 16, 1, -48, -16, 17, 20, -10, -37, -20, 20, -3, -7, -34, -32, 1, 31, 13, -26, -21, 15, 8, -26, -20, -27, 32, 24, 7, -21, -13, -9, 6, -5, -11, -25, 6, 12, -16, -22, 0, 6, 11, -18, -25, -8, -1, 1, -28, -20, -10, -13, -18, -15, -15, -2, -6, -7, -14, -27, -9, 10, -7, -42, -24, -6, 9, -40, -43, -16, 3, 0, -25, -2, -13, 1, 1, 3, -12, -2, 7, -3, -13, -17, -11, 3, 23, -7, 3, -17, 19, 20, -15, -3, 9, 8, -1, -10, -13, -3, 22, -10, -23, -30, 6, 26, -3, -21, -38, 13, 24, 26, -11, -16, 17, 16, -5, -12, -6, 13, 1, -22, -44, -1, 17, 11, -14, -21, -11, 33, 41, 5, -13, -6, 23, 11, 11, -29, 7]
6049GOJ8n2KM3J0jn2J7lLJ6k7JK3J6k6k3kL3Kjl5K0KK3k1j6oL7j8Pl4L4M4m5j7
6086a5j6N9l2LPl1jJ2K5k8oL2j8kl2L7%L0nl4oJ3K7j2k8J5JL2ol6nQRQl7K2K1
6123A1Nk5opK8j7Pk8J4L9rj5Kj3K4mMk8J9J6k2j8M2j6okl3%L9K6l6NkL4pm2PK
6161a2lJ3J0j3rRJ9Kl8L5j4kQl2J5N2m7J4rk4M4J5l9k6L5N%%k5K4J2j5kk9N2J
6197B6l3qlK3K2k4j3k4K1L4jk9rK8J6k5k2MkL4%k3J0j1K2plMKj8mJ4j6J5mj7J4
6234gk0J9j2JrJ1M3%k4k9L0J9mj1l9J2J9Knj6J9J4ll5K8kK1l3J7k5L8J2%o6K1
6269a4K4Jk2pOK4Kl6K7k6L1j7pK1j8J1J4k8j6OJ2Nj3qM2j8K3j0m2M5Qj9k3J3K
6304gJ3j8j1J7nJ4J0l3qJ9LjqJL1J7k7k6MK1k0kK7Kj8K0k5k3L3pJ5l4J3j3M4l2
$$ y = [7, 13, 31, -21, -19, 24, 34, 33, -19, -2, -5, -2, 14, -13, -12, 11, 27, 1, -22, -24, 9, 11, 10, -25, -5, -3, 20, -1, -17, -23, 14, -4, 3, -31, 3, 47, 2, -15, -31, 28, -4, -1, 6, -25, -26, -14, 11, -17, -23, 9, -9, -11, -43, -6, -6, 24, 19, -15, -21, -8, 19, 7, -21, -6, -5, 27, 21, -15, -20, -12, -3, 5, -32, -10, 11, 16, -9, -15, -22, 6, -11, -4, -32, -18, 21, 12, -3, -1, -14, 10, 6, 10, -18, 1, 17, -5, -23, 19, 3, -3, -5, -38, -38, 1, 27, -9, -4, -6, 28, 21, -21, -14, -12, -15, -2, 8, -5, -14, -5, 14, 16, -22, 13, -1, -3, 5, -27, -12, 40, -7, 7, -2, -26, 18, 33, -6, -32, 3, 8, 8, 8, -17, 7, 19, 4, 2, -27, 25, 26, -7, -15, -18, 5, 27, 3, -10, -34, -13, 21, 20, -9, -18, 10, 26, 1, -21, -17, -19, 15, 15, -8, 2, -9, 13, 6, 3, 7, 9, -9, -13, 1, -15, 0, -4, -21, -7, -27, -8, -20, -19, -28, -17, 26, 26, 2, -27, 3, 22, 18, 7, -32, -20, -1, 1, -4, -20, -1, 13, 10, -25, 3, 1, 22, -11, 6, -19, 19, 31, 31, -35, -14, 10, 11, -11, -18, -12, 12, 14, -22, 5, -21, 10, -7, -14, 7, -11, 0, 14, -14, -30, -24, -12, -7, -20, -28, 14, -4, 19, 9, -33, 12, 20, 1, -22, -9, -7, 6, -12, -23, -6, -11, 3, 13, -20, -28, -9, -6, -7, -15, -14, 17, 34, 7, -19, -15, 6, -14, -16, 11, 13, -5, 15, -10, -33, 0, -7, 8, -26, -13, -26, 18, -14]
6340a4k2K0J3L2j8j5kk2L1Om2J2lL9k0j2rJ1K8l2KrK3K8l2K1k4J3nK5n1L1j0K1
6374A4oj9K8kk9MQOJ2Mj7l2K4K8j4k6pJ2K9j8Pj3JJ8qj1KJ3Pnk2j4ON0j2m7kL6
6412Ej3Pj3MMK8l9J6j7L3kj9j2PL5Rl7k2K3KOj7J0OJ8lj7OK0j7J3l6nKL4l0Jm
6450a4L7j0k7Rj0JL0j6j4MJ9kj4k4K7RMNm4J0L6k0mj2RJ7Rl1k0L3rOk0J9j3J8
6486bL5n0NpM5k7k0K2J8LJl2J4J2J7pm3K3k7N4Nl7q%L8mj6mpJ2ok0j0M5j3ll2
6523b6K8K4l4o%J3nJ7jl1%L5j9Qk8J1J0J6j9k4K2K2j4rK2J3k5okJ2J9Qk8J0j4
6558a%J7nj4j1RLj8K0LJ1lMj9k9J7K5Krj7M%l0J6LQK4ll7M4jj4qj9K9nmJ4j5J1
6598BqK0k0oPRJ5m7ML5K7l7LLk5J9Jj6RPj2Ok1QL9J2m7J7j1K1J0l7kK1j9K8j1
$$ y = [-14, -36, -16, -3, 29, 11, -4, -6, -28, 3, 9, -33, -21, -24, 15, -5, -17, -26, -15, 13, -19, -17, -26, -3, 25, -7, 14, -10, 3, -2, 23, -28, 3, -7, 14, 8, -11, 17, 15, -14, -10, -2, 4, 16, 20, 3, -29, -5, 23, 9, -17, -24, -12, 17, -1, 6, -7, -6, 12, 4, -7, -5, 8, 15, 10, -12, -26, -20, 30, 18, -29, -31, 5, -8, -1, -14, -10, -6, 22, -17, -1, -18, 15, 13, -6, -18, -11, 24, 33, -4, -26, -3, -1, 5, -12, -2, 4, 22, 19, 2, 8, 28, 11, 24, -12, -17, -15, 19, -11, -10, -14, 23, 13, -14, -5, -15, -14, 16, 0, -14, -10, 9, 7, -7, -31, -4, 5, 9, 14, -30, -20, 16, -4, -8, -20, -11, 6, 15, -16, -36, -3, -12, -6, -26, -7, -20, -2, 33, -17, -12, -19, 26, -1, -21, 1, 19, 22, 23, -9, 5, 17, 34, 27, -16, 7, -20, 34, 39, 2, -6, -6, 32, 28, 12, 8, 1, 13, 7, -13, -23, 22, 9, 6, -26, 2, 26, -8, -14, -14, -1, -6, 11, 10, -21, -21, 14, -5, 3, -25, -14, -4, 12, -7, -31, -9, 13, -1, -10, 12, 25, 0, -6, -8, 4, 23, 31, 3, 13, -1, -1, 16, 11, -3, -14, -5, -2, -20, 0, 3, 14, 11, 15, -4, -33, -16, 9, 11, 2, -15, -11, -11, -41, -25, -22, -14, 10, 7, -30, 14, 13, -1, -9, -28, 1, -4, -8, 6, -9, 2, -6, 14, -6, -12, -5, 4, 19, -28, -24, 11, 38, 1, 4, 7, -18, 1, 2, -14, -5, 2, -10, -4, -25, -17, 22, 34, -13, 4, -7, 14, 24, -13, -15, 6, -13, 15, 4]
6635Dj3%PJ7l0%J8Mjlk6J0NJ2OK1j8k5J0J0j3J7Lponj1K3npP%J1Kk8J8k%Pj7m
6676iPk1J9oJ0j5K7j7J0k4L9Pj6qqMJ3rk%%J8k2j7J2K0j2k0j1K1nmj4J3K9j2K
6713aQj8MJ1kj4K4j3OnKk0J5oM4l0qL2k6kk4K4PK6k2k5J2J0Rj2k2MK2J1j1k4J8
6750DPKj3J0j7L1rj2k2J6lj6K7k1QK0k4%%RRjj7Pj2lK1k5J6qK2krNJ0onJNJ6j2
6791Ik7K8k2K7lj1j3PJ4Kk0K0qrj3k5N7j9jK7k1j0K5NJk9J2qJ5oj9j2L5j8KJ1
6827Cj5K9Qk1K3k9J4nJ4l2PJmJ8k8L2mnj6OM%j3nK3JJ7k0jlqK5k5nPJ3kj0K5j7
6867Bj3lK6j6RLjk3k1K0mK2l0K6j5j3L9l5J6pJ6J4j7OLj0J7k9J3pQNmJ0mRjk8
6905a7j5M4MJl7K1L3k8OoJ5rrj5K4j4J2J5l7kJ2qJ3j9J8Rj8kJ7qj4N4k7Ok7lR
$$ y = [4, -9, -9, -2, 15, -15, -15, 3, 7, 6, 3, -23, -13, -8, 4, 10, 31, 13, -12, -2, 8, -5, 12, 15, 8, 2, -3, -14, 9, 4, -3, 4, 4, 15, 17, -11, 7, 5, 5, 12, -5, -9, -2, -23, -4, -10, 0, -15, 12, -5, 5, -19, 20, 27, 11, 3, -5, -1, 12, 3, 1, 1, 1, 19, -3, -20, -8, 12, 0, -20, -31, -10, -15, -19, -33, -20, 9, -3, -1, 7, -11, -7, 4, 2, -12, 12, -1, 5, 0, 2, -18, -3, -9, 35, 5, -3, 29, 3, 1, -23, 1, 8, 34, 12, -13, -1, 9, 18, 6, -16, -12, 10, 21, 10, -14, 4, 11, 13, 0, 10, -7, 24, 15, 3, -19, -3, -6, -22, 5, -16, -8, 12, -12, -12, -12, -3, 6, 5, -12, -5, -17, -20, 1, -24, -8, -16, 6, 4, -5, 0, 10, 4, -1, 0, 5, 21, 9, -18, 10, -12, 15, 12, 1, -12, -5, 9, 11, -9, 11, 3, -6, -19, -44, 13, -6, -7, 20, -1, -11, 14, 19, 20, -9, 3, -5, 10, 4, -15, -27, 8, -10, -8, 3, -12, 17, 25, 4, 27, -2, 12, 7, 21, -11, -4, -3, -7, 11, -17, 15, 11, 6, -10, -4, 0, 0, -13, -18, 5, 6, 23, 3, 2, -1, -9, 16, -9, -14, -7, 6, 4, -6, 19, 2, -11, -14, 12, -4, 5, 8, 7, -16, -37, -17, -21, 1, -29, -3, -18, -31, 8, -27, -11, -18, -2, 12, -5, 1, 4, -6, 11, -18, -5, -12, -4, 1, -3, 7, 3, 12, 11, -17, -32, 12, 16, 17, -20, 1, 34, 6, 12, 6, 21, 12, 3, -12, 12, -2, 10, 25, -12, -14, -2, -10, 3, -16, 2, 11, -7, -9, 8, 0, -14, 40, 13, 19, -8, -11, -2]
6942bQk1OK8j2rkPrRJ6k4pj4L4Rn2K7%PJ9j5J4k0KMj0mN0j1j5k7klM3k7qL6k5
6981@j4nJ1J3rLjmK1Prl2%ML7nn5K1NJ4K3n5L2RK0l5Mj0OJ2jl5mPL4Pj0pj9M4
7021B4n0PJ8mK6k4j3qK6J1k9jK8j5K9k2RP%j1k9J6L6j6rj6k9K5K9J6m3L2l0K4
7055A4k7jK4Lj6K3k4J6j4K9qm4KRQJQrKmKkmkJ3poJ1K1k4poJ5J7Nk8rJ7LqK8l3
7097a2J5Lj0pJ1J1l6N4j3kJ1oj0j2k0K5nOqj2L1oqkL%RrmJoK4k9JKOK5j0k2L2
7137B1Mj4Ok0J1Onj2Kj0J6j7qMJ6J4k7J9l5KK6J0%MJ4j5oj1KL1m2NK3NNk7lqK9
7176A5K2j9j5nK2plnqPj5L4j2j3J0qj3KkK8j8korPN2l2j6J1l1N0k6kokK3j4JN
7215@j6J9J0k1J1PKOj9j0J7J7km9J8J9Ql1O%RJ6%j6JQj3J8j2j7L1J1k9J5j3Pk4
$$ y = [-2, 6, -15, -9, 19, 7, -2, -4, 3, -6, 3, 19, -5, -12, -26, 8, 17, -35, -8, -8, -1, 18, 3, 17, -3, -1, 3, -7, -11, 39, 28, 13, -14, -16, -19, 24, -3, -11, 25, 0, -14, -19, -8, 5, -4, -1, -2, -6, 15, 22, 13, -19, -19, -15, 22, 17, -38, -17, -12, 2, 25, -30, 2, 11, 31, -4, 0, -10, -4, 8, 7, -28, -32, -25, 9, 16, 6, -1, -20, 24, -26, -19, -1, -5, 21, -3, -16, -24, 2, 13, -16, -17, 11, -4, 25, 3, 12, 19, 19, 8, -21, -5, 31, 15, 6, -10, -39, -14, 15, 31, -12, 20, -10, 14, -13, -14, 10, 13, -3, 20, -4, 12, -2, 27, 19, -25, -23, -14, -6, -5, 3, -6, -4, -8, -6, -8, -12, -14, -1, -8, -14, -3, 18, -6, -13, -19, -4, 13, 18, -10, -19, -2, 1, -7, 21, -12, 3, 6, -4, -11, 0, 11, -25, 29, 16, 14, 25, 19, 9, -3, -23, 2, -3, 3, -5, -17, 14, 8, 0, -2, 1, 1, 10, 1, -3, -2, -8, 16, -13, -12, -10, -4, 21, 11, -11, 21, 25, 11, 17, -3, 8, 14, 9, -3, -1, -11, 5, -12, -20, -16, 0, 14, -13, 6, -29, -27, -1, 9, 9, 13, 27, 12, 6, -5, -3, 28, -14, -9, 14, 19, 24, -3, -6, -14, 15, 37, 18, 3, -2, 20, 13, 10, 5, -3, 4, -11, 23, 11, -2, 8, 0, -13, -11, -13, 15, -3, -5, -11, -20, -13, 39, 7, -9, 2, -29, 21, -5, -7, -13, -15, 8, -6, -5, 0, -16, 3, 13, -8, 3, 10, 12, 18, -1, -11, 6, 23, 21, -28, -10, 9, 17, -14, -8, -8, 1, 17, 17, 1, 2, 10, -3, 15, 3, -14, 17, 28, -1, 14, 1, 8, -16]
7252a6L9l5pK4j3J2Lj4RnMjJ4j3NQk0J2J3l8J4j4K1Pj9LLpK4J8m5M3m3K0Qpj7
7289a0J6k5J5K0k9K2J3k6j2J5%lp%KJ6NNn5M0Rj2NKk0J4j1j4pJ0K4j8j2RK9l0
7325b0jJ8PJ5k8QLp%LqJ0j0ORMoj6N6k1l1j5M2k5L2k4mM%K6k6j5M0k6M2m6K3N
7363B4Kl2j0LK7k1Pj5rM5k9J0j9J7LjPj5%j5LnJ5rK1j5K9j3j3JJJ7l7K4J9m8L7
7400Fj9J3Opk6J7J1PJ6l8J9qj3J6Pk8K7qJ3j1lJ2Oj4J2j0NQk7RrPK5k9nJ2jkj0
7439a4nL9rJ1k8l5M0%LonrK0J5j8lLj5J0j5J0pM1k2LpQNrJ1MMk9kkJ0j6J7qmK1
7480GJ7k7J5l4K1NJl0K8j6KRj8MnK6Jj6oL5l3J6pj4J9Nnj5mlJ2J0k6J5J0rNPk3
7519b1M1k0rL0Kk5RlRk3K9ppJ4k0Plj1OJpL1k3ORjo%Pl2J9nQnNJ2j9j0J1J1oJ2
$$ y = [-16, 23, -12, -19, 5, -8, 4, 7, -7, 2, -3, 1, 0, 14, 1, 6, 14, -6, 6, 19, -19, -5, -19, 2, 9, -10, -7, -4, -11, 13, 31, -14, 29, -14, 6, 14, 7, -10, 6, -19, -4, 16, -13, 9, 22, -4, -16, -1, -1, -4, -11, -11, -9, 7, 12, 17, -38, 2, 11, -1, 4, 6, -14, 0, -11, -25, -32, -22, 2, -16, -28, -19, 10, -20, -21, -3, 4, 19, -9, -1, 2, -5, -5, -2, -10, 0, -10, -4, 5, 9, 3, -13, 43, 22, -9, -24, 18, -7, 25, 1, -3, 1, 1, 27, 1, -14, 26, 0, 42, -4, 19, 24, 26, -6, -16, -13, 14, -7, 0, -15, -24, 21, -8, 2, -17, 0, 3, 2, 9, -6, -6, -21, -18, -23, -8, -17, 4, -11, 18, 5, -8, -7, -6, 11, -26, -2, 17, -31, 6, -13, 0, 6, -1, -27, -10, 1, 8, 24, -14, 5, -3, -16, 0, 7, -21, 6, -2, 11, 0, -3, 9, 15, 1, 13, 3, 8, 16, -11, -2, -11, -4, 21, -8, -13, -1, -2, -4, -14, -19, 20, 11, 22, -6, -41, -1, -1, 2, -4, -9, -18, 2, 17, -1, -4, -1, -16, -6, -21, -11, -18, 23, 1, 4, -3, 5, 10, 1, 12, 16, 20, -9, -11, -13, -3, -19, -2, -10, -14, 7, 24, -3, 12, -22, -1, 4, 5, -25, 3, -13, -11, -2, -20, -16, -21, 5, 6, -10, -16, 19, -14, 2, -5, -19, 0, 5, 0, -15, -19, -22, -10, 0, -26, -11, -1, -10, -5, 2, -21, 20, 0, -9, 21, 23, -2, 7, 4, 13, -10, 19, 12, 5, 19, -1, 6, 3, -8, -2, -1, -8, 23, 0, 6, 15, 14, 8, 8, 15, -17, 2, -3, 5, 0, 5, 17, -2, -12, -1, 10, 4, 16]
7561A6k2j0L0Ol1oK1ojnQk6M0rQk4J1J8k2JPj8J8J2k2lmJ2LpoLOJ1j0Lj0J2J3
7600A7j9j3K3lJ4jk2Lj5L0l8%K2J6j1pmoJ2qmOj0M1l1Nk8J2J6j0j9L1kJ9ll2K7
7637Hj0J9Nl2K9k3jj5%J6j3L2pJpNK6m4nL1Lj8Jk0M8j9lj1j6K8J9l0MJ4m6K8J0
7674Gj1LPnknj5OL2k7nK9j6j7K7j4j4K6Nm2J7j1L2olp%j3J9K6jj0J4j2lk6K1P
7712A3mLj5lK5Pl4J3kjOj0oK0j4oPJ5j3j2lPoJ7pJ8m6OK0K1m4RM5l1J6m3K1K0
7750Ik3K4rKk8K8qNjQmJ1lj5j8K0oK8j4%nrONj0K2lM%l9K3J9m1J9QJ8l9R%KJ5
7791A0J3k4RrkRlj3L3pl0JJK3qj7Ojj7K5nj6K1K0oj0j0PJ4k9Kj4L0Rqj6J0%J0
7830HpOK3m1L8l7J2j1JJ4nj8J6J6j5L1m7QJ2j5%J3JjNj7kNQJ5j2J3rJj6k5PJ4
$$ y = [16, -6, -16, 14, 20, -11, -17, 4, -2, -3, -8, 0, -26, 14, 5, 13, -11, 0, 18, -4, -3, 4, -14, 4, 16, -6, -9, -13, -1, 2, -5, -11, -8, -2, 9, -1, 2, -8, 4, 17, -2, -15, 8, 5, 19, 18, -4, -1, -16, 14, -24, -24, -2, 14, 3, -4, -8, -14, -2, -10, -14, -8, -18, 23, -8, -3, -31, -19, -3, -13, -32, -1, -3, 16, 13, -19, 8, -2, 17, 22, -10, 19, -4, -5, -20, -20, -4, -17, 15, 8, 9, 2, 7, 33, -11, -16, 15, 18, 0, 1, -19, 29, 10, 7, -4, -20, 8, 27, -3, 1, 15, -31, -3, 7, -4, -1, 6, 1, -1, -6, -21, -15, 17, -10, -15, 14, -2, -19, 8, -6, -20, 6, 11, -31, -14, -25, 7, 1, -2, -9, -9, -22, -3, 23, 22, 12, 26, 14, 11, -15, 6, 13, 9, 12, -3, -6, 19, 26, -8, 5, 3, 2, 8, -2, -8, 12, -2, -8, -1, 14, 1, -11, -14, -7, -13, 4, -3, 15, -31, -25, -5, 16, -28, -19, 26, -5, 11, -32, -11, 9, -14, 10, 1, 3, -25, 3, -5, 0, -1, 7, 3, 14, 11, -4, -22, -2, -8, 20, 6, 6, 1, -8, -2, 3, -7, 15, 12, 16, 16, -23, 0, 19, -22, -3, 5, 23, -16, -7, -7, -5, 10, 23, -1, 8, -1, -3, 6, 3, -10, 23, 16, -14, -13, -12, 11, 3, -14, -8, -9, -26, -1, -6, -22, -1, 19, 13, 3, -7, 0, 14, -15, -13, -27, 3, 12, 4, -12, -2, -2, 8, 1, 7, 30, -11, 27, -10, 2, -9, -8, 6, 1, -17, -1, 15, 0, 31, -16, -8, 4, -11, -11, 2, 3, 2, 7, -10, -12, -7, 1, 16, 4, 17, 8, 9, -7, -32, -25, -11]
7868a1M%oJ7qKJ5k0k0NM0k9J1j5J6lNOJjoLl3J8L7j6j7%j9L9j0J3k4MMKj5rJj3
7908c2L8Nk4J4rL3n7K9J9j0j1j9K1K1j4j9qPL3rj6pQJ3k9K2j3Lj3QNJ4j0rK1k
7944Cj6JL3j9Qk4J7J4omj7L3l0mN%K1J2rk2Nj3J9nj2jNL0j0l8J8L3l7J3j2LJK2
7982A7k1mlmM4n1K6j8J5pOj3KlJ2J0k3PjJ3j9jK6J5k6J0k0J5kNJ1m5L8rj1jLR
8020BOj2l0L4jJ0Ql8L2Lkl1%QK1k1J9j6OJ3Rj0k4JK7lLj3oJK1j1k1NK5l4lK0J7
8059A5PMl2mJ9k9M1l4OPoNLqL3Nm8j8K3J0j%j9J1J8K0pJ4m3J3qqkL7Ml5%nJ3j
8099@J8J3m4K0J4j1pMj7M%j4j1L4KJ4k1J2j3NKPk4rL1k6NqK3m7M0Kj0RK0m4K5
8136bj4J4Qmk2K0J5k0J7n1N4l7K0kj2L1j4ol6M6j4RmJ6k4K1%Rj2kj2J6%j7Oj3
$$ y = [-11, -7, -7, -13, 4, -4, -2, 13, -7, -27, -22, 18, -11, 0, -15, 1, -2, 3, 9, 10, 9, 3, 6, -27, -9, 28, 12, -5, -5, -24, 15, 5, 18, -6, -2, 2, 4, -11, -20, -19, -32, 6, 11, -13, 1, -8, 25, -32, -3, 16, 6, -5, -24, -3, 18, 4, -15, -23, -16, 17, 8, -8, -15, -7, 6, -23, -1, -14, -11, -24, -16, -11, 3, -7, -16, 5, 3, -13, -12, 21, 2, 10, -14, 3, 17, 11, 7, -10, 23, -7, -11, -6, -6, 15, 27, 18, -4, 1, -12, 7, 2, -10, -11, -6, 24, 14, -24, -6, 27, -10, 3, -9, -6, -5, 17, -4, -8, -11, -15, 29, -22, 4, -14, 1, -6, 0, -13, -11, -14, -2, 8, -15, -8, -9, 4, -15, -16, 10, 25, -1, 9, -11, 4, 2, 7, 18, -27, 11, 2, -9, -10, -7, 2, 8, -4, -34, 0, -1, 9, 17, -21, 11, 14, 12, -19, -19, -11, 10, -11, 8, -8, -2, 11, 20, 10, -14, -13, 14, 11, 14, 1, -5, -4, 17, 6, -15, -10, 15, -19, -22, -2, 15, 22, 26, -6, -10, 9, -20, 21, -13, -7, 0, -6, -1, 2, -6, 27, 32, -16, -34, -11, -1, -2, -2, -21, -10, 8, 28, 21, 35, -8, 5, -3, -11, -13, 24, 28, -7, -7, -12, 1, 0, 18, 31, -13, 7, 21, 10, 3, 7, -10, -6, -6, -20, -31, 3, 5, 19, -2, 10, -3, 2, 4, 11, -13, -22, 9, -17, -12, -20, 3, -44, -4, -2, -12, -3, 17, -27, -2, -16, -2, 6, 2, -20, 0, 15, -5, 12, -39, 15, -22, -2, -4, -16, 15, 1, -5, -41, 5, -9, 0, -4, 12, -12, 9, 9, 18, 6, 4, -8, 8, 8, -9, -3, -16]
8172a6M1l0J0j7J0R%oNk9J8J3k0qK3J8j8l2J2
$$ y = [-16, 25, -5, 5, -12, -2, 7, 7, 1, 6, -23, -5, 8, -12, -20, 3, 21, 3, -29, -17]
8191a7
$$ Imaginary data points
##PAGE= N=2
##DATA TABLE= (X++(I..I)), XYDATA
0@%%%%%%%%%%%%%%%%%%%%%%%kRj5J6j6J6j6J6j6J8k5L1l2L2l6M4m8N0n6O3p0P8
45D1q6R5j06J19j33J50j68J91k23K61l14L88m99O98j153M500j60m365L245K923
65E404j18l296p30J271J482o83j387r07R92J233l25k419j040J827K191j248l309
82a062j057K674K328j421l437p85K446J850j539k527j38J984P79j608j721N79
98b655J768L48j797j732O02K217R55j971k518L10K912J510k297k840Q60L232N50
115e46k831j522K057K207j009k310l2K098J336r70j853m64J795K145j93k590j297
132c979K180K829n15k819o31K509J814j276j975N25K369P88j723j548J048K397
148A993O60j801j719P74K468J039j623j993L26K392J266j529k043M98K348O06
$$ y = [0, 0, 0, 0, 0, 0, 0, 0, 0, 0, 0, 0, 0, 0, 0, 0, 0, 0, 0, 0, 0, 0, 0, 0, -2, 7, -8, 8, -8, 8, -8, 8, -8, 10, -15, 16, -16, 16, -20, 24, -24, 26, -30, 33, -37, 41, -45, 50, -56, 63, -70, 80, -88, 103, -120, 141, -173, 215, -284, 414, -739, 3761, 3601, -764, 2481, 5404, 5286, 1990, 1260, 2531, 4013, 3330, 1943, 1036, 2028, 3261, 2936, 517, -523, 1304, 3495, 2247, -1062, -2119, 555, 2883, 1462, -1975, -2760, -314, 1536, -3, -2530, -2668, -684, 95, -1513, -3234, -2655, -887, -539, -2336, -4068, -3466, -1249, -294, -2265, -4783, -4473, -1561, -51, -2348, -5188, -4328, -1096, -546, -3377, -4899, -2842, -635, -1644, -3954, -3986, -1888, -552, -1522, -3375, -3839, -2044, 101, -92, -2682, -3979, -1799, 1030, 515, -2304, -2935, -426, 1388, 112, -1863, -1338, 1031, 1819, 96, -1452, -404, 1993, 2653, 852, -867, -93, 2375, 3414, 1791, -202, 124, 2516, 3782, 2253, 210, 708, 3056, 3662]
164C662k100j538J597K291o38k811p98K398J934j262k633n29J877J576o60j997
180C69j069J098J714k05k134j045J647J591j363k455K72K510P29k346k078J001
196a764K405M07k021j751N11J928Q40j293j738J60J701Q09j292j451O37J895K60
213B43j924j277J498K342k41k600j164K063K398n33k570q26J924J828n66j792
229a197l68J357J204n38j413k05J509J298r54k065nK453J500j804k494N69K753
246A600R22j906j753P93J841L50j255r51N62J217K75j088j028O96J677K04j875
263B81j356J313K228m0k323j384J498K150k11k135r97J412J513n38j737l19J435
280G90R60j011j626L1J674R99j168k013j45J955J407j252k377r9K185J220j592
$$ y = [3662, 1562, 24, 1621, 3912, 3274, 463, -335, 2063, 3997, 2735, 102, -427, 1450, 3026, 2366, 369, -700, 398, 2112, 1907, -227, -1272, 375, 1966, 603, -1852, -1580, 930, 1659, -687, -2765, -1764, 641, 1048, -973, -2724, -2213, -285, 555, -738, -2476, -2316, -615, 194, -1098, -2549, -1912, -17, 243, -1681, -2958, -1460, 882, 641, -1959, -3123, -1060, 1338, 805, -1765, -2591, -667, 1161, 595, -1197, -1565, -208, 996, 458, -955, -1160, 349, 1647, 693, -1372, -1377, 1076, 2576, 772, -1722, -1153, 1600, 2522, 616, -1137, -344, 1497, 1847, 592, -359, 203, 1420, 1695, 607, -421, 275, 1952, 2156, 281, -1075, 238, 2466, 2426, 103, -1281, 217, 2367, 2156, 21, -976, 436, 1949, 1411, -326, -645, 790, 1750, 739, -887, -856, 818, 1817, 649, -1364, -1509, 446, 1853, 601, -1776, -1875, 310, 1530, -62]
297f2j949N34J913K76j709r25J058J385l23j540o89J013J504O8j590j283Q42K075
315E98L65j853j381J130J936q5j776o62J381J304o74j500k5J562R76r53j658O1
333a254J775J219j042j829k06J789J307q77j798j68J647J037j072j565M07J767
349A137L44j715j199J191J841k42j935r34J292J601j36j577r60P46J474K67j293
366i8j091O80J539jj612o82J391J337q48j781m2J815J067j108j717NJ581J117
384A552p21j573l19J377J098o54j435j21J453P61j096j383N56J663L44j643j332
401a473R85J916J42j892j277J046J757Mj525r11Q22J168r4j110n58P28J003k36
419D95j321n12J211J320o30j858l67J724J373r07j836j47J560R46p29j279k8J057
$$ y = [-62, -2011, -1477, 436, 712, -997, -1922, -864, 521, 198, -1342, -2031, -1018, 486, 554, -1036, -2319, -1477, 598, 963, -890, -2271, -1141, 795, 710, -1066, -1728, -347, 957, 283, -1217, -1242, 320, 1296, 343, -1315, -1254, 521, 1740, 698, -1131, -1337, 452, 1759, 882, -916, -1084, 563, 1600, 528, -1037, -630, 1137, 1481, -234, -1433, -242, 1599, 1357, -578, -1512, -220, 1381, 1245, -332, -1292, -546, 928, 1195, -98, -1189, -509, 1030, 1029, -583, -1265, 126, 1463, 615, -1166, -1208, 607, 1674, 566, -1151, -1146, 435, 1552, 831, -742, -1061, 316, 1414, 760, -675, -796, 657, 1418, 322, -1061, -505, 1158, 1502, -141, -1473, -488, 1428, 1570, -322, -1599, -553, 1204, 1208, -317, -1228, -406, 762, 668, -442, -1000, -272, 731, 495, -826, -1338, -127, 1193, 563, -1295, -1662, 62, 1435, 528, -1308, -1455, 105, 1051, 322, -957, -985, 72]
437G2P28o40j040P5J199O46j060j286M62J752N28j576j483P41J954M05j610j299
455a432P48J599J37j353q35Q54J208k81j309l79J114J016n51j400l51J243J275
472A303n19j641n58J368J392m66j645l97J353R77p54j202K37J213L92r54q80M37
490c44J171M73r93j187K45J553P77j167j531K86J715O39j292j245N94J396M0j284
508a54o69R29J084l64j434m32J135J209n32j613n58J252J265m29j521o18J106
525c44J073l90j342l18J111Q05p95j223K16J383M63j196j159N43J452M04j146
542d63j077K88J324O44q19j168J20J279O01q96j016N27J361N3j289o70J118J323
560A240l88j494m91J231J257k89j410n71J003J212j83j250n07R59R84m72j159
$$ y = [72, 800, 160, -880, -805, 394, 1040, -20, -1306, -844, 908, 1436, -140, -1623, -882, 1072, 1477, -133, -1432, -684, 915, 1052, -301, -1136, -282, 926, 645, -664, -1043, 71, 1087, 536, -864, -1215, 28, 1303, 784, -857, -1415, -47, 1345, 879, -766, -1163, 190, 1167, 413, -789, -552, 661, 1053, 99, -781, -344, 827, 1300, 307, -880, -635, 918, 1695, 528, -1003, -717, 998, 1637, 345, -900, -306, 1090, 1130, -154, -823, 106, 1190, 826, -608, -1040, 95, 1304, 772, -841, -1399, -147, 1118, 689, -832, -1450, -344, 729, 339, -1003, -1321, -210, 595, -200, -1423, -1207, 176, 639, -557, -1716, -1173, 279, 683, -463, -1540, -1252, 72, 716, -103, -1271, -1151, 128, 729, -167, -1183, -656, 705, 758, -531, -1201, -83, 1240, 852, -642, -1133, 98, 1355, 1066, -344, -915, 88, 1300, 1117, -133, -640, 319, 1303, 831, -328]
577c28n3J169O41r02j197K66J421O02j128j328L16J482O19j092j170K69J164M17
595A168q21q10K69R02K17q41p78N19J137Q2j355q57R42J434j81j611p99J093J314
614A024k77j371n91Q44R56k68j062l15Q57P10n48j149q8J233P86r50j412J23J481
633a7P60j037j326J76J353N88q73j023K49J112K63p98o50N56R46L6r87n59P62
652d69J129N6j119q07P71J442J52j247q51Q53J276j2j159m00Q94Q76m18r64k0
671a7J022O98n96j120k9J187R20p00j415j34J339R49p91j361K0J216N40q76r45
690i3L39J003N9j004o83N90J048n1j223q16O87J185M6j255q71N61J109O8j055
709c56p46N32R23j27j008m29P91P82n20j162j08J098P48p27j249r7J110Q25n21
$$ y = [-328, -381, 788, 1429, 527, -670, -404, 1017, 1619, 491, -837, -521, 961, 1580, 488, -682, -413, 751, 1168, 347, -463, -194, 708, 925, 84, -694, -175, 962, 1044, -311, -1168, -226, 1208, 1027, -584, -1383, -290, 1024, 747, -624, -1215, -371, 585, 317, -745, -1060, -203, 507, -41, -1190, -1278, -45, 741, -209, -1621, -1498, -17, 743, -294, -1620, -1444, -91, 497, -376, -1399, -1150, -38, 225, -573, -1223, -667, 279, 315, -672, -1231, -469, 660, 716, -403, -1210, -439, 1003, 1155, -92, -943, -90, 1186, 1174, 15, -385, 509, 1385, 967, 3, -17, 1005, 1703, 1107, -13, -42, 1145, 2065, 1365, -50, -184, 1155, 2104, 1313, -48, -28, 1188, 1728, 852, -93, 246, 1249, 1308, 304, -379, 211, 1259, 1208, -15, -831, -144, 1041, 1087, -168, -1039, -478, 631, 699, -356, -1102, -570, 353, 226, -782, -1211, -420, 362, -158, -1320, -1428, -330, 418, -309, -1558, -1655, -545, 280, -241]
728b41j186k82R52Q45m48j118q6J081N03q34r23M60J201J44j174p31P39J242R1
747B35j165p54N88J224J86r59p56N77J030J13q70m53O59Q73k08r21k07R77Q55
766A024m48j142j82J162J004m95j209j99J067Q62m26r41j44Q51O56m72p90N9Q95
785A132M67p87r17L60J260L00j153j072N85J325K10j158q68M84R75R6q80n81L93
804A71P72q7r10m31O95P81l75j156l15R42Q99n11j235l27R50Q54m06j071k79Q01
824b38P14m17q90l2Q05M28o11p83K14R96L58q48r36L20J206M83r75j049K80J285
844C10L99r32q62M68J026M6r31m13O59P86k13r50k99Q34Q71l31j105m06R16J018
864H91k73j180l78Q88Q51l59q87j39P67N00m63p30J21Q44M14o88q41K70J010M47
$$ y = [-241, -1427, -1709, -757, 88, -360, -1478, -1564, -483, 20, -814, -1737, -1277, -76, 68, -1106, -1837, -1098, 144, 235, -930, -1684, -1096, 128, 314, -645, -1401, -824, 206, 319, -551, -1004, -345, 528, 320, -601, -808, 169, 1024, 576, -566, -748, 414, 1418, 923, -286, -485, 582, 1444, 1018, 77, -67, 784, 1440, 968, 178, 237, 1132, 1599, 812, -105, 255, 1515, 1815, 662, -410, 175, 1500, 1710, 552, -316, 168, 1143, 1239, 359, -222, 171, 943, 856, -54, -485, 210, 991, 616, -540, -855, 87, 986, 475, -760, -1087, -137, 717, 311, -760, -1039, -238, 476, 59, -831, -863, -58, 370, -241, -1024, -810, 186, 544, -304, -1240, -920, 286, 769, -206, -1255, -975, 310, 709, -223, -1085, -617, 409, 455, -476, -889, -230, 556, 343, -607, -906, -72, 799, 468, -637, -1043, -127, 891, 618, -562, -940, -52, 799, 440, -447, -586, 181, 681, 218, -512, -391, 453, 867, 179, -662, -392, 618, 1065]
884A065p91r39K17J050N02p28r03J32R91L76p30o90L27Q97M5r10n18O92R26k75
904G36j132m32Q65R66k87j094n15P35R25j83r85m36P13P10l52r03n8Q07N01o96
924a15q68K12J046L49q04q56K06R85M98o93r33J18R14N03o02p56J86Q27K56p08
944b35n46M63Q65kr42n19P30R99r2j065n86P43J042j15j032m22O43P84j55q09
964b51k64O27O20l84q66kQ81N47o98j015J50J094N56q12r68J41R70M47o03p65
984e95J05P60L09n34o20K58P79J22p53n81N31R21J5r86n91O25J018J9r79o19N90
1005b06Q98L8q75m26N50P43k41p94j53P61N86n35r00j3R70N92o27j016m5J002
1025C09O42n98r75J5R05M02n83o88K12O98J33o47m72L81P49M6q03n76M84R27J27
$$ y = [1065, 274, -665, -448, 602, 1104, 376, -527, -395, 596, 972, 242, -448, -121, 776, 821, -89, -607, 85, 1011, 736, -396, -828, 37, 1003, 716, -378, -893, -158, 767, 584, -401, -837, -124, 586, 234, -669, -727, 80, 581, -115, -983, -771, 275, 624, -180, -1036, -830, 155, 653, -40, -973, -855, 59, 562, -40, -796, -610, 217, 473, -235, -781, -318, 547, 545, -397, -916, -186, 813, 721, -344, -930, -187, 855, 740, -292, -714, -71, 713, 558, -251, -515, 112, 732, 348, -518, -520, 361, 908, 210, -805, -655, 439, 995, 183, -785, -644, 326, 773, 170, -595, -490, 270, 579, 45, -575, -317, 462, 584, -169, -750, -219, 702, 717, -269, -860, -235, 783, 802, -177, -796, -206, 692, 730, -145, -571, -21, 722, 481, -313, -466, 295, 881, 346, -554, -567, 403, 995, 368, -648, -693, 309, 951, 353, -622, -607, 298, 700, 117, -571, -359, 339, 472, -175, -647, -266, 483, 529, -274, -850, -366, 561, 688]
1046F88r21o85N02R56J17q57n32M65P77m6p60k74N92N81k77q20j04P91O53m69
1066C77r75j38R50P21n22j002j22Q82O24m53q78lP92L60o01o70K86Q44J18q53
1086b63n92N43Q86K7q61o36M44Q78J63p78o17L74P87J08o92m53M47O93j78p24
1106d44k06P27N95l83q54j39Q14O87l55r31k20P62P40l03q61j59P02N45m10p23
1126d16N4P80K89o37o47K99R02J76q60p33M04R66J91q53o98L58Q81Q6p14m94L92
1147b74O28n0o63k95M98O30k29q10k35P32O97l17r70k20P94P09k92q11k31O36
1167g3N99k53o73j29O64M14m12o81J34Q45L12o84p49K91R92L31q19p61L03Q93
1187E44K88o80o47K70P86Q8o76m06M33O48j61p29l00O56O38k79q65k59O83P37
$$ y = [688, -233, -918, -416, 540, 657, -200, -732, -267, 510, 464, -296, -570, 22, 603, 326, -494, -598, 193, 846, 377, -598, -736, 214, 935, 413, -589, -711, 171, 795, 342, -536, -539, 253, 613, 12, -658, -372, 472, 590, -263, -855, -312, 574, 601, -260, -896, -452, 426, 589, -189, -806, -432, 355, 463, -229, -682, -235, 458, 280, -444, -650, 77, 672, 289, -565, -704, 110, 797, 442, -489, -709, 53, 793, 490, -371, -530, 172, 717, 307, -416, -362, 418, 707, 70, -577, -278, 624, 800, -60, -793, -389, 577, 768, -85, -783, -425, 456, 542, -172, -666, -274, 354, 304, -359, -654, -156, 474, 245, -565, -800, -68, 629, 312, -658, -878, -84, 625, 333, -478, -709, -73, 526, 273, -400, -529, 135, 549, 137, -544, -410, 435, 747, 63, -686, -395, 597, 928, 109, -652, -349, 544, 832, 152, -495, -225, 561, 649, -27, -433, 0, 648, 487, -242, -542, 114, 752, 473, -392, -651, 32, 769]
1207G69k49q60l29O53O90k59p33j75N93M26l43n75N3O21L02m68o80J07Q34L97
1227G74o33q08J46R33M09o61q24K05Q23K72o23n83L00O88K9p00l94N22P11k09
1247C77q39l21O55P53k00r39l68O49P47j77p95l03N32N84k38o59j14O54L88m35
1267d9o17Q5P46L57n99o75J49Q33L84n13p31K7P77M61m78o70J35P01K57n57m64
1288d41L84O90l0p09m19N76P61q7q50m33N88Q23j00q16m17N14O87j71o97k08N54
1309A99M87l72o67j6O86L66n23p21O4Q16M06n95p76O3P72L73m43o88O5O12K88
1330C96m52n13J81O43Q9n96m87M09P36Kp89m93N29Q15l4p91m72M99P07k6o82l44
1352f73M58N64j50o56j37N93M58m04p13J6P97M41n09q19M7Q09M60m71p21L4O73
$$ y = [769, 520, -340, -669, -16, 674, 415, -318, -493, 100, 526, 183, -392, -339, 282, 584, 116, -564, -457, 377, 774, 141, -667, -521, 412, 821, 160, -664, -459, 364, 636, 13, -570, -270, 418, 447, -253, -647, -125, 586, 377, -462, -783, -128, 625, 425, -514, -882, -233, 514, 337, -458, -761, -229, 355, 117, -542, -656, -2, 386, -49, -666, -581, 165, 522, -77, -752, -603, 230, 614, 101, -630, -603, 174, 635, 157, -513, -378, 323, 580, 23, -441, -57, 633, 603, -106, -525, 51, 812, 725, -125, -558, 30, 853, 753, -63, -480, 34, 721, 550, -147, -355, 199, 686, 314, -353, -369, 317, 683, 160, -561, -497, 319, 725, 130, -646, -583, 189, 562, 119, -569, -504, 108, 396, -56, -569, -388, 255, 344, -252, -739, -330, 406, 408, -381, -874, -345, 470, 436, -355, -827, -328, 379, 353, -329, -673, -215, 349, 199, -457, -594, -1, 457, 53, -660, -644, 153, 594, 85, -734, -687, 122, 582, 111, -610, -576, 97]
1373I7L61m60n17J44N97J44n14m20L65O29M7o81m20M36P49Q9p78m64M08Q20N7
1394F89o78m84M36O57o5n93k50M88N38k66o45r4O43M95l76p55j35Q02N30m17q19
1415b99r0P35M75m50o45M3N53K82m69m84K00N93R2o02n02M01O88J9o66n19L63
1436b82P19Q6o34n20L31O13O8n57l56L52N30j38n71j93N45N26k99p20j09O80N73
1457F44l45p83j87O90O03k97p59j12O22M43l70n91J10O13K00n41n39L02P04J00
1477E07o65n33L56P16J37o66n25K78P15J13o04l81K79N19Ln43k30M49M38j82o35
1498d54j54N83N39k60p17k07O12O27k47o78k14N61M91k23n68j04N29L77l77n31
1518d15J02O69K24n67o11K41Q08J92o47o20L22O95J85n83n26K29O17O8n20l27
$$ y = [97, 458, -2, -519, -375, 222, 366, -148, -568, -203, 426, 473, -208, -628, -192, 557, 646, -132, -596, -188, 632, 689, 11, -473, -37, 620, 555, -38, -288, 200, 738, 472, -173, -267, 376, 871, 495, -260, -395, 407, 937, 520, -299, -389, 346, 821, 371, -274, -231, 322, 604, 135, -349, -149, 444, 536, -66, -568, -167, 521, 540, -126, -645, -282, 437, 523, -111, -631, -300, 313, 381, -176, -532, -180, 350, 212, -359, -552, -7, 519, 220, -500, -609, 71, 644, 299, -484, -671, 19, 622, 325, -434, -546, 76, 519, 149, -442, -332, 281, 481, -60, -599, -297, 407, 507, -158, -691, -335, 381, 518, -148, -673, -395, 320, 433, -171, -552, -273, 246, 249, -294, -524, -75, 363, 181, -454, -608, -25, 514, 254, -463, -670, -58, 569, 322, -356, -570, -9, 482, 259, -309, -413, 116, 493, 116, -415, -313, 356, 580, 13, -598, -357, 451, 643, -4, -624, -302, 393, 578, -5, -531, -302, 315, 383, -137, -464]
1538d64L29N05j23n91j91N12N25k60o87j71N74N67k08o95k43N29N52j80n73k18
1558e11N14M25k59m86n4N76K97m20n69J72O89K66n38o59J83P47L15n64o30K00
1578c06O80K12n12m53K19N80K4n34k87L85N08j49o53k33N05O02j96p50k47N40
1598f5N78j49o39k28M54M18j93n03p5M90L01l29m69M9N90K80m61n96J41O89L18
1619F01m65o08N1O91L25m46n17J11N84J81m81l98K51O19m7n94l30M73O15j12p35
1640b31l34N14O55j11o68l35M46N07r7n67j89M56L75l06n03K9N29K73m26n47J38
1661c92N81L26m62o08Q0O21L51l97n51K2N52K74l72m14J38N15Q3m67l57L58N43
1682D24J3o58l39M33O71k9p11l80M38O16l8o04k66L87M73j76n16j35M98L63l63
$$ y = [-464, -135, 370, 247, -344, -535, -23, 502, 242, -445, -616, -42, 525, 317, -378, -621, -92, 460, 280, -293, -511, 3, 428, 169, -317, -371, 205, 502, 82, -487, -315, 374, 640, 102, -557, -374, 373, 688, 124, -506, -306, 374, 586, 74, -379, -160, 420, 444, -90, -377, 8, 516, 367, -286, -519, -14, 588, 392, -358, -605, -65, 513, 364, -275, -503, -49, 369, 176, -327, -402, 88, 389, 60, -409, -360, 230, 510, 49, -547, -406, 283, 601, 136, -472, -421, 270, 595, 149, -368, -257, 327, 508, 27, -371, -120, 499, 452, -142, -472, 1, 616, 504, -231, -565, -51, 604, 493, -175, -510, -64, 443, 346, -221, -410, 46, 421, 115, -388, -359, 170, 443, 17, -530, -392, 189, 515, 53, -555, -475, 146, 497, 100, -451, -429, 123, 397, 25, -389, -251, 264, 347, -120, -477, -119, 424, 437, -221, -560, -127, 544, 515, -196, -576, -138, 478, 440, -164, -430, -43, 430, 254, -262, -397, 101, 464, 101]
1703A01n64M6O03L06m43n85N3O42L32l69o27K0N25L14l25m46P7M46J51m05l30
1724d78K12N43L7n33l79L73N95N6o33l77L28O18J01o03l54K97N21pm93k18L74
1745b0M34k30n34n8N39L86l31o00l8O12M08l88o13n7N88L73l26n45L3M80K24l63
1767b6l69J56M68R3m63l18K58N67Qn13m27L06O33P5n48l77L11N28O9m85k93L11
1789c6M42n0m75j74M36M04k34n41q2N41M78l13o52r3N77M23k53n98n2M78L35k94
1811B67m80P3M67J70m37l74K11N11N8n20m03K72N78R1n14m39K32N30J39m94l59
1832d21K24M35K0m52k06L24L77j29n29q8M50M00k14o06j27M96N04k15n68j99N08
1853a6M10j99n41k9M60K49l32m03J16N10J33m55m49K44N69J56n13m79K56N70J22
$$ y = [101, -463, -417, 186, 492, 49, -536, -483, 159, 491, 122, -505, -485, 40, 354, 29, -417, -340, 106, 257, -148, -478, -266, 277, 314, -219, -598, -225, 370, 426, -207, -584, -256, 362, 463, -140, -494, -197, 324, 317, -176, -394, -20, 414, 184, -350, -408, 131, 517, 186, -414, -452, 160, 568, 180, -433, -490, 98, 471, 145, -400, -367, 113, 337, -26, -395, -239, 229, 322, -141, -459, -201, 366, 374, -139, -566, -260, 373, 448, -100, -477, -166, 362, 431, -54, -347, -36, 406, 356, -119, -293, 143, 547, 313, -228, -310, 231, 709, 396, -256, -349, 228, 651, 398, -200, -252, 226, 561, 267, -213, -140, 327, 497, 60, -314, -103, 408, 466, -54, -457, -185, 393, 484, -30, -469, -237, 293, 432, -62, -421, -197, 238, 258, -194, -400, -76, 301, 172, -357, -445, 5, 405, 191, -415, -542, -46, 458, 243, -325, -524, -16, 394, 195, -346, -375, 85, 334, 2, -401, -285, 225, 358, -97, -546, -302, 267, 423, -90, -569, -313, 257, 379]
1874C79m98l97K31M77N2l81k95K59L98n1m53j52L87M12j70n21j81M90M24j39n68
1895b97j59M63M18j58m81j35L76L51j71m28k3M54K35l47m49J84N18J86m51m85
1915c99J57O09K16m60m85J30N52J28m14l54K02M28J0m18k55L24L75j26n21j50
1935d51M27M35j66n66k35M48M31j13n09j85L59L59j39l94p9L72K56k31l98L8M54
1956A13K51l55m78Q3N66K46l53n21J05N41K45l54m35R4M59J49l64k95K00M24M
1977C25m55k55L69M92j06n55k47M11M84j02n10k41L53M17j04m44j14L16K80j63
1997A51l78kL77K33l26l94P0M70K64l76m69P3N11K70l25m44J6M72K18l13l77J63
2019a16M22N6l84k71K36M78m5m87k60L44N30o7n53k96L72M64l6m92k37L26L54
$$ y = [379, -119, -516, -285, 192, 244, -137, -432, -173, 225, 174, -279, -431, -44, 368, 198, -323, -504, -14, 410, 271, -297, -456, 7, 425, 267, -214, -349, 27, 378, 207, -221, -244, 210, 445, 98, -351, -167, 351, 537, 86, -399, -242, 367, 583, 123, -362, -232, 320, 448, 34, -320, -118, 310, 320, -98, -353, -29, 346, 220, -301, -451, -24, 411, 245, -321, -556, -108, 323, 210, -299, -484, -125, 234, 95, -299, -378, -6, 250, 19, -379, -341, 113, 364, 9, -469, -386, 180, 426, 73, -448, -343, 198, 443, 89, -346, -252, 207, 356, -8, -303, -103, 321, 325, -130, -385, -16, 476, 370, -185, -432, -21, 463, 361, -149, -390, -37, 380, 276, -168, -282, 34, 314, 151, -227, -229, 148, 381, 55, -339, -269, 201, 465, 89, -380, -307, 204, 474, 149, -295, -279, 193, 411, 98, -279, -116, 306, 362, -22, -293, -57, 421, 376, -111, -371, -27, 503, 436, -117, -413, -41, 423, 387, -105, -342, -16, 338]
2040C38j32m29l0L19K39j91m33M4M06K41l24m64L4N04K92l26m77J2L96K78k39
2061E8l87O7L32J62l02k63J47L98P9m15k96K61N11Jm81l33L12N00K9m51l11K70
2083a12M45k7m33j61L24K95j68m00p1M38K78k79m97L0M56K93k99n10j5M37L24
2104C48k47m17l5L84J94k58l46J21L38J11l56k90K19M32J4l91l37K60M68Q9m13
2125a12l60K44M37N3l66k46K08L69k5l88j08L27K95j37m81o1M35L90k26n21p5
2146c48M68L27k40m78j2L81K58j75l88J5L76J37k83l28J73M11N3m12l03K29M32
2167B93Q7l98l39J81M34J00l45k99J65L67K2l27k02K85L08j09l83j38M01L38j52
2188B89m75j28M16L83j59m80j44M01L58j72m18j00L81K14k39l43Q5M08Q2l61l18
$$ y = [338, 206, -223, -253, 66, 305, 114, -319, -275, 131, 372, 48, -416, -382, 122, 414, 88, -389, -377, 19, 297, 58, -329, -262, 70, 232, -70, -333, -186, 212, 291, -124, -420, -159, 352, 353, -128, -461, -149, 351, 380, -71, -382, -112, 333, 306, -127, -288, 36, 331, 163, -237, -308, 130, 408, 129, -368, -338, 118, 411, 112, -398, -413, 24, 348, 101, -316, -351, 33, 227, -31, -377, -256, 82, 193, -163, -453, -234, 198, 212, -179, -516, -256, 212, 301, -112, -472, -228, 209, 262, -104, -350, -142, 227, 202, -186, -294, 33, 328, 191, -290, -351, 84, 474, 248, -273, -348, 120, 447, 207, -271, -283, 98, 356, 181, -207, -192, 184, 321, 38, -290, -117, 294, 347, -65, -368, -139, 293, 380, -18, -357, -176, 258, 358, 13, -286, -121, 246, 268, -59, -261, 24, 332, 223, -160, -298, 103, 441, 289, -186, -314, 102, 485, 326, -154, -298, 103, 461, 289, -129, -229, 152, 366, 127, -216, -131, 277, 359, -2, -320]
2209c20J73M14J24m01l64J85M24J17l64l32J26M08M5l17k32J65K97j2l26j66K58
2230i8L40j09m23j30L54L78j37m57j67L78L44q5m30j29L52K60j40l26m1L56J94
2251B84k38l72J07M24J42l58l92J49M81J44l75l58R4M53J18l24k76J26L33M1l10
2272a07k05K41L40j20l92j22L07L36r6m18j89L31M09j03m05j82L10L22p4l39r7
2293b53K64K54j56l32K4L65J86k64l86N5M53K11l13m19P1M56K07k99l63R0L72
2314B23P8k89k39J62L31j4l42j90L00L33q1m49j91L41L71q1m14j92K97K96m9l39
2336a38j55K39K54j16k93m5K94K07k19l24J7M05K06k93l89N0L82K58k36l65j4
2357b75L88J69k14l09P6L75O7k93k76K20L54k0l82j99K48M38m0m17k77K67L69
$$ y = [-320, -147, 267, 391, -10, -374, -189, 235, 352, -12, -344, -218, 190, 235, -82, -314, -149, 148, 136, -190, -356, -98, 242, 133, -290, -420, -66, 312, 175, -282, -449, -71, 273, 188, -242, -371, -19, 241, 101, -225, -266, 90, 284, 46, -326, -219, 205, 347, -11, -403, -254, 227, 371, -4, -362, -268, 185, 303, -21, -297, -171, 162, 203, -107, -312, -71, 269, 149, -243, -365, -58, 278, 182, -236, -425, -94, 315, 212, -193, -375, -65, 257, 183, -156, -253, 11, 265, 109, -223, -199, 166, 352, 88, -298, -243, 210, 421, 108, -311, -240, 216, 423, 124, -239, -149, 223, 301, 12, -227, -65, 266, 252, -90, -280, 20, 353, 272, -177, -368, -27, 344, 263, -151, -343, -46, 250, 201, -138, -293, -54, 200, 84, -209, -254, 40, 247, 28, -296, -279, 126, 332, 39, -350, -300, 82, 340, 104, -261, -275, 113, 282, 68, -241, -165, 210, 277, -16, -292, -72, 282, 262, -120, -319, -71, 367, 327, -90, -367, -100, 269]
2378B69ol51j93K30L03q2l12r5K54K27j58l17NL26K01k36l48KL55K63k43l85j4
2401c05L65K40k04l43K4L37J59k28l02J30L58M6l35k46J87M57lm21k73K86L81
2422C10J0l49k77K13L73l1l03j93K38K65j05l46j2K72J82j71l49l7L67K48k21
2443H4l92m1L44K62j93l01o4L11J85k02k68P9K60J29k69k51J30L74L7l05k58J69
2465a80L98P9l41l32J92L85O8k88k43J58L49m6k92j59K68K90j32l68o1L62K62
2486C69j84l98p7L71K85k12l60m7L09K45j67l38K6K73J11k09k40J17L04O6k97
2507e3k48J46L59P1l04l22J46L93P8k62k87J44K87N7k60j73J72K64j1l45q3K60
2529B9K92j30l71r9L12L57j63l96j22L39K71j52l29o8K93J91j77k91N6L06J03
$$ y = [269, 263, -88, -281, -51, 252, 170, -142, -237, 17, 244, 86, -231, -226, 100, 301, 65, -283, -281, 74, 337, 94, -291, -305, 60, 300, 96, -247, -223, 114, 273, 45, -257, -127, 231, 277, -58, -304, -117, 340, 337, -84, -357, -71, 310, 320, -29, -306, -93, 280, 249, -54, -247, -9, 256, 151, -195, -207, 65, 247, 76, -273, -310, 57, 305, 84, -308, -349, -5, 257, 64, -237, -301, 10, 195, -7, -275, -196, 64, 193, -76, -327, -197, 177, 214, -91, -349, -180, 218, 297, -44, -376, -184, 201, 269, -19, -262, -104, 245, 199, -93, -252, 16, 306, 174, -194, -255, 107, 369, 185, -213, -290, 81, 366, 154, -206, -253, 56, 301, 134, -204, -178, 95, 206, -3, -243, -126, 178, 244, -53, -301, -155, 204, 275, -29, -351, -205, 188, 266, 4, -283, -139, 148, 205, -55, -228, -56, 208, 197, -148, -231, 29, 321, 191, -180, -279, 33, 390, 227, -169, -291, 48, 319, 167, -162, -230, 63, 254, 77, -214, -158, 148, 251]
2550B51k51k79J63L20O7l05k85J31L67R0k93k55P1L43Q1k61k08J53K46J0k83j20
2572b47K41K40q2l28j30K92L10n6l92j29K61L32p6l46j29K79K47j17k89n0K99
2593A30J61k25l02J05L33J34l18l01J08L75R8k74l03N3L39J41k65k31Q3K50M9
2614A40k16j82J60K57p9k68j13K13K85p1l26j57K35L45o1l61j37K40K76l5k97
2635a52j08K27K28j27k93J2L12J73k39l24O1L80J67k47l23L7L69K02k57l23N9
2656a66L31Q8k40k01J28K93rl03j26J66K86m9l19j85K72L17n6l44j78K30K75j7
2678A93l01j22J87K23o0k32p1K02K08j33k90QL07J97j95l52kL44K32k27l30ML18
2701A08J84k10k67N9K81O4k43j75J26K91j1l15j78K11L10j3l36k28K25L07Kl27
$$ y = [251, 0, -279, -116, 204, 271, -34, -319, -188, 179, 269, -24, -279, -208, 135, 216, -45, -253, -100, 146, 156, -127, -247, -6, 234, 152, -176, -306, -14, 296, 240, -152, -281, -20, 312, 236, -110, -239, 40, 287, 170, -119, -169, 130, 291, 66, -236, -131, 202, 336, 18, -283, -175, 200, 298, 24, -279, -226, 113, 254, -11, -242, -159, 91, 140, -76, -258, -98, 159, 80, -188, -301, -88, 197, 126, -200, -357, -122, 223, 162, -199, -336, -96, 180, 145, -152, -260, -33, 195, 68, -225, -213, 99, 272, 33, -291, -230, 150, 317, 70, -253, -216, 153, 355, 98, -225, -166, 165, 253, 13, -188, -60, 233, 224, -79, -205, -39, 247, 198, -121, -306, -34, 283, 227, -117, -295, -65, 210, 193, -108, -230, -43, 180, 120, -112, -183, 19, 227, 94, -196, -188, 119, 316, 121, -231, -233, 111, 343, 116, -214, -210, 108, 292, 82, -185, -126, 155, 219, -24, -199, -73, 218, 207, -108, -286, -75, 235, 222, -114, -342, -117, 190, 192, -135]
2723a35j73J72K57k6k59r0J78K01j30k38m5K59J98j79l07ML21K13j94l15l9L09
2745a8K07j29k83j6K58J80j82k23R4K31P2k47k01J66L51kl10j98J70L34N1l23
2767a8j91J46L16ok77r4J34K40r1k41o6K40J95j57k95jL04J58j36l24j9K76K19
2790C12j44k76n1K66J44j33k13J3K37J05k23k02R3L06M8k48k56J81L14O7l04k55
2812b19J33L22M7k62j89J57K32%k72j17J99K21j30k71o7K87K01j65l26o3K79K33
2834B30j37l02q7K42J74r9k39l4K24J16j74j88M8K55Q4k39k19J18K75Q7k62k46
2856c73J21L15Q5k39k24J23K48P4k24j37J30K18l4k40r3K20K55j17l08r6K90K53
2878B47j18l20n2K31K60j06k96l9K41J52j12k34L8K28J03j90k28Q0K79P4k49k18
$$ y = [-135, -308, -136, 121, 95, -164, -254, -76, 125, -5, -243, -288, -29, 169, -10, -317, -313, 8, 221, 27, -288, -327, -18, 189, 60, -223, -239, 19, 199, 17, -206, -112, 119, 191, -56, -257, -91, 260, 258, -52, -250, -80, 254, 305, -18, -209, -63, 253, 247, -30, -124, 10, 250, 159, -82, -148, 92, 287, 130, -165, -166, 138, 296, 160, -164, -183, 93, 312, 168, -108, -159, 107, 251, 118, -95, -82, 155, 260, 37, -165, -72, 234, 282, 34, -222, -41, 273, 340, 36, -219, -86, 236, 283, 21, -168, -11, 221, 221, -51, -168, 31, 252, 122, -149, -216, 71, 272, 107, -219, -282, -3, 230, 93, -209, -296, -54, 120, 21, -218, -252, -28, 88, -86, -274, -226, 29, 113, -126, -345, -227, 48, 135, -127, -373, -252, 63, 148, -91, -315, -192, 56, 130, -94, -231, -101, 117, 83, -157, -250, -30, 225, 108, -200, -296, -6, 247, 129, -191, -243, -12, 248, 142, -154, -193, 48, 200, 88, -146, -108, 120, 223, 33, -195, -115, 164, 238, -11, -229]
2900b29P6L02J09k15k26N6K42R1j57k18P5K54J9k06j17J68K31p6k70j15K18K80
2922B92m6l10j38K29K50p1k88j20K23K28r7k34l7K16J12j56k28O5K67N9j88k44
2944b16L7L22J32l00k30Q2K58J27k19k38R3K26N4k01j47J07K04nk32j18J84K47
2966A67k3k91j53K25K61j4k95j56K15K09J0k47q7K01K04j02k29j5K56J22j70k59
2988a71O1K66J75k37k66L9K79J49k08k29L3K51P4j52k01J05J93J5k11j13J25K36
3010B13l4k88j20J78K58l1k51j57J61K39j2k43j32J31K34n4k02o5J66J63j28k29
3032b03PK40J46j75k48j9K85J71j55k84MK44J69j75k31M9K27P7j92j48Q7K41J3
3055A30k63j50J57K72j2k38j84J70K51K0k40j48J25K12%k06q4J32K01o0k21l9
$$ y = [-229, -153, 149, 258, 43, -183, -127, 115, 206, 49, -169, -94, 160, 179, -27, -144, 24, 255, 179, -91, -206, 12, 292, 246, -64, -202, 27, 277, 206, -82, -202, 21, 249, 152, -82, -119, 97, 209, 53, -175, -110, 157, 216, 28, -216, -179, 143, 275, -25, -255, -173, 85, 212, -7, -245, -152, 74, 128, -73, -220, -113, 91, 86, -146, -264, -80, 167, 144, -147, -300, -75, 186, 172, -123, -279, -64, 145, 155, -92, -179, 22, 226, 124, -105, -120, 136, 258, 88, -171, -110, 156, 331, 94, -172, -133, 146, 295, 87, -142, -109, 142, 216, 64, -137, -32, 161, 176, -35, -148, -23, 213, 179, -109, -229, -51, 207, 176, -75, -232, -71, 168, 156, -87, -219, -88, 146, 92, -110, -175, -9, 154, 26, -203, -196, 44, 190, 15, -233, -252, 33, 204, 49, -235, -231, 13, 182, 7, -224, -175, 52, 129, -63, -211, -124, 117, 130, -133, -283, -126, 146, 134, -104, -288, -118, 133, 153, -87, -235, -110, 102, 102, -104, -188, -56, 145, 85, -136, -175]
3077a75K12J52j10k52k2K65J86j21k78l4K43J92r6k65K7J99J51j56j99N2K16P7
3099B64k22j78J31K74J4k48k01J36K86N7k67j89J10K40J0k31j21J41J63l2k10
3120g3o7K05J06r9k34k3K25J57r8k71p6K47J91j15k51l4J91J42j06j92k4J95J07
3143A03j44j59O4K38M2k06k03J42K53P6k39k37J19K24J03k26j75J23K30jk05j05
3165a83J61J55n2k29n8K22J84j24k58l1K02K02j07k46m6K24J37n8k15l2J51J49
3187A48j17j85L3K05P3j57j88P8K36J22k41k39J20K46P9j85k09J04K03P2j66j62
3209a30J04J75j6j98p5J73J83j03k08j24K43J85o4k55r5J87K01q3j92q4J75J32
3231A31q7j72j2J83P1j39j79M8J91J19j90k10P8K44J07j86k34Q2K20Q1j70j30
$$ y = [-175, 37, 189, 79, -173, -195, 70, 256, 135, -143, -177, 66, 258, 162, -103, -76, 123, 274, 118, -81, -29, 187, 264, 42, -136, -5, 269, 283, 35, -166, -30, 256, 313, 46, -143, -33, 207, 217, -14, -135, 6, 169, 137, -73, -140, 65, 171, 72, -162, -185, 40, 197, 99, -172, -248, -1, 190, 75, -176, -210, -19, 123, 17, -175, -199, -4, 103, -41, -200, -136, 102, 144, -62, -265, -123, 130, 206, -33, -270, -151, 73, 176, -50, -225, -102, 128, 127, -78, -183, -22, 133, 81, -148, -206, 16, 200, 76, -182, -213, -11, 191, 84, -162, -208, 16, 153, 95, -120, -152, -1, 148, 31, -154, -121, 84, 157, 0, -188, -110, 126, 248, 7, -232, -112, 134, 213, 28, -181, -77, 126, 198, 32, -130, -26, 149, 133, -65, -140, 33, 216, 113, -95, -219, 24, 209, 145, -110, -205, -18, 183, 100, -92, -176, -1, 131, 44, -128, -140, 43, 114, -25, -204, -156, 35, 154, -36, -246, -168, 76, 183, -3, -237, -155, 65, 146, -24, -154]
3253a54O9J71M8j87j13J38J93k8j97j13J73K02n4k23r4J67K44n4k72p2J50K07
3275B01q4j57p1J69J29j46j41J0J93J01j79j85O9K12P7j46k23M1K20J08j90j59
3297a51L0J89P3j64j22R2J51Lj53j25J29K04jk64r2J61K02J1k58j03J11K31l0
3320A24j86q2J34J49q3j50k2J72J21j58j83K4K25J08j84k02N4K09J05j43k23K9
3342a62K10O4j25j43N9J47L7j64p8J05J50j0k10j01J56K11Kk50j01J44J78K0k02
3365f3j31J33J79j7j79m9J45J34q3j96J2J97J14j10k32J8K40J37j47k43M3J95
3387I7J23j27j83J9J89M4j24j48Q3J55L0j92j37J33J99Pk23j15J21K06lj89j30
3410a65J00J82K3j61r9J07J39k8j66m8J68J28p9k21J1J86J33r7k51%K14J55j42
$$ y = [-154, -85, 86, 134, -53, -166, -28, 165, 137, -60, -173, 0, 202, 148, -75, -169, -2, 242, 188, -84, -156, -6, 201, 117, -40, -111, 58, 187, 41, -100, -90, 103, 204, 25, -160, -91, 121, 198, 52, -171, -130, 90, 198, 8, -151, -121, 68, 141, -23, -145, -53, 98, 101, -52, -177, -48, 156, 155, -109, -201, -40, 162, 173, -85, -188, -77, 154, 124, -62, -144, -10, 139, 56, -94, -116, 56, 177, 19, -164, -140, 85, 193, 9, -193, -139, 70, 175, 32, -191, -162, 48, 112, -13, -156, -97, 50, 87, -77, -155, -50, 100, 90, -120, -221, -65, 146, 148, -102, -203, -59, 119, 139, -63, -194, -61, 118, 101, -78, -127, 18, 152, 69, -127, -115, 82, 196, 86, -146, -128, 112, 249, 102, -141, -98, 97, 220, 93, -90, -71, 118, 162, 38, -110, -27, 128, 158, -34, -171, -38, 161, 168, -55, -170, -49, 157, 154, -35, -165, -65, 117, 140, -21, -120, -13, 126, 98, -68, -116, 52, 180, 101, -120, -109, 77, 210, 113, -138, -138, 76, 231, 89]
3433H9j75j7J91P6j12j67N9J92M0j93r3O9J90Rj91j31Q0K38lj94j39Q3J79L4j77
3458f3r8R0J21j1j50p1J28J35r1j54j2J35J35r4j92n0J98J41p6k21pJ68J00n9
3482Bj95L6J52J03j37j15L8J84M5j68j45J06K11L3k03j42O7K10O5j94j27J08J53
3505H7pj28q8J32J22n7j47l0J50J17o5j88m6J84J35p3j98m3J53J52m8k01lJ18
3529B8J12p7j32J8J74K9j03j64P6K08M4j48j75N5K31M9j72j59O6K01J1j14j42
3552h4J05J39j7j39r0J39J31o6j93m8J27J82q4k24l8J24J72n0j77o2J44R6q1j31
3576a25j7J29Q5j15j11J6J49P6j26j67L4K41N0j53j43L4J80P4j34j36N3J60J9
3599G3j13p2R3J38j6j54q4J42J61o1k04o2J82J46j8j88p0J22J23k6j40n4J32R1
$$ y = [89, -86, -103, 88, 164, 52, -115, -56, 136, 176, -17, -110, -41, 149, 158, -33, -164, -84, 154, 151, -43, -182, -99, 80, 114, -63, -161, -71, 50, 39, -111, -182, -54, 81, -10, -164, -176, -41, 94, 0, -192, -242, -44, 97, 21, -200, -207, -39, 61, 2, -193, -157, -5, 98, -39, -154, -116, 68, 113, -55, -200, -94, 117, 150, -53, -195, -128, 82, 147, -47, -174, -66, 87, 80, -48, -136, -4, 118, 61, -86, -116, 34, 151, 86, -102, -148, 36, 171, 98, -100, -143, 10, 162, 114, -87, -90, 28, 140, 63, -69, -51, 123, 152, 49, -115, -39, 169, 213, 65, -110, -55, 176, 225, 53, -106, -40, 161, 172, 58, -84, 21, 160, 143, 4, -86, 53, 184, 118, -75, -123, 4, 186, 102, -122, -160, -36, 136, 86, -91, -153, -9, 87, 6, -125, -142, -13, 72, -43, -154, -138, 11, 87, -39, -206, -172, 69, 119, -34, -177, -143, 37, 111, -23, -159, -106, 54, 73, -40, -112, -19, 119, 103, -51, -135, 7, 168, 107, -97, -159, 23, 169, 151, -37, -107, 15, 138, 112, -28, -82, 50, 141]
3623A41p0j43J5J58M6r5j58J4J97O8j26j81J8J82Q0j06j64M9J16J01j42j19M6
3646g3J83kj53q0Q8J68n7j48q4J18J90l0j88j08J34J34j3j57o1J16J04m2j54N
3670a10J18Q2q6j83M0J77P2j41j61J7J88J01j54j40K9J42Q9j27j15O8J07L2j12
3693f7r4P5J43nj52r5J04J64rj42r4R7J82Kj46j07R7J67k8j17n2J18J00l9j64
3718f2KJ49J06j03j53J5J69R9j09j76J4J35J19j16j32J4J19N7j14r9M7J46qj67
3742d8k2P5J15Pj46q5O4J64L0j77j22Q6J48mj23p1P9R3j0j16q4J52J11n0j84r
3768a27J41J17r5j67qJ40J13q1j38l4J56O5r1j06K9J42K6j31p6Q9J24J7j49j31
3792a75P4J85K8j35j28N8J55K3j21r3P5J17j8j12n0J11J10p0j42k0J38J02n8j64
$$ y = [141, 71, -72, -57, 101, 147, 52, -106, -92, 105, 173, 47, -134, -116, 66, 146, 40, -124, -75, 41, 142, 0, -119, -73, 110, 108, -45, -125, -37, 131, 74, -74, -158, -40, 150, 120, -68, -176, -42, 92, 79, -78, -139, -23, 81, 39, -115, -110, 8, 90, 4, -179, -139, 38, 110, -31, -192, -175, 13, 114, -40, -180, -151, -9, 80, -47, -162, -94, 13, 45, -67, -161, -86, 57, 52, -100, -195, -91, 73, 64, -78, -172, -75, 107, 109, -37, -144, -47, 120, 92, -25, -77, 41, 141, 102, -62, -60, 89, 195, 92, -61, -46, 123, 222, 113, -63, -49, 86, 205, 89, -43, -29, 90, 147, 33, -66, -19, 127, 119, -48, -70, 5, 120, 127, -19, -104, -40, 124, 154, -23, -145, -59, 89, 85, -38, -109, -30, 63, 53, -63, -147, 5, 116, 66, -118, -127, 14, 131, 36, -131, -139, 1, 114, 33, -105, -139, 17, 82, -9, -115, -86, 56, 82, -49, -125, -36, 88, 105, -44, -175, -101, 84, 112, -23, -151, -93, 62, 85, -36, -129, -54, 63, 45, -67, -117, -6, 104, 34, -108, -128, 10, 112, 54, -110]
3816a10j6J54P5j3j81k3J39J14o2j49qJ49O9j34r3N9J18K6j04j57P8K10%j36j34
3841a29Q2J59M7j61j14P8J26J6j27o7Q7R6l8j15m7R6J13k6j33m5J04J48p7j41
3865f8o3J27J24o0j41l0J15R1q7j09PJ60J2q9r7M7J64L5j52j28N9K10M2j71j04
3890a06M2J55M3j32n4N2R1j2j03p5J22P7k6j16o6J39R8m5j60m9J19J29l7j57n3
3915a24J12J09l8j15k9J16M2p3q5oJ48K6q8j31O5J09Q0r6j64M3J19J05j21j23
3939a19L7J43J9j04q6R0R4Qj40p3J39R4l3j66n1J28J23n0j14m4R5J03k1j39k0
3964h7R9M8m4j16L6R6O3p8j18NJ19P2q2j21J5J38Q3j14j21L5J06O0r9p8M7J04
3990F8J5j10n3N0J51m2j21n3O6J64k3j59o4P7J25K9j38q6R7J15l5j25kP8N9l6
$$ y = [-110, -126, 28, 103, 90, -91, -114, 25, 139, 77, -72, -80, 69, 138, 4, -89, -30, 88, 114, 10, -147, -69, 141, 141, 5, -129, -47, 112, 159, -2, -116, -38, 88, 104, -23, -90, -3, 93, 55, -60, -107, -11, 102, 76, -57, -102, 2, 150, 73, -68, -131, -4, 120, 60, -81, -111, 4, 95, 8, -101, -94, 66, 78, -11, -108, -61, 103, 138, -14, -142, -83, 127, 169, -2, -106, -64, 91, 134, 2, -52, 0, 91, 79, -24, -99, 23, 100, 74, -42, -108, 31, 129, 84, -76, -125, -6, 123, 86, -71, -124, -12, 97, 59, -56, -85, 31, 73, 0, -85, -91, 57, 83, -5, -136, -71, 38, 118, 22, -142, -99, 20, 125, 4, -119, -82, 61, 80, -24, -110, -20, 74, 82, -58, -131, 8, 102, 69, -97, -148, -20, 103, 53, -61, -105, -10, 93, 72, -67, -87, 12, 60, 16, -100, -64, 32, 95, 17, -101, -96, 23, 95, 13, -108, -93, 45, 128, 14, -107, -72, 34, 94, -5, -83, -36, 68, 83, -27, -80, -30, 121, 79, -42, -95, -29, 135, 112, -47, -111, -34, 91, 120, -18, -104, -7, 108, 73, -52, -54, 24, 83, 47]
4016D7j48M1J24M5j16j12L6J15J07j08j39J6J18N4n9r7mJ31J0r5o6O2J10J6j41
4041e3o5P3J26Qj28r0Q5J69k9j05j04Q2J41j4j39l8P3R4m7j03kJ11Q7r0j31LJ33
4068D7N2n0j36kJ32P5r4r0j1J02M5p1p6J4R3K4j04n4N3J16Jj07r0Q3R6L3j33p3
4096a25N2J10L6j13o2O5P6qq7l9J10R4m5j35j6J09J11j10j01j5J14R3m2j42lJ14
4122D1P0o0j11M6N7K8p3p1O8P6K3j10j01Q6J00M0j17j02O9J03K7r9p6P7Q3L8r6
4149A6p5N8P8%j01m2J08N7j4j37pQ2J22l1j67nR3R8q4r2k8J04N4o7n7LJ11nn8
4178A4j18P1R6L3j09r5O8R7L1p7j00L2Q8np5m8O9O3m4o2m1O1J17n5r9l8Q1J12
4206F7l6j25m1P1J38m9r3l4Q3P2l1q2LQ8M0m8j16M8J26J0q8j08L1J55L9r1j20
$$ y = [47, -101, -60, 64, 109, -7, -119, -83, 32, 139, 31, -108, -92, 26, 80, 21, -76, -80, 51, 61, -34, -100, -38, 72, 88, -53, -118, -45, 81, 89, -39, -129, -44, 125, 96, -9, -113, -31, 110, 96, -43, -81, -8, 86, 39, -64, -66, 45, 132, 42, -89, -86, 47, 99, 49, -87, -89, 43, 118, 24, -66, -77, 25, 70, -1, -77, -63, 30, 54, -50, -104, -51, 65, 66, -41, -131, -48, 48, 81, -52, -125, -73, 37, 73, -40, -102, -37, 39, 31, -56, -95, 15, 109, 64, -71, -87, 22, 133, 23, -78, -93, 21, 114, 72, -70, -73, 41, 111, 51, -60, -14, 43, 71, -2, -73, -5, 71, 94, -16, -117, -31, 69, 109, -8, -110, -41, 62, 89, -10, -86, -9, 74, 112, 16, -59, -1, 77, 77, -24, -66, 42, 99, 85, -52, -59, 23, 145, 114, -53, -58, 35, 133, 49, -43, -71, 33, 87, 20, -37, -34, 77, 72, 14, -104, -33, 63, 96, -13, -108, -40, 57, 88, 11, -89, -57, 31, 26, -49, -97, -28, 35, -9, -71, -112, -51, 66, 11, -88, -126, -45, 67, 31, -94, -135, -64, 74, 25, -68, -102, -19, 53, 22, -60, -57, 31, 71, 23, -93, -45, 81, 91, 3, -105, -74, 81, 120, 29, -91]
4233i1N8J05K4q1p7K6R1J6p3n2N9O6J0j14l2P9R0k6j16m6P8J03l1r7o1N6J03o
4261F1r3l9J10N5q8p1J9Q6N0n5j13JJ31K3q1q2j2J55L9o9j21L7J19ko2o7O1P3
4289F5k1j12j9N3J35n7j28k7P9J10k4j40k4O4R8k6r4k0Q4L8n3m9%R1J5o2p7K4
4317g7Q3O0n2j25L2J00O5p9p0J4Q0N5o2q3jJ01Qn3n2O4R2j7r7o9R0R5qj06o3O3
4347a2J01J8j12m5M8P3oj07J3M5O4k9j12K2R5L2o7j10M7N3P4n6j23j7J24O6p3
4374Fq5L3Q9J7p2n8K8Q2J4q5n5P0J02k3r4n7M3J07Lr5o7N9J44m8j03qP8M9m7n1
4404b4l6Q9M3n9q1k1J11P3p6q0j8Q5P3m5r6k0J05J7l8p3K8P3Kn7n6L4J04Jr3p4
4434a09L7J18K4j11o7N1R1K7r4m6M9R9l6o0l5Q1O8o9j07L2P6N5j7j22PP0Q1k7
$$ y = [-91, -33, 72, 96, 15, -62, -36, 55, 71, -2, -54, 5, 71, 81, -33, -65, 14, 104, 78, -38, -84, -6, 97, 66, -31, -92, -36, 67, 61, -32, -71, 39, 94, 6, -65, -46, 40, 90, 35, -78, -77, 54, 77, -4, -86, -98, 57, 96, 27, -94, -57, 62, 60, -2, -69, -8, 65, 44, -68, -87, -34, 101, 44, -84, -111, -32, 78, 54, -86, -110, -46, 52, 26, -68, -88, -4, 34, -19, -68, -68, 23, 38, -24, -101, -77, 6, 66, 14, -111, -79, 21, 86, 7, -63, -49, 31, 86, 24, -59, -60, 41, 49, -4, -56, 8, 100, 83, -14, -83, 7, 102, 94, -12, -75, -12, 89, 107, -5, -50, -2, 71, 65, -42, -29, 16, 80, 51, -61, -39, 56, 88, 21, -89, -42, 11, 85, 29, -94, -111, 13, 79, 6, -79, -46, 43, 60, -12, -70, -42, 40, 54, -31, -86, -16, 86, 63, -31, -88, -45, 62, 65, -30, -97, -38, 106, 58, -45, -53, 25, 74, 27, -24, -60, 29, 72, 13, -68, -89, 22, 95, 19, -61, -79, 6, 79, 34, -62, -82, 23, 40, 2, -71, -43, 30, 32, -25, -81, -47, 57, 58, -35, -109, -72, 46, 70, -41, -108, -57, 34, 61, -33, -79, -30, 69, 33, -27, -62, 19, 87, 18, -89, -57, 19, 74, 57, -65, -58, 12, 93, 66]
4462F6j13j2Q2N2n9o0J8M9L0o9n3K4Q0L9r8m4J8Q6K0o4q2L8N5O8p7p7M7P4K1q4
4492b5l3N9M0J2r8K2M8M5j8q0n2J17N3m2j11NP5O5k6q6lM8N9k5o8rP7J6n9o7M4
4523a7Q9K7q8j19P4Q0%p1m2K3N1M1n3n6J6Q5oq3pM0L2Nq3j7R1O6m9r0l1Q8P1l8
4555B9q7l4Q1O8n3m0k3O4P3p9q5L5Q9L3p4q3M0R8L0q0o0J2Q1K4n5n4JO8K1n4n6
4586g0P7M5j4p9nM8M8k6q2nN1P7l7o8n2P1N5lo2k8M6O2l9o0J3O8L1o2o7J8Q8J0
4618D9m6r5L6J05M8o6q7L4N1M2o0o3M6O4k7p2j2N5N1Rq6l1O1N5rr5m4P0P1mp7
4649b7m7O5P4n0n7j1M3N5n9m3%O1N7m0j03K3P1M4m6r6K4P2N0o5o3N1L4K3m2m5
4679d7L6O7Rr1m5M5J27l8j03k7L6R0l8l6n8N9M2po4k4N6N2k2o5j1O1N6n8o6JQ6
$$ y = [66, -47, -59, 23, 75, 16, -44, -26, 23, 53, -16, -69, -45, 35, 74, -24, -68, -50, 36, 56, -8, -90, -52, 3, 71, -6, -83, -36, 38, 59, -25, -58, 1, 41, 53, -45, -23, 25, 70, 52, -28, -80, 37, 90, 48, -63, -58, 17, 82, 56, -30, -33, 15, 74, 49, -19, -28, 49, 65, 6, -61, -17, 72, 99, 11, -108, -34, 46, 46, -25, -67, -44, 7, 48, -5, -61, -45, 40, 34, -49, -56, -16, 16, 21, -62, -79, 12, 78, 29, -61, -92, -4, 67, 29, -58, -92, -11, 57, 4, -36, -59, 5, 78, -1, -86, -51, 38, 71, -3, -86, -46, 52, 82, 2, -58, -46, 35, 59, 4, -50, -49, 19, 40, -14, -70, 7, 52, 38, -41, -46, 2, 50, 24, -58, -63, -12, 65, 28, -40, -92, -21, 34, 31, -31, -59, -13, 49, 10, -50, -37, 31, 62, 0, -67, -49, 39, 49, 3, -92, -56, 49, 97, 31, -56, -22, 29, 71, 11, -52, -6, 58, 31, -41, -53, 2, 53, 62, -24, -55, 6, 61, 52, -43, -87, -17, 54, 50, -27, -74, -9, 65, 15, -42, -53, -10, 45, -14, -57, -57, 4, 61, 21, -82, -59, 12, 56, 10, -86, -62, 10, 60, -5, -68, -17, 17, 40, -2, -47, -11, 56, 65, -26, -71, -26, 101, 63, -40, -67, -31, 59, 21, -15, -73, -14, 28, 21, -43, -67, -11, 41, 19, -46, -57, 4, 60, 2, -64, -63, 23]
4710B3O9p5p3j6Q5M1p3ql3N5N1n2l3mO3K1m6p3N1P7J2n9r8O6P3L8q8p7O9O9ko1
4742hn7O9O5m1n3k2O2M5k1p0j2N6O2l3r3j6J02K1j5o8pJ9M7l0l9J2K6K9l5m7J7
4773c5O5Rm6n7K4Q7J4p4o4M6P0On0n6N0N0j3o2k7O6L7j7q2k0J13L0n1p6k4Q1N9
4804E3l2r1MO0L2j8m8LM9M3m6o0PP9Pp5k4NR6K7p6p1J5Q1J4n5m5K4N4K0m9l4O3
4837A2M3k2o4l7Q4M7j3n8n1P1N4j8q6k0N6O4l5m7nM5N2n0l7j0O6nm5o3N5O4rn3
4869a5o2N1O2J9p4k7K2M8N1q3l8rP9Ln0j3K2O5j5p4j7N6O5l3p0l7M5Q3j4q0l1
4900g1O0M9Kp4QK2K0k2m3J6Q5ok8o6KN9L2o6m2K8M7L8l8o6M4K9j0mn4K9M0rl3
4933b2k6K9P2k3m4l8K3R4k3p6j2K8M4nm0j2L2M6n2j7k7O6M3n8m2J5M6K7l3n6J9
$$ y = [23, 92, 17, -56, -72, 13, 54, -19, -27, -60, -5, 46, -6, -39, -43, 20, 41, -5, -78, -27, 50, 62, 3, -95, -29, 44, 82, -6, -83, -14, 55, 53, -8, -65, 4, 69, 28, -25, -47, 15, 60, 39, -31, -43, 13, 75, 42, -51, -67, 35, 56, 41, -27, -34, -15, 32, 2, -37, -25, 1, 30, -5, -52, -35, 30, 39, -7, -64, -40, 47, 61, -13, -77, -31, 39, 45, -5, -61, -11, 39, 26, -36, -63, 3, 40, 23, -59, -79, 34, 64, 13, -63, -87, -6, 53, 21, -70, -66, -6, 26, 8, -40, -37, 12, 55, 9, -51, -44, 35, 42, -33, -57, -52, 44, 71, -5, -76, -61, 20, 34, -21, -66, -42, 12, 32, -17, -51, 12, 55, 33, -31, -68, 16, 63, 50, -8, -59, 12, 66, 48, -38, -58, -2, 62, 27, -20, -25, 20, 72, 22, -15, -25, 41, 36, -9, -72, -17, 47, 38, -15, -77, -26, 36, 55, -19, -46, -24, 24, 75, -8, -46, -55, 24, 27, -23, -36, -14, 51, 36, -38, -55, 1, 66, 33, -37, -74, -29, 54, 40, -40, -71, -11, 38, 40, -34, -26, -4, 16, -6, -49, -33, 52, 46, 18, -48, -46, 13, 45, -21, -63, -35, 12, 50, 12, -54, -10, 19, 9, 5, -49, -20, 20, 11, -22, -48, -19, 53, 30, -14, -52, -29, 65, 42, -34, -46, -18, 26, 21, -19, -31, 1, 47, -5, -22, -49, 17, 60, 2, -40, -25, 21, 48, 15, -41, -22]
4964b2N9J8o0l9%P7J2o3k0QN3j8k5k4J5O6j2m0m6M6O0rn0m0M2M6%p4k6O6J5j1
4996Dl6l6P2L8k5p0K1M9M6m1q9L3M7P7q2p1L0O7J3Jr9N5J2K7k3o8M8N8j9k4o6
5027e1O0L9Mo2j9J8L2Jm5j6J8L0j6rl1K2O8l8m7nM3K2pm5j3P0K8m8o1KN6M5n2
5060gk9pL6K9j8m1J7M2j0l9k2N1K2On1n6O0O3Km1m7NO6Kk1m2J8M3Po8rL1L1j7
5094Fm1k4O8J6j0n4lN9J9qq0rL0O1j1n3J6K9L1n8l7L8M6K1l1o3M0L6K8o1mpM5
5127C5K3m1k7NN5j2j4o9O4J8k2k2l6L5O1j5n2k3N6L3m8l8k2P0%j5k4j9N4J8on1
5159b9L5J9om4r%N2K4m7n8K2O1J3o8k5K0O6Ll4l8K3N5j1l7j7L1M4l2k2k2L3M5
5191D7k7o4oL9M9j6n6j0P2rj8k1j5K6L2kp6K3M6L4m9l8oP0Pj7p2L8K6K3m1l5L4
$$ y = [-22, 37, 55, -5, -44, -44, 33, 45, -18, -38, -30, 23, 5, -20, -44, -29, 37, 25, -15, -61, -15, 45, 36, -14, -54, -12, 34, 34, -40, -66, 0, 15, 4, -32, -68, 4, 42, 17, -53, -32, 17, 63, 22, -67, -34, 13, 90, 8, -63, -33, 34, 47, 48, -51, 4, 16, 43, 20, -48, 0, 58, 39, 15, -51, 9, 48, 52, -10, -29, -11, 21, 22, -23, -39, -21, 9, -7, -16, -47, -25, 43, 5, -42, -47, -4, 18, 11, -34, -47, 23, 51, 3, -58, -56, 0, 45, -7, -36, -43, -7, 22, 4, -37, -20, 22, 12, -27, -49, 2, 24, 30, -21, -77, -17, 46, 48, 7, -40, -35, 31, 33, 12, -30, -12, 31, 38, -30, -39, -8, 23, 6, -35, -59, 9, 25, 15, -39, -42, 17, 36, 28, -52, -61, -31, 30, 19, -34, -18, 11, 42, -16, -53, -15, 31, 52, 21, -42, -2, 34, 62, 1, -3, -10, 35, 58, 17, -10, -5, 50, 38, 24, -45, 19, 37, 15, -7, -43, -8, 53, 38, -14, -37, 19, 52, 4, -34, -56, 14, 14, -1, -25, -44, 10, 28, 22, -29, 6, 25, 19, -25, -34, -34, 18, 42, -5, -63, -41, 20, 33, -35, -60, -40, 26, 29, -5, -43, -20, 35, 24, -13, -30, 1, 45, 13, -9, -31, 2, 47, 20, -44, -50, -11, 38, 22, -34, -44, 28, 19, 1, -20, -35, -9, 23, 21, -55, -32, 14, 48, -1, -39, -45, 25, 32, 15, -57, -19, 7, 30, -11, -46, -12]
5224a2K1MNn6J7L9J8n9l6N3M0k8n1KK7P1j5m3j9J8K9j7j3j3L8Pk8k0jM6Mk6k6
5257b4j3L9L3m7l6K5L3K2k2m4J4K5J7m3k9%M5Ol5l7M3N4mn5k2M4M6J0o1j5J1N2
5289C2k0m1j8K8J8K2n8J9J2L1k6l8lL8L9k0n8K0M1K1k9l2j9N2L1l4m6K1L6j6J1
5320A4m5J6M6J7o6l6M2M8rk9m2ML1L1n2k0K6L1jl8j3M7L3n0j2k1N3J2kq5M7K2
5352aK9j8m7KM2L0qo2MM4nl0nJM0K1l8l5J5M3J1o1j4K4L8K9o8m8K7O8j7Nm5M4
5386A5pk1lnL5lj3m9J7M8K5l1n3ML8J9Kk5k1L5qml7QN6j3j5m4K9O3k5j1l9J9N5
5421D1L4q5k8J0P5k4j8j3QJ3Ol1k5K9J9kl1j5M9K2k4m6NK7L2j3n4J7j1N7j6l3
5453b5j0M7J0l0k0J3K6Rk8m8J6M5M2o8k6L1K9Rl9k1K7K2Lk6qJ9QQn0pO1L2k5o3
$$ y = [-12, 9, 13, 18, -38, -21, 18, 36, -23, -59, -6, 34, 6, -45, -43, -16, 55, 40, -3, -22, -4, 25, 8, -5, -18, 20, 27, -1, -21, -22, 24, 28, 2, -24, -37, 2, 35, -12, -48, -23, 10, 32, 10, -34, -20, 5, 22, -21, -50, -50, -5, 1, -34, -71, -28, 26, 22, -33, -55, -11, 35, 45, -16, -31, -20, 32, 12, -29, -47, -19, -1, 21, -37, -18, -6, 25, -1, -39, -42, -4, 35, 15, -43, -23, 18, 39, 10, -22, -41, 11, 42, 8, -38, -17, 19, 3, 14, -31, -15, 31, 48, -18, -54, -12, 36, 27, -2, -44, -40, -9, 22, -30, -50, -24, 7, 6, -32, -45, 2, 35, -15, -27, -48, 5, 17, 15, -70, -23, -1, 28, 10, -37, -35, 7, 37, 29, -33, -29, 15, 10, -20, -25, -24, 16, 37, -1, -36, -21, 22, 33, -28, -42, -18, 20, 49, -19, -67, -40, 28, 11, 16, -29, 15, 8, -13, -16, -21, 14, 11, -2, -51, -34, 14, 39, 8, -45, -41, -3, 16, 18, -7, -28, 7, -1, -5, -42, -34, 22, 9, -6, -50, -21, 42, 17, 6, -33, -14, 41, 75, -10, -38, -28, 47, 23, 5, -8, 0, 13, 19, -12, -37, -8, 11, 9, -22, -37, 12, 34, 10, -36, -31, -4, 28, 15, -39, -22, -33, 24, 8, -25, -35, 12, 22, -8, -28, -15, 11, 20, -8, -56, -40, 5, 47, -21, -47, -16, 13, 22, -17, -38, -11, 11, 14, -12, -20, -1, 7, 15, -35, -42, 19, 51, 26, -37]
5487c7OK6J3Qm8JJ7L4J4m5k5J4J3J4k3j5N1j1lk2lK1L8n1l5M4K0QJn8K2K2M0k8
5521B3l7OK9K1n4MkL9k2m5j4M6M3Oo7QPL5pMm2K0L2j4m6J4J7Rj7k2K9OK8l2n5
5556e0L0K1J2rn5J0O0j3j7k9nO0Lm0j9M3NJ1m9k1K3L5kl2j4M8K8j2m6rL3K0qk6
5590a4k4J5L6J3n9QM1rj9lrK0L5n1j8NN2J2l6l3L4J6K7m9rj2N9j4k4k1J8L7jl2
5624ik5K0N6oj6n5J9M0k4nl8NP5m2j6KJ9J4j8qQL5%l1l0LM6Knl6J1j1O1l8k5M
5660a8J0J5pk5J9RK3l2l5K0M4kn9K2j3M1Oml5JO9m2m0J2L4K2mp2K1K5K6k0l9j
5694b9N9j5nn2NL8L7l1l3J8QMkj7j6K2K5l4pj4N0jMk1j8L0Qj3j9J2J5Lj9LJ7K7
5730C9m2k2K0J1K4ml8j1J6L5j4m1K5oN6j7m8L1K0oj7oj7Ojj0k2L8J2pkl3L2K7
$$ y = [-37, -31, -5, 8, 16, -32, -31, -14, 20, 34, -11, -36, -22, -9, 5, -18, -33, 18, 7, 4, -18, -21, 0, 38, -13, -48, -4, 16, 24, 25, -33, -11, 11, 51, 23, -14, -8, 21, 42, -12, -8, -10, 29, 7, -38, -52, -6, 37, 43, -24, -16, -9, 26, 19, 23, -19, 1, 33, 19, -27, -13, 4, 13, -4, -26, 3, 9, 37, 5, -50, -20, 1, 13, 4, -51, -41, 19, 6, -11, -40, -45, 15, 18, -22, -41, 2, 7, 18, -31, -52, -29, 6, 4, -28, -42, 6, 34, 22, -24, -33, 0, 20, 12, -14, -38, -23, 13, 26, -33, -25, 16, 7, -12, -15, -24, -4, 31, -20, -38, -33, 19, 31, -5, -38, -4, 12, 39, -10, -19, -31, 28, 14, -10, -31, -13, 24, 23, -9, -34, -14, 42, 36, 20, -35, -16, 24, 0, -5, -43, -38, 37, -5, -21, -19, 0, 14, -4, -12, -4, 31, 31, 0, -30, -27, 19, 21, 16, -20, -9, -20, 41, 3, -22, -18, -8, 7, 0, -25, -6, 3, 26, -6, -41, -21, 23, 21, -38, -16, -29, 12, 18, 14, -21, -20, 49, 7, -33, -21, 13, 35, 31, -41, -20, 5, 31, 11, -28, -29, 30, 15, 10, -42, -37, 1, 38, 7, -26, -8, 0, 4, 2, -15, -31, -9, 16, -18, -25, -39, 11, 10, 14, -7, -25, 5, 13, 0, -19, -7, 8, 11, -8, -5, 12, 39, -3, -25, -5, 6, 30, 26, -12, -23, -7, 28, 14, -27, -2, -8, 48, 31, -17, 14, 34, 28, 11, 5, -12, -6, -7, -17, -39, -1, 11, 4, 2, -31, 1, 28]
5764B8ll8j6j5L5M1l6k8L4j1Rl3OMK2J0k7MJK5Kl2lRL1Rl5l2L8jJ6j0l1L6K1l9
5800ij5MK0K1k3l1L4JJ3k2k6NL5L0l7k1lL6J0l8QJ6k1L1j2l0K9K2k7l6J5LM0j5
5834GQm3K3K2J3m7PJ2L5j5j3j6J9qM0n8mN0lj0j1k9N6J2l6Mm0L3Qnj1k2M3j7n
5869al7J9L0Pk0k8L5K7pk2j9K1L3k9%m1K8MRk3KJ2j8K5m4MJ4L5m1Ll0O9j0j0j7
5904b0K4k2K4Qk1j9J7K7n6L3L6l1KJ6k8J5K9k8j2m0M1L7l2k5J4OK8j8Mk1J9Ol0
5937a7LOJ0K4k4j5oK9Plk4j5L4J4m0LJ1JL9k3l3j4N1lj5nkK3noqQlJpKqL4j0O
5977B0l9K8nJ7l5LJ5mK1k0JRJ3ko0K4J2K9j7n4J6K6j0J1k0J6MJ5l1J8j5J7J2l
6011A2k9k5M3MJ1l1L0J6j3j3jK1K1l9kK7l7K8nj3rk0M2nk5J8MK2mk4jRK4k8k3
$$ y = [28, 25, -13, -29, -44, -9, 32, -4, -32, 2, -9, 0, -33, -27, -23, -1, 9, -18, -14, -13, 12, 14, -18, -21, -12, 19, 28, -7, -39, -1, -2, 14, 4, -27, 9, 30, -9, -24, -20, 0, 21, -2, -33, 1, 2, 15, -7, -33, -28, 7, 37, 0, -21, -24, 12, 22, -16, -8, 8, -13, 18, 6, -24, 5, 27, 0, -36, -21, -18, 22, 7, 15, -28, -5, 17, 30, -17, -10, 2, 37, 22, 9, -7, 12, 4, 44, -14, -18, 32, 29, 19, 8, -21, 35, 47, 11, 15, -25, 8, 16, 11, 0, -22, 21, 4, -1, -38, -19, 11, 18, -2, -30, 5, 32, 25, 3, -16, 5, 38, 9, 9, -32, -4, 0, 9, -14, -12, 0, -18, 7, -37, -33, -19, 16, -25, -22, -52, 17, 7, -3, -20, 4, -18, 6, 14, -7, -26, -9, 18, -38, -5, 31, 0, 2, 18, -10, 5, 34, 6, -6, -46, -5, 32, 0, -25, -11, -5, 23, 5, 9, -12, 7, 13, -17, -14, -8, 2, 26, 2, -13, -19, 10, 17, 14, -10, -25, 9, 23, -17, -14, -3, -2, 37, 14, -19, -33, 18, 15, 0, -5, -7, 16, 11, 5, -3, 5, 2, 3, -4, -2, -10, 24, 14, 20, -19, 9, 4, 21, -14, -11, 4, 0, 21, 1, 2, 11, 24, 22, -38, -14, -2, 27, 10, -44, -28, -2, -12, -1, -21, -5, -1, 14, -17, 1, -14, 3, 15, 12, -17, -42, 1, 5, 16, -15, 15, 31, 18, 5, 4, 25, 46, 7, 5, 32, -5, 23, 18, 5, -4, -24, 18, 13, -12, 6, 10, 32, 28, 4, 3, 12, 36, 8, -15]
6046a5KK2J5k9J1KkJ4k5nlL3nk7j9NL1j3j0nJ7j2J8nJ0m3M5j0qlj1M0k8j3K9j2
6082iK6J3l2J1j0L2k7Jj8QJ6J6n0j6J3J8J6m2L0lK3nk7QJ6jPk8nL5Oj9l4qM4J
6118FOkKj3Pjj2RJ7qm1OKL3jj4j0K8Jj0J4j6J6J8k0k9qL7jok3J5K1rRk9K8kkM
6158B2k8RMJ8k2JOMj2K9k5k0K0J5lk8J1L1k5kl4J1L7j3l9QJ5Olj0jJ5%J0k6mL6
6195A3Kj6l4J3L7K3o5rL5k5O1l4k8K7JJ7k3j1J0J8j2Ok0oK2L1m1k2K9jj2J1Jk
6229dmRmPj7L0k0lNK0nj9Ql0L6KJ5n6K9KJ7jl5nK4Pok1K0K9j4l1NJ9RNm7J6J7
6268IJJ2k3%j1L0Rk2j5oKJ8qpK2JLk4MK8lk7jK2k5J8j8JNNlLj5J6J3nj0l5pN9
6308A6rKk3qK2pJ0k0j1L6K7k9k2jN4m4Mj2L9k8LKj1K9mPk7J9oj6J5l0JK6MRk6
$$ y = [-15, -13, 9, 24, -5, 6, 8, 6, 20, -5, -10, -13, 20, 15, -12, -31, -26, 5, -8, -18, -23, -6, -18, 0, -5, 5, -38, 7, -3, -11, -14, -25, 15, -13, -26, 3, -9, 17, 30, -2, 9, -1, 31, 4, 5, -13, -5, 11, 27, -23, -39, -26, -8, 8, -34, -4, -7, 16, 11, -16, -8, 8, 7, 14, -14, -19, 16, 22, 3, -31, -39, 5, 6, 12, 10, 12, -1, 6, 5, -7, 2, 19, 11, -30, -24, -22, 11, 10, -4, -14, 14, 15, 5, 19, 3, 19, 37, 17, -12, -20, 17, 16, 10, -13, 2, 23, 14, 23, -6, 22, 20, 18, 22, -6, 3, 7, 25, 3, 4, 10, 14, 2, 31, 6, -14, 6, 21, 18, -10, 1, 32, 7, 5, -29, -18, 19, 6, -33, -25, -10, -4, -7, -17, -18, -3, -3, 7, -19, -23, 13, 15, -1, -35, -22, 15, 38, -27, -36, -1, -26, 35, 1, -27, 0, 1, 18, -5, -16, -6, 12, 0, 6, -14, -20, 2, 33, -8, -30, -1, -2, -14, -3, -2, -4, -8, 1, -3, 4, -13, 17, -3, -6, -1, 19, 14, -5, 3, -27, 9, 11, 26, -30, -1, 1, 18, 17, -18, -23, 1, 8, 2, -19, 1, 30, 16, -15, -10, 9, 18, 23, -24, -8, 9, 10, 22, -1, -1, -12, 18, 27, 5, -10, -16, -14, 4, -4, -11, 11, 12, 15, -9, -5, 23, 20, -7, -8, 14, -11, 7, -11, -10, -5, 0, -3, 0, -15, 1, 14, 9, -1, -36, -43, 16, 7, 9, -14, -22, 0, -7, 3, -17, -28, 8, 35, 6, -16, -17, 37, -7, -3, -15, 24, -4, -1, 1, -10, 19, 15, 22, -5, 14, 8, -8, 7, -23, -22, 4, 8, 17, -9]
6345iK8k6J8Lm2J3K7j6OjRrPj4j0J0J7Qk4J2Mk8OJ0j0PK2j5j5jJK0j0Mk7K4j0
6382a1K4nl6L0K3l0j2pJ5JJ6j9j3L2lPl6J2J1MNl8L2rOl3KQJ1K9pk4J3J7k1MR
6419GrMkl1lM4j6J3j7%rQK5k7QlL0m2K0j6J4J2qjJ1pL2l7oK1k1QNj5lK0qJ2l4
6458b1K6j0JQJl%mqkJ8J8qk0j8KL2J8l1QK4j0Ml4MJ0K2Ln0j7O4j7k3k0K7J1Mq
6496A%jmK0rj9J4pJ2J5l5orL8j8MJ1%J4k8j7J5J2J6l9OJ4MJ6l0j9K0K5k0j7K8
6532Gk4J6j8K2K1l1L2l0j8J2J7JpMj4J6jmQk2K6k1J3jj5K9k0Lj0KKoK5j4k0J2
6568hLmlK0lrK2k0j6J1Rk0J5ORj1k6rM5Lk4J9k9RJ7J1k2j0nL1J3k7j9J7Pl1K4
6605ej6J7Nlm0L3K7k2J1l2J6KJ0J1jOqrk6J3J7pRk6PJ7j5J5m6J6K0J2Nk9k5L7
$$ y = [-9, 19, -7, 11, 14, -28, -15, 12, -4, 2, 1, 10, 1, 8, -6, -16, -6, 11, 19, -5, 7, 11, -17, -11, -1, -11, -4, 18, 3, -12, -13, -12, 8, -2, 2, -25, -1, -11, 13, 8, -28, 2, 25, -5, -17, -24, -9, -8, 8, -11, -24, 8, 5, 12, -24, -12, -1, 3, 8, -30, 2, -7, -1, -34, -32, -24, -13, 16, 9, -15, -2, 15, -6, -2, 7, -2, 2, 0, -31, -34, 10, -6, 7, -10, -10, -19, -11, 14, -13, -5, -8, 22, -20, 0, -16, -2, 10, 2, 1, 12, 5, 37, 0, -6, 15, -6, 2, 7, -8, -11, 9, 1, 13, -21, 5, -5, -4, 4, 5, 2, 2, -2, -10, -12, 6, 24, 16, -4, -22, -20, 12, 30, -1, 7, 31, 21, 25, -9, -5, 5, 27, 30, -20, -37, 27, 10, -13, -33, -6, 5, 9, 1, 1, 0, -4, 16, 7, -12, 2, -5, 7, 22, -13, -19, -28, 10, -8, -4, 7, 7, 21, -7, -24, -9, 3, 19, -20, -14, 0, 4, 20, -10, -29, -9, 16, -4, -21, 7, -17, -1, -19, 3, 24, -7, 25, -5, -23, -11, 6, 7, 0, 4, -10, 6, 5, 1, 9, -13, 13, -8, 5, 4, -11, 18, -2, 1, -9, -7, -5, -11, 14, 0, -20, -8, -5, -9, -12, 8, 5, -4, 18, -2, -18, -7, 2, -18, -3, 3, 12, 1, -25, -34, 11, 14, -10, 9, -20, -11, 6, 17, -5, -15, -20, 11, 24, -3, -22, -5, 2, -29, -5, -21, -4, 1, -2, -42, -9, 18, -4, 7, -25, -9, -7, 3, 14, 13, 19, 11, 2, -24, -11, 6, -1, 8, -18, -11, 6, -9, 6, -40, -24, -4, 8, 13, -16, -41, -4]
6641dJ7j3K3m9J9K5pk6J2J1J5j6Rmkjj9J7Oj7Pj0j9K9k5K6Mk4J2NRk2J1k2M3M
6677B4l3oJ4JPjj1J7j6J0j7j9K3J0Ml2qL1jrk7O2k2J9j7l7L1JK3l3MmK7j5okk
$$ y = [-4, 13, 0, 23, -26, -7, 18, 11, -15, -3, 8, 23, 7, 16, 12, 10, 9, -10, 7, 13, -4, 3, -7, -26, 3, -22, 4, 8, -16, -4, 1, 10, -12, -1, -23, 20, 24, -9, -15, -1, 0, 7, 6, -5, 12, -4, 6, -11, -30, -7, 3, 7, -25, -33, -2, -3, -12, -39, 23, 1, 20, 3, -34, -3, -2, 21, -12, -8, -12, 15, 0, -6, -8, -10]
$$ [...]
8191F
##END NTUPLES=NMR FID
##END=
