##TITLE=1H_AM A507
 CDCl3, 8 sc, 
 25.7.2019
##JCAMPDX= 6.0         $$ Bruker NMR JCAMP-DX V2.0
##DATA TYPE= NMR FID
##DATA CLASS= NTUPLES
##ORIGIN= UXNMR, Bruker Analytische Messtechnik GmbH
##OWNER= root
$$ XWIN-NMR		Version 3.5
$$ Thu Jul 25 14:32:33 2019 Russian Standard Time (UT+4h)  she@DPX200
##.OBSERVE FREQUENCY= 200.13155
##.OBSERVE NUCLEUS= ^1H
##.DELAY= (6, 6)
##.ACQUISITION MODE= SIMULTANEOUS
##.ACQUISITION SCHEME= undefined
##.AVERAGES= 8
##.DIGITISER RES= 18
##SPECTROMETER/DATA SYSTEM= spect
##.PULSE SEQUENCE= zg30
##.SOLVENT NAME= D2O
##.SHIFT REFERENCE= (INTERNAL, D2O, 0, 15.7039)
##AUDIT TRAIL= $$ (NUMBER, WHEN, WHO, WHERE, WHAT)
$$ ##TITLE= Audit trail, XWIN-NMR		Version 3.5
$$ ##JCAMPDX= 5.01
$$ ##ORIGIN= Bruker BioSpin GmbH
$$ ##OWNER= she
$$ F:/spectra/data/she/nmr/H-F/1/audita.txt
$$ ##AUDIT TRAIL=  $$ (NUMBER, WHEN, WHO, WHERE, WHAT)
(   1,<2019-07-25 14:31:28.50 +0400>,<she>,<DPX200>,
      <created by zg, POWCHK disabled, PULCHK disabled
       configuration hash MD5:
       00 E9 B6 7A A2 85 ED C7 34 08 36 98 17 FE 4E 26
       data hash MD5: 16K
       6E 12 BD F1 3E E5 3F 64 D8 5E 0E 7F 18 CC 25 FF>)
$$ ##END=
$$ 
$$ hash MD5
$$ 0A 6F 64 D3 69 62 FF 4B 43 CA 26 B8 D1 18 35 A6
##$RELAX= 
##$RELAX= 
##$RELAX= 
##$RELAX= 
##$RELAX= 
##$RELAX= 
$$ Bruker specific parameters
$$ --------------------------
##$DU= <F:/spectra>
##$EXPNO= 1
##$NAME= <H-F>
##$PROCNO= 1
##$TYPE= <nmr>
##$USER= <she>
##$AMP= (0..31)
100 100 100 100 100 100 100 100 100 100 100 100 100 100 100 100 100 100 
100 100 100 100 100 100 100 100 100 100 100 100 100 100 
##$AQSEQ= 0
##$AQ_mod= 1
##$AUNM= <au_zg>
##$AUTOPOS= <>
##$BF1= 200.13
##$BF2= 200.13
##$BF3= 200.13
##$BF4= 200.13
##$BF5= 200.13
##$BF6= 200.13
##$BF7= 200.13
##$BF8= 200.13
##$BYTORDA= 1
##$CFDGTYP= 0
##$CFRGTYP= 5
##$CHEMSTR= <none>
##$CNST= (0..31)
1 1 145 1 1 1 1 1 1 1 1 1 1 1 1 1 1 1 1 1 1 1 1 1 1 1 1 1 1 1 1 1 
##$CPDPRG= <>
##$CPDPRG1= <>
##$CPDPRG2= <>
##$CPDPRG3= <>
##$CPDPRG4= <mlev>
##$CPDPRG5= <mlev>
##$CPDPRG6= <mlev>
##$CPDPRG7= <mlev>
##$CPDPRG8= <mlev>
##$CPDPRGB= <>
##$CPDPRGT= <>
##$D= (0..31)
0 1.2 0 0 0 0 0 0 0 0 0 0.03 0 0 0 0 0 0 0 0 0 0 0 0 0 0 0 0 0 0 0 0 
##$DATE= 1564050687
##$DBL= (0..7)
120 120 120 120 120 120 120 120 
##$DBP= (0..7)
150 150 150 150 150 150 150 150 
##$DBP07= 0
##$DBPNAM0= <>
##$DBPNAM1= <>
##$DBPNAM2= <>
##$DBPNAM3= <>
##$DBPNAM4= <>
##$DBPNAM5= <>
##$DBPNAM6= <>
##$DBPNAM7= <>
##$DBPOAL= (0..7)
0.5 0.5 0.5 0.5 0.5 0.5 0.5 0.5 
##$DBPOFFS= (0..7)
0 0 0 0 0 0 0 0 
##$DE= 6
##$DECBNUC= <off>
##$DECIM= 24
##$DECNUC= <off>
##$DECSTAT= 4
##$DIGMOD= 1
##$DIGTYP= 9
##$DL= (0..7)
0 120 120 120 120 120 120 120 
##$DP= (0..7)
150 150 150 150 150 150 150 150 
##$DP07= 0
##$DPNAME0= <>
##$DPNAME1= <>
##$DPNAME2= <>
##$DPNAME3= <>
##$DPNAME4= <>
##$DPNAME5= <>
##$DPNAME6= <>
##$DPNAME7= <>
##$DPOAL= (0..7)
0.5 0.5 0.5 0.5 0.5 0.5 0.5 0.5 
##$DPOFFS= (0..7)
0 0 0 0 0 0 0 0 
##$DQDMODE= 0
##$DR= 18
##$DS= 0
##$DSLIST= <SSSSSSSSSSSSSSS>
##$DSPFIRM= 0
$$ [...]
##$SUBNAM2= <"">
##$SUBNAM3= <"">
##$SUBNAM4= <"">
##$SUBNAM5= <"">
##$SUBNAM6= <"">
##$SUBNAM7= <"">
##$SUBNAM8= <"">
##$SUBNAM9= <"">
##$SW= 24.9336996594482
##$SWIBOX= (0..15)
0 0 2 0 0 0 0 0 0 0 0 0 0 0 0 0 
##$SW_h= 4990.01996007984
##$TD= 16384
##$TD0= 1
##$TE= 0
##$TE2= 300
##$TE3= 300
##$TEG= 300
##$TL= (0..7)
0 120 120 120 120 120 120 120 
##$TP= (0..7)
150 150 150 150 150 150 150 150 
##$TP07= 0
##$TPNAME0= <>
##$TPNAME1= <>
##$TPNAME2= <>
##$TPNAME3= <>
##$TPNAME4= <>
##$TPNAME5= <>
##$TPNAME6= <>
##$TPNAME7= <>
##$TPOAL= (0..7)
0.5 0.5 0.5 0.5 0.5 0.5 0.5 0.5 
##$TPOFFS= (0..7)
0 0 0 0 0 0 0 0 
##$TUNHIN= 0
##$TUNHOUT= 0
##$TUNXOUT= 0
##$USERA1= <user>
##$USERA2= <user>
##$USERA3= <user>
##$USERA4= <user>
##$USERA5= <user>
##$V9= 5
##$VALIST= <valist>
##$VCLIST= <CCCCCCCCCCCCCCC>
##$VD= 0
##$VDLIST= <DDDDDDDDDDDDDDD>
##$VPLIST= <PPPPPPPPPPPPPPP>
##$VTLIST= <TTTTTTTTTTTTTTT>
##$WBST= 1024
##$WBSW= 4
##$XGAIN= (0..3)
0 0 0 0 
##$XL= 0
##$YL= 0
##$YMAX_a= 2781
##$YMIN_a= -3703
##$ZGOPTNS= <>
##$ZL1= 120
##$ZL2= 120
##$ZL3= 120
##$ZL4= 120
##$ABSF1= 10
##$ABSF2= 0
##$ABSG= 5
##$ABSL= 3
##$ALPHA= 0
##$AQORDER= 0
##$ASSFAC= 0
##$ASSFACI= 0
##$ASSFACX= 0
##$ASSWID= 0
##$AUNMP= <proc_1d>
##$AZFE= 0.1
##$AZFW= 0.1
##$BCFW= 1
##$BC_mod= 2
##$BYTORDP= 1
##$COROFFS= 0
##$CY= 11.3945322036743
##$DATMOD= 1
##$DC= 2
##$DFILT= <>
##$DTYPP= 0
##$F1P= 18.9103706918063
##$F2P= -1.10871071338519
##$FCOR= 0.5
##$FTSIZE= 0
##$FT_mod= 4
##$GAMMA= 1
##$GB= 0.15
##$INTBC= 1
##$INTSCL= 1
##$ISEN= 128
##$LB= 0.24
##$LEV0= 0
##$LPBIN= 0
##$MAXI= 10000
##$MC2= 0
##$MEAN= 0
##$ME_mod= 0
##$MI= 1.114404
##$NCOEF= 0
##$NC_proc= 0
##$NLEV= 6
##$NOISF1= 3.799351
##$NOISF2= 2.8
##$NSP= 1
##$NTH_PI= 0
##$NZP= 0
##$OFFSET= 15.70392
##$PC= 1
##$PHC0= -8942.27
##$PHC1= 14.00097
##$PH_mod= 1
##$PKNL= yes
##$PPARMOD= 0
##$PSCAL= 0
##$PSIGN= 0
##$REVERSE= no
##$SF= 200.130013532006
##$SI= 16384
##$SIGF1= 3
##$SIGF2= 2
##$SINO= 400
##$SIOLD= 16384
##$SREGLST= <1H.CDCl3>
##$SSB= 0
##$STSI= 0
##$STSR= 0
##$SW_p= 3612.71676300578
##$SYMM= 0
##$S_DEV= 0
##$TDeff= 0
##$TDoff= 0
##$TI= <>
##$TILT= no
##$TM1= 0
##$TM2= 0
##$TOPLEV= 0
##$USERP1= <user>
##$USERP2= <user>
##$USERP3= <user>
##$USERP4= <user>
##$USERP5= <user>
##$WDW= 1
##$XDIM= 8192
##$YMAX_p= 0
##$YMIN_p= 0
$$ End of Bruker specific parameters
$$ ---------------------------------
##NTUPLES= NMR FID
##VAR_NAME=  TIME,          FID/REAL,        FID/IMAG
##SYMBOL=    X,             R,               I
##VAR_TYPE=  INDEPENDENT,   DEPENDENT,       DEPENDENT
##VAR_FORM=  AFFN,          ASDF,            ASDF
##VAR_DIM=   8192,          8192,            8192
##UNITS=     SECONDS,       ARBITRARY UNITS, ARBITRARY UNITS
##FACTOR=    0.0002004,     1,               1
##FIRST=     0,             0,               0
##LAST=      1.6414764,     0,               0
##MIN=       0,             -3703,           0
##MAX=       1.6414764,     2781,            0
$$ Real data points
##PAGE= N=1
##DATA TABLE= (X++(R..R)), XYDATA
0@%%%%%%%%%%%%%%%%%%%%%%%%%%%%%%%%jLmMpJ1j2J2j2J2j2J4j8K0k1K5k9L1l3
51a7L8m5N2o0P2r2J23j79L20j262k653K259K020j023j496J034N91j714j115J872
71a275J478j662k001J069K021j09j222Q3L88q31n04J561J684n64j614j48R87M16
89b43l5L95J46n89j02J135Q43o18q69R3L92J32O97J066l22j727o37J399J058o48
109A566o19N64J80r83j72J368L26j892j229J479J669p51j438K18M69j168q42J543
127B88J599j319k273L60J848j23j581n3J062m12j162P66J685n76k245m13J692
144h57Q38p31k03O06l98j094L38J480K59j239m87Q94O25j60k6Q9n60n30P57J276
164H77O3q21l25J81j38J03R42N16r99r53P95J238l28r96J30N15m58l26J170R76
$$ y = [0, 0, 0, 0, 0, 0, 0, 0, 0, 0, 0, 0, 0, 0, 0, 0, 0, 0, 0, 0, 0, 0, 0, 0, 0, 0, 0, 0, 0, 0, 0, 0, 0, -1, 2, -2, 2, -5, 6, -6, 6, -6, 6, -6, 8, -10, 10, -11, 14, -15, 16, -17, 21, -24, 28, -32, 40, -52, 71, -108, 212, -1050, -3703, -1444, 576, -447, -1943, -909, -318, -2032, -3147, -1275, 203, -1459, -3460, -2391, -370, -479, -1701, -1618, -1230, -2061, -2565, -1004, 680, 116, -1498, -1646, -659, -243, -278, 117, 263, -326, -428, 707, 1550, 932, 63, 156, 548, 680, 1377, 2443, 2121, 394, -243, 1156, 2214, 1566, 947, 1511, 1691, 708, 536, 1904, 2230, 338, -891, 588, 2257, 1506, 68, 286, 755, -413, -1255, 288, 1887, 568, -1705, -1345, 503, 380, -1201, -1254, -192, -604, -1766, -1000, 685, 109, -2136, -2549, -857, -19, -750, -953, -347, -745, -1839, -1501, -21, 238, -1001, -1488, -594, 31, -129, -155, -66, -626, -1156, -399, 877, 940, 119, -206, -25, -163, -60, 882, 1398, 399, -554, 241, 1479, 1151, 155, 285, 800, 342, 16, 1186, 2162]
184B162j244j749M37J646J04j041N1P16n86j079O22J476m16j842k89J588O88r82
202B62o01M64j43r34J80J472L84j468j036P05Q93k99m61K31O5o24j09R36N19q32
222c96r62J68P21L16M5L5l95o38P6Q23M37l91l74O6K5K9N10M73n30r73J99J187
244D51M30o17l15K87j84m78N77J194j64j428l42J218O71p38m74N60R0p86M2J285
264A279L64j409j008Q48J075k94o43K03J81p26l53Q78P60p72j121J48Q60J61m22
283Ij28Om63k66N80O67k31q31l22K79L54J95M1k93m79o7N44L91j50l36j52q5N6
306f81N04N57k58q82k19P44N56j68k61J12j00l66K61R03K02r14o52O22Q45q5m73
327B47P6J45m24k20P66P40n55j078J4R05L23m51k07J48k26l91L26P75o4r47n04
$$ y = [2162, 918, -831, -394, 1252, 1356, 315, 366, 1082, 496, -583, 39, 1515, 1099, -743, -1032, 556, 1244, 262, -339, 125, -18, -952, -772, 700, 1084, -384, -1420, -715, 178, -121, -582, -351, -286, -910, -1019, -83, 436, -396, -1358, -1190, -469, -153, -108, -73, -468, -1106, -1030, -207, 230, -161, -535, -469, -444, -415, 95, 568, 38, -935, -736, 451, 881, 264, -51, 236, 52, -426, 151, 1345, 1181, -247, -589, 629, 1300, 562, 88, 648, 738, -48, -6, 1279, 1643, 234, -774, 74, 1149, 855, 212, 415, 596, -130, -483, 395, 1155, 383, -738, -590, 270, 431, 9, -119, -113, -576, -842, -262, 405, 174, -657, -979, -700, -346, -151, -110, -403, -882, -949, -405, -14, -164, -500, -652, -737, -681, -177, 380, 122, -760, -979, -235, 321, 153, -108, 4, -96, -462, -201, 702, 904, -10, -662, -40, 805, 720, 247, 323, 468, 44, -176, 590, 1330, 775, -303, -289, 616, 939, 488, 281, 429, 203, -188, 138, 913, 849, -98, -602]
348f02N40N68p7k78j12j78l06J19N48K31m91n80l7L93L54M6k82m24j67K87L85
369f3J08j83k53k48p7L79N54j9o48m18L71N26L8j55%j29l30Q9P03M22n45p50J46
392d82O83K42k30p7M9k69k19M30O51n8p70l63M32N44M3k60j30j07j71J06M75K74
414G93l87o55p1N49M04j46l58j62n1K1K00L13Pn19m83J85O12K44l60m57r7J52
436b66J56J50J21j66m62k29L57N55L5m95l73P8L09J86O1m0k33l35K9N01M28k10
458A57n69k08L49L88O6q5j26j88j33K09M83K12l82n30J7M98L60p3k83j77m2N8
480AK59L23j5m73m14K30N99J87l78l71J8J06M2J56K76j89o27k42N64N81k14o02
502a83j50K15O9j5K35J29m73n32K27O87J66m74l83P7J42M8J98K11k68n09n9N31
$$ y = [-602, -62, 506, 429, 151, 39, -139, -445, -326, 222, 453, -38, -618, -655, -262, 92, 138, -144, -568, -735, -448, -63, 45, -138, -391, -639, -716, -337, 217, 198, -450, -868, -497, 29, 67, -88, -88, -217, -547, -458, 245, 667, 122, -628, -482, 201, 443, 213, 136, 185, -84, -303, 127, 778, 720, -50, -413, 19, 563, 606, 346, 216, 109, -62, 44, 519, 793, 406, -249, -320, 229, 633, 487, 129, -33, -84, -63, 137, 450, 457, -62, -545, -360, 252, 496, 136, -321, -418, -266, -110, 40, 161, -5, -467, -696, -339, 216, 251, -244, -617, -539, -230, -44, 17, -23, -256, -591, -562, -61, 367, 157, -412, -620, -271, 117, 183, 98, -28, -216, -349, -140, 343, 555, 173, -357, -340, 158, 518, 445, 162, -15, -57, 1, 260, 583, 568, 95, -319, -89, 510, 697, 319, -52, -34, 72, 114, 270, 546, 357, -270, -512, 52, 633, 419, -183, -333, -118, -49, -64, 171, 300, -173, -705, -478, 209, 375, -99, -482, -405, -263, -215, -17, 194, -74, -583, -642, -111]
524a11L87j17l74k04K5K05L21J41k17l40p3K31K82J81o0l28l33J42N73K75l25
545B81m06lJ67O0J76K50j43n89k24N89N56k58n58m6K45k5m3L26J82n51o01L15
567c00P90R1o10l19K15R4j36J84L72k54o85p5O94M11l74m62L8J41n3J67L85o4
589B50n99k99M31N04l2k90j43m0l3K41L81p7m74k23K89L25N2Rp5l82k57L82O14
612E54m8n72k12K86J05q7J90K19l93n95K65Q30J02p21l34L37J45k56J90N18k06
633C17q61j37Q33M46n46m80K51K51k46J0M96J6p49l73O54O65k22n04lJ24j93L3
655b18M95K03n21m63L12N37nl00r4m0j34J48N04J63n32m59J76L54N6K3J04j77
677A32m60K0O21K61n50m38K61L28j02j3L13j50p38j83Q13N73m78n87J83L09k79
$$ y = [-111, 276, 159, -215, -419, -394, -189, 132, 273, 56, -284, -357, -126, 156, 337, 277, -51, -384, -242, 331, 606, 281, -125, -128, 39, 99, 275, 525, 382, -207, -431, 158, 714, 456, -102, -148, 97, 72, 29, 355, 537, -14, -615, -300, 490, 581, -29, -348, -133, -39, -175, 9, 381, 127, -558, -633, 61, 472, 98, -364, -326, -185, -238, -71, 314, 250, -349, -648, -217, 287, 255, -35, -178, -218, -251, -10, 371, 294, -180, -403, -114, 211, 263, 272, 197, -185, -442, -60, 554, 506, -66, -278, 8, 113, 26, 216, 435, 42, -553, -288, 542, 644, -77, -411, -74, 71, -185, 5, 523, 317, -544, -681, 152, 598, 52, -428, -177, 74, -172, -162, 334, 350, -399, -772, -118, 547, 325, -179, -182, -58, -251, -218, 277, 480, -41, -504, -192, 345, 340, 40, -54, -94, -228, -80, 424, 587, 55, -404, -228, 126, 182, 205, 309, 132, -328, -308, 313, 574, 24, -414, -153, 175, 73, 60, 373, 223, -515, -698, 115, 688, 210, -377, -194, 115, -164]
698a64j53N10K49o86n13O41P69l20p65QM16j01j83M98M09n87p80K84Q10N5n44
719a47n7L18j22k42L52M25m03o86J45O94K11k90j43Ql05j62N09N02k68n89M1L82
741A73%j75J47P1m17k23N84N83l69p26k4M00kr2M05K18o05n99M36P50j77o95K1
764c16M92m4l23K80L99n08p93K73R66J74o68k56L18n0l76K35O39j47p73p2P56
785B06K69n36l44K45P8j97K22N76r6p88l06N14M35j57j26J54j26l30J67N32n4
806C38o00j79M89L05j68jJ28l56n07K88P98J32o40k56L42Q4k89J32M34k32o58
827d16J33Q55J70p76m00L86J86k87J45O00j09q98k94P50M70m90l89L22J95l42
847a89p7N17M6p34l74O48O14k52m28L6O2l19mN86K73n02m57L09M24j21k38Q1j
$$ y = [-164, -317, 193, 442, -244, -757, -116, 653, 333, -432, -424, -8, -109, -292, 206, 615, 28, -752, -468, 342, 397, -147, -204, 114, -8, -250, 102, 527, 124, -562, -417, 277, 488, 198, 55, 63, -242, -404, 105, 607, 339, -250, -209, 173, 173, -2, 145, 216, -201, -424, 160, 743, 374, -352, -376, 24, 22, -70, 335, 553, -52, -651, -215, 535, 358, -337, -316, 176, 132, -191, 89, 488, -20, -813, -540, 426, 600, -68, -324, -6, -56, -432, -197, 442, 295, -478, -550, 206, 475, -61, -405, -160, -82, -279, -57, 519, 423, -365, -671, -157, 278, 121, -5, 149, 23, -307, -140, 392, 338, -262, -441, 48, 353, 185, 184, 312, -44, -551, -263, 535, 667, 27, -229, 113, 197, -92, 40, 474, 242, -416, -283, 572, 742, -34, -434, -48, 138, -149, -4, 596, 487, -411, -705, 45, 515, 25, -364, -42, 153, -189, -266, 251, 297, -437, -811, -163, 451, 199, -229, -193, -131, -450, -454, 132, 405, -97, -554, -245, 179, 58, -180, -99, -100]
870a00k23Q7N73J96n35m86K19L66lJ6K67p5n13j38N80L37m24m05K72L18j40o0
892A29L05n2o50k46P06N96l71n62J03K64k72j54M69K90n78n13M59O42k46o06j0
913b97L07j49j41M49L61n31o95J95O62N2m03mJ98j89k20L21L88l37n50J21N23
934F1J61k10n6ok98j55M77M76k30n00J3L14J8j09J85P0l55k21M47M99k34n36k7
957b16K93Pn2L20J90m77n00L15O22o5m98n3K97l4k07K35L01l40n89J16O81J68
979E14m28k36J49l9k05K15M38j44n86j02M74K56k71k36Q6j3j53J82M01n3n27k36
1001e14L11K91m2n7K2j81k38J84M51nm43j78K59J84m5N9R2k53l51J89N56J03m12
1024a8k15J76Q0j17J64K82k01m81N0N67K02l90k85J78R5j12J16L49o7n36k00M59
$$ y = [-100, -323, -236, 337, 533, -2, -488, -269, 97, 94, 110, 377, 302, -211, -349, 231, 568, 144, -261, 11, 329, 189, 129, 434, 382, -268, -514, 192, 788, 417, -145, -42, 222, -50, -204, 265, 555, -23, -536, -77, 565, 319, -287, -297, 10, -139, -280, 169, 530, -1, -696, -501, 161, 213, -190, -194, 4, -185, -405, -84, 304, -33, -583, -462, 61, 222, 12, -44, -50, -348, -503, -26, 450, 220, -280, -267, 47, 65, -44, 141, 211, -144, -365, 82, 581, 347, -189, -216, 77, 84, 32, 352, 542, 65, -435, -120, 502, 437, -61, -114, 183, 149, -58, 177, 478, 138, -451, -335, 346, 514, 86, -150, -1, -40, -245, -30, 408, 264, -322, -424, 50, 306, 35, -201, -115, -128, -281, -99, 302, 249, -278, -514, -203, 88, 46, -11, 11, -170, -408, -224, 227, 222, -221, -399, -140, 44, -1, 58, 150, -103, -454, -265, 291, 394, -18, -233, -57, 23, -94, 70, 352, 151, -330, -280, 287, 489, 99, -186, -8, 87, -25, 91, 440, 373, -163, -363, 96]
1046I6L61k04k78L3O3j35O1L30M6m62k81K83L74k5k29o9m5j22O3L26J12l14l06
1069c22P4K59O0l6m7j51j84R8L33J35k72k76K3J59R7O9Q5j70k99j0L84K25j87
1092D7k51jJ11NJ05K01o3l69j66L77L59j10k85l7Q7k5K8K60R3l31l07J97L91M5
1116C61k32j32L6l0K3K22J50k37l51ML26J67j06j60p5o9K5J93J58j39k80j05J64
1139h7J64O6n8j78j78J4K42J76r6k37r3L6J07J32Q9j28k54o4K21K63m9j98q2%
1163a92L0J51J55Rk81k18J74L27P1j70j57j1K2Q2J84Q7j74k59kK57K02m8k00r8
1187e9kP7J41J34q5k32j40J24K77O4j42j94o7O6J47R8j1j45k05j4J93J83rk08
1211ij92J4J59J57Kj07j74r9J09K05J02j22k38q1J28J93N9p8j48r7jJ62J86lk13
$$ y = [96, 457, 253, -25, 8, 71, -64, -3, 327, 373, -89, -370, -87, 287, 262, 33, -36, -81, -203, -140, 186, 298, -16, -322, -248, 11, 71, 35, -12, -163, -347, -249, 84, 219, -53, -329, -306, -147, -50, 19, 104, -66, -365, -375, 9, 234, 47, -204, -205, -94, -89, 16, 217, 154, -215, -381, -4, 355, 245, -40, -77, 10, -15, 13, 273, 366, 35, -272, -75, 316, 361, 129, -3, 33, 3, 26, 248, 398, 161, -190, -186, 140, 307, 201, 41, -34, -103, -78, 115, 273, 134, -146, -251, -87, 77, 143, 85, -93, -271, -257, -15, 161, 65, -172, -265, -229, -122, 10, 99, -29, -283, -347, -126, 137, 88, -110, -192, -192, -162, -11, 144, 153, -128, -346, -172, 155, 226, 56, -101, -112, -90, -8, 176, 263, 89, -170, -172, 85, 287, 239, 39, -59, -61, 16, 157, 291, 206, -26, -166, -42, 235, 299, 157, -37, -104, -38, 109, 207, 196, 51, -154, -168, 25, 208, 199, -9, -201, -187, -28, 129, 131, 24, -150, -249, -140, 65, 167, 45, -193, -274, -146, 47, 106, 28, -120, -217, -218, -56, 130, 127, -86]
1236h6j82L2K04J67k0j58j32k1J31J62O8r1j76j05R4K21J11j05j99p0J00J63Q0
1259A88j3j16j55l9J89K36j0k74j63R4J67P0nl7j18j75M8K96J52k24k60oJ64Q8
1283I7J7K4j01j98m8K24K45j08k85r2J26R0N6N6o8k06j07J83K42Kj85j48MN5J36
1308A1J27l6k51j28J36K23M4r6q9q4l6J29K32M4k58j98J10K07N5l5k2q8j50L6
1332a17K88J60k45k83N5K25O7m1K0l2k08j05K58K74j07l19o4J69Q8l2N1L1k09
1355g6j84J63L37Jk95j65J07J11PQ9M9j68k28O5K94R0j81j51J0L0N5J40J10k01
1379Ik83M5L03J20j22r2pq6m5K14K22j50l28j2K80J01j19k5K6j38j41K28L40j02
1403B38m00r9K56J28j00J0J15j54k74J37L84K5l69j73K08J53o4K4J15j31l15L3
$$ y = [-86, -268, -236, -32, 135, 115, -43, -175, -196, -65, 97, 165, 74, -102, -207, -113, 108, 219, 114, -85, -155, -55, 108, 188, 175, 59, -96, -135, 54, 290, 280, 6, -157, -63, 104, 174, 169, 132, 14, -161, -113, 183, 335, 111, -149, -155, 9, 97, 114, 138, 37, -161, -209, 15, 260, 152, -133, -225, -99, -9, 47, 103, 35, -171, -278, -95, 147, 149, -36, -184, -180, -125, 11, 138, 102, -149, -277, -141, 82, 126, 30, -59, -143, -179, -50, 182, 226, -32, -230, -120, 87, 142, 107, 85, -3, -153, -117, 171, 331, 86, -197, -142, 83, 150, 109, 129, 97, -111, -216, 42, 316, 209, -110, -174, -5, 83, 51, 102, 133, -76, -260, -97, 240, 241, -54, -219, -112, -1, 6, 95, 144, -24, -252, -187, 107, 197, 16, -135, -125, -95, -40, 100, 210, 9, -274, -229, 74, 194, 72, -20, -27, -113, -158, 56, 278, 128, -200, -212, 68, 169, 50, 25, 51, -87, -228, 0, 340, 238, -162, -261, -5, 123, 23, 33, 148, -6, -280, -143, 241, 266, -103, -276, -68, 85, 21, 45, 160, 29, -286, -253]
1425b53L93J74k60k17R4Q5m8M7J53o4k85l5L16K01j84k05RM1k4J13K22m5l48j27
1449b47K52K01j00j28M1j8j23Q5K95k6l63j74K48K30p9p4O5q8k69K9L93J25l30
1472e5k57K02K10j04j09J40j2k80m3L95K47k98l54J17K21m7l9K00N2l19j81L17
1494CK98j84k86M7J98k6l1J71N3l22k26K69L44n3k25k8O9j15j7K37J13k67k41
1517b19K11K82p0k13nL1j50J9K97J87l14l54J23K52k9j03R0N5k27j42K91K62k49
1540B5l77R2L01L4j34Q6P1k66k30K65L91q5l55k1K27lj39J16J69k08k64K02M08
1563C05j2l76j20J81L8n4J51J99j88l56P0L37P0k34o9J39l0r3J42K00j97l65M9
1586b13L62J14j80n5O5j52j65J90L21j17l66NK96N2j98j3J28j42k14K09L95p4
$$ y = [-253, 140, 314, 54, -163, -69, 16, -32, 15, 168, 104, -181, -216, 100, 301, 117, -88, -79, -38, -62, 51, 273, 228, -120, -247, 5, 206, 106, -22, 19, 1, -122, -37, 258, 232, -131, -305, -57, 173, 94, 20, 85, -3, -272, -243, 150, 275, -55, -312, -110, 100, -4, -113, 27, 15, -265, -308, 87, 334, 36, -318, -201, 20, -27, -66, 134, 186, -133, -314, 3, 301, 117, -169, -122, 76, 50, 19, 190, 243, -79, -305, -36, 308, 255, 30, 2, 71, -44, -61, 176, 289, 22, -219, -8, 274, 204, -9, -14, 17, -133, -114, 183, 370, 56, -298, -175, 77, 48, -55, 35, 90, -137, -279, 12, 274, 25, -352, -260, 41, 75, -59, 27, 98, -168, -398, -133, 258, 173, -182, -203, 24, 21, -118, -2, 167, -41, -305, -103, 305, 293, -83, -203, -22, 16, -38, 113, 312, 124, -232, -162, 175, 245, 11, -58, 81, 51, -42, 100, 300, 103, -262, -213, 149, 263, 83, 28, 93, -59, -224, -34, 287, 170, -196, -191, 105, 157, -41, -54, 74, -68, -282, -73, 322, 248]
1608B48m18j45K64J18j35M6J86j19l21P2L76M5l49j38K24J37r5MJ80j31l49KM11
1631A13J88k50j90J00N2j11M5K28m3l11m1L12J83k02j87O6K0p9J00K73ll67j59
1654b63K49J85j10r1J09qj80M2K91K0l37j73K45K20j09n9R3p1k64qL83J56k96
1677B4k31J63J71j15p0J29J1k62n5L33K11k51k89Q0J60m9k7J93M6l05j83K60K65
1700B09j24k47M3J28n3k1J63L7k75j88K38K72m1j85j0L8j08j1K55J25k39k19J52
1723f1K44m8j27J2J3j25oK65J68k36k92Q3K21j9n7Q3K2j95j21K46K27j59k84J2
1747a34K10J7o8P0K4j93j78J85L13n7k84n3J34Qo9R6J08j76k30J21L03K1k49j02
1771a83R4J6k1J27J29j50k69M3K58Q2j46n0M9o1l7J46J63j13k70QK31J09q7k2
$$ y = [248, -170, -315, -51, 67, -68, -22, 164, 45, -276, -204, 172, 217, -132, -270, -46, 91, -4, 0, 180, 49, -300, -298, 113, 301, 51, -139, -39, 13, -98, -53, 175, 132, -179, -220, 92, 275, 73, -114, -48, -28, -107, -7, 266, 263, -104, -263, -14, 171, 61, -30, 79, 71, -109, -67, 224, 244, -93, -266, -21, 199, 90, 31, 124, 53, -211, -219, 164, 320, 24, -207, -44, 127, 12, -58, 71, 82, -180, -235, 98, 309, 58, -231, -151, 9, -40, -67, 126, 172, -133, -316, -56, 209, 85, -162, -119, 9, -44, -65, 98, 135, -140, -328, -90, 182, 141, -44, -54, -16, -124, -135, 120, 245, 6, -213, -61, 183, 135, 8, 20, 33, -92, -98, 167, 335, 99, -193, -110, 111, 92, 35, 118, 140, -55, -176, 70, 297, 138, -146, -134, 76, 93, 25, 95, 119, -74, -252, -67, 246, 189, -95, -148, -14, -6, -75, 21, 129, -47, -277, -156, 147, 168, -81, -183, -89, -73, -94, 33, 162, 12, -257, -214, 44, 126, -20, -70, -21, -82, -119, 27, 190, 77, -193, -185, 46, 155, 68, 46]
1795D6Kj26o4J59K51r4k42n6J71P6o4J2N6j28j40J14K76Jk79j07J25Q4k3M4O9
1820A63j24j92M0K70O5k14j30P1N9oL8R1r8k20qK24J36j21j33k8L3%O8J18n0k14
1846a62n2J55J49n6r1l6k6j6Q0J70j2j97j12J23J37K5n4j4p0q5R6J95K2j86j28
1871a45Q7J22L1k5L4p8j35L4K08J13j44j74L2J00K8RN1m6j65m0J87J50j04j50
1895b0m5O0K0M6O6j5j77r6J18J61j5j14q8j3L4O7P6l0j39j07P7J52L3n4o4p3k4
1922a64Q3J24L3j30j27K4J17O7J3l9q4o3N6J53P1q7j42j1Q6P9O2k0p0r6pJ38J22
1949A88l5j25p3M5O9P3J2m8j09n9P8J46K8j03j20j9O0P0N9l8j17q5J7J22Q0m5
1975G1j25q5L2P9P5jr1r4j3Q5R3J5o9j18k4P5R8L2n2r3m5L6J13P6j8j04r2M3J14
$$ y = [46, 48, -78, -142, 17, 268, 174, -68, -124, 47, 123, 59, 71, 127, -1, -141, -27, 249, 250, -29, -136, -11, 73, 50, 94, 163, 39, -153, -113, 157, 222, 8, -122, -51, 8, 2, 40, 131, 33, -187, -195, 29, 165, 44, -89, -117, -84, -84, -16, 102, 52, -162, -214, -59, 90, 34, -57, -93, -119, -135, -55, 115, 103, -94, -206, -83, 54, 79, 25, 11, -59, -144, -48, 147, 169, -17, -145, -58, 64, 95, 70, 104, 26, -109, -75, 133, 246, 102, -72, -40, 60, 88, 97, 148, 102, -63, -103, 84, 234, 130, -20, -65, -5, 15, 61, 127, 112, -65, -161, -43, 118, 103, -11, -99, -112, -78, -11, 65, 35, -104, -211, -134, 18, 51, -3, -67, -140, -164, -81, 43, 76, -54, -181, -157, -40, 27, 40, 1, -83, -146, -90, 63, 134, 47, -95, -106, -20, 59, 121, 101, 31, -65, -72, 66, 188, 153, 28, -45, 0, 69, 142, 154, 106, -3, -62, 16, 162, 190, 87, -33, -52, 8, 78, 137, 99, -18, -103, -86, 36, 116, 71, -54, -139, -107, -28, 47, 46, -45, -139, -152, -67, 26, 41, -28, -146, -170, -95, 3, 35, -17, -110, -155, -119, -6, 70, 52, -52, -144, -101, 13]
2004A3R5l5r6o5J3Q3J03Rp5j04j6J04Q8L0n1j08n1O2J29L3o1r9m4L6P6O6mj12
2032A9r6K0J12P1l7q5o2j2K8J01O6r3j50k3J02J07l0o7n0l6lJ02J10m2j45q0Q0
2059i3J09K4m4j9q1l1P2J37M0j48j17M0J14M5Ok9p3o4M4J34O3q6j13qO3M9M4L1
2087A09q1j22NJ30J25o4j21l9K5M0O4O2m3j49n4J26J10k6q9l5oj8N9J11%j54j17
2114a52R5J45Kp4k1l7k6J5J33N6j39j35L3J57Rn2j8j3q0k2J53J25j00j79nJ21
2140iL6j8Oqr9n9J44J42p2j61k4O6M4J9O6jj45r7J22J74pj49l1N0lKJ03L5j41
2169a5j27Q7J97nj22m6L8l5k1J40R6j18j81J7J82M2j10k7L3n0n3J07J41q8k05
2194a23j1J55P4o3j9J7q2r4Q2J84k4j84p1J32N7l4rK4p4j11P7J95L3j72j03P6
$$ y = [13, 108, 73, -23, -88, -75, 8, 111, 120, 45, -59, -75, 29, 117, 147, 96, -12, -63, -1, 128, 161, 100, 1, -43, -7, 69, 135, 131, 19, -77, -57, 55, 126, 89, 4, -58, -70, -42, 59, 125, 32, -118, -141, -39, 68, 38, -29, -79, -115, -118, -16, 94, 52, -93, -173, -93, 16, 40, -4, -23, -104, -135, -63, 74, 114, -34, -151, -111, 3, 48, 54, 25, -48, -112, -68, 66, 129, 43, -70, -78, -15, 34, 78, 109, 28, -94, -89, 41, 166, 102, -19, -58, -33, 7, 71, 133, 90, -59, -113, 13, 123, 97, 8, -27, -33, -51, 8, 119, 119, -35, -152, -57, 88, 90, 16, -5, -42, -68, -53, 80, 136, -3, -138, -105, 52, 61, 9, -9, -22, -102, -124, 29, 154, 54, -125, -130, -9, 27, 9, 15, 7, -92, -151, -7, 135, 63, -98, -122, -56, -12, 7, 73, 72, -73, -170, -48, 126, 119, -30, -61, -11, -14, -12, 91, 126, -15, -142, -55, 142, 137, 15, -31, 7, -28, -49, 91, 187, 69, -112, -95, 87, 129, 19, -8, 25, -25, -78, 29, 170, 82, -123, -134, 21, 95, 32, 13, 30, -52, -146, -64, 120, 96, -88, -159, -27, 30, -4, -13, 11, -63, -174, -97, 98, 131, -41, -144, -68]
2220f8N1l2N6Q8o9j65J9K00O5j51q6O0M1l0O3J09p2k21NK02J04j15p0M5oq0M0
2247a7J85l2k16n7J74J17q9p3L1k8r3N8J98K9k21j19J17J13o3l9O3j0j37%J94
2272H5O4j81j51R5J31k9k0P2m7j62l3J99J25j27j32M5P8m9nJ05Pj78o1J87J44
2297A62j01j28K0L9l8J7J35K9j79j15J40J52p3j17M3O5p9j2J45P5j93j53J14J78
2321A26k3r3L2J1j05n2J59J22j35j66O7J61k2r6M3J5j03o7J64J67j07k18J2J21
2345A3Nm4N9M7j22j17J26J75q4j74KJ09Jl0P2N3j53j48J08J92J2j50j3O2l7m5
2371h1R7Q0j01j66Q8J88kj28l1O2l5o3J25J49r4k04mJ93L5j03jQ4p7q0Q9J69o1
2398A28k17j9J65N8p5J0N2r3j37Q3J69L3j97n5J14N1q0LQ8p6j51N4K15J1j57j01
$$ y = [-68, -17, -49, 7, 95, 26, -139, -120, 80, 145, -6, -92, -32, 9, -21, 42, 151, 79, -142, -137, 65, 169, 54, -16, 29, 23, -57, -17, 168, 136, -80, -137, 37, 154, 65, -8, 23, -5, -98, -40, 158, 187, -34, -153, -36, 77, 14, -25, 38, 28, -109, -109, 85, 149, -32, -183, -88, 43, 14, -6, 66, 19, -143, -176, 23, 148, 21, -111, -66, 12, -37, -42, 63, 70, -108, -169, 18, 162, 61, -67, -47, -8, -46, -29, 106, 135, -44, -159, -19, 133, 60, -57, -14, 51, -28, -40, 105, 180, -13, -166, -52, 126, 103, 10, 42, 53, -52, -104, 55, 177, 42, -124, -57, 104, 82, -14, 29, 44, -59, -126, 38, 205, 98, -120, -108, 13, 18, -26, 33, 80, -42, -159, -33, 142, 58, -116, -114, -5, -4, -34, 38, 91, -62, -210, -102, 90, 102, -48, -61, 1, -36, -81, 16, 96, -5, -171, -83, 105, 103, -25, -56, 6, -29, -92, 33, 182, 88, -116, -120, 73, 108, 5, 4, 88, 11, -69, 20, 189, 128, -89, -108, 57, 115, 40, 50, 102, 9, -128, -45, 124, 157, -40, -95, 19, 70, -10, -7, 81, 5, -146, -92, 123, 134, -23, -124]
2424a24O8L5l9M2J17o8j72lJ78O2j30o6O3L0o2O6J18o2j99j2J75J04q9o7M9or9
2451i1M9J59J3j82n5J39J02p2o8N6rj05K6J85M5j79j31J02Q6k7k4O7k0j40PJ45
2477G8P1j38j24P1Q4j9j5O2k8j52l2J65J02j03j03L1M5k9rJ03%j27p0J29J23o9
2503D6j11K0K4m5K8J16M9j64r8R6J40m4p8K5J1n9%J26N8j40j29P8J31Oo1LJ7r1
2531d6m8J28J14r7j28J6J10Ll8K1Nq7m0J13J04n1j47nO8J5j4N8K3j06q3Q3J47
2558A18l8j09l0N8OqP0J4r1j00N6J32J5q1k6Pl0j0J00O0j02j18L8J21K0o8j8J7
2586Cl6l1Q3R0o2j33k5J15L9l4oK9o4m7O4J16k9j41k8Q0N9k0mRn7n7N5J18J8j13
2616im2K8M5%K5L0n5r4K4J27K5p0o7K5%J7M7L7n3r5j5J15M4m3n4nnj8N7O2m5j04
$$ y = [-124, -56, -21, -60, -18, 99, 31, -141, -144, 34, 96, -34, -100, -37, -7, -69, -3, 115, 53, -146, -158, 17, 121, 32, -35, 14, 8, -91, -42, 117, 130, -52, -107, 32, 134, 62, -6, 50, 41, -64, -38, 147, 192, 13, -118, -16, 70, 43, 19, 86, 66, -74, -67, 78, 149, 11, -113, -42, 42, 23, 8, 70, 42, -110, -142, 23, 125, 22, -81, -50, -5, -34, -43, 60, 60, -67, -137, -8, 115, 46, -65, -45, -21, -66, -38, 78, 127, -37, -135, -39, 101, 57, -21, 4, 15, -44, -44, 82, 140, 0, -129, -51, 80, 86, 25, 28, 45, -46, -94, 34, 148, 51, -77, -61, 49, 52, 14, 35, 40, -47, -87, 26, 130, 79, -68, -73, -5, 10, -4, 54, 77, -29, -112, -29, 118, 80, -29, -59, -1, 5, -3, 67, 81, -10, -110, -54, 78, 93, 12, -14, -7, -37, -47, 53, 113, 11, -107, -69, 52, 72, 4, -14, 3, -33, -64, 19, 109, 47, -86, -111, 4, 43, 9, 3, 32, -32, -79, -15, 101, 72, -69, -97, -17, 42, 22, 18, 27, -30, -87, -32, 86, 104, -9, -51, -23, 22, 22, 47, 77, 22, -72, -48, 79, 104, 34, -33, -8, -8, 9, 56, 93, 40, -55, -70, 45, 89, 46, -8, -13, -18, -36, 21, 83, 38, -66]
2648f6m0J00O6k5l9j6k3k0L1Q9Mr7n6N5O0%nj0m9m2M5Q1M2j02p2L1O4J4J2Mm9
2679a3n0J5R6L8m6n3k0L8K3K6J9m1p3rP1P3k3n7l8NL5L0J8k3p0l2M7O3J1m4n3
2710c7pmO1M7rp3m8L0M8L1j6k8l6k6M7O1K0n5o6NM9L6%j9l2k8J9N2M9l6m5n5M2
2743b3M6L9j8m3m0lN7N7mn8n6PN0M2K2m9n1k4M4M5K0l3l9m8K8O6K7k3o5l2K4L6
2775AM7qn4l5qN6N4qm0m2k6M7L9L7l7n9j3M1M2J9j6m1j7rN8M0j1p0l7J8N7J2J1
2808D8l4n6j3N4O2Ln7m1jL3K5J9j0m6n2L7N6L6n0l6k4J5K3L2J3l8n5qO8M5k0m1
2840a3j7j1QM9M1k4o8l2O0O2rk8k3j9JL3N6Qp5m3K9N4J3pj0m3k6J9O7K8o8n9K5
2873b2L7J6J6j1m8m7J4P6N8p7o1PM2qJ5K9k8o3l0Q1O9l3n6k2K5kK4M2Or8m3P4
$$ y = [-66, -106, -6, 60, 35, -4, -20, -43, -63, -32, 57, 61, -36, -92, -37, 23, 23, 18, 8, -41, -83, -38, 43, 85, -17, -89, -58, 6, 20, 32, 36, -13, -63, -48, 48, 86, 40, -13, -33, 5, 28, 54, 73, 32, -41, -50, 21, 94, 71, 14, -24, -19, 16, 46, 64, 41, -29, -61, -14, 49, 60, 16, -37, -44, -48, 13, 60, 51, -22, -70, -40, 8, 39, 23, -5, -41, -67, -20, 41, 61, 6, -60, -55, -6, 30, 30, 11, -21, -49, -30, 22, 71, 35, -10, -65, -23, 23, 62, 44, 1, -39, -42, 15, 72, 68, 10, -46, -39, 11, 53, 75, 26, -25, -49, -5, 40, 60, 27, -12, -60, -32, 34, 61, 38, -27, -59, -35, 1, 48, 40, -14, -49, -57, -1, 53, 45, 5, -37, -63, -16, 23, 60, 23, -36, -49, -8, 34, 53, 37, -4, -21, -30, 28, 68, 57, -13, -50, -32, 25, 37, 48, 14, -42, -55, -1, 61, 64, 7, -34, -35, -2, 23, 42, 32, -14, -66, -29, 27, 63, 13, -23, -47, -32, -9, 23, 36, -2, -57, -65, 3, 48, 28, -13, -30, -41, -33, 16, 57, 33, -35, -67, -7, 55, 46, 18, -5, -24, -23, 10, 66, 74, -1, -44, -15, 39, 52, 45, 35, -8, -34, -15, 52, 80, 12, -47, -22, 15, 31, 47, 36, -12, -59, -45, 31, 89, 12, -49, -42, 0, -8, 7, 36, 8, -55, -85, -4, 65, 32, -24, -46, -21, -23, 1, 43, 49, -49, -92, -18]
2905a8P6mq1J3J2k0K2N2K4p9n5M4O7J0m4rjl6J4O8N3q1q0K3P4Mk3jln7pQ3M5m6
2939C9r0NN1J1qK8k3p4j8P2P9k3q9j3L4J3PL1J2o7n2L7R7%p3k0K0jLN7L6q0q4
2972h3M2R1J2n1j9L3l7k0N7N7n9q5J5Q1L9n2k3J0k4l0O1P0k1j07k2P5J9j5j4L1
3002C1n2m9N1R1j6j00k7N1K4j7K6K6m1p6M4R6K7j03m0N7K0l4K4N5m5r6K3J13L3
3031I6q5l7J7Pk1L8O2l3j05j4J02M0n5m2K2Jl7M1N6Oj05m4Q1O7m0j9Rj2n6K2Q8
3062E0J7r3m8P0M9l5l2L2j0o8J7R9L9q0p4L4N1k2%N1j4p8j9R5O1q1o3M0L3k1O
3093FO9oj00m5Q1P3l5p0K6J6m5J7O3K1j01p3Q9Q4l5n4RMl4oQ6L9p7q4N2P1rm3
3125a1J6K1p1JP6M8p1q7K9P7lj7K1nm5n9P7Q2m3q2J1O3ok5L4J9q2l8O6R3l2p8
$$ y = [-18, 58, 54, -27, -14, -2, -22, 0, 52, 76, -3, -58, -14, 53, 63, 19, 10, 9, -27, -13, 55, 108, 27, -53, -30, 44, 48, 25, 24, 21, -36, -43, 40, 85, 39, -51, -46, 5, 16, 8, 36, 13, -61, -79, -7, 72, 49, -40, -53, -19, -6, 1, 32, 44, -23, -75, -38, 59, 59, -14, -34, -14, -15, -12, 45, 81, 1, -83, -41, 50, 62, 11, -8, 25, -12, -32, 25, 82, 23, -62, -47, 34, 73, 21, -2, 8, -16, -46, 15, 85, 64, -43, -65, 10, 29, 14, 0, 31, -21, -70, -19, 72, 56, -44, -71, -20, 4, -13, 13, 39, -2, -78, -34, 62, 89, -14, -54, 3, 23, -11, 13, 68, 23, -73, -50, 63, 96, 11, -26, -9, -2, -23, 15, 77, 44, -61, -75, 27, 67, 12, -30, -8, -7, -44, -3, 53, 59, -46, -90, -9, 58, 18, -1, 8, -4, -60, -38, 50, 67, -26, -74, -4, 45, 10, -22, 10, 0, -68, -51, 48, 87, 7, -67, -33, 18, -4, -4, 47, 33, -45, -64, 31, 92, 11, -52, -12, 21, 0, 6, 75, 69, -31, -76, 5, 78, 43, -27, -1, 15, -30, -13, 50, 71, -30, -103, -14, 70, 35, -19, -10, -6, -40, -46, 40, 79, 2, -82, -30, 41, 32, -11, 5, 26, -45, -44, 32, 80, 9, -78, -49, 28, 25, 8, 29, 24, -21, -80, -3, 79, 36, -46, -35, 28, 22, -3, 31, 50, -32, -70, -4, 89, 57, -21]
3157b1k1M7jk5N7K8o2r1N9P3Np1qM0j8k6O2M5o4q4J7J00J9n9j4K6k1m2M8O5m2
3188B1q0QP6K1m7%L1l9m8N8Q3k2q4l5O6J9l8PL3l8n9L7R3j0p9l2N6K2l2L0L0l9
3220Iq4K5R2J8o9k0L5Qk7K3M2k4q2kR6K5m5l8J7qj8K8O2qr6j9P5L4k7k3ROm3K2
3254gO9op3l9O1L9l4k0K5k1n0J5P6J8o0m1J8M3Jk1K5Jp4PQ6K2m8m1JK9rJ7L6j9
3288B6o1k6P4M9l3n6J4K5j0QN1pq4k9O1N3k2l8LOj9JO4kn2n7L9O4j3l7J3kl0n
3322c2N9K8n2n5K4M6Km4L3%l9j2M3N0l9n6MM1J7j6Rjn6kM2O4k3m9qK4%%J5K6m6
3357cl8M5N0j3n3pJ7oOK4K0n1l9J8O4Ql4j9Qkk2M4L8m1p2J4N1K1l1oJ3l3j5L9
3391eN0k5n9J1K8K4j2qjk3k8N5L9qm7k3K1J9QJ0J3l4m0K9M3J8l9k5OK0%J2Ok1
$$ y = [-21, -42, 5, 4, -21, 36, 64, 2, -89, -30, 43, 48, -23, -31, 9, -9, -35, 27, 72, 8, -76, -59, 41, 60, 1, -13, 13, -8, -50, -2, 63, 21, -59, -51, 25, 46, -1, -1, 30, -9, -57, 1, 84, 62, -22, -57, 9, 28, -10, -3, 30, -8, -67, -30, 63, 53, -26, -58, -2, 20, -12, 18, 48, 9, -75, -50, 42, 60, -9, -29, 6, 14, -13, 10, 52, 28, -54, -56, 40, 65, 20, -18, -1, -9, -27, 1, 63, 55, -41, -60, 15, 49, 22, -1, 8, 14, -29, -7, 62, 56, -17, -56, 5, 44, 10, -10, 15, -6, -56, -41, 35, 53, -7, -48, -30, 13, 14, -7, 18, 19, -55, -48, 38, 60, 12, -29, -28, 1, -8, 9, 45, 26, -35, -61, 13, 62, 29, -27, -13, 12, 2, 10, 61, 54, -30, -59, 2, 55, 33, -5, -2, 4, -15, -14, 50, 48, -4, -61, -22, 42, 29, -8, 5, 3, -27, -32, 27, 55, 3, -52, -28, 18, 20, -24, 9, 9, -30, -42, 1, 51, 12, -44, -40, 1, 18, 2, 11, 10, -46, -48, -6, 58, 35, -14, -22, 2, 2, 2, 17, 43, -3, -41, 4, 54, 41, -12, -19, -2, -8, -2, 22, 42, -9, -48, -30, 34, 42, 8, -11, -3, -5, -27, 17, 55, 14, -58, -44, 7, 28, -3, -9, 4, -29, -44, -5, 45, 20, -39, -28, 0, 24, 12, 4, 3, -20, -48, 7, 46, 38, -9, -32, -11, 8, 16, 26, 39, 5, -35, -6, 37, 55, 16, -9, -3, 17, 17, 29, 35, 14]
3425A4l6QM0K4j9m2nJ4oK6J6j6o5MM8K7j2j9k4j2NK2M1j4l9l4L0L7Ok7mj4KK2
3459bJ4J3k2m1J4L5Pmrj4j0J2K9J2j0l7LRK8OPk5k7PL2K3j2k7j0oK3J0Mj0l0j
3495iJ2L7j0k4j8k6K9K8nNm7k8K9K5J3ok1j3MJ6L2j1l1j6NK7OJ5j6k1k0K4L4P
3529B6j0l0nJ6J8Rnj5j8NK9K1j4k0j6JK2J9Jj8k3QJ4J6lpk9j1L0K3Kj1l6j4J6
3564iK0NMl3j1jK1K2nj6k8LJ2L6Jk9j7QJ2J7Oj5j3j6OL2J2pk9nJ5J0K0j4j0k7
3600b3LL1J8ll2j1NJ9%Rkk1k2K8K9Kk2m0K2kJ1K2Qk7l3jM1K1j6j3j6qK4J5J5j9
3636A2m1kK9L3j1j8j2j1PK4K0J0m6j7J5L2%j2Qj2l1L1K9j1k4k7J8J9%nMj8k2P
3670b2M6Pl3k0J0J4j2J2Mrl9QM3J9j0m2LOLOK8k0k4j4K2M6k1k0nmLJ5J3J0l2l3
$$ y = [14, -22, -14, 26, 50, 31, -11, -16, -2, -8, 18, 34, 18, -47, -43, 5, 32, 20, 1, -23, -35, -30, -8, 33, 19, -20, -54, -24, 13, 19, -8, -12, -26, -24, -2, 12, 25, 3, -38, -24, 11, 18, 14, 5, -9, -19, -7, 22, 34, 24, -13, -10, -1, 27, 33, 40, 15, -12, -5, 27, 50, 38, 11, 1, -5, 18, 28, 32, 22, -8, -9, 3, 40, 30, 6, -12, -38, -9, 19, 14, 19, -28, -56, -27, -2, 11, 5, -16, -29, -25, -9, 23, 12, -19, -35, -30, -3, 3, 18, 2, -19, -39, -15, 19, 26, 16, -14, -19, -3, 15, 24, 19, 4, -14, -9, 20, 41, 27, 7, -9, -8, 14, 33, 34, 16, -7, 1, 15, 31, 28, 21, -8, -19, 11, 34, 36, 25, -11, -25, -9, 11, 16, 20, -13, -24, -25, -4, 18, 13, -3, -31, -28, -16, 20, 21, -8, -25, -17, -5, 12, 18, 3, -10, -26, -20, 12, 24, 17, -12, -17, -2, 8, 28, 14, 4, -23, -20, 11, 29, 26, -6, -17, -12, 7, 7, 16, 14, -7, -29, -1, 28, 30, 8, -32, -10, -12, -1, 21, 29, 2, -31, -32, 9, 30, 14, 1, -15, -23, 1, 16, 31, 12, -29, -31, -2, 31, 20, 2, -10, -21, -14, 10, 30, 40, -6, -23, -8, 24, 24, 12, 20, 8, -23, 8, 37, 26, 2, -25, -7, 12, 12, 7, 11, -7, -29, -22, 24, 31, -2, -22, -12, 2, -10, 2, 6, -3, -42, -34, 9, 28, 18, -24, -21, -15, -12, -6, 22, 2, -22, -36, -14, 32, 11, -9, -14, -18, -15, 0, 13, 23, -9, -42]
3706d2L7L0jk2qJ1j2JM2Ql0l2K6K6Jj5J0ql2J2J4K1k5k8nK7MjMlk7j9L8K9j1m8
3742b8j2L2JkK1Pl8j6K0L5nk7nQN%J0K2m4k5J6M2Rl0j1J9j1j6K3L4k5m1OM6J6
3777C6l2pJ2oj2L7K1j5n0j0M1J1j6Jkj0qK6L7j6n0j0L1K3k2kjj3k0J1L7J3n1q
3811b4J5J3j7J8K5j4n3J2M1K1m6j7J6Oj0J8J4j4m5lN4Pj8k0L1j6j4J1L5qm9mL4
3844aL5j7k7NPl7K9L9J5o2j6L4J7p%LJl5%N1Jm8j5QL3k3NJ4Ll3j1M3J9k2l0J7
3880eJ3rJ0Q%m7j7N1L9l0l6K2Mj0JK3kk8l1L8K9j1l0kK2j6pM1Ok6l3J1M0kmkj0
3917@j0j6N7J1l7l2K1L9oj7%Mk9j1L4K6j7j6j9K8mpJ9Nk6k0J8L3mn2OK1JrJ7K2
3953C0l5l6L7L8rl6LLnpJ2L3l5l4K0M4Kk1k1J8j3pK6K6j0n0J3J9J2j3Kjqj4K2
$$ y = [-42, -5, 25, 24, 2, -6, 5, -7, -6, 36, 44, 14, -18, 8, 34, 35, 20, 30, 22, -10, 2, 16, 37, 12, -16, -21, 6, 10, 9, 13, 10, -17, -36, 2, 31, 20, -28, -40, -8, -7, -9, 12, 19, -19, -35, -15, 20, 15, -12, -17, -9, -4, -4, 6, 28, -16, -41, -25, 17, 26, -4, -15, 4, -7, -23, 0, 34, 9, -32, -26, 20, 36, 4, -3, 9, 3, -9, 28, 49, 34, -16, -26, 15, 26, 10, 11, 9, -1, -9, 17, 54, 38, -12, -22, 9, 32, 10, 8, 7, -6, -26, -15, 22, 35, -16, -24, -9, 4, -13, 5, 30, 16, -37, -25, 16, 37, -9, -26, -10, -4, -14, 4, 18, 4, -41, -44, 10, 17, -1, -21, 10, -6, -20, -9, 26, 18, -31, -35, -1, 34, 17, -10, -5, 2, -35, -6, 33, 48, -14, -30, 4, 21, 14, 14, 17, 18, -17, -17, 34, 35, -13, -28, -20, 13, -10, -5, 9, 12, -21, -32, 11, 30, 8, -22, -5, 8, -1, 9, 17, 17, -30, -47, 4, 43, 13, -23, -1, 3, -7, -6, 17, 15, -13, -44, -6, 23, 12, -18, -20, 2, -14, -21, 20, 26, 0, -33, -22, 18, 16, 12, 10, 0, -10, -26, 31, 42, 5, -27, -6, 33, 27, 10, 10, 14, -15, -26, 8, 34, 17, 1, -18, 10, 6, -1, 18, 23, -3, -23, -5, 28, 24, -28, -22, -1, 0, -9, 8, 30, -5, -41, -4, 34, 25, -11, -8, -5, -10, -17, -5, 28, -7, -41, -21, 23, 25, 4, -17, 1, -12, -19, 7, 33, 23, -27, -14, 5, 17, 4, 6, 5, -3, -17, 5]
3988EL1j2m0mL0Nn%%j6k1J9L3pk9j5K6LoMJ8k1k0QM7rl1qJ2J3j2MK2j0m3PL7J3
4026B8l1pJ1mmNK4ml8pK7K8j3k6J1mj2J7J7ll6j2L4K6j5oOj4k5K1K3K0m5oLK5
4062A4j0j2K3j4k6mM1K0m4k3K5J8k1K3J2k1j5oL0J2j7j8J1J3okKRl0lK0K0%k1
4096@JkrJ3K2j4j6k9L1J8nrpJ1j1nL2kk9pNL0mj2Nqk2MK4K4k1l5jL8olPjj8j2
4136b3K7J7qk5oRRjJ2Jl2J1nM8j9k2QkNLJ5Nk4k3J5K6J2k1j9QNpRJ0j3l1J0L3
4174A7mkj8MrlK2%Kk7J1OjRkk1mNK5Mjk2mOJ0%J8j2j6j2K0J8Jj7n%RkJ2plk2K0
4217EJ7Kj3j8jKJJ6Nj6j5kJ5J5j0jj2%%PK1pl0nJ4QpPj0olK3J4lk3qQJ7OMj9Q
4259Fj1kMJ4j1j0POQolmrJK2%Lqj3J3MLRj2j1nK2%Jj1oj2%K7%qk5MNJ5%qj9Pk
$$ y = [5, 36, 24, -16, -20, 10, 15, 10, 10, 10, -6, -27, -8, 25, 18, -11, -26, 0, 3, -3, 1, 19, -2, -22, -14, 33, 24, -7, -15, -3, 10, -2, 2, 24, 14, -29, -22, 15, 28, -3, -10, 1, -3, -7, -2, 22, 18, -20, -27, 0, 28, 15, -11, 0, -4, -16, 1, 18, 15, -21, -33, 1, 27, 12, 6, 12, -2, -27, -6, 17, 37, -8, -14, -11, 14, 4, -8, 15, 1, -25, -29, 12, 32, -12, -35, -10, 8, -13, 10, 22, 1, -14, -20, 10, 22, 5, -13, -2, 11, 5, 3, 5, 14, -16, -19, 1, 21, 21, 0, 1, -1, -10, 3, 25, 11, -5, -34, -3, 15, 10, 1, -6, 5, -6, -11, 21, 19, -10, -17, -12, 18, 14, 2, 7, -1, -23, -19, 5, 29, 8, -27, -28, 10, 4, 1, 8, 7, -11, -23, 4, 21, 13, -12, -18, -9, 0, -1, 11, 12, -20, -9, -14, 34, 15, -7, 1, -1, 4, 7, 22, 27, 3, -20, -5, 21, 33, 12, -7, 1, 6, -1, 8, 18, 5, -26, -16, 17, 13, 11, -7, -3, -12, -15, 7, 7, 9, -18, -7, -1, -2, 7, 5, -16, -20, -15, 10, 14, 13, -9, -13, -7, 3, 3, 21, 9, -7, -19, 1, 19, 20, 3, -2, -2, 7, 5, 17, 10, 7, -15, 5, 22, 24, 11, -7, -8, -6, -5, 11, 16, 0, -15, -17, -2, 13, 3, 2, -10, -10, -10, -3, 18, 11, -19, -24, -10, -2, -9, -2, -12, -18, -21, 2, 16, 13, -10, -18, -10, 7, 13, 17, -2, 6, -5, -7, -3, 11, 0, -10, -3, 3, 11, 5, 2, -2, -11, -10, 12, 12, 15, 7, -6, 7, 11, 14, 23, 11, 0, -5, 17, 17, 18, 7, 1, -11, -11, 16, 16, 8, -17, -13, -8, 7, 7, -1, -20, -13, -15]
4304a5J4MmrLQMjlnj9J7mK6mLk3j5K5Qjp%j5J2J0nJ0j0j0pJ3J6qj2rPJ2mL%nm
4347dQJ7j0Pl2J0J3Onj4Nkj6K5j3Pj3rJ5j2K5%j9m%RJ1jqmNK%J2ono%K7j0qRj9
4390gPQNMj1n%PJ2k3J3j6OJMRpj6QMjJQmk5MJ3P%j5lRjjK4k0oj0J3J8qj1PnrJ6
4436DJ8l1j3J1J5J4j2jJkmj1K7Qj7k0J9RmlO%k2OJ5kllrJ1okQMk6J4PQoj2mKJ5
4479IkQrk0kJ8Jkl%lRP%Jj8j4J8J4j2nJ2o%j3K3nMj1pPJ3n%njmJ9J4j7k7QJ3J1
4523A8rLpKj9J5J1mj7lJ8j1KPMk3JKJ6j2rQ%lJ3Oj1Nj8J8OJj1qMPLJ1kj8lnJ2
4566@Klj1J9%j1J5J7j8j8nK4J3j7Lj2J5k4K7Qpj2oLJ8jnkmj5lK0J5l6%J0Oj3P
4605aMmj3PPJ8k7PLKj%Roqj5K4J7j9qJJj0RRMj7qJ5Pj0oJ2pmkJ7Nj6j1J4J1Jl
$$ y = [-15, -1, 3, -1, -10, -7, 1, 5, 4, 1, -4, -23, -6, -10, 16, 12, 15, -8, -23, 2, 10, 9, 2, 2, -13, -1, 9, 4, 14, 4, -6, -13, 0, 16, 8, -4, -13, -6, 6, 2, 5, 5, 0, -4, 4, 21, 11, 18, -14, -4, 9, 15, 10, -4, 1, -1, -17, 8, -5, 2, -11, -20, -5, -17, 8, 8, -11, -15, -15, -6, 5, 4, -4, -8, -3, -1, -1, 11, 5, 0, -6, -6, 21, 11, 3, 12, -7, 0, 8, 13, 17, 6, 1, 1, 8, 20, -3, 10, -6, 0, 1, 5, 14, 7, -9, -1, 3, 2, 3, 11, 7, -18, -14, -1, 6, 6, -9, -12, -3, -4, -5, 19, -1, -7, -17, -4, 14, 6, -5, 2, -3, -12, 4, 22, -9, -22, -11, 4, 18, 6, 5, 6, 4, 0, -11, 16, 24, 7, -13, 6, 15, 11, 8, 14, 14, -8, -2, 13, 11, 8, 5, -4, 7, 1, -1, 7, 11, -15, -1, 6, 14, 8, -4, -8, -6, 9, 7, 15, 6, -14, -16, 2, 3, 1, -2, -2, -5, 4, 11, 11, 12, -6, -20, -2, 12, 0, -5, 7, 1, 1, -12, 11, 6, 10, -1, -8, -1, 12, 7, 7, 2, 1, -3, 16, 30, 13, -14, -6, 7, 18, 9, 12, 5, 7, -12, 3, 14, 10, -7, -10, 8, -3, -1, 6, 10, -13, -12, -10, 6, -6, -15, -7, -7, -10, 3, 9, -2, 3, -15, 3, 9, 10, -1, -9, -5, 2, 5, 16, 14, -4, -7, -12, 0, 2, -1, -12, 7, 7, -4, 11, 28, 10, -8, -13, 11, 24, 7, 10, -2, 13, -11, 16, 24, 17, 5, -1, 2, 20, 19, 14, 12, 8, -7, -10, 10, 25, -11, -11, -1, 5, -8, -1, 3, -1, -14, -7, 0, 18, -9, -2, 1, 3, 2, 2, 11, 5, -3, -18, 6, 23, 4, -4, -3, -2, -12, -3, 6, 10, -7, -15, 0, 7, -3, -9, 3, -4, -8, -10, 7, 12, -4, -15, -1, 10, 11, 8]
4649HrNr%K5lj7loJ2MqNjk2J1OQj7JJRj3MJ1Mkj1OJ0rjpMJ7k0K0kj2j2K1J3mm
4693A3orPqJ4Lj7pQK0onkJ2k4ROJ7j9%oJ0j0O%OrpPK1j6npRlK%Krj2K2J3j9mP
4738DlLk0K0Jj2j1J9J4j3kj0K1qJJJ8j3q%JJ0j8rK3qLjQmj2kK3k5QkMjj5RJ3O
4780A3l2J2J1JPj2kPj8J4J0Qk8jLRj3POj0JnJ7Qk2oJ0jLJK2mk4JJ7kj1LKJ4r%
4822GLjj2PjKJ2rlJ2j8%J7oj4JpK1j0%LkkpK2nj4qKQjJ2Lmj3JNmNj8OJ0jrRMr
4869fnMJ3kj0J0j1NLRklpPPJ0j5j0RLj0K9pj3qLLLKnjkj1J2NoJjjKPj5L%%KJ4
4916A5rrKJJkJjLpj7K1Rj3jkJ8rLpKKj8K4Oj6QJJ3j3LJ7j6qNQOj0nMnj2J9Poj1
4962BKnLJ0j4Mlj0J9nPj1pjJ8nj3%J0rJ0JNkroJ3QlJ2j8mJOLlo%JNNkNj2LJ3n
$$ y = [8, -1, 4, -5, -5, 20, 17, 0, -3, -9, 3, 7, -1, 4, 3, -19, -8, -2, 6, -11, -10, -9, 0, -13, -9, 2, 6, 4, -7, -1, 9, 0, -1, -8, -4, 13, -7, 13, 11, -1, -13, 8, 21, 17, 13, 7, -2, 5, -3, 11, 14, -3, -10, -2, 18, 12, 7, 5, 17, -7, 2, 8, 25, 6, 6, 0, 10, 0, 6, 6, 12, 3, -4, 3, 24, 8, 3, -4, 5, 2, 4, 4, 6, -3, -15, 7, 20, 1, -3, 4, 1, 4, -16, 4, 5, -7, -18, 1, 15, 2, 0, -10, 11, 3, 4, 5, 23, 10, 2, 2, 3, 13, -5, -14, 9, 1, 4, 3, 11, 7, -5, -7, 16, -9, -1, -3, 1, 0, -15, -6, 7, 13, -19, -7, 4, 5, 12, 0, -2, 5, -13, 1, 11, 19, -9, -10, -7, 2, -11, -4, 2, -8, -7, -12, 5, 13, -9, -15, -5, -6, -3, -2, 20, 16, -8, -7, 10, 8, -3, 0, 2, 16, 7, 7, 10, 9, -3, 4, 3, 5, 17, 8, 5, 17, -1, -1, 16, 10, -4, -3, -10, 11, 1, 1, 4, 2, 0, -7, 15, 10, -4, -12, -10, -2, -3, 9, 12, 8, -5, -4, 1, -3, 2, -16, -10, 0, -1, -10, -1, 3, -6, -11, -7, 6, 4, -6, 4, -7, -2, 1, 10, 8, 5, -2, 5, 12, 22, 7, -3, 6, 9, -1, 28, 21, 8, 0, 3, 6, 9, 11, 6, 5, 3, -8, 4, 9, 3, 4, 3, 2, 4, 11, -4, -1, -1, -1, 1, 15, 6, -3, -1, 0, 1, -1, 0, -1, 2, -5, -22, -1, 8, -5, -6, -8, 10, 1, 4, -3, -1, 1, -17, 7, 13, -3, 5, 6, 19, 6, 9, 26, 10, 2, 7, 15, 21, 11, 6, 10, 5, -7, 12, 19, 13, 2, 4, -1, 2, 12, -2, 2, -1, -11, 8, 3, 10, -1, -8, -9, 9, 4, -9, -9, 1, -8, 2, 3, 8, 6, -3, -9, 4, 12, 9, 21, 3, -1, 0, 6, 9, 6, 0, 0, 1, 6, 11, 9, 14, 2, 5, 18, 13]
5009A3JK%qORrLj2lOlKjjj1J0qNPpoJ1kjoMloMOmPj7JRJ1poNKkNJ1j7j0J1MO%
5059A1J0l3J5j4J3J2rJNpJ%MlrJOQkj2KKlKMKonj0J2J0Ppj0oqJ2kj4J4j0J3Ll
5103cj0PLkJ1qJ3mk0J3PoJ1qj2ORRj0PJj3J1j7OJ3Jj1oJJ6qNrmjK2j6jRrL%jJ
5148FJkRMj3LknjJ1lj3Jj4J5KqNj3J2OlJ2qMrOQqjJ1k5J7kpJ1Lj0nJ0NKkQj8P
5194GQnJkj9PJJMkmJ3n%jQj0KJj1J6pKjj2J0Nj2OmoLLNlNj2RLjMkk5NJ7qlJ4j2
5243gLJJ3Llj0KLJ0%rj0MQNj9J4j2mLjKlJjNkJ9j0lj0mJ0%nOrJ5oNJ1k5J0MoJ9
5289A7pMqj1LO%Jj5OQPKj9K6j4qMQKnJJnNpJ7j6nJ6oljMmpNkkLn%KQRj1kJj8R
5339fJ1mrpJ5MjoOn%J2Rj3oPKJ0k6J4oJ0k3J7JkLrLMPOj3qRj3J5JKk1K2mp%JQ
$$ y = [13, 14, 16, 16, 8, 14, 23, 14, 17, 5, 2, 8, 5, 7, 6, 5, -6, 4, -4, 1, 8, 1, -5, 6, 4, 3, -3, 1, -2, -8, -4, 2, -2, 5, -12, -11, -2, 9, 2, -4, 1, 3, 1, 6, 17, 0, -10, 1, 5, 11, 11, 21, -12, 3, -11, 2, 14, 5, 6, 11, 4, 5, 5, 9, 6, -3, -2, 4, 12, 10, -2, 0, 2, -1, 1, 5, 7, 1, -4, -14, -2, 8, 15, 8, -2, -8, -16, -4, -6, -20, -6, -16, -3, 0, -3, -13, -6, -3, -5, 6, -2, 11, 7, -13, 0, 7, 1, 12, 4, -8, -2, 7, 16, 6, 13, 14, 1, 12, -5, 1, 14, 15, 4, -2, -1, 15, 7, 12, 3, -1, -2, 20, 4, 3, 12, 3, 6, 6, 5, 6, 7, 5, 14, 18, 5, 8, 6, 1, 0, 11, 8, -5, -4, -18, -3, -1, -9, -4, -17, -5, 1, -2, 10, 2, 6, -3, 3, 11, 3, 2, 13, -12, 5, 3, -4, 7, 10, 0, -5, 5, 10, 12, 10, 18, 0, 7, 15, 10, 11, 9, -10, -3, -2, -1, 3, 1, -3, 10, 5, 5, 4, 12, 2, 4, 5, -6, 10, 3, 5, 4, -8, 2, 7, -5, 1, -3, -9, -6, -3, 2, -1, 4, -8, 1, 4, 3, 7, 5, -20, -15, 2, -6, -9, 5, -7, -4, -3, 10, 13, 10, 0, 2, 5, 15, 15, 6, -4, 0, 8, 13, -6, 8, -4, -8, -5, -6, -4, -7, -6, -7, -2, -4, 15, 5, 2, -8, -12, -2, -2, -7, -1, -10, 5, -1, 4, 15, -10, 0, 4, -2, 17, 10, 14, 6, -5, -2, 4, 4, 5, -10, -4, 4, 11, 13, -6, 20, 6, -2, 2, 10, 12, 7, 8, 9, 4, 9, 2, 19, 3, -2, 14, 8, 5, 4, 8, 4, -3, 2, 0, -2, 1, -4, -4, -2, 6, 15, 4, 2, 3, -15, -6, 5, 1, -8, -15, 0, 4, 3, -3, 3, -2, -2, 10, 19, 6, 0, 7, 9, 19, -7, 7, 1, 11, -12, 5, 6, 4, 7, -2, 1, 5, 12, 18, 5, -3, 6, -7, 8, 9, 11, -10, 12, 8, 1, 1, 2, 10]
5385A0j7OLMJ1k1kQolJ2J1l0NMNj2lKlJ3%J2%j0RmKMj1mK0j8kJ0jLj3nJ9rmJ2
5428GmlNPomnNoRKj1J3j7KOPPqJnMpJ7kk0J2qJ0Lj5kLkJq%J2j2J2%NnlOnKKQl
5478Gj5kJ4J0oroJ6j4J7lNrnLOOk2J8j4Oj1K0%j9KJ6Lk1J9Qjj6oJ3kMj7JOoJ1
5520Gmj1nPNOLpkoMNlqmRJRj6KJ4j4RJ2lJj1%J2JnpJ1mrMJ1klnlJ7j5K2j7mjL
5568FMJJorJ0RolNj4lJ1Mmj3%J3oJ2rnPj4J2LlJj8RQMnKj4J3rJ6jqmJ7j3mJ6m
5614I%j2J2%kO%mJmnKNj1LjJ7j9J2nNj3%J5jj8KMPqONj3qPJ5llNolLLpoj7K0O
5662ARj6kJ2j4J2LNmkoPNj0J3j3ONoLlQj5lK3Kj3pkkKK5j3j6J2j0J0qN%MJj9K1
5706A0qkj2J0jkJ1Pnj1L%J0j2oMLjRnqOnjLKPmkKPj9PlJ1KOMj2Pj2J0pJ3Jmnj4
$$ y = [10, -7, -1, 2, 6, 17, -4, -6, 2, -4, -7, 5, 16, -14, -9, -5, 0, -12, -15, -13, -16, -3, -3, 9, 9, -1, 8, 4, 6, 10, -1, -5, 15, -3, -5, 5, 4, 7, -6, -11, 8, -1, -5, 7, 3, 0, 5, 12, 6, 2, -3, 2, -4, 5, 7, -4, 9, -8, -6, 0, 7, 14, 6, 7, 2, 6, -1, 16, 14, -6, 6, -2, 8, 11, -4, -6, -3, -5, -4, -12, -12, 0, -12, 0, 0, 5, 0, -3, 3, -2, 0, 2, 10, 7, -8, -10, 4, 14, 8, -1, -7, 9, -5, 12, 9, 14, 5, 0, 3, 9, 15, -7, 11, -3, 3, -8, 12, 12, -7, -5, 11, 14, -7, 12, 20, 19, 3, -3, 10, 8, 12, -5, -4, 2, -4, 7, 3, -8, -13, -6, -1, 5, 8, 1, -1, -7, -3, 2, -1, -9, -13, -4, -3, 6, -10, -8, 6, -8, 1, 13, 10, 11, 0, 0, 12, 13, 8, 1, 12, 8, -1, 3, 14, 12, 9, 4, 1, 18, 3, 25, 8, 4, 3, 6, 10, 11, 12, 6, -3, 7, 16, 10, 7, 12, -2, -5, 6, 10, 6, -7, -7, 6, 0, 12, 3, -2, 5, -9, 3, 6, 3, 4, -14, -5, 3, 7, 2, 4, -10, 3, -6, 10, 9, 1, -3, 14, 1, -3, 13, 9, 9, -3, 9, 9, 7, 13, 13, 9, 10, 6, 1, 3, 8, -3, 0, -1, 16, -3, 9, 4, 9, -4, -4, 11, 10, -8, -6, -2, 5, -3, 3, 8, -5, -13, -6, 9, 6, 3, 8, 2, -1, 2, 5, -2, -8, -25, -5, 1, 10, -6, -8, 4, -10, 2, 5, 10, 6, 4, -2, 5, 10, 0, 13, 0, 6, 11, 5, 8, 5, 13, -2, -5, 18, 20, 7, 0, -2, -4, -2, 23, 10, -6, 6, -4, 6, -2, 3, 3, 7, 8, -11, 10, 2, 0, -12, -2, -3, -5, 6, 13, 8, -3, 0, 0, 10, -2, -8, -4, -1, -2, 7, 2, -6, 0, -5, -6, -3, -1, 6, 2, 0, 2, 9, -10, -3, -6, 5, 7, 13, 17, 5, 12, 0, 10, 3, 16, 17, 13, 8, -6]
5754fOPLoj0j3J6MKmk0J2PLpQom%J5MqnoJ2ojJ6j1qNOJ0rlj7K3kkRqplQOknoR
5803FpPPj5NPmOLmoOj4mJ1MrLMj0Olklj4PJ8Mj7KJpNQmojQjQNj5QnJJ0JKrLo%
5855@RmqkJ6j2J4rjNnJnJ7qkj0RJOmlMqJ1k1K0j4nJ8j0LJ1j7NnJ5j0jjnkQqPj
5901aj1PPpOlLkjMJ1PplpnJ6nKppJ6j1PMrO%Pj2LqKNkMj3Rj2qJ3JKj1KRnJ6mP
5951A5k0J4j1qJ2Pj9nMJJ6Jk3%OJ5OqJj3JJ2%%kpJ8j5J0J3onlJkJ2j4QOj0LLK
5994A6j0j6J4J%o%mnJ5lJ2Jk2PnJ5Jj1KpjRQpj2MJ4oLJj5pJ3JOJKj4J5j0%PrP
6039Ej5MPQp%kJ6j2J1pjj1mJ4JJ2j6Pok%%jmlRJ2j5Q%JlkOj0LpkK1j8LMLMj6J6
6086A1J2j0k2J4%LrJ0j4NKRNk5qJ4J3jpJ2j8J1MnJ6lqmjJ0nk%j8MO%OjmOrLJ0
$$ y = [-6, 0, 7, 10, 4, -6, -19, -3, 1, 3, -1, -21, -9, -2, 1, -6, 2, -4, -8, -8, 7, 11, 3, -2, -8, 4, -2, -3, 13, 2, -6, -1, 5, 15, 6, 3, -14, 9, 7, 5, 14, 6, -1, -4, 4, 10, 8, 3, -3, 6, -1, 6, 13, -2, 3, 10, 6, 12, 15, 11, 5, 11, -3, -7, 4, 8, -1, 2, 6, -4, 2, -1, -3, -6, -20, -13, 5, 9, -8, -6, -5, -12, -7, 1, -3, -9, -10, -2, -3, 5, 10, -5, 3, -2, -1, 9, 10, 12, 3, 6, 0, 0, 9, 5, -3, -5, 11, -1, 13, 4, 3, 8, 3, 4, -1, 16, 8, 6, -4, 5, 6, 12, 8, 5, 9, 1, 12, -9, 11, -3, -8, 10, 0, 3, 14, -3, 2, -3, 12, 2, 1, 0, -5, -7, 1, -7, 0, -1, -12, -5, 2, -5, 1, -2, 1, -1, -2, 2, 13, 20, 13, 10, 3, -2, 14, 9, 11, 4, -3, 13, 2, 9, 13, 4, 10, 10, 17, 5, 8, 0, 2, 7, 5, 9, -4, 5, -7, -15, -2, -1, 1, -10, -8, 1, -4, 12, 8, 15, -5, 9, -2, -10, 2, 9, -10, -15, -11, -10, 6, 7, -16, -16, -10, 5, 11, 3, 4, -9, -8, 4, 4, 4, 2, -5, 13, -2, 8, 21, 15, 10, 7, 8, 6, 18, 4, 12, 18, 8, 11, 14, 16, 6, -10, 4, 5, 5, -1, -1, -5, -10, 5, 2, 14, 15, -7, 0, -5, 10, 11, 0, 2, -5, -6, 3, 11, 4, -8, -4, 10, 4, 7, 8, -7, -14, -1, 0, 6, 7, 9, -5, 10, 0, 0, 7, -2, 5, -10, -6, 1, 9, 2, 2, 0, 16, 4, 15, 8, 7, -4, -8, 6, 7, 19, 3, 10, 4, 2, 2, 2, 1, -3, -6, 3, 15, 0, 8, 8, 9, 6, 4, 10, 0, 3, -4, -6, 15, -3, 0, 4, 7, 11, -5, 11, 23, 13, -9, 5, 5, 8, -1, 9, -5, 0, 2, 11, 16, -9, -17, -3, 10, 9, 2, 14, -4, 7, 11, 6, 22, 19, 11, 7, 6, 16, 11, 9, 9, -9, -5, 1, 1, 7, 6, 2, 8, -1, 2, 12]
6130A2rj1kKJ9pj5J1plJ5j0J7j9pJ0RMQj5jKqJ1Oj2pmQJ5j0OorlJ7Mnj3J0NpP
6173HPJj4mKJ9pj1lK3r%jjlnkJ1j1%KmjPrPnj0LNJ0j2KNMmJNjqpJ2PJLj7PmLR
6223A1nomJ1jpR%kpPj1Nkj2J7pMNmJnqJ3J7rj0MmjnJ8j1j7%J1J5oj2kJJRJ2j3
6268@lMoJ8j4RnLJnNMmoJ1j6J0MOplLKLj7JoJ5j2J1jPk2NJ5nlpPjN%%JJj5J6n
6316DklllJ1j1J4%k0KOJ6lppjj%lQLj1nK2JkkQj1MKJ7j3rJ8prJ8j4Mlj0POopk
6363djQjKnjJJ3qJ0k7K2prPNojpJ0J3j1QpNj6kJ8rpj1J4MLkj5PJ0qQMmnOMQo%
6411A0%nJJ0qKroJ6JqLj4%QMnJ1%j2MrlJ6j5%JOQ%pj3J5lmKJ3j0PpJ0jmlj0K%
6458fJ0nOj6J2lMJJ2j1oLRlmnJ1koJ2lL%j3POmrJ3nNj0J1koKj4RjLj9J3nPMmJ0
$$ y = [12, 3, -8, -10, -8, 11, 4, -11, 0, -7, -10, 5, -5, 12, -7, -14, -4, 5, 9, 17, 2, 1, 3, -5, 6, 12, 0, -7, -11, -3, 12, 2, 8, 2, -7, -10, 7, 11, 6, -7, 3, 8, 1, 8, 15, 16, 2, -2, 0, 19, 12, 1, -2, 21, 12, 12, 11, 10, 7, 2, 0, 11, 0, 0, 2, -2, -3, 4, -5, 2, -3, -13, -10, -5, 5, -7, -5, 0, 4, 0, 1, 6, 5, -3, -10, 2, 9, 10, 13, -4, 3, -1, 2, 11, 6, 0, -4, 7, 6, -1, 8, 8, 6, -1, 6, -5, 0, -2, -14, 3, -4, 0, 5, 1, 2, -3, -11, 2, 19, 10, 0, 4, 0, -1, -6, 12, 1, -16, -16, -5, 10, 4, -8, -10, -9, -8, 1, 13, 0, -3, 1, -5, 13, -1, 8, 3, 6, 7, 2, 7, 11, 7, 1, 12, -4, 6, 10, 16, 9, 6, 9, 11, 14, -3, -2, -8, 7, -5, 6, 5, 12, -10, -5, 10, 5, 2, -5, 2, 1, 6, 6, 6, 7, 8, -7, 9, 4, 2, -1, -4, -7, 4, -7, 7, 7, -13, -11, -5, 11, 8, 1, -6, -7, -8, -8, -11, -3, 0, -11, -16, 6, 7, 5, 3, 11, 0, 4, 6, 23, 10, 1, 19, 12, 3, 21, 7, 11, 8, -2, 5, 11, 5, -2, -4, -5, 3, 2, 4, -1, -2, -1, 12, 4, 14, -13, 9, 2, -7, 0, 5, -1, -2, -9, 1, 14, 3, 11, 4, 9, -7, -9, 9, 0, -7, -18, -4, 0, 3, 1, -14, -7, 3, -5, 3, 7, 3, -2, 4, 8, 16, 10, 10, 10, 5, 6, 16, 8, 10, 1, -5, 11, 12, 4, 7, -7, -7, 1, 5, 0, 11, 11, -1, 3, -6, -9, 7, -8, -8, -7, -1, 7, 7, 0, -13, 2, -1, -5, -3, 10, 0, 7, 0, 10, 9, 5, 2, -8, -6, -6, 4, -1, 5, -11, 1, -2, 2, 3, 15, 4, -2, 1, 10, 7, 3, -2, 9, 7, 1, 13, 10, 13, 13, 0, 7, 13, 9, 0, 13, 8, 13, 3, 14, 12, 6, 8, -6, 3, 2, 5, -14, -1, -6, 1, 5, 1, 11]
6505A1j1%RmOj2Rj2PnRklolJ9j4J2j0lPJKjoN%Qj1NpjKJ2qPnj8J0PMpQlpPnmJ4
6554A3j0nPKKj6L%LKKKpkMjJ6k1mJ9j9J6mLLomPJ1nOmlo%QKj1J0j0%K1j6Rj9l
6600eRPnm%pK1%pJrrJ2jkRj3pJMlJ1mj6J1jQJ2j8%jnJ1Pj4j%RpJ5j8J3kkMJJJ2
6648A8j5MoJ6nj2JOPpRpj0qQKJ0ommjOJ0j3Qj2nJ2KNrjjqJ5llOj3NJ4j4KpLkQ
6695AJ2j9LoKKJ8j8J3j2pK3nQj6NkRLnJlknK%J4j2LkmjJ0on%JOopnK0j1lJ5nj6
6742a2J3jlPmJkj0RJ5j0LrKMlKklo%K2kj4oJ3j5J2PMj7NjJ6lj2QmrNQJ7j0j0m
6787ARrPQk3RJ4j1%jj1%RPlj5%J5NklmrM%nLMjjkRKlj4QjRjnOqMoJJ2pj3J2oJ0
6838DJ9rj5%lJ6nJjrJ3klPqj3J3l%kMomLOJ1j9J2k3J9kRj4J3ppJ6j5Llj0J1KO
$$ y = [11, 0, 0, 9, 5, 11, -1, 8, -4, 3, -2, 7, 5, 2, -4, -7, 12, -2, 10, 0, -3, 4, 5, 7, 6, 0, 5, 5, 13, 2, 7, 0, -1, 1, 13, 5, 12, 7, -11, -1, 6, 10, 3, 11, 8, 1, 8, 3, -1, 13, 3, -2, 5, 7, 9, -7, -4, -4, -1, 1, 3, 5, -2, -4, 0, -1, 15, -6, -10, 9, -10, 6, 2, 5, 8, 2, -2, 5, 16, 11, 17, 13, 10, 4, 4, 12, 14, 3, 13, 3, 3, 24, 8, 17, -2, -5, 4, 11, 6, 2, 2, -5, 16, 16, 9, 10, 1, -8, 4, 3, 1, 10, -3, -10, -9, -5, -8, 3, -1, -17, -6, -7, 1, 13, -5, -5, -6, -11, 0, 7, -7, -8, -8, 1, -6, 9, -9, 4, 2, 0, 4, 5, 6, 18, 3, 7, 1, 17, 12, 0, 1, 7, 14, 7, 16, 9, -1, -9, -1, 1, 11, 5, 1, -3, -4, 2, 12, -1, 7, -5, -10, 2, 4, 9, 0, -1, -2, -10, 5, 2, -1, 5, -8, -3, 11, -3, -1, -8, -5, -7, 1, 13, -6, -3, -9, -7, -5, 13, -5, 8, -4, -11, 12, 7, 15, -1, 4, 2, 11, 14, 9, 10, 7, 5, 0, 2, 2, 16, 4, 7, 5, 1, 0, 10, 4, -1, -1, 0, 6, 0, -7, -12, 8, -3, -6, 9, 4, -12, 1, 0, -3, 4, 0, 1, -1, -11, -2, 13, 3, 6, -3, -1, 3, 0, 2, 0, -3, -9, -9, 13, 11, -3, -9, 4, -11, 1, 8, 12, -5, 0, -1, 15, 12, 0, 8, 4, -5, 0, 8, 25, 15, 5, 1, 10, 1, 8, 16, -7, 2, 16, 5, 5, 4, -7, -7, 2, 9, 6, -9, -9, 6, 11, 9, 6, 2, -7, -3, -3, -8, -5, -1, -2, -3, -5, 4, 6, 3, -11, -3, -4, 5, 4, -1, 5, -3, 1, -5, -4, 8, 1, -12, 0, -6, 4, 23, 14, -1, -1, -4, 12, 7, 8, 7, -2, 11, 9, 6, 13, 5, -8, 5, 2, 2, 0, 4, -2, -6, -3, 3, 14, -5, 7, -16, 3, 1, 10, -4, 9, 2, -5, 11, -4, -1, -4, -14, -3, -1, 5]
6882ELmqmnJ7PorOJkJ0j4Rpj2J5QpoKPMMoJ5j2jlJ4pqlQqmJ9lj3kj0QJ4kj0J7
6929A7j1oQrMj4J1Jk%KOLj1ROqqJ7j2JKMj4JmK2mkqRqLQj1jN%nJ3j1J1JrjOMj4
6977An%kJ3JjnqJRnLLj6j0J1J1KnjqJ8j2KLn%J3JnLKmmnNOpQnQqKoNl%J8pjk0
7028iJ7pOQj2jj8J5J9n%k0LJ7rjPmqJNMJqL%j0kK2k0jqQQlmjjnOJ3%qjJK6k2N
7076Gj1J0Kj2J2Pj5OrMKjJ0prNkNK1k4rPQqQj3J3pnL0j5lk1RMKoJ4qj1j1J4Qj1
7120a0nRJ1mQnnlOMj0QpmNNJJ3Lk0j1K2l%kKNj2J4jQj9pNM%k%j0NoK0orkJNNO
7169A2lkj1NOkmomJPJ3kj1lMJ7j7L%ojNpK0j7J1k1J3mKL%JqK0mMpkPj0QRj1mm
7216@JjPjmPnNmOqMj8J5J0pj2mK0ojQpj7J3M%%pJ2mJ3rMlrLOj7K6j1oj0J0J0j1
$$ y = [5, 8, 4, -4, -8, -13, 4, 11, 5, -4, 2, 3, 1, 11, -3, 6, -1, -13, 2, 10, 3, -3, -1, 6, 10, 14, 8, 23, 11, 10, 7, 21, 14, 6, 3, 11, 3, -1, 18, 15, 2, 0, -10, -2, 12, 10, 0, 17, 6, 0, 8, -1, 3, -11, 0, 1, -1, -1, 1, 7, 10, -1, 8, 14, 6, -2, 15, 3, 4, 6, 10, -4, -3, -7, 15, 11, 9, 1, 10, 2, 5, 13, 2, 1, 6, 6, 1, 14, 3, 14, 15, 6, 5, 11, 15, 1, -4, -4, -6, 7, 8, 7, 2, -6, -5, 4, -1, 2, 5, -11, -21, -10, 1, 3, -2, -3, -11, 7, -5, -3, 0, -5, -5, 8, 9, 4, 7, 9, 5, 1, -4, 1, 7, 0, 8, 3, 11, 3, 5, -1, 4, 1, 1, 19, 12, 11, -9, 8, 1, 7, 15, 3, 2, -16, -1, 18, 13, 13, -7, -4, 13, 4, 3, 10, 6, -2, -1, 4, 8, 9, 1, 4, 4, -6, -8, 14, -6, -7, -15, -7, 1, -2, -6, -7, -8, -13, -7, 6, 6, -2, -3, -2, 24, 2, 7, -4, 6, 8, -4, 8, 15, 0, 6, -3, 1, 3, 2, 12, 5, -4, 1, -1, 4, 25, 1, -8, -1, 7, -1, 7, -6, 7, 0, -5, 25, 10, 7, -14, -5, -1, 1, -5, 9, 1, -10, -21, -7, 1, -10, -15, -6, 5, 1, 9, 4, -1, -4, 2, 6, -4, 4, -3, -7, -2, 3, 4, 17, 20, 0, -11, 11, 8, 8, 6, 8, 13, 1, 15, 14, 22, 3, -4, 1, 5, 5, 3, 3, -7, -2, -8, 12, 6, -3, -5, -4, 1, 6, 12, 9, 7, -4, 1, 7, 5, 1, -5, -9, -8, -1, 12, 10, -1, -4, 0, 17, 0, 3, 3, -3, -4, 1, -6, 14, -3, 8, -13, 0, -4, -2, 1, 1, 2, -6, 14, 10, 14, 7, 5, 12, 2, 10, 19, 8, 4, 0, 1, 0, 7, 6, 2, 9, 4, 9, 5, 11, 3, 7, -11, 4, 14, 7, -5, -9, 11, 5, 4, 12, 5, -12, 1, 5, 5, 5, -2, 10, 6, 19, 10, 14, 11, 2, 5, 11, -6, 20, 9, 3, -7, 3, 13, 2]
7262BJ0j2lLJ3lkNqLkkM%j8J2RNqkkNnKKNj3%LOKj4J1j0kpJ7lKpqRNNKorMM%O
7313A0lLj2%NJLqpK4oJ0rj1jJ2JPj3lKJKPj0lLNNj1J2j6J0K%J0rnJk0K0jLj0r
7358hJ2mJ7mk1Rj0J1J0oJp%LKnJ5j7nmJ8nMkr%J4Klj8J9q%J4j3Mj4jK3Kj3J1N
7401A9j7JK1k1J1j2J2k3K7j5MKj2%OJOoNj2%J5pjPk3J1MmLrQmKpK4j2KokOmJ0
7444A0qkPNPj6Lj6J3Ojnj1RpJ4J1j3j1kPJN%ojmNK0k2J2qkPnJ5j0Pj3rJ3NkqL
7489CpoJ1Opj1OQLrL%MNJ0Nj2jj0J0Oj0MoqK3j3PRj3j0PJJRop%kQKj6oJ4nmJ5
7536A1pOqj0NO%jKqJ2J%j1j5K2oQj2Oj9J6NjNqkKOPj1RqpOjJ2j3J5j0%J5n%j3
7581AQOoPlopnOJ2j2KmPk1J6kj0QkMLMj2QkNoJ3nJj0NJ2qk0J5oJ1qPQqmmMmQO
$$ y = [2, 12, 0, -3, 0, 13, 10, 8, 13, 5, 8, 6, 4, 8, 8, -10, 2, 11, 16, 8, 6, 4, 9, 4, 6, 8, 13, 0, 0, 3, 9, 11, -3, 8, -2, -4, -11, 6, 3, 5, -2, -10, -1, 4, 9, 11, 5, -4, 0, 4, 4, 10, 7, 10, -2, -2, 3, 4, 7, -1, -8, 16, 10, 20, 11, 0, -1, 11, 12, 19, 6, 3, 5, 6, 8, 15, 5, 2, 5, 10, 15, 4, 16, 0, 10, 12, 12, 22, 13, 8, 9, -11, 9, 8, 11, 1, -8, 4, 0, 17, 13, -8, 1, -9, 2, 12, 6, 7, 0, 0, 3, 5, 0, 15, -2, -7, -11, 7, 2, 6, 4, -5, -5, 9, 11, 8, -10, 9, 1, 1, 15, 2, 6, -8, -9, 14, 16, 3, 14, 19, 2, 3, 24, 3, 14, 2, 14, -9, 18, 3, 7, 9, -3, -3, 3, 4, 10, 4, 9, -3, -3, 12, 5, 4, 11, -12, -1, 3, -1, 2, -7, 1, -3, -1, -8, 16, 4, 6, 0, -2, 4, 0, 10, 2, 0, 7, 12, 19, 3, 6, -10, 3, 9, 8, 3, -8, 1, -6, 8, 19, 6, -5, -7, 0, 1, 6, 6, 0, -1, -5, 0, 20, -2, 10, 2, 0, 7, 2, 17, 7, 14, 1, -8, 5, 10, 8, 0, 3, -4, -10, 1, 7, 0, -11, -5, 3, 6, -3, 0, 0, 4, 9, 19, 24, 12, 11, 1, 11, 17, 7, 11, 5, -3, 20, 7, 14, 23, 10, 0, 7, 8, 9, 18, 12, 5, 5, 3, 11, 13, -3, -9, 5, 0, -4, 11, 4, 10, 2, -8, -3, 3, 3, 2, 4, -4, 8, 9, 9, -2, -17, 5, -1, 7, -5, 1, -18, -2, 3, 2, 7, -1, -3, -1, 5, 12, 1, 10, 2, -5, 1, 0, 12, -1, 14, 4, 4, 19, 14, 14, 1, 9, 15, 9, 16, 13, 7, 0, -5, 1, 13, 1, 3, -1, 6, -15, 1, -1, -11, -3, -5, -1, 2, 6, -6, 2, 0, 5, -1, 12, 7, 8, -2, 3, 15, 7, -13, 2, -4, 7, -1, 6, 14, 6, 2, -2, 2, -2, 6, 12]
7630A2j9OkOKojjOMjNpqP%J6JqpJ1k4MJ1qLm%QJJqKKmNQj6KMQojoQq%OMMj8JJ4
7683INj2jJ4j2j5J2J8rj1JLnqJ2QKj7LK8j1mj4RQoJ2nonj1K3j0LrPlJ0j1PmqJ
7726bpPpKjlLOPOk7J6%J3j3MKj1PkJ1J0l0pJ5JJ8j2l%noJ8J0j7pMNjKPj9N%Ql
7772Dkjj0J8rJ0j0JlJP%qKqJ0j1ONj1%mOJ4%Kj1jnMJ2Nj5kJJ9Nj7Rj1j8J2PQ%
7817A1qpLPj0J7pmoJ7Mkj7NnJ3j5J7nj2lJ8mPrj0PKOj0Kj0OpOJ4j7JmMKLNpLp
7863fPpJ8j4J0Lj4JKNlj0J6nj%LjnPPmrjLJmOn%j3J3J2J1k1oJ3nOkMoj0nJ7Lq
7910Cj0KNkPjJ0k0nJ5j%KjjpOLlj1NoJ6oKkJ5j6J0KlLj4K0Nj0M%qRj5J1Oj6%q
7956eJ3j1PJ1j4nJ5Oj1j5J3MoLMOj0Oj0j0J5j0MjJ1NPj0Jj5LKOOmqrlJ5JKpj3
$$ y = [12, -7, -1, -3, 3, 5, -1, -2, -3, 3, 7, 6, 11, 4, -4, 3, 3, 19, 20, 12, 5, 16, -8, -4, 7, -1, 2, -2, -2, 6, 7, 8, 0, 2, 4, 0, 5, 13, -3, -1, 3, 11, 5, 4, -2, 6, -2, -2, 4, 8, 12, -6, -5, 9, 14, 2, 1, 15, 3, -12, 0, 18, 9, -2, -1, 2, -3, -11, 1, 9, 11, -6, -3, 25, 14, 10, -4, 5, 13, 7, 19, 14, 8, 3, -8, 15, 5, 8, -1, 6, 3, 13, 2, 9, 5, -3, -2, -9, -2, -9, -7, -8, -11, -8, -2, 5, 11, -16, 0, 0, 13, 0, 4, 6, -5, 2, 0, 11, 21, -9, -16, -1, 0, 18, 6, 3, 3, -2, -8, 10, 20, 3, -4, 0, 5, 4, 6, 13, -6, -1, -1, 7, 4, 2, 1, -9, 9, 0, 10, 0, 1, -2, -1, 6, 6, -2, 0, -8, 2, -9, -3, 2, -9, -9, -13, -7, 7, 7, 9, -2, -3, -8, -4, 8, 13, -2, -4, -3, 16, 21, 4, 13, 2, -16, -4, 3, 11, 11, 3, -4, -1, 6, -4, 13, 6, 2, -4, 13, 17, 15, -2, 3, -2, 11, -4, 13, 8, -4, -7, 11, 7, 14, 5, -5, 2, 4, 10, 0, 2, -8, -2, -9, -3, 11, -6, -5, -9, -5, -3, 0, 5, -2, 1, -6, 1, -6, 12, -2, 8, 11, -3, -2, 0, 5, 2, -8, 8, 3, 2, 2, 5, 4, -1, 6, 13, 9, 0, -1, 2, 3, -1, 5, 0, 0, -13, 0, 12, 23, 2, -4, 9, 4, 10, 8, 12, 6, -4, -9, 8, 11, 3, -7, -5, 0, -2, 5, 4, 14, -6, -11, 4, 3, 3, 5, 4, 3, -4, 2, 5, 2, -9, -4, -10, 6, 0, 2, 0, 15, -1, 9, 11, 8, 11, -3, 17, 22, 12, 16, 16, 8, 17, 2, 13, 19, 3, 3, -5, 8, -3, 4, 15, 1, -4, 11, 17, 6, -9, 4, 8, 2, 5, 9, 15, 5, 11, 1, -9, 6, -4, 0, -1, 10, 15, 22, 12, 13, -2, 1, 3, 9, 15, 11, 3, -6, -9, 6, 7, 9, 2, -11]
7999a1K0NMqNnpOqJ5Jj0kJKLmj2NpMJ7j0Kj7J3JMj5J3Kj6K4lj0%j%qJ0J3k5J3
8042Dj4J8OKj5QrJ3lmkpJ3p%kK1j9KPQ%kOj6Mj0PJmLJ%kQJpj2J3J4j3lJkmLnL
8090EMj8J0pNNlLj2J1nLMOLmLOq%pJPqJ2j2rJ0KLPnk1RJ1RqOj9Qj0J6j0J1lpj
8137CM%MqpJ5NNj6nJ0j0Nj4J3Kj9J7lJ3j2%lLkQJ%mjlOQlj2J9j2kJ0Qqj5JRJR
8183B0j1JrNJ2j8J9j3
$$ y = [-11, 9, 14, 18, 10, 15, 10, 3, 9, 1, 16, 17, 7, 5, 6, 8, 11, 7, -5, 0, -7, -3, 14, 4, 6, -11, 2, 3, 7, -8, 5, 7, -9, 15, 12, 2, 2, 1, 1, -7, 3, 16, -9, 4, -10, 8, 14, 16, 1, 9, 0, 13, 10, 6, 4, -3, 10, 3, 3, 1, 22, 3, 5, 12, 20, 20, 18, 24, 8, 12, 2, 9, 10, 6, 9, 10, 10, 8, 16, 17, 10, -2, 11, 25, 12, 9, 10, 8, 4, 7, 2, 5, 9, -9, 1, -6, -1, 4, 1, 4, -8, 3, -2, 1, 5, 11, 14, 10, 13, 19, 11, 11, 4, 5, 12, 4, 16, 4, -5, 5, 7, 10, 17, 12, -9, 0, 11, 20, 12, 18, -1, 7, -3, 13, 3, 14, 11, 4, 3, 7, 7, 11, 3, -4, 11, 16, 21, 5, 0, 10, 0, 5, -9, 4, 6, -13, 4, 1, 14, 2, 2, -1, 2, 0, 8, 9, 9, 5, 4, 1, 7, 15, 12, 0, 19, 7, 5, 15, 23, 15, 0, 1, 10, 11, 20, 9, 10, 1, 6, 18, 0, 19, 6]
8191F
$$ Imaginary data points
##PAGE= N=2
##DATA TABLE= (X++(I..I)), XYDATA
0@%%%%%%%%%%%%%%%%%%%%%%%%%%kNrJ3j5J6j6J6j6J7j9K2k6K9l2L5l8M2m7N2n9
47c2O4p1Q1r0J01j14J32j56J87k30K98m16O84k491J0L164j844j422P35J209j439
68a640n46J903J527j796j556J510K311m97j558K8Q82k98j37J428J220j115j724
85e8J62J435M21l75k4O5n16q8Q69M32j019r96K97O86R9J41L10p79j634k50J568
106G46Q82j081j006M27K56q60k31J056Q8j746p96J714J479j183j735K84Q72o38
124a472n15J471J186j531k020Q38K152j42j671L3J370r6r66O89J439p21j989J92
142a753K172Q44j099n37N89r2p39N08J420J3j366l45J135O36m76l63N1k79k14
161A05Q04R60l81j191l16M76J49L6N77J41j095p91Q83J095o11j209J37P24k55
$$ y = [0, 0, 0, 0, 0, 0, 0, 0, 0, 0, 0, 0, 0, 0, 0, 0, 0, 0, 0, 0, 0, 0, 0, 0, 0, 0, 0, -2, 3, -6, 7, -8, 8, -8, 8, -8, 9, -10, 12, -14, 15, -17, 18, -20, 22, -25, 27, -32, 32, -39, 42, -48, 53, -61, 71, -85, 102, -128, 170, -246, 438, -2053, -2043, 1121, -723, -2145, -1410, -201, -1640, -2186, -283, 1244, -552, -2108, -598, 1713, 1216, -342, -314, 568, 270, 133, 1561, 2781, 1666, -58, 104, 1539, 1960, 1585, 1561, 1626, 1110, 1022, 1891, 2323, 1304, 308, 605, 1291, 1390, 1531, 1841, 1062, -572, -822, 746, 1628, 547, -459, -32, 224, -636, -867, 189, 277, -1469, -2265, -551, 928, -255, -1990, -1706, -834, -1472, -1987, -516, 670, -861, -2881, -2043, 109, -33, -1704, -1671, -301, -397, -1363, -674, 765, 44, -1945, -1753, 419, 1263, 164, -373, 216, 124, -615, -107, 1313, 1326, -40, -385, 750, 1386, 910, 547, 598, 319, 105, 909, 1869, 1488, 297, -19, 457, 606, 642, 1219, 1360, 265, -526, 357, 1452, 841, -368, -231, 493, 238]
180B38l91P87N14j390j478Q46J790j38j375j37P51l66q90O30J268o03j714Q8J762
199A92N24j312p46O32K35o08K88J264M7j542p59J132J070m36o53K40K77l83J1
218e27Q34L17r20p61N87R70J95l14j90k89l19L34Q50K68o32m52K20K64L6K78J96
239I45n63p45M41J161J41r52m70L65Q3l08M30Q23m74j402j30J327N28j011o36
258d47N44K43o59KJ010M4j474p46J159J107n66r39J48L34m76k34Q51N28q97r95
278a463M70J064M7o59k04J61j22o6O21M95m33q09m6O27M60K6j59k64k73J98O17
299B88K88l56l92J7J84K06L77K60m29p50N2Q86M59m34m40Q6N2j76K19O36o1r90
321a8m57P90Q09l69p13j8K47k65j29O13M30p69r93K67J019J73p15l53K21k6k45
$$ y = [238, -153, 634, 1148, -242, -1720, -874, 916, 778, -597, -734, 17, -349, -1239, -609, 659, 56, -1658, -1570, 192, 716, -596, -1342, -710, -475, -1083, -795, 469, 516, -1026, -1785, -653, 417, -19, -672, -432, -155, -538, -527, 307, 624, -296, -1057, -470, 500, 695, 381, 191, -98, -417, -83, 767, 1035, 403, -49, 171, 435, 471, 749, 945, 382, -363, 78, 1239, 1380, 428, -42, 323, 406, 98, 528, 1351, 877, -525, -655, 672, 1200, 189, -447, 97, 340, -319, -317, 693, 737, -737, -1483, -324, 783, 217, -722, -574, -240, -716, -950, -99, 429, -468, -1463, -993, 71, 118, -541, -745, -584, -706, -772, -151, 344, -89, -898, -944, -317, 143, 169, 10, -254, -527, -329, 288, 576, 220, -172, -155, 29, 235, 612, 872, 443, -307, -255, 631, 1090, 656, 216, 302, 354, 178, 397, 1033, 972, -18, -475, 315, 1124, 755, 42, 24, 271, 6, -123, 490, 920, 151, -842, -575, 444, 617, -98, -451, -230, -256, -501]
342e01L14N54k77r26k38P71N84k79m64j08J8m7K20M68K7n68m37K55N72K59j63
363C4l81k63R2M32L58o1l10k16k4J70L95L46k00o52j96N72N59j23l73q8K6j25
385b8J81N53J46o81o14L68P54Q9m57k15P8j04j00L91M35l09p94j83O33N15k15
406D43m59j50J7jJ42L43L5n19n10J80O37K42l69m44q5J55J51J56J46j49m79k57
428g75L98N88N2n25m00J21L54J90M2m0k38k95J1N04M32j69n53k54L36M31J09j27
450A92j51j71j25J95M94K12l89n45K2N15L54j17k86j40o7K0K61L51l6n06l95K06
472a06N56K01l00m07r5J22J62J66J13k01m75k20L83N32j1n62l34J61K68L7K3R6
494A09k58m60l3O49M46m16o50k3M30J78q4R6K7l93l23M03O71j4o17l13L06L02
$$ y = [-501, -187, 367, 90, -836, -1074, -303, 281, 2, -462, -570, -552, -599, -379, 89, 116, -452, -889, -634, -62, 197, 34, -347, -610, -518, -86, 272, 211, -99, -315, -339, -169, 226, 572, 372, -280, -476, 96, 655, 532, 159, 71, 97, -28, 153, 706, 852, 171, -443, -75, 679, 768, 311, 96, 174, 70, -30, 361, 796, 487, -307, -490, 143, 658, 443, -16, -166, -149, -150, -8, 335, 370, -149, -659, -479, 158, 400, 31, -413, -498, -343, -192, -36, 110, -39, -518, -775, -377, 211, 263, -262, -662, -541, -187, 3, 45, 5, -233, -528, -517, -13, 419, 250, -303, -557, -221, 210, 319, 192, 41, -130, -255, -60, 434, 646, 257, -288, -266, 249, 603, 486, 200, 60, -7, 13, 274, 625, 589, 83, -312, -106, 450, 651, 351, -56, -151, -29, 133, 299, 412, 211, -264, -484, -101, 431, 420, -142, -476, -315, -47, -10, 13, 109, -149, -609, -642, 7, 453, 37, -613, -636, -206, -28, -112, -16, 11, -382, -705, -302, 369, 355, -262, -575, -269, 33]
516C3N7N8M7k56l63J57N90K66l32m40o5K38K72J86l5l20k65Q5L42K20m4k06l09
539h4j59K96M94O2m97l98J43K99P8OO6k31m77j9O10M10m47o19O8M04M7j29J63
562H6N1m92l83M84P42j03p58k59M22K31j25O5K38k69n29J21P56K72n72m74J90
583c06L39K3O2K04j51n29j05N70M60k32m21r4J19R8J85K01k00m67r3M51L05r2
605C27k06j46k16n9M25M80k53o39j44M31J98j68L2J24l47m06L81P46r1q36k54
626f21N11K97k49M7L36k53o91O4Q92L16o98n09L88L85j94q6L34k3o51j77P82N71
648G71m53o43O3L03l1QL40O9n50l53M52N26j49m62r1J27L9J24L29m0n87l34L57
671a85M64j9j77k4j67k90J46N64R5o12l72M15L99j41j61J46j33n29K5Q44M11o69
$$ y = [33, 90, 148, 195, -61, -424, -267, 323, 589, 257, -183, -248, -10, 262, 448, 413, 93, -172, -87, 255, 475, 431, 225, -84, -243, 53, 547, 609, 112, -286, -143, 156, 234, 240, 306, 75, -402, -421, 189, 599, 152, -467, -399, 5, 52, -77, 86, 137, -355, -738, -254, 488, 385, -373, -632, -210, 21, -104, -39, 199, -70, -599, -478, 278, 550, -22, -496, -306, 33, 56, 118, 322, 171, -358, -463, 107, 567, 335, -86, -180, -61, 37, 222, 423, 223, -244, -337, 114, 419, 327, 121, -25, -241, -300, 125, 605, 352, -287, -431, 0, 198, 30, 62, 186, -161, -567, -186, 560, 469, -367, -621, -110, 187, -62, -15, 321, 68, -623, -559, 333, 649, -49, -558, -170, 215, 21, -65, 269, 246, -405, -582, 200, 771, 318, -325, -262, 41, 10, 18, 358, 427, -123, -476, -24, 502, 353, -109, -200, -73, -34, 90, 419, 379, -208, -542, -185, 279, 260, 83, 59, -108, -398, -252, 312, 407, -205, -577, -162, 237, 96, -65, 81, -52, -581, -556, 288, 699, 30]
693C0o33K82M61j73k00M15J81o31l63P03O70m94q05J41O16jk41K92K50n85o21
714g06M77Q31o9o86q1L89qk51K47K98m02n64K99P53O3n42k48R7p8k1M52L40m24
737A66n86J32M99Mk82M3R9k80j07N38L93n49p02J61O01O7k11J97R2n61m14N61
759a39P06l07p36Q9N91jl88J40L08m27n75M40R52l5q79k63M60J16k89J93M97k07
781B46p15L9P85J79o51l55L92K49j63J03L82k25p37j18P16M35l08k74Q8k7k14
802a73J75M35j28n98n9N92K63l19j93P6k08l00L92P05r5p61k71M65J91l02N0L38
824B75k00n46J95P65j7q63l35N95L38k80qM07j84q10q3Q59M32o07m53L75L01l12
846a56j28M19K6o28j79P65N33m39n82R0K41j48O5M82J41n76l87M30M68j96l45
$$ y = [30, -603, -321, 140, -33, -233, 182, 363, -268, -631, 72, 742, 248, -557, -416, 200, 199, -42, 250, 500, -85, -706, -229, 602, 533, -153, -234, 155, 147, -104, 143, 441, 39, -525, -226, 527, 590, 48, -200, -103, -181, -202, 250, 590, 166, -420, -288, 211, 215, -67, -24, 75, -205, -312, 226, 619, 70, -632, -471, 130, 197, -14, 183, 275, -286, -700, -139, 567, 260, -476, -387, 204, 203, -185, -45, 263, -164, -739, -299, 653, 618, -261, -524, -64, 52, -237, -44, 453, 246, -469, -430, 355, 534, -117, -472, -80, 169, 6, 109, 491, 266, -471, -589, 127, 562, 254, -20, 68, 41, -173, 2, 437, 309, -289, -348, 244, 507, 188, -5, 71, -137, -437, -45, 660, 565, -196, -467, -2, 189, -113, -63, 275, 75, -471, -276, 489, 472, -391, -726, -131, 207, -73, -81, 326, 142, -668, -751, 108, 540, -67, -520, -145, 156, -156, -284, 135, 161, -467, -646, 119, 652, 213, -369, -279, -38, -186, -121, 361, 502, -74, -461, -31, 437, 241, -104]
867a04Q2J25j04Q7M17K5o17l82M11M84o4j59P5r4m19j2N79K38n34l85L37L72j81
890A77k17J69m5m98o0P06M49n68o50J92L85j56j73L74J98n49m03N31N84l69o66
911e89J12M60qj80K95K15n24n53L97P43m1n13n9K62n2j94K73L01l29m61K49N92
933C96N4l86j48Q0j42J0M43L24l84n04R5M18L3j90O8O6k79j33M28L70l91n61Q4
956b49M33P2j44J21P3m45l68M21N84j85n95k3L86K2k34J09K18l10m61K69O65L9
978C98n97k49K59R9j39J61L30k10n34K3N51K10l73k85J74J33q9J29K83j53n03
999c82o6M43L21j46j91Mq1j12K23L58j06m55q0L52K30j27p0K1j97j84K66M73m1
1022D53n07j89K75J67r2M5J62k15l90J34N54Q2m98k85K57K13j09J6K12j49m82
$$ y = [-104, -22, 103, -1, 86, 503, 528, -89, -471, -60, 424, 360, 201, 276, 182, -237, -249, 330, 568, 34, -351, -14, 358, 177, -40, 129, 84, -414, -474, 232, 681, 113, -537, -345, 40, -116, -289, 85, 283, -266, -669, -138, 446, 77, -589, -477, -17, -25, -205, 90, 305, -219, -772, -375, 368, 327, -186, -245, 17, -35, -229, 44, 345, 16, -445, -196, 396, 450, 64, -84, -4, -146, -136, 307, 631, 247, -257, -162, 256, 289, 99, 167, 233, -46, -179, 249, 619, 228, -333, -249, 184, 256, 112, 233, 306, -139, -507, -86, 498, 313, -282, -305, 81, 103, -131, -22, 196, -114, -575, -306, 359, 398, -199, -448, -189, -90, -229, -68, 262, 52, -482, -459, 92, 302, -71, -356, -182, -49, -138, -9, 274, 121, -382, -448, -5, 316, 170, -21, -17, -98, -210, 13, 371, 265, -190, -270, 82, 312, 185, 115, 136, -61, -245, 21, 494, 453, -54, -243, 32, 199, 107, 152, 314, 99, -291, -157, 397, 479, -19, -304, -47, 166, 57, 73, 285, 136, -346]
1043c46m8N24L03l55l39Q7J67p8J6K33m1m16j77L79L80j64l45n7P9j0R8K36J0
1066A36l38k28K16L08J8j41r2o8m3J43L05J4l22k40J80K48O8k4k6j38j91R7L83
1089B65J25k85k77R9K11RL2R4j20l23k3M09K77k38l68OJ88K5%J45j2l20k14K78
1113a7L78r0l53q6Q7O9J7J44L5k73k80J33L65Q2k31k07kN1P2J50P1k02k46J9K49
1138f5J63l8j45j37o0J07K58J06j93k33mJ64J45O7k9j54j75M5L01J68j47k36n4
1161a46J23J04Q7Q8q8k58j04K57K81l6k66j49P3J11Q2P9k0j98j94Q2K88J25j80
1184A41k28o2J02J15Q8Mj40k08k8J94K21k4k43j68L9J54J28Mr8j59j01Q9K16J16
1208A52j14k33j14J27K08Q1p8j54j09K6J55J79J4k00j87L0K04J63k1j57j23jR0
$$ y = [-346, -394, 130, 433, 78, -261, -174, -7, -85, -69, 164, 123, -293, -470, -91, 289, 125, -220, -277, -198, -208, -110, 126, 136, -202, -430, -214, 94, 112, -29, -121, -189, -232, -89, 216, 230, -92, -332, -152, 96, 164, 140, 114, -24, -215, -118, 265, 390, 105, -172, -73, 138, 147, 179, 273, 153, -170, -193, 216, 493, 255, -113, -107, 81, 106, 106, 251, 239, -81, -295, -17, 361, 271, -82, -168, -81, -12, 5, 149, 184, -89, -369, -236, 129, 211, -20, -227, -229, -178, -106, 44, 115, -87, -333, -314, -65, 98, 60, -85, -222, -282, -175, 83, 189, -4, -237, -241, -77, 68, 135, 106, -48, -223, -178, 123, 291, 144, -92, -146, -23, 81, 168, 256, 168, -90, -194, 63, 344, 308, 42, -107, -34, 77, 159, 238, 218, 20, -174, -92, 196, 321, 141, -87, -149, -47, 68, 156, 160, 20, -188, -216, -22, 199, 175, -68, -236, -197, -43, 85, 89, -9, -168, -269, -180, 36, 152, 38, -195, -309, -182, 26, 107, 29, -125, -234, -208, -53, 126, 140, -60, -247, -217, -13, 150, 129, -28, -151, -152, -62]
1231f2J66J12r9k11j10J38K37R0j23k03p9R5J70J01k3j55j58J4J62J90kj83j90
1254a23J3J64J50pj14j26r2O2J83J52j18k86r3J84J99j1j11p5q6m5R8K47L1k66
1278g0k35R0K45P4p7o9p5j14J8K80J41j93k74jK12J19k0l1q5j34j6K27J99p5k55
1303a19p8R7J24R5K5r3j83o0K18K13l9j75j10J2L6J44J43n7k58j51K00K07J8j46
1327F3n7n3p0Q5K53M7k89k45J27K83L3j49m1j7j32j8K52J91j83l35JK63J09j00
1351A8l6%j36r3K24K70j01l33r8K02J60k6qOj43j62J62K83L1k77j46J19J10L8
1375F4P0J6k00k03J20L32N5k24j49N4oL7J62J16k09k94P8L29N4j82r3M7n7o5K11
1400F3K44j87l93rL37J27j61o1P8q2j89J67L29o3l87j09K90K00j16p3O5j01k24
$$ y = [-62, 104, 216, 117, -94, -204, -66, 171, 261, 138, -65, -144, -49, 121, 222, 199, 44, -114, -100, 62, 252, 250, 67, -123, -110, 54, 204, 197, 83, -43, -135, -73, 110, 262, 144, -142, -235, -51, 148, 137, 26, -49, -135, -180, -82, 165, 196, -70, -305, -215, 30, 104, 27, -42, -117, -231, -213, 67, 208, 15, -259, -260, -48, 71, 51, 20, -65, -199, -215, 12, 211, 136, -119, -197, -100, 24, 119, 144, 51, -132, -192, 26, 239, 200, 25, -85, -73, -37, 107, 250, 193, -65, -216, -16, 191, 209, 63, 6, -47, -117, -32, 221, 268, -21, -266, -139, 144, 177, 28, -13, -30, -162, -180, 72, 263, 80, -255, -254, 9, 118, 18, -18, -18, -154, -247, -23, 247, 146, -187, -285, -83, 77, 51, 43, 49, -94, -256, -94, 189, 220, -57, -203, -84, 26, 64, 134, 150, -50, -253, -133, 199, 254, 30, -119, -65, -71, -34, 128, 244, 35, -259, -181, 148, 202, 20, -73, -26, -83, -148, 63, 307, 120, -273, -282, 55, 182, 21, -40, 38, -44, -233, -66, 263, 200, -187, -296, -6, 194, 78, 5, 70, -31, -255]
1423b55J18L95N7l36k14J72J72n4k0R2p8k17K8L07J36k61k35P8J25J6N4J22j10
1446I2l22l2K98J90j68j82M8M7o3O2K03p7l55p5L35K28j59j86N1j3j65Q9L42O4
1470B52l88k00K71K55j46j60J12M0j91J5L59J30l60l15K05L05m3j11J14J0k67
1491a13j02L31K58k58l13J21K62l1j06P4Pk60j18L10L08j78l16NJ13k9k6J88N1
1514A78k83j97K60K75j46k75KJ29n9K0K35P3l53k74K14L30n8j73M7P2j74o3K80
1537F0J89k91l10J72L69mk17jQ7j89j21L06L44j93l89J5K96L1j68N6J23j46j98
1560a79K02L56j29m08o2K67J10j01P6J05k16k91J29L82j8k93o5J62L4j06P8J29
1582A62k10k78J39L90M3k67j41Q8l3r7J90K51j62l57M4L34N8k52m3J41n7j46K12
$$ y = [-255, -137, 258, 315, -21, -235, -63, 109, 55, 35, 127, 49, -168, -140, 167, 303, 42, -193, -115, 10, 26, 80, 202, 92, -230, -262, 36, 226, 58, -124, -76, -29, -92, -30, 173, 96, -259, -334, 1, 229, 70, -116, -65, -78, -243, -154, 188, 252, -136, -336, -65, 190, 44, -116, -4, 36, -155, -140, 219, 349, -11, -326, -121, 184, 141, 30, 144, 154, -113, -215, 116, 374, 116, -197, -76, 186, 155, 49, 123, 130, -130, -248, 62, 370, 192, -124, -119, -6, -35, -61, 127, 178, -105, -302, -42, 233, 87, -188, -186, -57, -116, -96, 139, 212, -141, -415, -201, 129, 71, -102, -55, 17, -157, -220, 60, 249, -42, -352, -180, 189, 185, -32, -33, 54, -135, -256, 50, 394, 201, -188, -173, 123, 154, -14, 42, 165, 19, -179, 23, 379, 250, -158, -220, 47, 157, 56, 132, 237, 21, -270, -141, 241, 223, -70, -135, 27, 61, -45, 33, 162, -48, -326, -187, 203, 246, -21, -162, -74, -107, -204, -14, 237, 75, -282, -238, 96, 154, -98, -141, 0, -57, -203, 9]
1605IL00j61m46l1L54J57j76nJ15j11k32R9L67j1l72r7K97J52j45p0J00q5k54
1628b46R3M09R7l34k15J56J24r5J8J70p0k49mL15J12k75j94J15J18m9O9J72r5
1651A42l53n9L14J86j55j44Q5J7j38M9K14nl35j03L22K02j51j77P1k2j80N8L49
1674A87R4l61k19K14K17j24j32J25L5k05j0L09J45l30k68J59K50l5o9J13mk56
1696a65r8K85K54k00k62Q6J96l4p0J12Kk28j17K83K57j19k58pJ07m2J5J77N8k64
1720c2j77K04K38r3k04J3P3n9QK15O7k90k38J60K63k5j43K9L1j52o4K19J78k19
1744Bk69R2K66J6j53jM0j44r4K24K66j33l28mK11M0p6N0O5j47j55J63K74m6k90
1769a31o9J65P7k1O2N7j54j94J06K77L0j92r4Q8J8k9J05J08j69k22Q1K55P5j72
$$ y = [9, 309, 148, -298, -329, 25, 182, 6, 1, 116, 5, -227, -128, 239, 228, -144, -241, 56, 208, 63, -7, 93, 8, -246, -153, 256, 353, 19, -196, -40, 84, -11, 7, 177, 107, -142, -146, 169, 281, 6, -188, -73, 45, -4, 65, 237, 142, -211, -270, 44, 230, 75, -69, 16, 33, -105, -56, 158, 153, -182, -285, 37, 239, 88, -89, -18, -40, -220, -162, 187, 281, -80, -299, -85, 132, 8, -124, 1, 36, -169, -179, 130, 275, -55, -323, -164, 86, 51, -18, 95, 91, -165, -263, 22, 276, 76, -186, -100, 96, 62, -8, 104, 106, -122, -239, 44, 301, 182, -76, -83, 24, -18, -3, 174, 232, -32, -209, -5, 233, 140, -64, -51, 22, -37, -29, 186, 253, -37, -275, -115, 148, 123, -20, 9, 40, -112, -176, 43, 221, 2, -267, -175, 91, 107, -46, -47, -7, -151, -245, -21, 245, 112, -216, -220, -9, 31, -45, 5, 70, -77, -232, -69, 205, 159, -131, -200, -35, 42, 21, 83, 140, -14, -208, -102, 175, 205, 13, -81, 7, 25, -4, 101, 209, 40, -182, -101, 154, 229, 57]
1793E7q3K8m1l0J59J69j35k70QK23P4j15n2N6q8r5J50J92p4k89p1K15J13o9l8
1818fK9q5j41Q6K42Kk26j21J26J16l9j0N8j01j59O6K31Q8j86j52O2Q3J8N3N0q2
1844Bj70J2K02J16j01j29PK6L2Q2R9p7j96m9J81J41m3j05j9k6j8Q5J50k8k19p7
1870a22J41J40j3p4k5n1q3O1J86L9j94j54P3J44J1m1pm7j30K9J76R3j44j80QJ27
1896c7M3%Pn6j27l2J62J37n3j51p4P1O2N3M3m8j41l9J27J34Jj03o3J4K7Q0J02
1923A39l4j39o9P7J36M1m4q6m9RP2J31nj25j17L0J43N0j8n2q4o1M6J26O4r3j51
1950f3k5P4R6K1m1q9p2j1J15R0l6j45q5L8J05O1k3o2r1m8Q5J26K8q3j22k9R3J06
1978A3L1o1q3m2M1J04P2k3r8p5K8J21Q0kj01p9J6R2Q9K0p2j03k2Q9J10K3q6j00
$$ y = [57, -26, 2, -39, -69, 90, 259, 124, -146, -138, 85, 159, 44, -8, 48, -40, -135, 15, 207, 133, -156, -227, -12, 101, 32, -6, 23, -62, -203, -117, 125, 127, -99, -220, -94, 22, -17, -27, 31, -70, -229, -163, 68, 156, -30, -182, -120, -37, -19, 34, 84, 2, -168, -156, 46, 162, 61, -68, -61, -35, -3, 79, 178, 101, -95, -144, 37, 178, 135, 30, 11, -15, -33, 52, 202, 174, -45, -122, 19, 159, 146, 72, 47, -4, -87, -26, 160, 199, 5, -149, -76, 68, 79, 38, 31, -16, -146, -117, 59, 152, 8, -172, -164, -37, 6, 6, 13, -43, -170, -202, -40, 97, 44, -107, -181, -110, -48, 5, 48, 0, -141, -180, -53, 81, 82, -21, -84, -70, -43, 37, 139, 105, -34, -103, -26, 110, 151, 107, 21, -28, -19, 53, 184, 179, 54, -63, -33, 110, 160, 142, 90, 6, -55, -9, 117, 181, 88, -63, -88, -14, 82, 103, 62, -27, -99, -110, 5, 95, 59, -86, -171, -133, -28, 33, 10, -52, -143, -191, -106, 20, 48, -35, -157, -186, -93, 13, 44, -17, -100, -142, -101, 3, 75, 52, -46, -121, -93, 28, 108, 106, 5, -74, -58, 34, 123, 143, 71, -32, -54, 35, 145, 168, 82, -18]
2006a8k8O0R9L4l0j04o5K7J11N6l8r9p2J0Q2Q8j8j04r4jQ3P9J3n8j12m3N9J20
2034C7K3p5r5k1M0P5N3lr8j13L7J44Q0p4q8k7K4K9R0N6o5j40k4J41J09l9p3l4
2062c1k6PQ1J19l3j54p3P8J28K0o1m0m2l2O9J33Kj40r4L8R9M5j5k6p2q1M8J58
2090A05M5j09j25oQ3M1K6Oo5j13OJ29J01q9j13qM2L6L7M0k8j37o5J34J57m4j21
2117c5m5K8PK6Q9J8j40j23J02J63kj08l3J8l3J7J12Q3j33j65M4J75L0o7j0k3o0
2144f5nJ25J00j02j65K5J31M5l6jj0j13m5J53J46o3j80k1J00M3l3M6K5j41p4J15
2170@J77n6j64k8O3K2k0Q1M9j39j65Q6K00Mj50n1N3lk3Q1R3j10j87L4J94N8j14
2197a5n6M2m5o3J04J48n6j99j8J63R5r2m3L6m4n7P6J75j9j98p1J22J04n2QM4o1
$$ y = [-18, -46, 14, 113, 147, 117, 13, -52, -25, 86, 142, 104, 5, -67, -57, 25, 113, 95, -9, -103, -104, -21, 58, 71, 13, -99, -142, -83, 37, 60, -15, -110, -131, -91, -16, 37, 34, -64, -177, -140, 4, 84, 10, -78, -105, -81, -52, 38, 94, 29, -111, -135, 6, 115, 76, 3, -31, -57, -50, 31, 150, 117, -37, -110, -32, 96, 116, 55, 15, -27, -59, 10, 143, 145, 5, -89, -51, 48, 93, 78, 52, -20, -101, -53, 105, 150, 41, -84, -90, -7, 34, 60, 66, 1, -112, -106, 23, 124, 35, -78, -86, -44, -8, 29, 69, 41, -96, -161, -27, 130, 86, -35, -80, -52, -45, -19, 70, 88, -52, -175, -73, 90, 88, -20, -53, -35, -68, -51, 61, 144, 11, -154, -110, 65, 95, 28, 18, -5, -65, -70, 55, 155, 53, -112, -87, 44, 89, 53, 52, 42, -71, -116, 37, 183, 120, -60, -81, 19, 62, 29, 75, 100, -41, -115, 0, 177, 121, -43, -71, -8, 14, -6, 75, 124, -15, -180, -94, 106, 110, -40, -91, -38, -41, -64, 17, 110, 0, -187, -153, 41, 99, -15, -71, -29, -74, -137, -33, 115, 59, -140, -158, 5, 100, 8, -35, 1, -43, -100, -24, 151, 132, -66, -137, -15, 89, 37, 45, 89, 28]
2224B8j32N8J90K5j84q4J16P1l9J3N2q3j63M4K20O2j72r7O6M6q0M2J25n4k00k3
2250a53K01R7j43j24P4K8o5N3J63m2k28p4J80J17p7q6O0Jq4MJ93K4k16j02J48
2275e1J53m8o7K3k5j11jK14Q5j70j41R6J03k7m2N7J5j38j6J79J20j59j54M2J09
2300D6k3KQ5Jj84o6J72J38j10j40M6R5o0j9J04K4j76j21J68J85o8j46QN8p1l7
2326h9J62P6j68j51J07J69m7j31J6O4o4m8J63J09j49j98N1J63K6r1L4M1j09p9
2350a43J42J41j07j90N5J64Oq5M1L9j22j07J33K14o1j82j6J20k9m2Q6N8j17j24
2374a26J12J88m2j73m4J11ln6J11R5j25k00M3K03K4j25k6Q5l9q9R7J19j00j99
2398a59K5K00O3j19m4L6m7q8P2J85m4j75n0J40O5q6j6N5m8r4P6J75qj85q4J14
$$ y = [28, -104, -46, 144, 169, -15, -99, 17, 88, 49, 62, 114, 31, -132, -88, 132, 194, 22, -75, -9, 37, -43, -1, 124, 70, -130, -153, 48, 145, 2, -122, -48, -20, -85, -32, 131, 89, -139, -213, -33, 84, 7, -79, -19, -18, -102, -98, 95, 119, -97, -199, -51, 102, 54, -13, 10, -15, -126, -127, 87, 172, 2, -139, -43, 60, 33, -9, 48, 63, -75, -91, 88, 208, 49, -105, -63, 46, 23, 25, 110, 111, -73, -139, 33, 171, 61, -79, -33, 62, 2, -17, 87, 111, -65, -186, -18, 167, 99, -47, -39, 19, -52, -89, 73, 149, -19, -170, -63, 106, 59, -72, -56, 8, -56, -104, 59, 168, 19, -179, -128, 35, 61, -30, 4, 45, -64, -143, -1, 140, 33, -157, -102, 62, 68, -17, 24, 63, -59, -166, -33, 181, 120, -62, -78, 42, 13, -29, 57, 115, -2, -126, -14, 174, 132, -41, -85, 26, 23, -33, 78, 173, 48, -152, -109, 94, 118, -7, -33, 52, 13, -76, 21, 140, 40, -159, -134, 66, 129, 10, -34, 2, -45, -133, -61, 124, 80, -95, -145, -5, 60, -26, -42, 13, -35, -129, -53, 122, 114, -71, -155, -41]
2424d1P8n0K6O9o7j43L2J85L7j40q2J03N6n3LR2o1j65K6J95Q9j57q9P3J8o3L7
2451HJ34l1j83k7J55Q5j00j00M8J3n6M8J39j4j92r9J42J22o1o2M7j2j05K2J43
2476F4M6j60j07J07J11k3n7L4l9j12K7J63Q3j21j32O1Q4l8mO2j6j09k2J37R9j08
2502C0j20L0P8j1lR1rj39p6J47J10o6j12L1N5l7qP2M4j45r4J09J40l3r8%J8n8
2530e4j6J38N8j17j47O8J49k1q1OK5o0j5J09R6r6j57J9J31J5l8J0K0r5n2J10J09
2557A14n4j29j0J01J7k5K1J4r4p1Q6J30j9j21k8M5PjO8L1j05j03P7J33qj11rK6
2585a8%j7O7O5q7j10J1J37L0n8l4Oj7l0Q1Q1n5j36KJ03N9m8k7%k2m1P4R5k6j19
2615c4m8O6O5Qk3Jn8m8M4J04Mr6o6L8M7J2K3Oo9o2K2J04L8q9n5J2J2J4M2M5o0
$$ y = [-41, 37, -13, 13, 82, 15, -128, -96, 89, 126, -14, -96, 7, 63, 10, 13, 105, 44, -121, -95, 100, 189, 32, -57, 16, 34, -29, 8, 142, 111, -72, -99, 56, 141, 41, -59, -11, 2, -54, -6, 133, 119, -73, -172, -30, 92, 31, -31, 16, 4, -101, -79, 64, 110, -50, -157, -50, 61, 38, -19, 15, -24, -136, -109, 54, 137, 16, -116, -55, 29, -9, -13, 49, 33, -76, -98, 39, 138, 30, -90, -60, 18, 7, 4, 95, 86, -53, -129, 18, 128, 62, -50, -19, 36, -1, -9, 63, 107, -38, -132, -23, 117, 84, -14, -14, 4, -54, -70, 68, 126, 9, -138, -70, 79, 58, -23, -17, 8, -52, -67, 42, 138, 42, -115, -96, 35, 50, 12, 22, 42, -53, -105, 5, 114, 60, -69, -79, 22, 39, 14, 35, 49, -45, -116, -30, 100, 81, -40, -68, -23, -16, -17, 51, 82, -23, -126, -49, 84, 76, -35, -44, -18, -18, -35, 32, 97, 10, -100, -89, 48, 78, 20, -14, -8, -25, -55, 26, 107, 52, -84, -82, 21, 80, 32, 5, 5, -17, -58, 16, 111, 85, -34, -82, -16, 49, 57, 34, 35, -23, -71, -27, 77, 81, -15, -81, -43, 4, 16, 39, 45, -24, -86, -64, 40, 78, -11, -66, -54, -42, -28, 14, 59, -1]
2646aj02J4J08M8n0m8j2jNM4P3m4r8k5Q0O4j2m6k1kj3N1P0j2r8m3N1P4Lk9rm2
2678b3k2K8Q6J1p3p4K4M4L6J2k3m4l3JQ5L3n9o8j2M1M8J8mm1p1NO9O9l8o1j8P
2710d7L1M1K6n4n3j1M9N9Kl6m6mJ3M3N9k2o9m4L8O7K2k3m6k7LL2O0J1n8n6j3O1
2742HM1Rm3n0j0L0O1K3l9n8l4K5O1L6k9n2m6J4N3M9j7n0l1j1M2N3Pn3l8KL3M1
2774B7K3l1m9l8L9N6K5j5n2l0J4N2L9j5m8n2K5M8L8j0n4k9mL4N2Qm8m0j1K3N3
2805C0Jk4l8l0LO1N3k4q5j7L6L3K1j1k7m9j6N1Q0No3n1NM7K6K9k2l5n7M1P4J9
2837F6k8o9OK1J9L8j0m3n4J0O8M5k4n7j8PJ1M5M0l9q6j6O1N2on3ok5QK5P0j2r1
2870d5m0N5M2J0k7j3k4k8L1P6Jn4o6L6L8J0NJ4l5n0J3Q3M5o5o3ON9jPK0j1p0q
$$ y = [-1, -103, -89, 19, 67, 17, -31, -43, -44, -39, 5, 78, 34, -64, -89, -9, 55, 43, -3, -24, -26, -39, 12, 82, 70, -28, -71, -20, 54, 57, 28, 19, -23, -45, -17, 69, 80, 7, -67, -43, 1, 37, 49, 26, -18, -51, -50, 35, 68, 9, -59, -71, -30, 18, 36, 32, -9, -80, -75, -6, 63, 25, -36, -54, -47, -16, 25, 51, -3, -56, -67, -18, 41, 43, 7, -39, -43, -30, 13, 72, 50, -19, -63, -25, 42, 64, 41, -5, -32, -29, 3, 63, 74, 16, -40, -53, 8, 49, 58, 15, -35, -45, -15, 46, 69, 30, -28, -62, -37, 24, 60, 31, -21, -67, -53, 0, 49, 32, -18, -49, -60, -18, 35, 42, -11, -49, -47, -14, 27, 50, 19, -30, -68, -29, 27, 52, 37, -15, -45, -31, 21, 60, 45, -3, -55, -30, 18, 56, 46, -8, -37, -41, -7, 45, 53, 5, -35, -46, -23, 30, 31, 7, -31, -61, -58, 3, 56, 32, -53, -70, -34, -1, 20, 9, -18, -67, -83, -32, 48, 53, -10, -61, -56, -9, 17, 46, 24, -11, -68, -27, 47, 66, 38, -31, -25, -4, 15, 53, 43, 0, -54, -44, 24, 69, 45, -12, -30, -23, -12, 33, 73, 34, -52, -68, -7, 45, 39, -14, -20, -45, -37, -12, 58, 46, -45, -85, -30, 12, 22, -5, -18, -42, -70, -39, 37, 38, -16, -82, -46, -8, 2, 7, 21, -14, -64, -51, 32, 77, 12, -51, -45, 14, 13, 20, 40, 29, -41, -49]
2903d9O5P6m9o5PK5lQM9j3p2n7P7P6j6o8j3Oj3J3O0J4q4o0M3Q2jn0j5qj7MO2M0
2937E4o6p9M2O7J1k6rom8lQ8O3o6q3jO0K7j2NK1o3l8P8O8m5q7mM7K5oK3K5p7o7
2971h2O4J02j9o8l1L5j0j3M8L6n9p7L5R5kn6l4K1rj8O3M7m6r9nQ9K3k3k0K1k5
3002a7l9N6N9k2j02nQ1L8l2pJ7m5n1N1J11k6r8k0N0L7m1NL7l4p1M3Q7J5j01n0
3032g4M6M0k7J9M8m1r1J7R6L4p2m9L5Rj1J5N5rj06k7J09M4n3m2L5j4l4K3Q0Nr5
3063c5m3P5O6m0l9K2mm4K9Q1L0j13o7P6N6k3j8K6j5o2%R9K6q5p0L8P5k8mK6qq8
3095f1j5R5O4o5o0J3M3k2j6N8mp6m3R8Q5p7p6K1L6j3jO0Pr0m9N6P5j6n3K2J3l8
3127b9lO0L7p6p2N2Q2%m6oJ2m7k0P7O6o8p6K7P0km5J1J4m1l1P4P8o0r3j1O6Qj9
$$ y = [-49, 16, 92, 43, -22, -15, 10, 7, 15, 64, 51, -21, -78, -1, 75, 59, -9, -22, -16, -29, -16, 44, 58, -26, -86, -43, 39, 38, -12, -27, -35, -52, -48, 14, 54, -12, -91, -49, 18, 29, 3, -6, -12, -60, -63, 25, 88, 22, -61, -62, -2, 25, 13, 18, 39, -24, -62, 16, 84, 39, -48, -52, -5, 20, 14, 37, 62, -15, -82, -18, 84, 65, -3, -34, 1, -9, -22, 26, 62, 3, -74, -39, 56, 54, -2, -36, -15, -24, -42, 21, 68, 22, -77, -82, 7, 30, 7, -13, 8, -17, -56, 0, 59, 37, -65, -70, 11, 49, 17, 10, 27, -18, -69, -18, 93, 67, -31, -51, -1, 36, -5, 0, 37, 3, -68, -25, 62, 77, -24, -74, -28, 12, -15, 4, 52, 11, -80, -63, 33, 67, -5, -54, -19, -10, -21, -6, 49, 40, -66, -93, 16, 60, 7, -35, 0, -14, -48, -25, 55, 60, -35, -78, -3, 63, 23, -16, 6, 2, -42, -13, 68, 98, -15, -82, -6, 50, 27, 9, 35, 20, -42, -42, 57, 83, -2, -72, -34, 41, 13, 9, 35, 27, -61, -76, 19, 83, 18, -42, -29, 14, -8, -24, 34, 30, -46, -89, 9, 94, 17, -59, -38, -2, -15, -16, 44, 51, -39, -88, -32, 43, 27, -26, -4, 9, -29, -32, 28, 65, -11, -83, -31, 51, 51, 5, -1, 11, -36, -56, 21, 87, 19, -57, -30, 40, 38, -7, 4, 18, -23, -54, 20, 98, 38, -55, -66, 0, 8, -11]
3160a1J7K8n4o7O3Q0k7p0lN2Lk9L6K5n9p9M8J00Qp9k8M0j4k9N0N7m3q5J8J02Q
3191E8p7nL0j2j7L8N4l2r7kP9L4m3j1J5rm7L5P7j9r0j2O4K9k6KJ6m4m9K1R7Rq2
3224a6m5O3L3m3J1L4l6n8J5R4J8p8m0M2J9k3K6K6j5r0lR4L8n9m2K2Rk7K3M8j2
3255B8q3j4P1M8j9o2K1Ml0J3O7Pq6k2O1M2l0j5Mkl3OP5J8o2o0M2L3lk5K9j5m6
3288c8%P4L6n0p4L3L6npK9j2o9j3P0N1l9m7kK2j1OL3J0o8l1O7N0k5n3kJ4j9K1
3321a3L8J8p4l3L4N2lk6Lmk1lO1K2l9n5J7M8J2k0kjm2oO7K4l0n6LM5Mj0J1ol8
3356b3k2M5N9l2n8j2L6Rj0K5%m5l4L8O2ln7Kj2K2PJ9Lk2m5RO2J3m7j1KMPK9J9
3391C9k3m2oN7K0j2k8J0k0KL6L3m1m7k2M9K8j2%jl6KK2L2Nn5k1J9K8joj3pl7K7
$$ y = [-11, 6, 34, -20, -87, -24, 56, 29, -41, -44, 8, 11, -18, 18, 43, -16, -95, -47, 53, 61, -18, -46, -6, -20, -49, 1, 58, 15, -70, -52, 50, 58, -19, -24, 6, -6, -23, 15, 69, 37, -60, -62, 17, 51, 8, -3, 12, 3, -44, -9, 68, 49, -41, -53, 11, 40, 14, 16, 32, -12, -61, -40, 57, 66, -16, -61, 2, 35, -8, 3, 37, 1, -57, -42, 52, 70, -8, -48, -6, 13, -10, 16, 42, 27, -63, -66, 28, 66, 7, -35, -13, -4, -31, -8, 40, 28, -55, -69, 2, 50, 31, -31, -10, -6, -36, -23, 44, 51, -35, -57, 4, 46, 16, 1, 5, 3, -30, -24, 51, 69, 7, -53, -11, 22, 19, -6, 23, 8, -38, -38, 36, 72, 22, -52, -19, 17, 12, 5, 34, 22, -47, -60, 10, 61, 22, -25, -27, -5, -16, -10, 23, 33, -35, -66, 1, 51, 26, -27, -29, -15, -34, -13, 25, 43, -31, -64, -30, 22, 19, -7, -4, -8, -29, -32, 29, 51, 12, -43, -26, 22, 34, 14, 12, 11, -31, -37, 30, 54, 24, -32, -29, 16, 20, 10, 21, 15, -23, -45, 0, 59, 27, -31, -43, -7, 2, -8, 17, 17, -28, -62, -24, 38, 35, -22, -20, -32, -10, -3, 16, 19, -3, -48, -39, 23, 36, -11, -22, -20, -16, -9, 20, 39, 16, -26, -32, 25, 45, 33, 5, 15, -5, -3, 33, 66, 25, -22, -44, 5, 33, 21, 21, 20, -16, -14, 8, 40, 45, -10, -31, -12, 16, 15, 9, -4, -11, -48, -21]
3426b1M2J7m8l2J2J3KK6Nm3k4QM9K9m6j7qONK9J8l2k1j1M1L6j3k2j2M%J8L7k4
3460B3l2oL6Qjlj3j2%K7J5Mn2k3J7K2J6mj2k1j0J2K8Jk3l4MJ9J5J1j6j7k4J5L0
3495@J4j4k1k9L1NJ6Qj8l7J0K3K9Nk5k4NJ4K3Qj0k7nKL4J7j3j5j0JK5J4rk9k2
3530b4J3K9K5k7j1k1LJ3K2Kk7j2nKL4J0j5l4pJ3L2Oj9Km0qM8J8j1k1k9J4J8J7
3564A0J0k0j7j0J9L2Lk7k2pJ6K1J6mk0k5J9J9J9j2l2Pj0J9J6J5j3m0j3L5K4j2
3596A6k1j0kj7M6K0j8l1j5K2J1Qplj8j0L1K2J0m2j6PJ1QJ9k2j6k6L0L9J4m0j3
3629a3nJ6J7PMj3m3J3N4Nj8l3KNJ8J0Jrl6j4L5J9oj6qNroL4rl2j7K2J8J3k4mN
3667a2j6J7L2jl7k5K2K1Oj0Lj9j2K0K7K4l8l6J5L0KPplk7nM6J6k4k0MJ2qJ3Rm
$$ y = [-21, 21, 38, -10, -42, -30, -17, -15, 11, 16, -27, -51, -43, 6, 35, -11, -28, -36, -30, -25, 4, 22, -10, -31, -42, -1, 35, 22, 0, -12, -8, -8, 10, 47, 23, -9, -15, 21, 29, 28, 25, 12, 0, 0, 27, 42, 46, -6, -29, -12, 10, 26, 22, 10, -11, -21, -9, 19, 20, -3, -37, -33, -14, 1, 12, -4, -21, -45, -30, 0, 14, 0, -21, -50, -19, -14, 2, 10, -8, -45, -35, -12, 17, 22, -3, -27, -22, -8, 15, 23, 13, -14, -19, -17, 17, 34, 21, 6, -4, -3, 22, 36, 27, -2, -24, -11, 18, 43, 16, 5, -16, -13, 0, 22, 24, -3, -15, -20, -18, 16, 26, 11, -23, -30, -17, 15, 21, 2, 4, -36, -44, 4, 22, 11, -10, -39, -25, -7, 10, 20, 0, -17, -27, -8, 24, 27, 0, -22, -29, -13, 8, 24, 20, 0, -25, -6, 13, 32, 20, -12, -5, -15, 4, 20, 35, 22, -18, -31, 4, 28, 16, -5, -15, -17, -34, 12, 32, 14, -17, -32, -10, 1, 9, 2, -1, -19, -29, 2, 24, 34, -8, -24, -17, -6, 2, 21, -1, -17, -43, -13, 26, 40, 0, -13, -18, -2, 15, 22, 26, 13, -30, -17, 37, 42, 24, -9, -7, -2, 16, 26, 27, 18, -18, -32, 3, 22, 16, 0, -8, -3, -12, -18, 16, 7, -25, -42, -20, -2, 11, -13, -17, -12, -28, -11, 21, 20, -17, -42, -20, 1, 7, -3, 0, -19, -31, -11, 16, 40, 2, -34, -19, 11, 13, 20, 13, 10, -17, -22, 24, 40, 16, -4, 0, 12, 4, 17, 26, 22]
3703B2l4j2M2J6Nl5nJ3j4OK8j7k6k3J7L6kl2oMmlM1J6l7l2JM2Ql3MOk4pM7J6k2
3740Bm6K0K5QmKLk2k4M8K0lm8j2L8RkPPl8j7K1N5k1m6QJ3jjK2J1k9m1L2L4jl1
3777bj5L6k1lL0kj0n3K0M8qj3j7J9l0oJ8L4j9m0jL2J8j0j4Pj5oK0K4jm6j5L4K1
3812A4k0PK4k3l1RN1j0m1qJ4K3%mK1j8m6J2N5K4m9j6qK6j3J1J9j0m4LN1J4l0k2
3846a5%J1mJ9J7nm8mK8J9j3k3J5oqLM2pm3k1J7N3k1j0JJ2l4JM3K0l8l9K2K9j3
3881@nP%m4J0M7K7l0n2K4J6j1KK0ml8j2L5M0k9l1K3Oqj6M5Lm3k9M0N0j1m4NJ0
3916Cj0mL0J4m5l0L0L7pk4NJk3KL2J5k1l3PL6kj4J0Lj6k3K2L9k1m5NL5KJpNk6
3953a7k3M0L2k5k8j0L4%krK3k5k8K0M4%m1lJ4Lj3L1J4k3k7OL8pl5JROnJ6K0k8
$$ y = [22, -12, -24, 18, 34, 39, 4, -1, 12, -2, 4, 32, 15, -11, -34, -17, 19, 17, -15, -21, -17, -21, -24, 17, 33, -4, -36, -35, 7, 15, -18, -14, -8, -32, -39, 8, 24, 2, -44, -24, 1, 9, 5, 7, 10, -12, -36, 12, 32, 29, -19, -31, 7, 16, 14, 21, 28, -10, -27, -6, 49, 28, -18, -10, 3, 2, 1, 23, 34, 5, -36, -4, 30, 29, -2, -17, 19, -2, -5, 25, 23, 13, -40, -20, 28, 20, 7, -10, 9, -21, -27, -9, 25, 6, -34, -35, -3, 15, 5, -9, -2, -17, -23, -3, 21, 20, -26, -41, -7, 14, -6, 1, 25, 2, -29, -20, 31, 21, -20, -28, -14, 9, 9, 5, 26, 8, -38, -26, 29, 53, 4, -12, -20, 6, -7, 4, 23, 13, -31, -28, 23, 37, 7, -15, -15, -4, -8, 11, 28, 23, -25, -29, -1, 18, 5, -18, -3, -9, -17, -14, 28, 21, -22, -43, -26, 27, 6, -4, -3, 9, -25, -24, 19, 39, 1, -38, -16, 13, 0, -5, 2, 2, -42, -32, 15, 42, 12, -40, -16, 0, -11, -9, 11, 7, -31, -43, -8, 32, 3, -28, -5, 1, -7, -23, 22, 25, -18, -47, -7, 43, 32, -12, -7, 3, -7, -11, 19, 33, -12, -42, -12, 25, 18, -6, -1, 0, -23, -21, 11, 26, 5, -28, -21, 15, 13, -1, 9, 12, -4, -27, -5, 34, 13, -32, -27, 8, 10, 11, 4, 9, -17, -40, 0, 32, 7, -21, -31, 3, 3, 1, -8, 15, -10, -38, -18, 26, 26, -15, -18, -4, -1, -14, 17, 31, 8, -19, -13, 25, 18, -17, -16, -7, -1, -6, 10, 30, 2]
3989Bl2LL5K4l8KMkk2K8J6nl3MK8ppKNj4k1J7M0qk5j7J8J2j4nJ8j1qmL1Pl2rJ2
4028fRj4RJ1Jl6mM0Rk6lO%RrK9j7l2nL3Rj2m%KnjL6mm6j1K4J3Jk0ORqkL1lk9J
4071ilK5Kj6J4rk0J8J4J9l9k0J0K0JqnRl6J7J1L0l3qOPjjJ7rk0qJ8L0j4qqLjJ
4111dJ9ml0lL0Rj8jOpmMLK7k0k9J6J6QLj4j1Nj4K6J4j6j4j4L4j5kJ3j6nj0J6L4
4149C2j2l9mK9o%nmj0JJ0J2J1k7k3K4oJ7Moj2qPJ9J9l5JJ%NJJ3kk8J4RNKj6J6
4189Ij9kJ7J4pl4J0QJ6%nnJkj0M6l8Lj4RJ6j3Rqj0%MJ7J0l0qLjJ4P%j6ooK8%j3
4231fj0kJ0KRLj1j4oK1K6k2qjkMJ4Oj0qj3PK1mLj0KnRJ7j3j0j5J4PMOqokJM%j
4275Cj4j2J2J3Oj3%mPMRpj6j2K2mJ1nj4NnJ9oJ2j1j8MNK4Nk1noKK1mOj4pjK5M
$$ y = [2, -30, -27, 8, 32, -6, -4, 0, -2, -24, 4, 20, 15, -18, -14, 14, 7, 0, 2, 7, -7, -28, -11, 29, 21, -4, -21, -3, 9, -5, -10, 8, -3, -11, -15, 16, 23, -9, -18, -6, 3, -11, -2, 9, 10, -26, -30, 10, 19, -7, -10, -4, -4, 5, -4, 25, 8, -24, -29, 4, 13, 1, -3, -3, -1, -6, -7, 29, 25, -21, -32, -8, 5, 6, -14, -8, 1, -7, -9, 22, 19, -10, -9, -12, 13, 15, -1, 13, 4, -16, 2, 16, 35, -4, -24, -14, 6, 7, -1, -6, 3, -33, -16, -5, 25, -8, -16, -10, -3, -4, -5, 12, 3, -17, -25, -7, 23, 9, 1, -7, -4, -5, -4, 15, 11, -19, -22, 8, 17, -1, -2, 4, -3, -7, -3, 0, 27, 7, -22, -6, 10, 18, 21, 7, -4, 1, -13, 13, 27, 11, -3, -17, 17, 2, 0, 13, -3, -8, -18, -2, 32, 20, -19, -23, 6, 0, 0, -5, -9, -19, -18, -8, 4, 15, -12, -35, -11, -17, 0, 4, -2, -14, -22, -15, 4, 23, -12, -11, -10, -10, -5, -4, 9, 7, -21, -7, 2, 7, 9, -7, 9, -10, -12, 5, 19, 12, -22, -12, -4, 12, 12, 7, 2, 3, 1, -9, 37, -1, 2, -12, -3, 13, 0, 9, 1, -9, -9, -5, 12, 22, -8, -16, -13, -14, 0, 7, 7, -9, -15, -21, 7, 7, -6, -16, -18, -8, -6, 3, 6, -5, -19, -25, -4, 22, 0, -8, -9, -11, -7, 7, 13, 3, -5, -18, -11, 10, 6, 9, -1, 1, -4, 5, 22, 9, -1, -16, -2, 5, 9, 15, 7, 1, -1, 0, 4, 4, 3, -11, -23, -11, 2, 8, -5, -5, -9, -2, 2, 11, 4, -12, -24, -2, -6, 5, 0, -14, -9, -14, 5, -1, 11, 0, -18, -14, -9, 15, 20, -1, -6, -12, -10, 11, 7, 13, -1, -8, -9, 16, 20]
4317B0j1pj3RPNMj2rJJJ3MMk9PNNJ1k5Pj0J1qJ2J2j2j5NNRJ5l0nORoJ7j7poJ7
4359aOqKpJlJ1J5%j4JLMj0PjMj4PMKj3JJNKMj4lpJ7%QJj9jnMPk%jj0NK4j2olL
4408eJ3j6K2j4j2QjK2oj3QqRj3J5Pj2rJJ9kmqNlJ0jJjj1qJ7Rj3j2%mJ0jJ2qnj7
4451a9J6J6j3j3RPj1LJ2Nk8NpK3j5J2JpnKMJ5j6j1RJ4%lJ0qj8KK1J9l0r%K5oo
4491ENnj0LJ6oJ3k1mJ0rlK9Lk0j0MRqrMJ2j4mJ7mj9j5J4NJ3moPj4LRJ1k0jJQM
4534aJjJmj3K2Rpj6J0%M%%%qllJ3Rk0MQKnJ5rj0j9J3J3J%l%LrPMj0j4%J3JqKL
4581eolJ2Lkj6j2L1lk%Oj0nJ0jKj9QJ1J1oj3Rlj9J7J8Ok2j1J5Oj3%J5oj3qK6J0
4622A8ok0J9j2Roljj5JL2j0Ok3kJ2pRJ0nk3%J6jQj4nRj5mJ4RqmRRj3mJ0mo%J9
$$ y = [20, 9, 2, -11, -2, 5, 10, 14, 2, -7, -6, -5, 8, 12, 16, -13, -6, -1, 4, 15, -10, -3, -13, -2, -10, 2, 14, 2, -13, -8, -3, 6, 21, -9, -14, -8, 1, -5, 12, -5, -12, -18, -1, 5, -3, -1, -8, -7, -10, 1, 16, 16, 2, 3, 6, 10, 0, 7, 6, 10, -4, 3, 7, 9, -4, -3, -2, 3, 5, 9, -5, -8, -15, 2, 2, 10, 11, -8, -9, -14, -10, -3, -5, -5, -6, -16, -11, 13, 1, -5, -8, -5, 8, -8, 14, 0, -12, -4, -5, 17, 11, -2, 6, -2, 7, -6, 9, 16, 4, -5, -4, 15, 13, 9, 1, 6, 3, 13, 12, 13, 12, 1, -7, 10, 19, 6, -6, -6, -10, 0, -1, 11, 3, -2, -19, -3, 13, 0, -13, -4, 3, -8, -5, 7, 12, -16, -11, -18, 5, -10, 2, 3, -4, -9, -7, -3, 12, -4, -15, -6, 8, 8, 5, 15, 7, -11, -9, 12, 31, 1, -8, -8, 17, 11, 5, 10, 5, -5, -2, 14, 8, 21, 0, -4, 6, -3, -6, 23, 26, 6, -4, 0, 9, 1, -8, -4, 8, -6, -10, 7, 3, -16, -31, -17, -12, 1, -3, -9, -2, -16, -13, -4, 7, -13, -14, -13, -5, -1, 0, -1, 0, -4, -17, 5, 14, 7, -9, 1, 1, 5, 5, 5, 5, -3, -6, -9, 4, 13, -7, -3, 5, 7, 2, 17, 8, -2, -21, -8, 5, 6, 6, 3, 3, 6, -3, 4, 8, -2, -16, -16, -3, -2, -10, -8, -5, -11, -14, -2, 1, -1, -17, -29, 2, -1, -3, -3, 3, -7, -12, -2, -3, -1, -20, -12, -1, 10, 4, -9, 0, -3, -22, -5, 13, 19, -3, -14, 1, 7, -6, -6, 9, 3, -10, -18, 8, 18, 12, -8, 11, -1, 8, 2, -1, -2, -17, -16, 16, 6, 12, -11, -13, -1, -8, 1, 11, 6, -17, -17, -1, -2, 6, -8, -13, -4, -19, -23, -9, 0, -8, -12, -3, 6, -7, -11, -1, -5, -11, -11, 8]
4665HPmk5O%J2Op%pLJ2Pl1RrJ3jmJ3Kj3pJ4Noj7JK0rlJ0Mk1OJ2Oj9klJ6j6mJ6
4709@J5k0j8RK6jk7PmnLJ4OooROnkLLj7KPJ5Nk7kJ6j3K3pnopJ4N%k3OJpJ5pQq
4755eoPnQprJ8Lj0J4p%k4NK2mpLj0J1j3J0JLj9PPK0k3OQomJK1qj3oJ5Kj4RNj8
4799a2JJ2J6jk3J8j0mOqNPk4J4J2jrj5J2pMJ5rKj7jJ3Pnj4J7nplJ8j2KpOLmnN
4842h%lOJ7mj3JnJ9orJRj1pK4pKj2%K0j6mJ1Pj4pJ8Pj0k4QK1rm%Kkj3J5jjrJ2
4886Aj1J0Kj1Pkj1J0J0lQor%nJ0MrJj3K3pOj0J1j8PJ1Jqj0OQpJ3kLj4jJ0Pj3J
4929@mRknMOoj1kJ6npKkLPLmlqMPqjLklKJ1%j3rRJ2jLnpJ1rLMJlQjRr%mmmRJ9
4983B3j3%j1NRj3JRk2LJ3lRnj5J0lRqJkjMR%j2mJ2nqJ1llj4PlJ5j5J2j4ORQql
$$ y = [8, 15, 11, -14, -8, -8, 4, 10, 3, 3, -4, -1, 11, 18, -13, -4, -13, 0, -1, -5, 8, 10, -3, -10, 4, 9, 3, -14, -13, 7, -2, -5, 5, 9, -12, -6, 6, 12, -7, -9, -12, 4, -12, -16, 0, 15, -5, -23, -14, 12, 11, -16, -9, -13, -18, -15, -1, 5, -1, -7, 2, 8, 3, 1, 4, 7, -10, -8, -1, 14, 19, -8, -10, 6, -7, 16, 9, 4, -2, -9, 5, 10, 10, -13, -7, -6, -13, 2, -5, 3, -5, -11, -4, -9, -1, -8, -17, 1, 4, -6, 8, 1, 1, -23, -18, 4, 0, -7, -4, -14, -3, -16, -6, -5, -2, -21, -14, -7, 13, -10, -4, 4, -2, -6, -5, 16, 8, -5, -11, 4, 6, -8, 1, 6, -12, -11, 1, 17, 16, -7, 11, 1, -3, 3, -5, 0, 7, -17, -3, 9, 8, -1, -16, -4, -11, -7, 8, -1, 1, -16, -17, -4, 3, -2, -16, 1, -4, -11, -14, 4, -8, -6, -13, -7, -4, -8, -13, -8, -8, -11, -5, 12, 8, -5, -4, -9, 10, 4, -5, -4, 5, -6, -13, 11, 4, 6, -6, -6, 14, -2, -6, 5, 12, -2, -9, 9, 16, 6, -18, -10, 11, 2, -2, -2, 0, -2, -15, 0, -1, -2, -11, 1, -10, 0, 2, -9, -2, -4, -15, -5, 5, 2, 10, 4, -5, -5, -10, 0, 4, -5, -4, -17, 6, -1, 5, -5, 6, -12, -5, 6, 7, -1, -11, -5, 3, -4, 9, 7, 10, -4, -5, 5, 12, -1, 0, -4, 5, 3, -2, 2, 8, 2, -9, -11, 5, 0, -7, -5, -7, -4, 3, 6, 2, -1, -9, -5, 2, -6, -7, -4, -6, -9, -7, 4, 4, -9, -18, -9, 3, 2, 5, 0, -7, 4, -5, -2, 2, 3, 0, 8, 7, 16, 7, 7, 3, -1, -5, 4, 23, 10, 10, -1, 4, 13, 0, 1, 10, -12, -9, 4, 1, 10, 5, -10, 0, -3, 6, -2, -1, -3, -4, 0, 9, 9, -3, -7, 5, 0, -8, 3, 0, -3, -17, -10, -13, 2, -13, -1, -15, -9, 0, 8, 0, -3]
5028cJ2j2J8j4LpOpJ6qlkJjkJ0ONj5OjmLmOpjqJ5LrKj5J2%JLr%J3k5K2pq%J1r
5075gJ6Mk8J9mj5J4ojOj6QJ3JLj8JRnNQolKLmJ0j0KPJoJ1j1J4k0OKNqj5J1Mmm
5120fJ4nqOm%rOmKJ1nJj0LmoK1lj1Pj1Mj1K2J3k4Pm%QMNoj1oPOlJ3j1mK3j0rO
5166DKj1J2qJ7j9%%jK1qLqj1OMKrj2J3oJ2Njj2mNkQoplJ2lLJ0oj2JkNJ0k1J6r
5211a0J4j0QJ3j9pRKkLjj0jRRjnm%OOpqkmJ0Omj1JPLjlLRprnK0j4rlJ3J%Joj6
5260b6PJ2JkJ6k1K0rMj0J1Jj0J1LJ8l2nJ8%j6QKRk5K1pJj2LJ2oONpOmqMK1k2m
5302fnJ0mmQJ2k1JJ1rJ5j1Nk1Q%J4kmpJ3j2PnJ3nmKLJ6k1pJ2j%LLp%j2J7ojLJ
5347BJojJ9k0Pj3J6knjlQp%J1Jj5JKN%kLrrJ8O%j4qJ0Mj0RlNpj6J6J1oj0jJ1p
$$ y = [-3, 9, -3, 15, 1, 4, -3, 3, -4, 12, 4, 1, -1, 0, -1, -3, 7, 13, 18, 3, 9, 8, 4, 7, 3, 9, 2, 1, -7, 8, 11, 2, 4, -11, 1, 1, 2, 5, -4, -4, 9, -16, 6, -1, -9, -9, 2, -7, 9, 13, -15, 4, 0, -15, -1, -7, -8, -2, -18, -10, 3, 4, 7, -11, -10, -1, -6, -1, 7, 1, -2, 0, 3, -1, 9, -1, 1, 8, 9, 3, 14, 3, 17, -3, 3, 5, 10, 2, -13, -2, 2, -2, -6, 8, 3, -5, 1, -3, -3, -12, -6, -10, -8, 3, -2, -1, -11, -8, -12, -18, 3, 0, -11, -4, -15, -11, -22, 0, 13, -11, -4, -8, -8, 0, 4, 9, 3, -8, -14, -7, -1, -4, 9, -2, -6, 17, 7, -2, 4, 6, -5, 7, -1, 16, -3, -3, -3, -4, 17, 9, 12, 4, -7, -1, 3, 5, -4, -16, -3, -9, 3, 8, 7, -5, -9, -4, -6, 2, -4, -11, -14, -2, -5, -2, 8, 2, -10, -9, -11, -6, 4, -17, -1, -10, 4, -6, 2, 15, -4, -11, -2, 0, -2, 1, 0, -10, -11, -2, 7, 6, 1, -3, -3, 3, 9, 2, -6, -8, -12, -2, 4, 0, -11, -10, -3, 0, -1, -4, -1, 8, 1, -8, -13, 7, -7, -16, -19, -6, -5, -5, -4, -10, -26, -19, -7, -6, -8, 8, -13, 7, -2, 2, -8, 3, 4, -6, 5, 8, 26, -6, -11, 7, 7, -9, -1, 1, 10, -15, 6, -1, 0, -12, -9, 3, -3, 3, 8, 1, 7, 3, -5, -1, 20, -2, -6, -11, -1, -5, -9, -1, 11, -10, -9, 2, -7, 8, -3, 2, -19, -11, -11, 3, 1, -3, -10, 3, -9, -2, -7, 6, 1, -3, -1, 2, 18, -3, -10, 2, 1, 1, 4, 7, 0, 0, -12, 5, -1, -2, 1, 2, 3, -3, -4, 15, -5, 2, -11, 5, 3, -2, -3, -6, 2, -5, -5, 6, 7, -8, -7, -5, 0, 0, -2, 1, -8, -17, 1, 7, 7, -7, -15, -5, -1, -11, -2, -5, 0, -7, -23, -7, 4, -2, -12, -13, -2, -9]
5393iKqK3j7%J3qLOrjJ5jkmlj1OJ2Oj3j8J7KJ2rLoj2%K3k1QJmlJJ1oQj5jLPLK
5439Fj9LLJ1J2j7mj1J4Nk0RRj0%J5Nkj9OLj3K0jKj0LJ4nmrNJ0oMj6J9rk0QJ6j
5481FjjmMlJRmj3lRoLLnKjjJ4pj4J4LNqmmmLKMPj4j%J0KqNPj4RlJ5pnOLr%Nkq
5534cMO%lJ6j4OqqJ2oJj0jJ6pJqMLkPj4Qk2OJ9jKQopj4J5LpmNQqJjRk0JJ9Mj4
5582doMqOQPJj3RlPJj4JJ0Jj0MOrPPj3Rj3JjLPklj0jJ4%LjrMqNJ0mj0%MJ%nlk
5633a2J2LLj0jLJPqOMpLj0J4jQlj0MJ4oOpj5QKmK%qOrPJJ3j4r%PJjkNpKJ1lpj8
5683a9J5mJ5lnrJ1qjNo%qJ1OoLP%j2J1oJ8j5qmJ5%joJ2qNJLj5J%J9pj0K1j3kl
5728@MQj2Omjj4J1MJ4j8oL%NnMlL%KnJ%j0J2J2j8lJKjJ1KlkkLLmjN%j2J3KJpp
$$ y = [-9, -7, -15, 8, -9, -9, 4, -4, -1, 5, -4, -5, 10, 9, 7, 3, 0, -11, -5, 7, 13, 0, -18, -1, 1, 13, 4, 7, 1, -11, -11, 12, -9, -1, 0, -4, -7, -6, 5, -1, 7, -8, -9, -6, 1, 4, 6, -13, -10, -7, 4, 16, -1, -5, -16, -2, 3, -17, -8, 1, -9, -9, 6, 11, 9, -10, -4, -1, -14, 6, 5, 7, -3, 0, 14, 9, 5, -4, 1, 11, 5, 9, -7, 12, 3, -17, -9, 7, 6, 5, 4, 0, 4, 1, 2, 11, 7, -6, -9, 0, -6, -3, 0, -5, -3, -4, -5, 9, 2, -12, 2, 5, 10, 2, -2, -6, -10, -7, -5, -1, 6, -8, -9, -9, 1, 3, -5, 0, 7, -7, 2, -1, 14, 7, 2, 8, 11, 2, 2, 7, 5, -3, 1, 7, 7, 4, 20, 6, 12, 4, -4, 8, 2, 3, -7, -8, 8, 1, 2, -6, -2, 1, -1, 6, -8, 0, -22, -16, 3, 2, 4, 12, 6, -1, -15, 0, 3, -4, -8, -3, 5, -3, -2, -3, 6, -14, -13, 6, 10, -4, -10, -6, -14, -8, 0, 7, 8, -5, 4, 1, 8, 9, -5, -4, 6, 7, -3, 1, 7, -2, 5, 12, -1, 8, -5, -4, -5, -2, 5, 3, 0, -10, -11, 3, 3, 6, 5, -4, 0, -8, -3, 7, 3, -7, -7, -3, -2, -2, -7, -10, -12, 0, 3, 6, -4, -5, -2, -1, 6, -2, 4, 8, 1, 4, -6, 8, 7, 15, 12, 2, 6, 20, 14, 20, 13, -2, 6, 8, 4, 6, 6, -2, 4, -5, 2, 3, 16, 2, -7, -7, 0, 1, 0, -2, 3, -4, -2, 9, 6, -1, -19, -4, -8, 7, 4, -1, -10, 1, -7, -8, -3, -9, -9, -17, -6, 0, -6, -3, 4, 4, -8, 3, -3, 15, 0, -8, -12, 3, 3, 2, -4, 8, 0, 5, 6, 9, -6, -5, -5, 14, 7, -3, 18, 5, 3, 0, 4, 12, 0, 6, 2, 1, -13, -2, 2, 16, -2, -8, -5, -5, 0, -5, -1, -4, -1, -1, 1, -4, -3, -3, -13, -1, 11, -7, -10, -9, -7, -8, 3, 5, 2, 0, -2, 1, 4, 0, -1, 4, 4, -8, 5, 7, 8, 1, -6]
5777fK0j8%J3j5QQlJ0j4r%M%PKj0qJ0Kj%lLrKLRpNj7J2QorPj1J2nNRlrJ7j0MQ
5824A5rj1NPlNmpJ2qJRnNj1Qj0J8rJmNpOOrnpqJ5Pj0jm%JQ%kOqlQMk2J3jrK3j5
5874dMj1JK1qOKj3KQOj3LmkJ5%JLrKj5J8j3OJnMnJ1jj3NJJjPqj2J1mJ6j1rNkR
5921FMj2lMjkJQnj3J1jj3PJ1%j0J0LnONk5J5JNjjoj2J7J4%j4nQj0QJ5j2mmQkJ1
5966A7j3njNKJ0ql%j6J6oLPn%j7J6qQj0JNkKLj1KoJ8krRLrJ2moJ4j4mMOJ4pj0
6012AqJ6j1kJ3l%j4J4%Pj6J9orJ5Jj3j5J3%J5j8QrnnJ2Qj3j2NPpLK1k0LLmNJ2
6054A1j5pJLNmRk2JNJ3LkKojkJ2koNj4K1Lj0jJJ9k1OjRok0J5oRnMqnQMNrqJ1n
6102aJQllk2K1KJ2j6j5NJ8j0JqJ0%j3J2MMlkPojJ7j9j0QPJ6k4JnK1nljMj4QkN
$$ y = [-6, 14, -4, -4, 9, -6, 2, 10, 7, 17, 3, -6, -6, -2, -2, 5, 7, -3, -11, -1, 1, 0, 0, -3, 0, -9, -7, -4, 5, -2, 3, -14, -2, 6, 0, -9, -2, -13, -1, -6, -1, 8, 5, -4, 13, 3, 7, 15, 6, -5, 0, 7, 4, 9, 5, -2, 10, 2, 3, 12, 7, 12, 1, 9, -1, 17, 8, 9, 5, 10, 3, 9, 15, 6, 1, -6, -14, 1, 8, -2, -3, -7, -7, -6, 2, 2, 0, 6, -2, -5, 3, 7, -15, -2, -3, -12, 11, -4, 0, -11, -10, 11, 3, 9, 11, -2, 0, 8, 14, 1, 4, 0, -2, 13, 13, 14, 17, 8, 10, -5, 13, 0, 6, 7, 2, 6, 1, 12, 11, -2, 3, 4, 5, 4, 11, 3, -9, 2, -2, 14, 3, -6, -1, -3, 6, 10, -2, -5, -1, -2, -4, -3, 5, 0, -13, -2, -3, -16, -9, 2, 2, -8, 2, 5, 0, 6, 11, -14, 1, 2, 7, 6, 5, -1, -13, 4, 18, 18, 4, -1, 7, -3, 5, 20, 8, 4, 0, 8, 6, 17, 4, -1, -2, 3, 5, 15, 7, 4, 4, -12, 4, -2, 1, 8, 3, 3, -14, 2, -6, 2, -8, -7, -2, -4, -2, 1, -10, -8, -14, 4, 2, -7, 2, 5, -4, 8, 4, -2, 12, -2, -6, -2, 4, 18, 11, 1, -7, 9, -2, -4, 9, 6, 6, -8, 6, 6, 13, -3, 16, 10, 1, 16, 17, 4, -11, 2, 2, 17, -1, 7, -2, -7, -12, 0, 8, -5, -17, -12, -5, -12, -9, 12, -8, -5, -2, -6, -1, 11, -4, -11, -10, -7, -2, -6, 3, -19, -18, -13, 0, 3, 1, 3, -3, -4, -6, 6, 4, -2, 3, -11, 10, 13, 3, 2, 3, 22, 1, 7, 6, 15, 9, -11, 4, -2, 7, 2, 6, -2, -7, 1, 5, 10, 1, -7, 4, -1, 0, 8, 5, 2, -20, 1, 3, 15, -1, -16, -11, 7, -3, -2, -10, 0, 0, -13, -1, 3, 7, 4, 2, 9, 3, 2, 19, 0, -10, -2, 5, 21, -3, -2, -7, 14, 9, 6, 5, 9, -5, 3, 1, 6]
6146FNj2J3nkMj2Rj0oJ1KmjNJ3j7OoJ5j5%pJ3j5J4komJ0jlJpJ0KKrOKj3J8j2K1
6190A9j3oj%%NmkMrOPJ0j4Lj0KJ3JjmqJJJ2j4PmKKJ0Lk2J3oLKnmnKkkK0nj8OK
6238cmNLrP%MlJ6j8JJ%Ln%QloOJJrQKpOJ3j8oPpPQpLJrJ0n%j2J4j3J3nOoj1RJ0
6289GrKj6jPPJ0j4R%mnQk%nOKLKjplj0J8rNMlNjlJ2onmK9k2Kj1j2PJ6oNorPK%
6339AKQrNlkK%qkmQJ5k8K0pmPoPLj4JJ8j0J0mmqrK0%m%%KNj2J5pj3%QJ1mqLkk
6388cJJ2j0p%J3J2j5JJJ0oMmPj7Qj0NQnj1MnLJJ3qj2QKJ8j4klmkpK2Nk1J3kNj3
6433eJ9j8LMj5K1jpLj1OnJ6Kj4Rj0J0jJj0MLJj1J6Jj3NRLlj3oMKJ%J9k9%LJ6r
6477@%KqNJJ1nj1lJ2rJ5nJj3J3j2J0MqQp%MLnnPnkPmmjOPJoOk1J3%LQj4OnMKo
$$ y = [6, 11, -1, 12, 7, 5, 9, -3, 6, -4, -10, 1, 3, -1, -2, 3, 16, -1, 5, -1, 14, -1, -1, -8, 5, -10, 4, 2, -4, -8, 2, 1, -2, -1, -8, 2, 4, 6, -3, 3, 5, -8, 10, -2, 19, 6, 0, -1, -1, -1, 4, 0, -2, 2, -7, -1, 6, 16, 2, 5, -5, -3, 10, 11, 10, 6, -2, -1, 0, 12, -2, 5, 1, 3, 5, 15, 18, -4, 9, 3, 6, 8, 3, -1, -6, -4, -6, -8, 12, 7, -11, -5, -3, -7, -2, 1, -8, -1, -1, 3, 0, 16, -2, -1, 0, 0, 3, -2, -2, 6, 3, -3, 3, 4, 5, -4, 4, 6, -1, 5, 18, 0, -6, 1, -6, 1, 9, 2, 5, 6, -3, 7, 2, 2, -10, 4, -9, 4, -1, 5, -1, -12, -3, 7, -2, 0, -16, -17, -10, -3, 7, -7, 2, 2, -2, -7, 1, -1, -1, -6, 0, 2, 5, 7, 6, -1, -4, -14, 4, -5, 0, 4, 1, 6, 5, 2, 14, 8, 3, -1, 28, 6, 8, -3, -15, -8, 8, 2, 7, 1, -8, -1, 1, 1, 3, 11, 2, 7, 4, 2, 4, 4, -4, -6, -10, -2, 13, -15, 5, -2, -6, 1, -5, 2, 5, -9, -8, 10, 0, 10, 6, 2, -6, -15, 5, 5, 1, 1, 1, 3, 8, -4, 11, 4, -9, -9, -1, 10, 6, -2, 1, -1, -3, -2, 10, 0, -7, -7, 6, 18, 3, 4, 5, 15, 9, 13, 9, 16, -1, 7, -3, 2, 10, 5, -6, -2, -7, -4, -3, 10, 2, -10, -2, 0, 18, 4, 2, -1, -5, -7, -14, 8, 13, -8, 5, 3, 8, -5, 14, -4, -1, 3, -12, 9, 8, 1, 4, -7, -1, -6, 10, 12, -2, 7, -3, 7, 6, 7, -3, 1, 4, 5, -6, 10, 11, -2, 3, 12, 15, 12, -1, -7, -3, -1, 0, 0, 19, -10, -10, -7, 9, 0, 0, 2, -6, -1, 0, 11, 6, -5, -8, 4, -5, 10, 5, 6, -7, 6, -6, 4, 8, 0, 8, 1, 1, 5, 8, 3, -2, 5, 0, -2, 5, 1, -3, -4, 2, 9, 10, 4, 10, -11, 2, 2, 5, 13, -1, 5, 0, 4, 6, 0]
6527@oPkJ0%j1QNj3JqkJ8j0nJJ2lJk0J3LNjPqj9J2OQmLk2J4lPJ1j2Jj4J8nJ2p
6571HQj5RPOj3ljqJ2jj0OlmJ0m%j0KMjmNMj2J0k0L0Ljk0J0mOJ1j2nk0PRK0j6L
6615CmpJ3j1J3%j0R%J5j6Pj7%J3OJj0lMjOPJrj0jMPlKj1lNjjRlj2%kJ1J3k6Kk
6661a2J1LKpKnNJ2j0Lj1JMRMlmLqKjloOkNRljrJ4mjNj1lJ1jnMNjlj7J7Lj2MqJ1
6711DlOj4PoOnKMJk1J8J1qLmj0JJ5qQ%j2pPJ2j1J1qMJn%k%Lj0J5j1K1k0%%NPj
6757Fk%mJJ3lj7J4mOkjOj6MrRkK%qRloRjmmPJ2kqj1lJ5Pj0Pnj4K7lo%Jj2KjQj
6807CJmjQ%Qk0OMpJ2pLLj7J3J4qoKj1jNJk%oJKMjNj2J0qK3lj6%Mjj5J8pJ0j9K0
6854HLkpLnJ6j1mRj2J1kQKjroO%NqOjj1OPPj1KqJ2j0J0Lj9J0oOmlqJ8oKRokj1
$$ y = [0, -6, 1, -1, 9, 9, -2, 6, 11, -2, -1, -9, -11, 7, -3, -8, -7, 5, 2, 3, -17, -4, -1, 4, 3, 10, 2, -17, -5, 1, 9, 5, 8, -14, 0, -3, 4, 15, 3, 4, -10, 8, 3, 15, 8, 16, 1, 10, 17, 23, 10, 7, 6, -2, 10, 9, -1, 5, 2, -2, 8, 4, 4, -6, -4, 0, -1, -5, 0, 4, -8, 2, -18, 12, 15, 14, -6, 4, 0, 6, 17, 5, 0, -20, -13, -4, 16, 0, 3, -1, -8, 5, -6, 7, 7, -3, 6, 6, 21, 5, 12, -5, -5, 8, 14, 15, 5, 2, 6, 5, 11, 18, 19, 10, 0, -1, 3, 10, 7, 9, -2, -5, 0, -1, -2, 7, 4, -8, -8, -10, 1, 14, -12, -10, -12, -1, 2, 4, -3, -1, -6, -1, 11, 1, 4, -7, -6, -2, 7, 11, 8, 4, 7, -1, 1, 0, -3, -9, -3, -5, 0, 9, 6, 5, -4, 10, 6, 5, 10, -1, -4, 7, 6, 1, 5, 10, 9, 6, -11, 6, 9, -3, 1, -7, 4, 1, 7, -7, 0, -6, 0, -5, -3, 1, 2, -19, -1, 10, 2, 5, 1, -9, -8, 7, -1, 7, 7, -5, -12, -5, 7, -4, 7, -1, 3, 4, -1, -1, -3, -3, 0, -10, 5, -6, 15, -5, -5, -5, 0, 7, 6, 4, 4, 0, 1, 14, 11, -6, 8, 4, 10, 8, 7, 13, -3, 1, -8, 1, -1, 1, 1, -7, 2, -1, -7, 2, 1, -3, -7, 0, 12, 10, 2, -9, -12, 3, 10, 0, 7, 2, -12, 15, 12, 6, 6, 7, -5, -3, -4, 4, 3, 4, 0, -1, 7, 7, 15, -5, 1, 5, -2, 10, 3, 6, 9, -8, 5, 19, 11, 5, 7, -4, -5, 0, 1, -1, -1, -7, -6, -4, 0, -1, 4, -8, 2, -6, 17, 14, -2, -2, 2, 1, -14, 4, -3, 7, -12, 8, 11, 9, 2, 5, 0, 16, 5, 1, 10, -2, 9, 7, 15, 17, 16, 7, 1, 7, 7, 12, 4, 10, 9, -2, 4, 11, 18, 7, 9, 1, 13, 3, 13, 16, -3, 7, 1, 7, 3, 0, -8, 10, 4, 6, 15, 9, 7, -4]
6902dnJ5J%pMj4QnKJ0j0pJ3J9j0loNqJ1Mj0JmNMJKkJj7OJ5j0KnmKQmQj2jnJ0L
6949G%JjqoJ5Jj2mKJ1oNlqJ3j0J2Oj3MrLLKpJ0qJjKMkrJ7JJnmNj0NRNpnmNOpK
7000Ijj5J5kJ4j6kqmJ1JJ3rrkRkjnKLj0JJ4Kj0lpJ3J1j6lJ2j4NPjqpJ5J2j0Nq
7044AjQj1PNlmqJ4j3J4J0j0j1LJ1lMqmlJ1pP%%rnJ0Lj2j6K0%kKpLKMkNj8J2Mo
7090cj1J2k%qJ3nmJ4mqLlQmLkLlmJ0j%j1QlJ4OorPj5K5qNk1OLJ2j0mj2J1%j2K8
7136A8j8Pk2J2KNmQj0m%NJ0j4%j1K1J%nnrJ3Oj3J%OQj0PmNj4jJ8nKNk3J3jmPR
7181A2j4J3j8J5klMojQMrLj4J6j1J6j5mJ8k3J8%Nnj7RlJ4k3PMnnJ4Mjk0J0J2K
7222I%j3J8j4MNjOj0mkJ0Rj0kjJoPQlj4lJ0jJ4j1pkmJ5nkrJ7lJ0j2jKrpJ3K%m
$$ y = [-4, -9, 6, 7, 7, 0, 4, -10, -2, -7, -5, 5, -5, -12, 1, 20, 10, 7, 1, 6, -2, 9, 13, 3, 4, 0, 5, 9, 10, 12, 10, 11, -6, 0, 15, 5, 7, 2, -2, 0, 8, 4, 12, 0, -1, -6, 4, 7, 7, 8, 7, -1, -7, 8, 9, -3, -7, -5, 6, 0, 5, 2, -6, 7, -3, 9, 15, 2, 6, -3, 0, 3, 5, -2, 8, 0, 1, 0, 2, 6, 4, -5, 12, 13, 14, 9, 5, 10, 0, 5, 14, 19, 12, 7, 3, 8, 14, 7, 9, 8, -7, 8, 6, 20, 4, 2, -6, -10, 1, 2, 15, 6, -3, -5, 4, 2, 1, -4, -2, 1, -9, -8, 6, 8, -2, -5, -12, 1, 12, -4, -7, 5, -9, -4, 3, 2, -6, -13, 2, 14, 4, 9, 1, 0, 8, -3, 4, 9, 6, 2, -6, 8, -5, 9, 19, 9, -2, 1, 12, 9, 13, 5, 1, -2, 9, 2, 9, 9, 9, 0, -5, 5, 8, -4, -20, 0, 0, -2, 0, -7, -4, -2, 2, 0, 5, -13, -1, 3, -3, -14, -2, -4, -4, -12, 1, -4, -8, 6, 2, -6, -3, -6, 2, -2, 1, -1, 2, -1, -5, 5, 4, 4, -7, 1, -2, 12, 18, 12, 3, 10, -5, 20, 12, 17, -4, 2, 5, 17, 7, 3, -9, 2, 2, -10, 18, 0, 7, -15, -3, -1, 4, 0, 8, -2, -6, -6, -1, 9, -5, -5, -16, 5, 6, 6, 1, -4, -13, 0, 6, -7, -6, -6, 0, 8, -2, 5, 1, 6, -8, -9, 9, 4, 6, 11, -12, 1, 0, -4, 3, 12, -2, 11, -7, 8, 6, 3, 7, 1, 0, 8, 12, 3, 6, -8, 8, -3, 13, -2, -6, 12, -11, 7, 7, 12, 7, -10, -1, -4, 10, -13, -6, -2, -7, -12, 2, 6, 5, -15, -5, 7, 9, 9, -4, 14, 0, 4, 9, 8, 14, 4, 0, -2, 8, 17, 7, 5, 4, 5, -1, 6, 14, 11, -3, -6, 4, 3, 17, 6, -1, -3, -7, 8, 3, 1, -8, 9, 6, 16, 4, 3, 5, -4, -11, 2, 4, 4, 0]
7268@n%qNPJ9j8j5J5LJ8k6LrJ6nkJ3rkrOKPoQonJ3lrKk%J5nQj7J1j4J2jooJ0j
7314DKLKlklJJ2%onLqjKmNj0%RpnkOJ0Lj6RMk0OJ3J0pqjJ1nJRk3JKJ3%JjrQoM
7365BQKnLqRKjqj5J3mKQmj5P%J7qpoJjkJ4nJ1jrj1RJ0j6%QjPJ7k0LpMj0J3ppm
7413a2MPK4k1j5QLNJ0rj4K0rNJ5j5j0J7j6MJ4j3kKQj7J0MmlJlJ4j0pQj3mK3k0
7453a1%OlKMJ5j0Jj3NqJ7q%j3OjJ2mPnmMR%rJ0pkJ2lMjj7kJ2Mojoj0RJ2%j1Mk
7500bRrJ4pj1KrP%J4j5kKlLJ1p%jPoJ9j3j3RMKNkj7KPRjOj6lMO%pJ2oMmQmKrL
7550Dj1MQKnJ0rj0J9j2LjLKKomojJ0%nMj0KjJ1%krNQqJ1Knj1KKnQJ0j0%qJ6lP
7598A3oj8J8mj0J2Lkj2KPMJj8J2oNj1%J8rN%qNoKRJ0j6mjKLRKj1j0Rj6J7MOj5
$$ y = [0, -5, -5, -13, -8, -1, 18, 0, -15, 0, 3, 21, -5, -2, -11, 5, 0, -2, 11, 2, 0, -9, -3, -1, 6, 0, 8, 2, -3, 10, 7, -2, 0, -2, -2, 13, 8, 16, -1, 10, -4, 8, 7, 1, -5, 5, 4, 6, 9, 11, 8, 6, 3, 4, 16, 16, 10, 5, 8, 0, -1, 1, -3, 2, -8, -8, 1, -6, -11, -13, -7, 3, 6, -10, -1, 3, -17, -11, 2, 12, 5, -3, -4, 7, 2, 3, 12, -11, -10, -8, 5, 5, 6, 5, -4, 4, -2, 2, 10, 12, 7, 10, 2, 11, 13, 12, 4, -11, 2, -2, 0, 8, 4, -11, -4, -4, 13, 5, -2, -8, -7, -8, -10, 4, -1, 10, 9, 0, -11, -2, 8, -8, -8, 0, -1, 6, 23, 3, 6, -1, 3, -7, 6, -1, -8, -12, -8, -1, 23, 2, -13, -5, -2, 3, 13, 4, -10, 10, 1, 6, 21, 6, -4, 13, -3, 1, 15, 2, 0, 2, 10, -7, 3, 7, 3, 0, 1, -2, 12, 2, -5, 3, -10, -14, 9, -11, -11, -5, -8, -6, -2, 13, 3, 4, -9, -4, -12, 5, -3, -3, -16, -10, -11, 1, -3, 4, -1, -5, -1, 8, 8, -1, 9, 2, 0, 12, 9, 13, 12, -5, -7, 5, 9, 3, 2, -4, -14, -5, 7, 7, -4, 0, -2, 7, -2, 12, 5, -6, -4, -13, -6, -6, 8, -7, -9, -7, -10, -7, 4, -3, -3, -4, 3, -3, 16, 3, -10, -1, 3, 5, 10, 8, -9, -7, 0, 9, 8, 14, -2, -5, -1, 5, 5, -2, 10, 4, 8, 4, 12, 8, 10, 1, 4, -7, -3, 5, 7, 2, 12, 3, -7, 12, 0, 3, 2, 5, 7, 9, 3, -1, -7, -8, 2, 2, -3, 1, -9, -7, -8, 3, 3, 1, -8, -3, 5, -3, 8, 10, 5, -6, -4, -2, -7, 1, 11, 1, 1, -7, 9, 6, 13, 7, -11, 7, 3, -7, 5, 8, 6, -6, -4, 3, 7, 8, -10, 2, -4, 1, -10, -10, 8, -1, 4, 4, -4, 1, -5, -3, 6, 16, 0, -4, -5, -3, 0, 9, 11, 0, -10, -1, -17, 0, 4, 10, -5]
7642eJ2j0J6qjrRlQKmlj3jJ1J1Nl1QNOjlJ3qlmJ3j0Qj5mQL%J5j7kmJ5j0JJ2j5
7686c%j0J2Nj8J0qQOQj0Oj2M%P%j8lQRmNnj4J0PJ9j5j2jOj6J7QOj7NlRjLnkOk
7732EPnpKrJ2LMj8NJ1j0RKnj1Qj2J0J%j6MJ0J0lmnrKJ3j0LLnJL%JknJ1KqJ1oK
7779EOj4J0Nj8MLjOlLRj6JPKmj1J0j0MnJ1Jj6RkjNj1J0%LkkPLj9lK3lLj6LMpK4
7826A7j4j3OJNKJ2rrJlQpkRqkJ3j1PjRqQkl%j1J0JQqJ1j1k0RJ5oj6J3mMj1J0L
7871ClmOMjp%n%OkRnj5K5rk%Lk0RrJ7KKqj5J4KlPJ1j6OKJj0Oj0Rj4RJ5k2RkkQ
7919Aj0J6j5nJ5KLKrj3%J5kOj3KkNJ9j3lopKMoRlMrOJ%qpJ1MJNpjkKJ1oooJQj
7969eO%%poK0kppmMJ7pmj6PJ3kOj4OpqMOJ4j4Jj0LPjJqlPlOJ1oj0LJJ2j1nMnJ4
$$ y = [-5, 7, -3, 13, 5, 4, -5, 4, 1, 9, 11, 7, 4, -9, -10, 1, 12, 17, -14, -6, -1, 5, 4, 1, 14, 6, 3, -1, 12, 2, 10, -5, -9, -1, 2, 2, 17, 0, -2, -6, 9, -1, 0, 12, -3, -3, -13, -1, 4, -14, -4, -12, -4, 2, 10, 0, 6, -6, -2, -2, 5, 5, -13, -16, -8, 1, -3, 2, -3, -17, -7, 0, 19, 4, -8, -9, -3, -19, -2, 6, 12, -5, 0, -3, 6, 5, 8, 3, 1, 7, 5, 12, 7, 0, 2, -7, 5, 8, 12, -6, -1, 10, 0, 9, 11, 6, -5, 3, -9, 1, 2, 2, -14, -10, 0, 10, 7, 3, -2, -11, -9, 4, -6, -3, 0, -5, -4, -1, -1, 0, -2, -7, 4, 6, -2, 9, 3, 5, 11, -3, 7, 12, -6, -2, 1, 0, 6, 3, 6, 15, -1, 0, 7, 9, 5, -6, 4, -6, -2, -7, 4, 5, -11, -2, -4, -5, 0, -11, -1, -1, 2, 0, -2, 5, 8, -11, -14, 9, 6, 9, -7, -4, 0, -7, 17, 3, -10, -4, -3, 2, 4, 16, 7, -2, -1, -4, 4, -3, -5, 4, -4, -6, 7, -4, 3, 2, 11, 3, 11, 9, 6, 6, -5, 5, 6, 14, 6, 17, 6, -14, -5, 10, 4, -12, 1, -3, 1, -10, 0, 3, 0, -4, 2, 6, 5, -2, -2, -7, -7, -1, -3, 6, 1, -14, 11, 2, 0, 0, 3, -17, -8, -17, 0, 2, 4, -4, -19, -5, -3, -6, 1, 12, -4, 2, 4, 5, -5, 1, -9, 0, -14, -5, 10, -12, -3, -5, -7, 1, -9, 7, -8, -13, 2, 4, 7, 9, 0, -13, -13, 2, 0, 6, -7, -5, -7, -2, 17, 4, 1, -5, -12, -10, -6, -12, -3, -6, -2, -11, -5, -4, -4, -12, -19, -8, -4, -3, 2, -5, -6, -8, -6, 5, -1, -7, -13, -12, -4, -5, 1, 1, 1, -6, -12, 8, 6, -1, -8, -12, -8, 9, 2, -2, -18, -11, 2, 0, 6, -8, -2, -9, -17, -13, -7, 7, -7, -6, -16, -13, -6, -7, -6, -14, -17, -10, -13, -7, 4, -2, -12, -9, -8, 4, -7, -12, -8, -13, 1]
8018AKqOo%LLq%KKMmOJj2%NJ1j1kj1pQJ2K4j3j9JLJ8k5K0j2Oj6ORkoJRj5J3kj0
8064a3MjOJ1j1qOj3JJ5Qj0J1j6jPJ2pkMj1J7j1Kjj1%J2pJ7mKj2mjQknR%OnPqM
8109Ej3JOLkmRj5nK2rLpjoRJ5j5rOlpJ1J0j5J2kj2J3J1j8KLRnLj3MjKRKrkPj0
8155fJ5nMknOj1J0j1nJ7Kjj3Pj4J3%lJ1j4OqLmMJ0j7jN%ONrjj0
$$ y = [1, 3, -5, 1, -5, -5, -2, 1, -7, -7, -5, -3, 1, -3, 3, 4, -8, -8, -3, 8, -3, -5, -16, -23, -15, -3, 21, 8, -11, -10, -7, 11, -14, 6, -6, 0, -16, -10, -1, -3, -9, -8, 1, -14, -1, -3, -13, -9, -10, -4, 7, -4, -12, -6, -19, -18, -3, 5, -5, 6, -10, -11, -4, 8, 1, -1, 3, -8, 9, -2, 0, -1, -12, -12, 0, -7, 10, 6, 8, -4, -8, -9, -1, -3, -8, 1, 1, 7, 2, 9, 1, 5, -8, -7, -1, 2, 0, -4, 5, -10, -15, 7, -2, 1, -6, -7, -13, -4, 11, -4, -13, -7, -10, -17, -6, 4, -11, 1, -1, -13, 0, 11, -7, -5, -2, 7, 2, 5, -8, -4, -5, -3, 6, 8, -1, -3, 4, -6, 9, 4, 8, 6, 1, 7, -4, 6, -5, -10, 7, 9, 8, -5, 2, -12, 1, 1, -2, 9, -5, 1, -7, -4, -8, -4, 6, -11, -12, -7, -7, -1, 4, -5, -6, -16]
8191a6
##END NTUPLES=NMR FID
##END=
