##TITLE=1H_AM A503.1
 CDCl3, 8 sc, 
 24.7.2019
##JCAMPDX= 6.0         $$ Bruker NMR JCAMP-DX V2.0
##DATA TYPE= NMR FID
##DATA CLASS= NTUPLES
##ORIGIN= UXNMR, Bruker Analytische Messtechnik GmbH
##OWNER= root
$$ XWIN-NMR		Version 3.5
$$ Wed Jul 24 13:53:47 2019 Russian Standard Time (UT+4h)  she@DPX200
##.OBSERVE FREQUENCY= 200.13155
##.OBSERVE NUCLEUS= ^1H
##.DELAY= (6, 6)
##.ACQUISITION MODE= SIMULTANEOUS
##.ACQUISITION SCHEME= undefined
##.AVERAGES= 8
##.DIGITISER RES= 18
##SPECTROMETER/DATA SYSTEM= spect
##.PULSE SEQUENCE= zg30
##.SOLVENT NAME= CDCl3
##.SHIFT REFERENCE= (INTERNAL, CDCl3, 0, 15.7039)
##AUDIT TRAIL= $$ (NUMBER, WHEN, WHO, WHERE, WHAT)
$$ ##TITLE= Audit trail, XWIN-NMR		Version 3.5
$$ ##JCAMPDX= 5.01
$$ ##ORIGIN= Bruker BioSpin GmbH
$$ ##OWNER= she
$$ F:/spectra/data/she/nmr/H-F/1/audita.txt
$$ ##AUDIT TRAIL=  $$ (NUMBER, WHEN, WHO, WHERE, WHAT)
(   1,<2019-07-24 13:52:40.28 +0400>,<she>,<DPX200>,
      <created by zg, POWCHK disabled, PULCHK disabled
       configuration hash MD5:
       00 E9 B6 7A A2 85 ED C7 34 08 36 98 17 FE 4E 26
       data hash MD5: 16K
       2A 37 09 93 C4 17 91 3B 68 45 5B 51 10 97 91 4C>)
$$ ##END=
$$ 
$$ hash MD5
$$ AA 97 DF D4 89 01 E7 7C 16 D7 B5 F4 96 FB 12 30
##$RELAX= 
##$RELAX= 
##$RELAX= 
##$RELAX= 
##$RELAX= 
##$RELAX= 
$$ Bruker specific parameters
$$ --------------------------
##$DU= <F:/spectra>
##$EXPNO= 1
##$NAME= <H-F>
##$PROCNO= 1
##$TYPE= <nmr>
##$USER= <she>
##$AMP= (0..31)
100 100 100 100 100 100 100 100 100 100 100 100 100 100 100 100 100 100 
100 100 100 100 100 100 100 100 100 100 100 100 100 100 
##$AQSEQ= 0
##$AQ_mod= 1
##$AUNM= <au_zg>
##$AUTOPOS= <>
##$BF1= 200.13
##$BF2= 200.13
##$BF3= 200.13
##$BF4= 200.13
##$BF5= 200.13
##$BF6= 200.13
##$BF7= 200.13
##$BF8= 200.13
##$BYTORDA= 1
##$CFDGTYP= 0
##$CFRGTYP= 5
##$CHEMSTR= <none>
##$CNST= (0..31)
1 1 145 1 1 1 1 1 1 1 1 1 1 1 1 1 1 1 1 1 1 1 1 1 1 1 1 1 1 1 1 1 
##$CPDPRG= <>
##$CPDPRG1= <>
##$CPDPRG2= <>
##$CPDPRG3= <>
##$CPDPRG4= <mlev>
##$CPDPRG5= <mlev>
##$CPDPRG6= <mlev>
##$CPDPRG7= <mlev>
##$CPDPRG8= <mlev>
##$CPDPRGB= <>
##$CPDPRGT= <>
##$D= (0..31)
0 1.2 0 0 0 0 0 0 0 0 0 0.03 0 0 0 0 0 0 0 0 0 0 0 0 0 0 0 0 0 0 0 0 
##$DATE= 1563961959
##$DBL= (0..7)
120 120 120 120 120 120 120 120 
##$DBP= (0..7)
150 150 150 150 150 150 150 150 
##$DBP07= 0
##$DBPNAM0= <>
##$DBPNAM1= <>
##$DBPNAM2= <>
##$DBPNAM3= <>
##$DBPNAM4= <>
##$DBPNAM5= <>
##$DBPNAM6= <>
##$DBPNAM7= <>
##$DBPOAL= (0..7)
0.5 0.5 0.5 0.5 0.5 0.5 0.5 0.5 
##$DBPOFFS= (0..7)
0 0 0 0 0 0 0 0 
##$DE= 6
##$DECBNUC= <off>
##$DECIM= 24
##$DECNUC= <off>
##$DECSTAT= 4
##$DIGMOD= 1
##$DIGTYP= 9
##$DL= (0..7)
0 120 120 120 120 120 120 120 
##$DP= (0..7)
150 150 150 150 150 150 150 150 
##$DP07= 0
##$DPNAME0= <>
##$DPNAME1= <>
##$DPNAME2= <>
##$DPNAME3= <>
##$DPNAME4= <>
##$DPNAME5= <>
##$DPNAME6= <>
##$DPNAME7= <>
##$DPOAL= (0..7)
0.5 0.5 0.5 0.5 0.5 0.5 0.5 0.5 
##$DPOFFS= (0..7)
0 0 0 0 0 0 0 0 
##$DQDMODE= 0
##$DR= 18
##$DS= 0
##$DSLIST= <SSSSSSSSSSSSSSS>
##$DSPFIRM= 0
$$ [...]
##$SUBNAM2= <"">
##$SUBNAM3= <"">
##$SUBNAM4= <"">
##$SUBNAM5= <"">
##$SUBNAM6= <"">
##$SUBNAM7= <"">
##$SUBNAM8= <"">
##$SUBNAM9= <"">
##$SW= 24.9336996594482
##$SWIBOX= (0..15)
0 0 2 0 0 0 0 0 0 0 0 0 0 0 0 0 
##$SW_h= 4990.01996007984
##$TD= 16384
##$TD0= 1
##$TE= 0
##$TE2= 300
##$TE3= 300
##$TEG= 300
##$TL= (0..7)
0 120 120 120 120 120 120 120 
##$TP= (0..7)
150 150 150 150 150 150 150 150 
##$TP07= 0
##$TPNAME0= <>
##$TPNAME1= <>
##$TPNAME2= <>
##$TPNAME3= <>
##$TPNAME4= <>
##$TPNAME5= <>
##$TPNAME6= <>
##$TPNAME7= <>
##$TPOAL= (0..7)
0.5 0.5 0.5 0.5 0.5 0.5 0.5 0.5 
##$TPOFFS= (0..7)
0 0 0 0 0 0 0 0 
##$TUNHIN= 0
##$TUNHOUT= 0
##$TUNXOUT= 0
##$USERA1= <user>
##$USERA2= <user>
##$USERA3= <user>
##$USERA4= <user>
##$USERA5= <user>
##$V9= 5
##$VALIST= <valist>
##$VCLIST= <CCCCCCCCCCCCCCC>
##$VD= 0
##$VDLIST= <DDDDDDDDDDDDDDD>
##$VPLIST= <PPPPPPPPPPPPPPP>
##$VTLIST= <TTTTTTTTTTTTTTT>
##$WBST= 1024
##$WBSW= 4
##$XGAIN= (0..3)
0 0 0 0 
##$XL= 0
##$YL= 0
##$YMAX_a= 1900
##$YMIN_a= -2386
##$ZGOPTNS= <>
##$ZL1= 120
##$ZL2= 120
##$ZL3= 120
##$ZL4= 120
##$ABSF1= 10
##$ABSF2= 0
##$ABSG= 5
##$ABSL= 3
##$ALPHA= 0
##$AQORDER= 0
##$ASSFAC= 0
##$ASSFACI= 0
##$ASSFACX= 0
##$ASSWID= 0
##$AUNMP= <proc_1d>
##$AZFE= 0.1
##$AZFW= 0.1
##$BCFW= 1
##$BC_mod= 2
##$BYTORDP= 1
##$COROFFS= 0
##$CY= 11.3945322036743
##$DATMOD= 1
##$DC= 2
##$DFILT= <>
##$DTYPP= 0
##$F1P= 18.9103706918063
##$F2P= -1.10871071338519
##$FCOR= 0.5
##$FTSIZE= 0
##$FT_mod= 4
##$GAMMA= 1
##$GB= 0.15
##$INTBC= 1
##$INTSCL= 1
##$ISEN= 128
##$LB= 0.24
##$LEV0= 0
##$LPBIN= 0
##$MAXI= 10000
##$MC2= 0
##$MEAN= 0
##$ME_mod= 0
##$MI= 1.114404
##$NCOEF= 0
##$NC_proc= 0
##$NLEV= 6
##$NOISF1= 3.799351
##$NOISF2= 2.8
##$NSP= 1
##$NTH_PI= 0
##$NZP= 0
##$OFFSET= 15.70392
##$PC= 1
##$PHC0= -8947.235
##$PHC1= 21.60096
##$PH_mod= 1
##$PKNL= yes
##$PPARMOD= 0
##$PSCAL= 0
##$PSIGN= 0
##$REVERSE= no
##$SF= 200.130013532006
##$SI= 16384
##$SIGF1= 3
##$SIGF2= 2
##$SINO= 400
##$SIOLD= 16384
##$SREGLST= <1H.CDCl3>
##$SSB= 0
##$STSI= 0
##$STSR= 0
##$SW_p= 3612.71676300578
##$SYMM= 0
##$S_DEV= 0
##$TDeff= 0
##$TDoff= 0
##$TI= <>
##$TILT= no
##$TM1= 0
##$TM2= 0
##$TOPLEV= 0
##$USERP1= <user>
##$USERP2= <user>
##$USERP3= <user>
##$USERP4= <user>
##$USERP5= <user>
##$WDW= 1
##$XDIM= 8192
##$YMAX_p= 0
##$YMIN_p= 0
$$ End of Bruker specific parameters
$$ ---------------------------------
##NTUPLES= NMR FID
##VAR_NAME=  TIME,          FID/REAL,        FID/IMAG
##SYMBOL=    X,             R,               I
##VAR_TYPE=  INDEPENDENT,   DEPENDENT,       DEPENDENT
##VAR_FORM=  AFFN,          ASDF,            ASDF
##VAR_DIM=   8192,          8192,            8192
##UNITS=     SECONDS,       ARBITRARY UNITS, ARBITRARY UNITS
##FACTOR=    0.0002004,     1,               1
##FIRST=     0,             0,               0
##LAST=      1.6414764,     0,               0
##MIN=       0,             -2386,           0
##MAX=       1.6414764,     1900,            0
$$ Real data points
##PAGE= N=1
##DATA TABLE= (X++(R..R)), XYDATA
0 0 0 0 0 0 0 0 0 0 0 0 0 0 0 0 0 0 0 0 0 0 0 0 0 0 0 0 0 0 0 0 0 0 0 0 0 0 -1 2 -3 3 -4 5 -5 6 -7 7 -7 8 -10 11 -12 14 -15
53 -15 20 -22 28 -35 47 -73 137 -678 -2274 -995 438 255 -1133 -1469 -693 -74 -400 -940 -1028 -592 -226 -356
75 -356 -941 -1113 -461 300 -56 -1194 -1468 -239 844 227 -1194 -1318 -20 822 103 -917 -728 264 536
94 536 -129 -618 -201 481 453 -221 -649 -168 689 820 -51 -866 -475 683 1040 44 -906 -476 685 840
114 840 -193 -813 -142 681 333 -570 -636 226 695 66 -811 -767 130 724 237 -754 -958 -100 683 355 -637
135 -637 -916 -107 590 227 -623 -635 222 622 -117 -854 -367 711 813 -273 -944 -240 830 832 -125 -672
155 -672 -205 626 772 176 -380 -183 502 728 142 -368 82 895 723 -304 -607 397 1268 638 -567
174 -567 -568 551 1161 508 -368 -344 322 786 521 -28 -189 234 645 390 -247 -259 519 924 174 -693 -334
195 -334 819 1042 -29 -856 -300 790 856 -62 -622 -193 463 455 -75 -373 -57 363 279 -280 -573 -82 589
216 589 379 -575 -956 -120 788 408 -764 -1054 -134 604 154 -707 -748 -63 261 -172 -668 -515 50 210
236 210 -280 -779 -552 186 462 -203 -940 -698 298 677 -76 -862 -587 318 576 -88 -594 -219 453 406 -244
257 -244 -453 134 681 372 -353 -462 249 830 525 -274 -510 115 806 661 -112 -453 74 733 553 -191
277 -191 -354 301 712 186 -497 -249 582 715 -75 -678 -296 512 646 -18 -623 -436 241 535 63 -536
297 -536 -462 157 433 -100 -613 -290 383 318 -458 -744 -47 646 296 -612 -771 -13 613 310 -434 -628 -96
318 -96 403 286 -246 -452 -70 341 186 -344 -410 179 553 53 -653 -465 427 716 -14 -752 -457 407 612
339 612 -12 -555 -335 225 377 -27 -376 -226 222 276 -168 -487 -128 469 403 -352 -717 -101 657 462 -398
360 -398 -723 -71 580 389 -289 -494 22 443 218 -288 -291 195 437 84 -397 -282 338 611 123 -509 -417
381 -417 328 738 216 -508 -438 317 644 112 -428 -240 351 408 -132 -404 -10 431 278 -287 -497 -30 506
402 506 396 -250 -604 -177 490 487 -181 -583 -160 442 351 -245 -425 57 457 128 -391 -296 301 531 44 -491
424 -491 -322 343 615 146 -444 -386 224 590 237 -313 -325 210 502 110 -344 -150 385 422 -167 -497 -44
445 -44 561 424 -316 -592 -83 512 393 -251 -555 -201 306 300 -200 -492 -199 233 140 -358 -497 -39 345 6
467 6 -603 -551 126 482 -11 -681 -585 105 459 34 -532 -465 50 311 -5 -385 -290 135 252 -123 -421 -167
489 -167 335 366 -187 -569 -168 504 516 -178 -597 -142 501 459 -124 -408 -21 396 270 -144 -212 124 400 199
511 199 -237 -256 213 564 270 -347 -403 239 703 329 -341 -380 238 599 238 -259 -190 304 435 55 -240 -17
533 -17 408 408 -37 -336 -33 497 537 -32 -454 -145 497 587 6 -433 -145 392 407 -88 -337 -8 370 172
555 172 -299 -348 100 383 68 -460 -465 54 409 91 -491 -588 -91 335 79 -451 -565 -111 189 -66 -487 -405
577 -405 28 153 -269 -596 -325 215 242 -295 -668 -329 264 330 -190 -589 -308 213 322 -88 -383 -160 247
598 247 244 -132 -298 29 421 266 -250 -340 202 653 350 -299 -352 247 658 361 -156 -214 227 513 307 -48
620 -48 -71 264 452 201 -132 -34 412 559 108 -336 -100 518 631 49 -402 -112 465 519 46 -288 -74 340
642 340 334 -1 -174 31 312 219 -155 -286 74 449 267 -293 -449 37 506 284 -342 -485 -1 395 163
663 163 -310 -367 -2 205 -35 -349 -257 87 193 -159 -514 -336 146 289 -162 -623 -448 149 302 -176 -624
684 -624 -431 80 179 -210 -490 -272 55 14 -326 -457 -139 213 47 -404 -556 -116 324 155 -393 -550 -97
705 -97 326 188 -273 -415 -58 267 136 -220 -265 84 293 27 -325 -217 261 427 3 -409 -226 333 474
726 474 33 -371 -230 239 380 84 -253 -145 197 276 -15 -241 -38 331 290 -169 -367 29 490 303 -242
747 -242 -404 46 478 318 -166 -307 20 346 256 -86 -196 80 324 169 -150 -165 224 456 129 -316 -184
768 -184 367 571 125 -350 -203 346 515 138 -205 -75 274 355 99 -131 -11 289 313 6 -215 28 433
789 433 350 -159 -392 26 502 384 -176 -375 -12 361 262 -127 -255 7 261 145 -162 -211 82 289 56
810 56 -300 -267 191 403 31 -435 -338 160 401 61 -361 -299 111 282 20 -303 -225 101 185 -118 -354 -115
832 -115 226 157 -275 -467 -128 310 210 -273 -510 -196 218 190 -222 -447 -195 140 99 -234 -358 -87 158
853 158 -10 -359 -352 69 266 -50 -456 -367 112 339 15 -389 -347 82 301 72 -251 -251 92 251 45 -222
875 -222 -102 255 308 -60 -304 -9 428 371 -111 -318 16 432 371 -36 -248 -15 326 329 26 -171 10 287
897 287 225 -101 -190 140 393 142 -276 -264 210 428 104 -349 -281 151 349 112 -247 -258 33 223 47 -233
919 -233 -190 121 204 -86 -340 -164 243 250 -184 -449 -130 311 293 -148 -415 -157 238 248 -73 -288 -95 177
941 177 162 -126 -234 29 259 104 -241 -268 109 363 116 -320 -320 104 387 151 -272 -311 33 283 98 -214
963 -214 -203 85 224 -10 -241 -129 200 237 -105 -340 -105 306 311 -82 -361 -145 273 324 -4 -271 -123 225
985 225 268 -34 -210 -9 276 184 -152 -228 131 399 151 -252 -247 163 408 191 -198 -257 67 347 206 -140
1007 -140 -221 59 279 98 -194 -167 170 259 -60 -327 -125 266 275 -106 -380 -163 225 261 -71 -350 -212 138
1029 138 219 -39 -286 -151 154 145 -139 -258 -3 265 107 -261 -303 69 346 153 -259 -310 53 336 177 -182
1051 -182 -250 30 276 141 -140 -161 113 251 25 -234 -116 231 300 -59 -349 -158 247 312 -47 -357 -192
1072 -192 185 268 -34 -288 -172 115 167 -116 -268 -82 170 105 -232 -315 5 274 99 -285 -376 -28 286 158
1094 158 -237 -348 -44 249 141 -183 -238 33 214 44 -195 -126 187 264 -19 -273 -123 245 340 34 -281
1115 -281 -161 239 354 66 -247 -137 191 290 23 -179 -48 220 195 -100 -201 55 298 162 -192 -278 37
1136 37 332 209 -159 -291 -23 295 213 -126 -236 11 246 130 -142 -157 114 258 43 -221 -113 232 316
1157 316 21 -282 -146 234 363 60 -234 -162 182 317 80 -184 -98 182 224 -30 -194 -2 258 188 -147
1178 -147 -267 30 315 170 -191 -325 -44 252 182 -163 -315 -81 161 98 -185 -250 -37 140 -9 -258 -225
1199 -225 71 185 -65 -357 -258 102 250 -29 -351 -268 88 244 -8 -270 -198 105 176 -45 -200 -74 179
1220 179 170 -103 -235 -10 279 213 -141 -293 -11 313 273 -105 -274 -19 264 210 -93 -175 27 232 121 -123
1242 -123 -126 117 252 50 -222 -171 162 317 45 -277 -239 137 309 65 -253 -210 103 223 26 -198 -118 134
1264 134 174 -60 -201 -46 216 166 -124 -277 -33 266 226 -122 -299 -72 245 225 -77 -236 -41 199 141 -107
1286 -107 -165 44 197 55 -219 -173 107 246 22 -277 -225 102 270 49 -284 -257 63 209 23 -244 -194 49
1308 49 139 -63 -243 -120 121 131 -156 -304 -80 215 183 -153 -340 -98 224 193 -109 -267 -94 184 159 -91
1330 -91 -182 2 187 106 -131 -159 98 271 92 -202 -188 158 340 119 -212 -186 125 313 120 -163 -133 105
1352 105 219 65 -130 -76 140 165 -34 -209 -56 229 218 -93 -281 -78 254 249 -77 -265 -75 220 202 -51
1374 -51 -188 -22 168 134 -84 -141 57 225 95 -164 -169 122 327 132 -204 -202 130 334 152 -161 -167 104 272
1397 272 115 -101 -101 136 209 26 -155 -49 205 224 -45 -245 -73 250 256 -53 -277 -104 190 209 -55 -234
1419 -234 -111 125 125 -82 -199 -41 129 55 -197 -241 10 201 34 -267 -280 28 233 50 -235 -269 -8 178
1441 178 51 -182 -213 6 142 -9 -190 -143 91 160 -79 -256 -116 186 190 -99 -318 -138 173 199 -65 -265
1463 -265 -129 108 149 -48 -216 -83 121 92 -142 -216 -8 184 74 -219 -249 46 255 95 -217 -243 34 238
1485 238 111 -142 -186 15 165 73 -118 -109 95 195 21 -180 -78 206 242 -20 -222 -81 245 278 10 -199
1507 -199 -66 187 237 28 -126 -45 163 191 -4 -135 28 208 142 -119 -184 64 283 135 -180 -227 33 256
1529 256 139 -152 -207 10 179 96 -125 -172 20 148 27 -180 -132 111 186 -63 -262 -130 175 224 -35 -261
1551 -261 -145 137 202 -14 -204 -118 114 172 -21 -166 -54 159 132 -89 -176 49 244 135 -158 -204 54 278
1573 278 168 -119 -196 23 229 159 -76 -155 23 179 85 -103 -99 101 201 14 -194 -104 178 230 -8 -228 -117
1596 -117 159 224 21 -195 -134 126 196 24 -152 -79 130 141 -52 -170 3 207 127 -151 -215 41 240 140
1618 140 -136 -208 3 210 140 -99 -194 -28 155 91 -117 -153 16 147 9 -197 -157 116 192 -45 -252 -157 127
1641 127 201 -26 -238 -190 81 179 12 -188 -160 51 115 -53 -182 -66 140 102 -118 -216 -3 196 111 -140 -220
1664 -220 -5 213 159 -96 -215 -37 178 145 -60 -140 10 173 75 -124 -112 107 208 21 -187 -108 149 243
1686 243 19 -206 -144 93 220 40 -170 -152 85 158 9 -164 -74 120 127 -91 -188 -23 172 125 -136 -222 -20
1709 -20 207 136 -111 -223 -55 166 153 -64 -171 -29 155 98 -92 -133 57 193 37 -163 -113 129 238 30
1731 30 -194 -128 127 230 79 -156 -135 88 208 70 -131 -88 117 148 -9 -150 -8 178 133 -83 -178 2
1753 2 210 161 -87 -205 -48 193 178 -45 -184 -38 157 141 -61 -128 21 166 77 -115 -97 125 213 50 -167
1776 -167 -117 130 243 99 -141 -116 105 245 117 -113 -84 91 184 42 -113 -48 153 151 -47 -163 -14 192
1798 192 142 -87 -201 -41 173 164 -65 -215 -87 130 143 -61 -172 -41 111 47 -125 -157 28 142 9 -186
1820 -186 -173 46 184 3 -213 -201 31 186 50 -173 -200 10 123 13 -163 -121 60 106 -57 -164 -70 143
1842 143 109 -91 -217 -68 140 149 -78 -229 -96 134 143 -52 -189 -84 104 85 -106 -164 -11 118 14 -165
1864 -165 -164 48 163 18 -187 -180 42 188 74 -161 -183 31 174 79 -122 -114 63 143 15 -125 -39 135 142 -34
1888 -34 -150 -27 186 190 -23 -167 -37 175 205 0 -142 -37 156 180 0 -91 21 163 107 -68 -86 79 187
1911 187 84 -128 -130 79 229 91 -134 -175 20 185 85 -123 -157 26 134 24 -126 -102 75 116 -51 -169
1933 -169 -67 139 147 -52 -207 -88 135 176 -29 -195 -94 128 156 -13 -140 -39 125 98 -54 -121 25 150
1955 150 68 -111 -146 42 188 82 -150 -188 17 185 97 -122 -164 1 147 51 -120 -121 37 107 -15 -155 -88
1978 -88 90 135 -52 -192 -91 114 150 -36 -210 -122 103 162 -10 -155 -82 95 124 -41 -112 -4 149 110 -66
2001 -66 -107 56 201 132 -91 -127 70 234 143 -64 -118 55 209 141 -29 -77 87 172 73 -70 -53 124 171 2
2025 2 -158 -66 138 178 -7 -186 -104 110 176 -19 -177 -121 71 116 -36 -163 -84 48 52 -103 -176 -47 92 31
2049 31 -164 -213 -37 131 44 -158 -225 -49 120 57 -126 -199 -47 76 19 -124 -136 9 81 -29 -177 -122 67
2072 67 137 -17 -199 -134 87 148 -13 -184 -128 56 128 -1 -146 -85 62 92 -52 -128 -35 122 87 -95 -154 1
2096 1 162 99 -102 -170 3 178 136 -64 -128 10 156 123 -31 -76 60 168 88 -63 -39 134 207 71 -98 -28
2120 -28 172 241 78 -86 -44 150 237 96 -55 -27 117 175 53 -44 5 148 130 -15 -103 27 178 128 -74 -158
2144 -158 6 160 120 -80 -168 -41 114 78 -75 -174 -55 73 26 -120 -152 -9 82 -29 -188 -156 36 116 -37
2167 -37 -222 -162 30 124 -12 -161 -146 27 104 4 -125 -95 51 79 -36 -134 -35 114 92 -86 -165 -15 150 91
2191 91 -93 -161 -30 146 112 -44 -134 -47 111 91 -51 -98 12 122 33 -109 -97 50 162 17 -146 -111 85
2214 85 159 46 -122 -135 52 139 37 -93 -81 46 126 17 -103 -41 114 106 -46 -122 -10 167 133 -54 -146 -8
2238 -8 175 149 -15 -123 -32 120 122 -21 -103 1 104 65 -87 -104 52 129 15 -148 -134 46 131 18 -167 -158 9
2263 9 116 15 -137 -156 -15 80 -11 -142 -119 26 57 -75 -171 -75 86 63 -95 -198 -66 110 103 -47 -165 -57
2287 -57 98 102 -23 -113 -29 113 97 -25 -73 42 147 81 -81 -71 109 195 76 -90 -76 107 213 105 -59 -74
2311 -74 67 176 92 -43 -52 99 143 29 -66 -19 140 138 -17 -114 -7 154 137 -13 -130 -40 110 148 -13 -128
2335 -128 -55 95 110 -18 -108 -12 113 51 -99 -108 37 121 30 -128 -140 34 132 37 -114 -158 -4 112 50 -108 -143
2360 -143 -3 76 -11 -143 -101 43 76 -76 -173 -87 73 60 -88 -186 -103 64 95 -62 -184 -118 41 78 -60 -140
2384 -140 -73 53 38 -90 -125 -11 97 32 -121 -117 33 146 51 -105 -126 33 148 84 -56 -103 36 152 91 -57
2408 -57 -43 90 153 35 -63 0 135 145 7 -88 -13 151 176 35 -100 -42 125 167 46 -84 -21 106 117 -6
2432 -6 -82 11 122 57 -74 -95 39 122 55 -105 -128 3 137 73 -90 -150 -32 110 45 -109 -121 -10 69 -17 -131
2457 -131 -87 37 59 -59 -155 -78 68 96 -49 -173 -121 48 108 -14 -138 -105 47 79 -33 -124 -53 59 50 -84
2481 -84 -110 -6 96 42 -117 -144 -17 131 65 -97 -151 -10 126 82 -64 -119 -5 101 49 -72 -59 60 114 -5
2505 -5 -98 -23 96 138 20 -96 -41 111 169 60 -94 -48 112 156 38 -72 -17 108 111 1 -57 28 133 84 -46
2530 -46 -79 29 150 104 -53 -106 2 141 112 -43 -111 4 115 60 -78 -88 27 88 -2 -101 -88 41 86 -18
2554 -18 -138 -110 53 94 -21 -156 -138 19 88 -19 -148 -117 4 45 -57 -123 -60 42 22 -106 -139 -37 74 38
2578 38 -105 -162 -56 85 63 -97 -162 -64 75 61 -71 -115 -33 69 11 -89 -84 38 86 -3 -117 -88 55 123 10
2603 10 -111 -93 60 147 37 -94 -80 63 122 30 -75 -19 99 103 4 -60 21 127 103 -34 -82 24 147 135 -29
2628 -29 -94 5 140 136 -18 -65 19 129 83 -31 -48 58 115 36 -69 -51 75 138 26 -98 -81 50 126 35 -114
2653 -114 -104 42 104 25 -94 -77 32 57 -26 -117 -44 67 46 -68 -138 -49 80 75 -80 -151 -63 82 69 -66 -154 -58
2679 -58 73 58 -63 -109 -31 63 6 -89 -107 5 71 -6 -116 -113 35 102 8 -121 -122 21 112 33 -102 -98 25 87 9
2706 9 -88 -54 51 69 -36 -96 -25 96 83 -43 -123 -19 122 116 -31 -112 -24 97 101 -16 -68 0 92 79 -11 -40 63
2733 63 122 64 -51 -44 79 165 86 -61 -56 84 170 96 -39 -49 68 150 59 -45 -20 90 109 21 -49 -2 93 100 -16
2760 -16 -100 -21 104 114 -31 -128 -39 87 94 -15 -114 -50 45 48 -48 -101 -13 60 4 -91 -99 3 76 9 -130 -147 11 87
2788 87 6 -129 -137 -6 68 1 -111 -116 -19 45 -28 -118 -76 17 39 -59 -148 -73 47 61 -73 -156 -88 55 60 -55 -144 -76
2816 -76 33 35 -63 -125 -51 29 16 -84 -101 3 69 7 -96 -102 17 96 41 -95 -104 22 120 69 -59 -72 27 111 46 -40
2844 -40 -17 79 117 31 -58 12 123 144 14 -64 15 136 158 23 -58 -9 110 136 28 -45 -6 86 92 -10 -40 26 101
2871 101 54 -58 -63 45 112 49 -96 -99 22 96 43 -95 -126 -25 76 18 -90 -100 4 55 -22 -124 -83 18 48
2896 48 -45 -139 -72 55 74 -46 -137 -79 46 79 -13 -104 -65 47 59 -27 -88 -23 65 36 -55 -84 13 98 37 -87 -96 17
2924 17 104 57 -58 -96 -5 92 61 -38 -83 15 85 39 -60 -53 47 82 -6 -92 -23 79 106 1 -88 -36 81 114 27 -85
2952 -85 -42 69 100 13 -66 -15 76 62 -18 -62 20 105 44 -52 -76 25 110 67 -54 -85 2 91 63 -54 -92 -13 73 31
2980 31 -66 -79 2 43 -25 -124 -77 18 43 -54 -138 -99 7 49 -46 -139 -132 -9 33 -44 -129 -105 -5 26 -62 -123 -60 25 13
3009 13 -86 -98 -20 65 35 -67 -104 -15 101 83 -40 -85 -6 88 76 -28 -55 33 98 60 -25 -9 77 116 34 -41 -20 98
3037 98 138 56 -50 -22 88 135 73 -31 -13 76 125 41 -42 3 87 70 -18 -60 20 108 71 -48 -86 8 94 76 -40 -96
3065 -96 -12 93 73 -40 -78 -5 70 38 -54 -59 28 61 -1 -87 -62 47 83 -16 -111 -80 17 85 6 -91 -94 5 76 -2 -90 -68
3095 -68 18 30 -53 -102 -40 50 11 -69 -110 -44 56 43 -89 -121 -48 55 57 -62 -116 -43 39 25 -56 -81 -14 60 -1 -62 -61
3124 -61 37 83 1 -79 -68 54 102 38 -63 -58 52 128 61 -44 -30 73 103 42 -29 8 88 80 5 -37 21 109 95 -16
3152 -16 -72 -7 103 102 -6 -87 -21 78 70 -22 -71 1 66 30 -55 -61 23 58 10 -91 -82 21 78 -5 -96 -91 4 77 7 -99
3182 -99 -110 2 57 -10 -94 -60 28 31 -32 -93 -36 52 33 -53 -93 -34 71 74 -20 -97 -25 78 82 -11 -73 -6 75 59 -30 -48
3212 -48 32 76 37 -45 -41 37 87 35 -68 -67 22 97 57 -61 -71 26 86 26 -58 -41 32 58 3 -44 -13 59 58 -20 -60 -19 85
3243 85 90 -11 -82 -30 79 93 0 -62 -25 74 67 -12 -49 6 65 42 -30 -44 41 78 23 -51 -67 33 90 29 -75 -94 14
3272 14 90 23 -69 -78 4 49 -7 -71 -52 16 22 -33 -89 -44 29 46 -37 -117 -70 31 58 -29 -116 -70 23 35 -36 -78 -36 35 24
3303 24 -52 -59 -1 55 29 -48 -59 15 87 38 -77 -81 11 98 54 -38 -70 23 80 39 -37 -38 31 57 -3 -45 -6 66 63 0 -68 -29
3335 -29 73 86 -6 -78 -36 66 74 -2 -60 -36 41 44 -10 -38 0 64 31 -58 -64 9 72 37 -60 -85 4 93 60 -52 -71 16
3365 16 72 34 -40 -43 11 56 12 -30 -24 55 74 7 -54 -34 61 80 1 -92 -46 50 93 -9 -78 -57 33 69 -27 -69 -23 36 19
3396 19 -35 -53 2 58 32 -58 -87 -7 61 30 -66 -94 -17 60 37 -67 -82 -9 38 2 -65 -53 -1 33 -39 -75 -60 17 40 -40
3426 -40 -113 -78 26 65 -12 -93 -58 30 49 -7 -60 -43 24 38 -25 -67 -16 29 28 -43 -67 -5 69 42 -57 -89 -7 70 59 -27
3456 -27 -71 -3 51 34 -34 -46 15 48 24 -43 -22 53 81 21 -46 -22 66 117 36 -60 -33 67 100 41 -27 -16 70 76 31 -10
3486 -10 13 73 64 1 -28 34 107 71 -20 -59 26 108 89 -12 -56 10 78 68 -22 -50 14 49 31 -33 -41 31 62 16 -61 -42 32
3517 32 66 -10 -76 -70 13 73 10 -85 -73 8 42 -26 -76 -55 1 28 -34 -71 -15 31 25 -53 -88 -28 56 38 -52 -92 -35 43 23
3548 23 -51 -82 -25 31 24 -35 -60 8 42 8 -56 -48 23 73 10 -69 -50 51 86 36 -60 -37 39 78 26 -40 -22 48 71 12 -29
3579 -29 -5 51 52 -7 -44 4 67 53 -12 -66 -12 81 70 -32 -62 -28 56 44 -21 -39 6 34 29 -41 -43 17 46 12 -79 -64 14
3610 14 63 0 -72 -73 5 51 10 -66 -73 -11 33 -23 -55 -51 10 15 -48 -78 -31 28 24 -55 -78 -39 52 43 -31 -84 -47 44 43 -21 -65 -15
3644 -15 47 24 -31 -46 7 53 18 -57 -54 34 62 11 -67 -56 17 80 37 -48 -55 16 63 29 -29 -22 30 55 -4 -28 -7 57 57 -11
3676 -11 -45 -2 87 69 2 -49 -3 67 82 14 -49 -7 53 54 -2 -27 18 64 41 -18 -29 33 70 36 -50 -50 30 69 24 -53 -67
3707 -67 11 74 27 -59 -49 10 45 -14 -61 -38 11 36 -38 -66 -51 31 27 -54 -93 -52 28 43 -31 -87 -53 19 27 -34 -71 -26 19
3738 19 13 -45 -51 7 43 11 -51 -54 14 72 26 -40 -73 16 75 56 -36 -56 15 59 29 -36 -22 30 30 -2 -45 -20 42 47 -7 -50 -21
3771 -21 59 64 0 -75 -34 43 60 10 -56 -22 37 35 -26 -34 -3 37 15 -43 -37 21 62 18 -44 -60 8 54 39 -42 -58 1 62 38
3803 38 -32 -45 16 47 10 -31 -12 36 57 3 -38 -13 49 66 5 -58 -36 48 70 -6 -69 -24 27 45 -9 -37 -1 38 16 -30
3833 -30 -52 7 49 22 -42 -54 6 60 30 -42 -64 7 53 30 -43 -56 11 41 10 -22 -24 31 42 6 -32 -22 48 52 5 -53 -39
3864 -39 49 80 22 -55 -27 47 56 16 -33 -21 42 39 -13 -35 4 54 17 -40 -46 -11 56 25 -52 -78 -16 47 22 -40 -80 -16 22 -4
3896 -4 -49 -56 -16 26 -18 -62 -41 10 24 -8 -66 -38 28 44 1 -66 -57 23 54 2 -62 -29 28 39 -7 -47 -13 30 26 -25 -36 9
3928 9 60 36 -26 -50 11 71 55 -9 -50 7 65 37 -4 -34 15 38 25 -34 -17 35 34 3 -48 -34 28 59 5 -82 -62 16 52
3959 52 5 -71 -55 25 41 -13 -48 -16 31 25 -18 -34 -8 46 24 -28 -42 -1 62 51 -28 -58 -10 46 48 -12 -44 9 52 12 -12
3990 -12 -21 26 40 14 -32 -11 32 59 1 -53 -32 26 51 12 -61 -54 5 41 0 -52 -22 6 18 -23 -39 -17 12 13 -33 -46 -31 32
4022 32 35 -41 -77 -10 42 27 -25 -47 -15 32 20 -29 -22 12 38 21 -30 -20 29 44 15 -32 -23 34 76 14 -36 -33 32 57 24 -34
4054 -34 -29 20 23 -2 -35 -26 20 19 -21 -38 -15 24 23 -37 -68 -28 39 36 -35 -62 -20 40 31 -14 -48 -14 20 6 -18 -29 13 52 7 -34
4088 -34 -22 31 60 15 -37 -38 46 71 28 -21 -20 29 54 21 -2 5 41 44 19 -15 1 55 40 4 -41 -3 60 59 -16 -64 -14 50 35
4121 35 -24 -49 -21 17 -3 -30 -39 -11 14 -8 -50 -42 -3 28 -16 -45 -53 4 46 -9 -61 -50 1 31 5 -39 -53 7 21 -19 -35 -28
4153 -28 22 21 -29 -53 -18 36 29 -30 -58 -25 35 47 -1 -56 -18 32 38 -10 -29 -6 18 19 -15 -19 5 53 18 -41 -38 14 47 28 -38
4186 -38 -44 6 39 12 -37 -42 11 34 2 -29 -17 15 34 -6 -29 -11 40 49 -5 -38 -15 43 54 -5 -51 -2 39 48 13 -22 0 34
4218 34 41 -9 -16 3 49 31 -24 -20 23 48 21 -31 -38 17 62 25 -29 -33 5 26 13 -30 -34 16 23 -4 -34 -26 20 13 -28 -59 -30 35 39
4253 39 -30 -65 -32 21 38 -9 -50 -27 16 14 -11 -42 -8 21 21 -18 -31 4 56 12 -23 -30 26 62 32 -16 -35 17 68 28 -13 -23
4285 -23 10 39 15 -13 -15 17 33 -4 -32 -16 37 43 10 -41 -17 42 51 -4 -36 -18 24 39 0 -26 -14 22 33 -8 -22 4 33 9
4317 9 -35 -39 15 40 20 -37 -29 9 40 21 -30 -27 -1 30 13 -16 -18 19 29 4 -27 -19 31 23 1 -29 -39 29 41 -7 -45 -43 12 34
4351 34 -3 -46 -29 7 17 -9 -29 -25 24 4 -32 -41 0 36 18 -41 -40 -9 47 17 -22 -60 -7 37 30 -23 -37 1 24 -9 -27 -22 23
4384 23 37 -4 -42 -24 30 46 7 -47 -27 21 50 -1 -35 -19 28 41 4 -29 -8 38 29 -5 -14 6 33 27 -23 -41 -4 51 26 -33
4416 -33 -39 -8 44 27 -26 -26 -2 31 5 -34 -25 13 44 -2 -28 -18 19 38 -6 -33 -13 26 46 12 -28 -28 4 40 14 -17 -11 17 27
4449 27 -8 -29 3 29 28 -21 -32 -3 44 25 -17 -34 -11 39 39 -16 -29 -9 27 26 -13 -6 7 31 6 -21 -16 29 44 9 -43 -32 26
4482 26 49 -3 -47 -26 10 38 -7 -40 -37 1 11 -18 -26 -10 20 20 -33 -41 1 24 12 -25 -55 -9 24 18 -19 -59 -17 32 15 -29 -46
4515 -46 -6 15 13 -23 -25 0 19 -4 -38 -25 14 41 6 -35 -41 34 42 5 -34 -27 20 41 18 -23 -13 22 10 -7 -26 -3 26 24 -1
4548 -1 -35 -22 42 36 -10 -52 -3 21 25 -18 -35 -4 21 17 -30 -30 3 24 4 -23 -26 13 41 9 -32 -18 21 55 24 -38 -31 9 43 11
4582 11 -24 -22 18 23 -15 -24 -12 23 21 -18 -27 0 34 35 -6 -40 -4 34 31 -13 -47 -11 38 21 -13 -22 -7 26 2 -13 -19 1 26 0 -45
4617 -45 -37 0 42 5 -32 -44 7 30 8 -40 -35 15 9 -7 -29 -14 12 20 -24 -33 -14 32 32 -8 -51 -15 28 35 -3 -36 -1 19 35 -14
4651 -14 -34 2 31 18 -11 -32 8 32 10 -24 -22 13 40 -3 -49 -37 5 45 14 -32 -35 6 18 5 -21 -15 1 -2 -12 -34 -24 17
4683 17 18 -11 -51 -25 31 20 -22 -55 -13 24 31 -23 -35 -6 23 16 -11 -11 -6 27 24 -17 -22 22 46 25 -26 -26 12 47 21 -22 -23 6 35
4718 35 18 -2 -18 23 25 -3 -21 -14 11 13 -5 -35 -26 26 25 -19 -52 -23 20 28 -25 -49 -22 9 11 -19 -32 -6 18 7 -15 -30 0 28
4752 28 15 -32 -37 0 35 9 -37 -38 -1 29 19 -26 -10 8 23 11 -6 -12 20 21 13 -35 2 23 33 3 -37 -9 18 27 -14 -39 -20
4785 -20 21 24 -1 -28 -14 4 15 -7 -28 -5 16 8 -24 -38 6 31 16 -34 -36 8 37 21 -11 -32 17 26 16 -9 -21 10 36 15
4817 15 -14 -20 25 34 -11 -12 -4 45 37 5 -25 1 27 53 5 -30 1 31 41 6 -8 5 16 18 -10 -16 -11 34 13 -23 -30 -3 26 -1 -44
4852 -44 -54 -15 3 0 -45 -54 -7 9 -14 -34 -37 4 12 -3 -26 -28 17 23 -12 -47 -28 28 35 -3 -22 -15 25 20 2 -22 -8 21 25 -4 -10 7
4888 7 37 15 -8 -27 24 38 32 -21 -20 8 47 27 -3 -13 2 35 32 -2 -18 9 28 3 -30 -9 10 33 4 -52 -23 22 25 -2 -40
4921 -40 -15 4 13 -4 -26 -17 17 27 -12 -26 -5 27 19 -14 -27 18 50 10 -13 -23 0 48 25 8 -21 0 21 25 -10 -5 -2 30 17
4954 17 -20 -8 11 25 4 -34 -26 7 26 -6 -35 -32 19 23 11 -23 -18 -4 18 -9 -16 -10 12 8 -20 -35 -18 21 9 -37 -31 3 29 17
4988 17 -19 -33 -7 28 13 -7 -16 7 15 18 -1 -8 28 37 7 -13 -10 28 47 3 -26 -4 32 46 7 -11 -6 13 25 12 -22 -14 12 14 -2
5023 -2 -18 -14 22 18 -18 -26 0 32 14 -18 -33 -29 25 18 -8 -30 -11 28 17 -5 -8 3 17 -2 -23 -8 16 27 8 -26 -16 30 50 17
5057 17 -16 -12 21 37 23 -1 -7 30 30 19 -8 0 26 34 -5 -17 9 29 13 -2 -35 -3 33 19 -3 -39 -7 18 11 -12 -29 -16 19
5090 19 8 -16 -23 -2 20 0 -36 -31 7 14 6 -27 -22 9 21 13 -21 -16 12 28 -1 -21 -14 9 19 -6 -16 -5 21 22 -11 -25 -2 17 18
5125 18 -14 -22 -10 24 23 -7 -26 -5 7 16 -1 -9 8 14 3 -16 -15 13 14 -2 -30 -26 0 29 13 -27 -42 13 11 -1 -23 -31 4 16 -7
5160 -7 -18 2 20 11 -7 -22 -6 38 36 -2 -24 4 31 34 -2 -18 -8 28 23 1 0 0 31 15 0 -15 -1 22 9 -23 -17 11 29 28 -23
5195 -23 -26 5 23 1 -27 -25 -5 20 2 -6 -7 9 6 -6 -25 -13 11 14 -19 -40 -20 18 24 -8 -29 -10 10 14 -14 -33 -6 17 3 1 -8
5230 -8 5 18 12 -23 -19 26 39 20 -1 -19 12 40 26 -10 -22 7 26 13 -8 -9 6 8 -6 -21 -14 22 15 -1 -35 -12 18 33 -3 -32
5264 -32 -13 14 14 -5 -29 -4 11 9 -12 -21 -3 15 11 -13 -31 -5 35 15 -18 -26 6 23 21 -27 -15 -5 32 25 -7 -11 12 21 8 -3 -9
5299 -9 12 25 7 -6 -5 21 38 10 -20 -2 27 32 3 -23 -13 13 24 -6 -14 -5 14 9 -13 -26 -16 12 -10 -20 -34 -2 18 -3 -27
5332 -27 -39 -2 25 1 -21 -22 -1 12 4 -11 -22 8 21 -9 -20 -10 7 20 -7 -28 -18 18 31 -6 -26 -12 8 25 -8 -9 -9 8
5364 8 18 -10 -4 5 19 20 -19 -24 6 41 22 -15 -24 -1 27 13 -33 -28 5 15 4 -23 -11 2 16 -4 -18 -15 7 16 -6 -33 -10 22 10
5399 10 -19 -22 -17 7 17 -4 -26 -15 14 15 1 -24 6 8 3 -15 -21 3 23 9 -14 -29 -4 21 13 -22 -20 -8 30 12 -6 -11 2 19 5
5434 5 -15 5 26 19 5 -20 -13 14 19 -2 -32 -12 13 20 -13 -23 -6 17 14 2 -17 -16 14 14 -4 -12 1 32 15 -12 -18 0 22 20 -2 -27
5470 -27 4 23 24 -6 -11 0 26 1 0 -4 9 27 6 -20 -16 21 27 7 -26 -1 19 29 10 -19 -28 18 25 3 -4 -7 14 16 -6 -4 -5 8 14
5507 14 -4 -22 0 16 11 -14 -30 -2 16 10 -15 -33 -11 6 -3 -19 -22 8 17 10 -6 -10 7 13 2 -28 -2 5 24 -3 -18 -9 16 28 21 -5
5543 -5 -9 17 10 4 -12 -4 11 19 -7 -14 10 27 14 -7 -24 6 32 22 5 -22 -5 24 13 1 -10 -3 12 13 -10 2 13 8 6 -26 -22 7
5579 7 15 2 -28 -34 -3 21 -8 -27 -25 4 29 7 -9 -4 4 5 -19 -8 -14 13 14 -6 -14 4 31 28 3 -19 4 22 21 12 -13 -3 18 23 -12
5616 -12 -10 -12 9 7 -19 -21 2 20 0 -8 -17 -9 13 5 -22 -22 4 5 -3 -9 -11 -2 13 -2 -11 -1 7 2 -24 -27 0 14 13 -8 -25 -13 18 21 0 -13
5656 -13 -6 14 19 -14 -3 19 35 15 5 3 13 28 19 -13 -1 18 33 11 -14 -10 8 31 23 -4 -7 4 29 5 -12 -6 2 13 -4 -14 -17
5691 -17 8 2 -16 -26 -4 8 9 -8 -21 -16 20 11 -6 -14 -7 5 17 -4 -11 13 24 -6 -11 -22 8 23 12 -12 -17 14 27 19 -16 -12 12 18
5727 18 15 5 4 11 18 2 0 -7 9 16 -3 -13 5 20 15 -5 -19 -15 13 20 -3 -27 -15 5 2 -11 -22 -9 10 -2 -29 -24 -6 13 -9 -20
5763 -20 -22 4 8 5 -12 -2 10 20 8 -3 -5 -4 26 11 -5 -4 13 25 -5 -12 7 23 26 1 -3 -9 22 30 6 -20 -13 15 30 0 -5 2 19
5800 19 4 -4 -12 5 3 1 -12 -24 -1 14 7 -23 -28 -13 10 3 -20 -15 -3 4 7 -24 -15 -14 3 -2 -12 -18 4 8 7 -21 -12 16 23 -1 -14 -10 19 33
5840 33 6 -10 -2 20 18 0 -10 -8 11 21 -7 -13 2 10 14 -18 -23 -4 18 5 -23 -36 4 13 4 -8 -18 -1 10 -6 -27 -26 -10 2 -5 -25
5876 -25 -11 20 8 0 -32 -17 -3 12 -12 -29 -15 1 14 -11 -16 -5 13 15 3 -11 4 24 13 4 -5 9 34 27 0 -15 2 19 17 -5
5910 -5 -19 5 16 -3 1 -14 8 3 -9 -16 -10 6 -7 -6 -26 -13 13 15 -4 -20 -7 1 5 -3 -25 -14 6 10 -3 -9 -4 10 0 -13 -17 -4 22
5947 22 9 -5 -24 11 24 12 -6 -15 0 15 14 -12 0 -1 13 5 -11 -9 14 24 13 -8 -4 12 17 3 -4 -12 16 24 2 -29 -9 -7 3 -7
5983 -7 -22 -19 14 0 -24 -19 -8 5 15 -19 -20 -13 21 13 -18 -18 -8 0 13 -5 -9 12 16 10 -8 -6 11 17 13 -2 -8 14 17 7 -15 -14 19 24 6
6022 6 -13 -14 5 27 14 -9 1 4 12 7 -1 -5 17 11 -7 -16 -8 28 16 -9 -17 -1 7 13 -10 -19 -1 -4 0 -14 -21 -5 3 2 -9 -30 -3 6 0 -22 -7
6063 -7 7 17 13 -9 -9 15 24 7 -7 -7 5 16 15 -5 -2 13 15 -6 -19 12 17 15 -8 -15 2 17 10 -6 -19 -15 4 14 14 7 -1 8 5 2 0 3 18
6104 18 0 -3 -26 3 18 -3 -19 -27 3 18 13 -21 -9 -4 0 0 -14 -16 8 14 -19 -14 6 11 21 1 -10 11 13 13 -9 -5 -2 17 23 9 -10 -8
6142 -8 6 10 1 -3 0 12 9 -12 -22 -3 21 2 -15 -18 -5 6 5 -7 -21 -8 7 2 -6 -11 -6 -3 -3 -25 -8 13 7 -12 -22 1 5 13 -8 -25 -9
6181 -9 8 6 -8 -6 -18 18 19 2 -5 9 4 14 5 -1 19 16 18 0 4 28 25 16 -9 -11 14 30 10 5 5 14 23 8 -8 -9 21 4 -9 -8 -10 11 17
6222 17 -14 -16 -1 -4 12 -13 -15 -9 8 1 -12 -26 -2 10 -2 -2 -10 -8 14 -9 -29 -11 -1 2 15 -30 -8 -1 3 -1 -5 -12 -9 8 5 -17 -11 12 9
6261 9 2 -6 4 21 24 -12 -10 -2 16 24 -3 -14 -10 10 16 2 -9 -5 1 11 -4 -15 -25 15 2 -22 -17 -8 2 -4 -19 -5 2 19 0 -2 -18 -6
6299 -6 9 16 4 -7 3 7 2 5 8 18 15 -3 -19 -4 20 22 19 -11 -11 9 24 10 -1 -1 10 11 8 -5 -2 22 20 -8 -4 10 19 0 -7 -18 6
6338 6 11 0 -16 -16 -8 4 7 -18 -11 -14 -8 -11 -15 -11 8 -1 -10 -10 -14 16 12 -1 -18 -8 18 10 2 -4 -10 0 19 10 -6 -5 13 7 2 3 6 14 13 -1 -6 5 25
6383 25 15 -8 -14 3 22 19 3 -7 5 0 19 1 -3 10 7 14 -4 -3 14 18 4 -13 5 11 13 3 -25 -16 -1 11 -9 -15 -10 10 0 -7 -18
6420 -18 -15 4 2 -12 -17 -4 8 10 -20 -8 1 22 8 0 -7 -7 10 20 -5 0 7 27 18 -12 -17 12 28 -1 4 -4 2 14 1 -5 -4 2 15 -10 -21
6459 -21 -3 4 -4 5 -13 -17 9 -2 -2 -16 -6 -5 2 -22 -18 -8 5 6 -13 -17 -11 -7 -18 -19 -16 -4 -8 -14 -16 -8 -11 9 2 -15 4 9 17 8 -14 -6 5 12 -2
6502 -2 -3 -8 10 5 5 -8 -7 7 7 6 -4 11 13 10 -3 -20 1 10 7 -10 -17 2 18 25 -7 -13 -7 9 8 -4 -6 0 22 23 -1 -7 6 13 7 -17 -11 7
6544 7 15 -2 -6 -14 8 19 15 -13 0 16 17 10 -7 -2 18 11 0 -14 2 22 15 2 -6 -6 21 19 -10 -10 4 13 11 2 -3 -6 2 7 -9 -12 4 7 -9 -29
6586 -29 -18 -7 7 -1 -29 -24 -7 15 -15 -28 -30 -10 -10 -1 -16 -15 0 -3 -18 -21 -2 -1 15 -13 -21 -10 3 5 -4 -21 -16 12 16 -4 -6 -2 3 2 -9
6625 -9 -4 5 16 16 -10 6 7 17 10 0 -4 14 20 3 -5 -11 -4 17 -2 -11 0 -5 7 2 -6 -10 10 6 -6 -11 -12 2 7 -10 -17 -17 9 4 4 -11 -5 3 -4 8
6669 8 0 2 14 20 2 -9 -5 11 -3 -19 -14 11 20 6 -10 -3 0 15 11 -10 -8 -7 24 7 -5 -5 10 7 7 -17 -6 20 6 4 -16 -12 9 17 -8
6708 -8 -25 -8 -10 5 -12 -25 -21 -9 -4 -24 -23 -7 -5 -1 -18 -17 -5 17 10 -19 -13 -5 -1 16 -3 -12 5 15 24 -18 -3 7 8 -1 -8 -2 8 15 2 -9
6748 -9 -7 5 9 -3 -13 -13 3 5 -4 -15 -10 4 0 -8 -2 -7 6 5 -13 -23 -24 3 -3 -21 -25 -10 0 -10 -22 -23 -4 -3 -20 -12 -17 -5 -13 -11 -20 -11 13 15
6790 15 3 -5 -2 11 9 -6 -8 -5 15 22 2 4 2 13 12 11 -8 -2 0 18 4 -9 -4 9 -2 -16 -18 -4 12 2 -12 -10 -10 -3 9 -6 -18 -17 9
6829 9 8 -7 -10 5 4 10 -8 -6 0 12 -9 -17 -12 4 0 0 -24 -4 -1 2 -4 -13 -20 14 8 -8 -22 0 12 4 0 -12 8 12 3 3 -16 3 5 12 -17 -2
6871 -2 3 12 4 -5 -9 -5 1 -3 -2 -14 -7 -6 -8 -17 -14 4 7 -8 -26 -20 2 -5 1 -14 -20 -2 9 -3 -8 -3 14 16 -1 -5 -8 15 13 -8 5 1 20 2 4 -5 -5
6916 -5 10 11 5 7 -1 6 8 -1 4 17 3 7 -4 -8 8 15 3 -10 -6 6 6 -3 -7 -20 -8 0 -10 -22 -14 -9 -4 -8 -22 -7 0 -9 -12 -24 -10 6 8 -12 -18
6959 -18 -3 -1 7 -12 -13 -3 9 -6 -3 -7 9 9 7 -8 -7 0 9 -3 -9 -8 2 15 -3 -5 -9 5 14 10 -4 0 -5 7 6 -3 -1 8 6 0 -12 -11 8 7 -10
7002 -10 -23 -10 2 -1 -15 -17 -11 6 8 -3 -7 -17 -8 1 -20 -17 -7 4 -10 -20 -13 12 5 7 -29 -19 12 13 -9 -1 -9 8 15 9 7 6 13 4 4 -1 6 12
7044 12 6 -8 -10 9 15 13 -12 -18 5 5 6 -7 -4 -3 5 4 -4 -11 -1 0 -2 -10 -29 -4 9 1 -21 -21 -6 -1 -3 -19 -10 1 -2 -10 -11 -12 -3 -12 -10 -8 2 1 4 2
7090 2 -3 -3 13 8 5 -12 -10 5 21 3 1 -2 13 18 -3 -6 -8 11 3 -8 -1 -1 9 2 -19 1 -6 7 -5 -15 -15 5 15 4 -17 -7 2 0 -6 -24
7130 -24 -10 -12 -5 0 -14 -2 4 -2 2 -20 -14 -3 8 6 -12 -4 5 12 -5 -11 10 -3 10 -4 -4 0 17 19 -1 5 1 26 18 -4 8 12 16 17 6 8 18
7171 18 18 8 3 -2 3 11 -7 1 9 0 5 3 -20 -8 -1 -5 -7 -11 -21 1 5 -8 -12 3 -2 -2 -3 1 -9 0 -10 -15 7 -5 10 11 1 -13 20 12 3 -1 -11
7214 -11 4 8 6 2 -5 1 -2 1 1 14 16 23 9 -8 14 21 16 9 -1 6 15 20 -3 -2 -7 8 13 -14 -1 -2 16 9 -8 -9 -1 17 -3 -6 -20 -7 8 -6
7256 -6 0 -11 4 16 2 2 -2 12 18 32 -3 -2 4 18 3 -5 6 16 26 2 7 4 19 27 9 -6 4 20 11 14 2 -1 12 6 10 -6 10 24
7294 24 6 -5 5 1 21 0 -6 -12 -9 10 16 -13 -13 2 14 13 -6 -11 -3 2 -3 -11 -2 7 -2 0 -4 -1 12 25 0 -17 -4 12 22 7 -1 0 9 9 9 -1
7336 -1 -7 10 14 -2 8 12 13 4 -1 -3 8 17 9 6 0 10 6 19 -2 -9 3 19 4 9 -11 6 0 9 -2 -2 -4 15 -7 -12 -2 6 5 4 -17 -25 6 -3 -1
7379 -1 -1 -1 3 -6 -12 -12 -2 16 10 4 -14 12 23 15 -3 -3 4 14 9 0 1 -1 21 7 6 5 15 16 20 1 6 22 22 13 -5 1 13 10 7 -1 0 7 12 2 -8
7424 -8 -5 0 3 3 -6 8 16 7 -14 -19 2 12 6 -2 -4 5 13 11 -8 -12 -10 6 6 -11 6 5 1 5 1 -10 5 19 4 -14 6 9 28 11 20 9 20 20 12
7467 12 8 9 13 9 15 -4 11 7 -1 -2 -14 -8 14 16 -7 -8 -11 8 0 -6 -13 -3 3 -1 -2 -4 -2 7 11 -5 -3 5 14 3 -8 0 6 19 2 -3 -6 2 12 3 -5 4 6
7514 6 1 19 2 1 13 7 9 8 14 19 16 0 0 8 17 27 -5 -9 12 11 17 7 -10 0 0 11 -7 0 2 14 1 -17 -2 2 1 -4 -4 -9 -7 7 -1 -12 -15
7557 -15 -6 4 -16 -1 7 13 16 6 -9 3 3 10 3 0 -8 2 16 8 2 3 6 14 17 -4 1 11 10 9 3 4 10 14 -2 7 0 19 0 3 -1 10 8 0 -5 -9 6
7602 6 3 8 0 -19 -3 11 -4 -12 -2 -7 10 1 -16 -18 1 1 -6 -9 -1 6 11 4 -9 -5 14 15 0 -6 4 6 19 9 2 17 20 8 3 12 12 24 11 -1
7644 -1 5 13 20 10 0 -8 8 10 -5 -10 -5 11 3 -3 -3 6 4 -4 -9 -7 -19 8 5 -1 -16 -11 -7 -8 -15 -17 -11 8 5 4 -3 -27 10 13 -6 -7 9 11 -3 -3 -7 2 7
7691 7 3 2 -3 9 4 21 12 7 11 19 9 0 19 10 18 2 1 5 19 12 10 3 -3 10 6 -2 -21 -6 5 7 -7 -14 -14 9 17 -12 -10 0 8 -6 -1 -14 7 0
7735 0 -1 -15 -12 -10 14 0 -13 -6 0 14 4 -10 -11 -4 10 4 -11 -2 2 13 10 8 1 7 16 4 -7 2 13 14 6 1 5 18 9 5 -7 6 7 7 -12 -9 -9 6
7779 6 -5 0 -8 -2 9 -11 -14 -16 -10 -1 -6 -11 -5 -4 -2 -9 -12 -4 1 2 -8 3 -9 -1 16 5 4 -2 9 14 -8 0 7 6 11 7 17 11 11 18 1 1 8 17 15 9 1 16
7827 16 15 10 1 -7 9 25 10 7 0 9 5 -7 -12 2 -4 2 1 -6 -5 5 -1 4 -28 -14 2 -11 -3 -19 -17 7 0 5 3 15 9 4 -8 -10 -5 16 21 -1 7 4
7871 4 11 7 -3 -1 -5 16 10 5 -12 9 13 6 6 1 10 17 1 11 0 9 15 0 3 -8 4 6 5 -10 -6 16 7 -3 3 -1 2 0 -11 -24 -12 3 -10 -6 -5
7914 -5 -12 -6 12 -7 -23 -7 10 1 -5 -5 4 6 12 9 0 -5 28 19 11 17 13 22 21 9 1 17 4 9 -4 6 11 15 8 5 6 -6 11 6 -5 -2 4 6 0 -5 0 -2 -5
7961 -5 -15 -5 -9 5 5 -4 -12 -3 5 6 -10 -12 -11 3 -14 -9 -12 -3 1 -5 -10 5 7 -3 11 -3 -10 1 11 11 2 1 4 13 0 7 8 9 17 5 3 18 17 10 6 5
8007 5 4 -4 11 4 -19 12 19 4 -12 -5 -7 -2 1 2 -4 -7 -4 2 -12 -17 -3 -4 -6 -13 -6 -1 8 -2 -11 -12 -1 3 -10 -17 -7 5 10 -7 11 10 -2 2 -3 -5 5
8052 5 10 1 -8 -6 1 14 12 11 -3 2 13 9 0 -3 1 14 5 3 8 -1 3 8 -8 -6 13 -9 15 -6 -13 -8 -1 -4 -13 -3 -20 10 2 -12 1 0 -15 -14 -7 2 -11
8097 -11 -3 -10 0 -4 9 2 -4 -2 -11 3 9 -4 -6 1 5 2 -9 -1 3 -4 -1 2 4 0 10 10 1 1 8 8 5 -2 -1 7 14 14 -3 -13 2 7 7 -5 -8 4 5 5 -17 -2
8145 -2 9 4 4 -7 -8 1 1 -1 -14 -8 0 1 -3 -1 -6 11 -1 1 6 7 16 13 5 -6 7 17 11 2 -4 11 9 6 9 -1 11 15 7 -9 4 5 1 10 3 -2 11 8
8191H
$$ Imaginary data points
##PAGE= N=2
##DATA TABLE= (X++(I..I)), XYDATA
0 0 0 0 0 0 0 0 0 0 0 0 0 0 0 0 0 0 0 0 0 0 0 0 0 0 0 0 0 0 0 1 -4 5 -8 8 -8 8 -8 8 -8 9 -11 12 -15 16 -17 19 -20 24
48 24 -27 29 -33 37 -44 51 -60 72 -90 121 -175 316 -1557 -1934 63 -888 -2119 -2386 -1122 -669 -1060 -1687
70 -1687 -1453 -953 -599 -877 -1246 -1203 -446 70 -380 -1310 -1120 205 998 74 -1150 -831 693 1280 316 -592
90 -592 -56 1031 1162 389 47 642 1293 1125 458 299 964 1664 1495 574 110 815 1887 1874 758 56
110 56 796 1900 1765 630 196 1059 1779 1271 364 478 1341 1564 774 41 358 1274 1529 739 -147 -69
130 -69 881 1366 715 -302 -328 549 1030 386 -472 -346 459 613 -234 -844 -258 627 376 -805 -1236 -347
150 -347 532 147 -950 -1303 -577 133 -49 -821 -1244 -851 -208 -174 -839 -1228 -715 -41 -361 -1284 -1329 -254
170 -254 352 -492 -1540 -1197 45 409 -489 -1252 -890 -21 271 -168 -666 -598 -71 278 -29 -501 -307 443
190 443 648 -108 -699 -71 1009 951 -177 -715 179 1218 983 -53 -391 305 976 790 179 30 451
209 451 813 609 95 4 552 1021 633 -227 -312 617 1246 576 -500 -495 584 1130 402 -488 -326 467 644
230 644 73 -378 -110 402 371 -183 -543 -177 440 432 -334 -881 -398 512 541 -376 -1029 -508 381 374 -451 -873
252 -873 -364 240 26 -659 -758 -121 271 -205 -874 -774 1 357 -181 -917 -879 -122 389 2 -768 -885 -209
273 -209 356 10 -697 -696 26 335 -248 -771 -344 447 396 -448 -806 -153 606 494 -265 -642 -177 523 606 33
295 33 -423 -141 526 658 63 -315 133 740 538 -196 -287 497 1007 443 -394 -310 578 1003 450 -288 -268 402
317 402 777 429 -131 -191 255 563 286 -217 -168 391 584 4 -567 -217 603 643 -233 -801 -257 572 511 -263
339 -263 -666 -254 331 302 -191 -482 -207 209 150 -296 -491 -66 404 161 -542 -663 67 642 210 -637 -705
360 -705 84 632 210 -504 -518 87 445 68 -399 -297 197 335 -99 -459 -202 363 440 -133 -626 -312 431
381 431 580 -99 -693 -392 380 531 -114 -592 -221 369 284 -270 -436 40 410 102 -423 -431 108 491 181
402 181 -442 -558 25 569 347 -366 -582 -3 528 289 -339 -392 154 467 42 -402 -180 403 463 -107 -495
423 -495 -144 498 544 -53 -517 -243 393 558 62 -437 -253 306 479 -5 -386 -93 407 334 -263 -440 111
444 111 591 261 -441 -498 153 632 285 -377 -470 48 489 299 -219 -384 31 395 211 -263 -281 210 456
465 456 25 -475 -248 414 564 -63 -594 -291 426 560 -47 -530 -290 263 383 -59 -391 -182 206 204 -197
486 -197 -409 -104 310 164 -377 -587 -83 447 239 -490 -713 -113 439 207 -449 -588 -82 288 46 -371
506 -371 -350 45 232 -44 -394 -277 189 393 -24 -497 -346 328 608 82 -502 -322 395 617 121 -327 -96
527 -96 415 463 57 -175 135 513 411 -57 -194 209 642 486 -98 -323 131 698 568 -79 -357 58 580
548 580 449 -111 -263 136 446 173 -273 -200 257 407 -10 -444 -279 248 419 -38 -548 -453 124 394 8
569 8 -524 -468 47 250 -124 -496 -319 93 110 -332 -548 -178 246 120 -438 -640 -188 333 198 -398 -641 -219
591 -219 277 190 -302 -486 -159 202 98 -293 -373 6 286 23 -421 -364 202 453 22 -513 -379 271 551
612 551 81 -407 -278 250 441 128 -202 -93 265 376 100 -147 45 450 475 2 -285 97 658 587 -32
633 -32 -326 120 674 574 10 -204 161 532 429 43 -71 219 427 268 -92 -119 241 508 192 -311 -323
654 -323 216 542 143 -469 -438 116 381 3 -489 -426 -12 115 -220 -492 -350 -35 -37 -421 -662 -404 17 15
676 15 -487 -824 -498 64 58 -508 -839 -489 13 0 -456 -665 -337 -9 -120 -466 -500 -109 133 -107 -509 -475
698 -475 32 339 41 -439 -415 116 455 178 -289 -261 175 431 211 -118 -58 314 450 146 -120 100 554
719 554 565 93 -179 160 681 659 148 -147 163 639 671 262 1 190 561 554 225 58 320 625 468 38
741 38 -24 425 730 428 -112 -111 412 718 375 -123 -146 279 530 284 -81 -103 204 358 125 -187 -135 227 301
764 301 -76 -433 -210 291 310 -246 -626 -325 200 199 -291 -589 -358 14 -4 -340 -522 -341 -66 -124 -450 -570
786 -570 -280 30 -139 -611 -689 -198 188 -93 -636 -667 -185 154 -76 -475 -487 -132 81 -98 -364 -322 12 143
808 143 -113 -384 -205 221 317 -93 -440 -186 343 435 6 -329 -115 310 395 60 -198 -6 322 336 15 -141
830 -141 121 427 268 -133 -200 211 548 303 -192 -267 146 495 312 -125 -238 104 405 248 -123 -173 140
851 140 327 90 -217 -115 283 374 -31 -353 -138 327 395 -26 -365 -183 243 338 2 -303 -192 149 238 -49
873 -49 -260 -95 209 154 -215 -363 -1 336 135 -345 -435 -3 330 120 -329 -416 -69 221 101 -229 -346 -99
895 -99 146 20 -272 -292 50 220 -79 -424 -275 200 312 -101 -466 -245 229 320 -36 -333 -209 151 273
916 273 25 -203 -77 220 251 -50 -218 39 387 288 -147 -274 111 484 308 -139 -273 83 443 314 -79
937 -79 -192 60 335 211 -82 -131 150 321 96 -218 -146 233 364 22 -345 -222 241 374 18 -361 -273 142
959 142 304 28 -273 -201 109 188 -84 -291 -103 193 150 -206 -335 -28 312 191 -243 -378 -69 311 233 -162
981 -162 -335 -77 245 192 -135 -250 -7 237 86 -224 -199 153 315 8 -336 -209 200 335 9 -345 -254
1002 -254 141 303 67 -291 -257 81 233 -9 -278 -160 161 178 -149 -323 -59 266 174 -238 -386 -62 299
1023 299 206 -186 -363 -98 234 210 -115 -290 -69 208 148 -157 -210 84 277 48 -259 -204 193 350 37 -309
1045 -309 -225 174 351 80 -265 -214 115 275 78 -213 -149 132 213 -29 -236 -65 246 212 -162 -326 -51 309
1067 309 244 -168 -356 -67 277 244 -110 -296 -74 213 177 -111 -206 17 231 91 -210 -190 139 323 82 -273
1089 -273 -213 185 387 122 -237 -239 120 348 134 -189 -163 132 264 46 -179 -70 214 227 -89 -258 -38 287
1111 287 249 -119 -330 -100 258 267 -86 -321 -131 199 195 -99 -285 -76 170 86 -196 -227 61 228 27 -292
1133 -292 -258 86 291 74 -282 -288 68 302 106 -232 -238 77 254 83 -190 -142 161 227 -23 -229 -48 273
1155 273 251 -83 -277 -58 303 314 -44 -279 -94 244 286 -23 -228 -66 218 180 -80 -200 28 238 90
1176 90 -215 -227 96 284 75 -285 -290 59 292 81 -260 -300 3 223 59 -224 -219 27 160 -39 -269 -147
1198 -147 131 174 -128 -337 -147 201 236 -118 -373 -162 195 229 -65 -302 -148 149 164 -80 -230 -39 160
1219 160 83 -170 -212 45 237 88 -242 -273 47 315 138 -234 -294 31 282 122 -175 -213 48 216 48 -169
1241 -169 -108 134 208 -18 -219 -83 247 283 -22 -281 -103 283 336 10 -239 -102 220 274 31 -159 -21 212
1263 212 210 -45 -145 77 278 153 -137 -193 93 330 173 -189 -250 50 308 170 -158 -231 1 212 90 -169
1285 -169 -168 64 171 -41 -252 -163 127 168 -105 -326 -201 142 222 -89 -358 -232 100 179 -70 -283 -157 84
1307 84 114 -105 -231 -57 148 80 -181 -256 13 252 136 -213 -282 34 293 171 -167 -243 26 250 158 -102
1329 -102 -143 69 216 89 -125 -80 162 268 37 -199 -81 253 317 30 -258 -108 234 325 50 -197 -87
1350 -87 172 244 42 -119 -18 193 196 -42 -131 47 280 198 -129 -216 71 329 209 -129 -236 28 302 204 -101
1373 -101 -188 16 207 106 -123 -135 83 187 10 -219 -147 146 237 -12 -308 -202 139 248 -30 -311 -229 57
1395 57 173 -48 -254 -180 35 74 -141 -258 -116 96 56 -228 -317 -90 176 81 -244 -359 -106 159 104 -206
1417 -206 -297 -89 139 75 -144 -205 -21 139 17 -189 -163 116 224 16 -241 -169 171 277 35 -241 -155 137
1439 137 257 71 -155 -123 117 205 43 -135 -52 177 189 -60 -196 12 259 188 -123 -244 -1 279 190 -112
1461 -112 -240 -21 203 161 -63 -162 -10 170 107 -114 -136 93 220 56 -202 -142 173 300 42 -233 -137 162
1483 162 289 79 -177 -129 118 220 75 -119 -75 139 193 -10 -152 -13 223 195 -87 -237 -6 272 207 -105
1505 -105 -250 -38 196 180 -82 -189 -49 154 107 -98 -181 16 153 47 -187 -171 93 222 18 -255 -207 102
1527 102 257 40 -204 -191 67 209 56 -157 -120 76 176 4 -151 -42 179 177 -70 -208 -10 266 210 -96
1549 -96 -234 -37 235 211 -62 -198 -56 176 173 -50 -172 -21 164 85 -131 -161 46 209 13 -237 -196 82
1571 82 236 21 -236 -211 39 187 38 -203 -205 10 140 15 -169 -139 76 125 -83 -237 -79 173 155 -110
1593 -110 -263 -75 195 173 -80 -228 -85 157 170 -36 -182 -39 146 124 -90 -143 55 201 67 -194 -171 85
1615 85 245 52 -221 -196 79 222 64 -176 -192 25 171 52 -148 -147 44 129 -42 -205 -114 151 160 -106 -250
1638 -250 -77 183 162 -98 -251 -101 163 174 -39 -206 -87 122 138 -49 -147 -3 170 83 -131 -154 87 224
1660 224 85 -184 -164 88 256 98 -149 -181 49 208 108 -113 -139 39 163 39 -156 -95 108 163 -58 -203
1682 -203 -77 165 158 -85 -230 -97 159 175 -47 -212 -125 109 155 -24 -173 -61 128 109 -101 -159 34 196
1704 196 76 -159 -161 81 263 98 -147 -179 65 231 151 -91 -142 39 209 103 -95 -79 125 199 24 -137
1726 -137 -35 189 198 -14 -189 -60 192 215 3 -194 -95 130 201 10 -170 -87 117 128 -56 -161 -13 157
1748 157 55 -139 -172 42 193 76 -169 -208 22 204 117 -128 -198 -13 166 105 -100 -146 38 149 29 -149
1770 -149 -88 117 168 -32 -195 -99 160 197 -21 -199 -118 127 190 -9 -185 -115 87 138 -60 -173 -66 103 56
1793 56 -145 -190 -21 150 36 -198 -236 -32 155 58 -183 -254 -68 121 53 -152 -203 -63 91 1 -169 -157 39
1816 39 101 -54 -207 -115 107 152 -36 -221 -130 118 188 11 -185 -114 100 185 25 -124 -42 133 139 -40 -111 32
1840 32 203 121 -86 -135 57 226 149 -78 -163 34 231 170 -49 -153 17 190 113 -72 -79 80 176 37 -122
1863 -122 -48 144 190 8 -165 -81 148 236 36 -164 -103 114 201 52 -126 -82 114 153 6 -120 -10 144 102
1886 102 -75 -143 6 196 108 -110 -185 -14 186 144 -104 -207 -35 144 92 -96 -166 -17 102 31 -141 -137 60
1909 60 112 -26 -208 -154 74 150 -24 -221 -178 56 155 -4 -190 -152 52 133 -4 -153 -74 90 106 -70 -147 -18
1933 -18 154 120 -86 -168 8 211 172 -59 -169 -2 203 188 -34 -116 23 167 110 -49 -62 80 170 51 -105
1956 -105 -71 123 204 50 -142 -117 117 211 68 -147 -125 75 177 45 -118 -93 62 108 -30 -141 -52 117 93
1979 93 -92 -182 -38 156 129 -111 -210 -63 135 134 -80 -174 -49 115 81 -84 -131 3 114 34 -118 -120 49 149
2003 149 8 -184 -159 56 171 24 -192 -174 34 144 28 -163 -139 33 99 -18 -164 -80 75 84 -94 -176 -60
2026 -60 127 105 -99 -203 -76 139 129 -69 -201 -74 115 112 -52 -128 -23 112 74 -74 -106 39 156 60 -113
2049 -113 -104 87 214 76 -129 -122 89 212 107 -83 -94 72 167 77 -69 -41 112 169 20 -88 -4 150 162 -35
2073 -35 -142 -17 172 182 -27 -165 -36 151 156 -16 -132 -31 106 101 -44 -100 12 129 54 -112 -108 54 175
2096 175 58 -136 -146 58 189 77 -124 -151 34 152 64 -96 -103 50 120 23 -102 -60 98 121 -46 -155 -45
2119 -45 143 155 -31 -175 -55 129 146 -22 -162 -78 95 110 -35 -122 -26 98 52 -96 -131 13 139 49 -138
2142 -138 -156 26 167 62 -133 -153 19 156 76 -96 -121 17 127 38 -91 -78 68 112 -18 -145 -55 136 154
2165 154 -42 -164 -50 133 167 -22 -161 -84 95 137 -13 -136 -60 75 85 -58 -125 -15 110 51 -125 -153 19
2188 19 148 47 -142 -167 0 132 53 -116 -169 -22 88 38 -106 -126 13 88 -15 -144 -99 75 112 -57 -179
2211 -179 -84 107 137 -28 -163 -102 84 143 -3 -123 -81 70 110 0 -113 -16 114 78 -79 -119 49 163 81
2234 81 -99 -139 44 181 100 -76 -137 14 159 106 -44 -91 29 137 56 -76 -61 89 148 15 -120 -43 138
2257 138 172 3 -118 -60 112 169 33 -107 -66 108 160 36 -87 -19 125 122 -15 -94 34 165 87 -77 -109 46
2281 46 181 106 -72 -134 1 142 106 -57 -127 -16 113 77 -78 -109 20 92 1 -141 -102 60 115 -39 -170 -109
2305 -109 55 106 -16 -170 -133 34 98 -18 -157 -114 35 50 -68 -144 -50 91 40 -122 -166 -18 120 57 -118
2328 -118 -167 -29 118 94 -66 -148 -28 103 79 -44 -114 -3 102 34 -93 -72 78 135 -2 -128 -69 99 169
2351 169 21 -111 -95 78 159 52 -86 -86 77 129 21 -85 -27 100 108 -41 -99 20 153 110 -59 -105 19 164
2375 164 129 -44 -118 -11 144 131 -20 -86 -3 125 69 -59 -63 61 136 28 -102 -72 93 144 10 -126 -112 60
2399 60 142 36 -125 -133 31 107 5 -128 -86 38 55 -64 -134 -60 62 36 -114 -156 -43 96 71 -111 -193 -76
2423 -76 82 80 -69 -164 -70 75 58 -76 -109 15 97 21 -103 -78 68 124 10 -114 -73 87 168 70 -89 -86 60
2448 60 169 90 -57 -49 80 151 49 -51 7 135 116 3 -73 28 164 135 -28 -99 2 145 148 -9 -103 -25 123
2473 123 111 -26 -93 16 95 53 -61 -69 57 115 28 -109 -95 64 145 33 -114 -120 29 140 47 -108 -101 20 104
2498 104 12 -99 -65 47 65 -40 -121 -35 96 69 -70 -153 -49 76 97 -50 -165 -89 75 86 -60 -140 -68 55
2522 55 33 -97 -117 -15 67 -15 -131 -118 6 96 18 -139 -138 -3 118 37 -122 -129 10 101 35 -101 -76 43 89 2
2548 2 -89 -19 93 95 -38 -99 -16 135 144 -4 -94 -31 134 155 16 -95 -17 127 122 1 -51 30 113 70 -48 -53 60
2575 60 131 53 -78 -84 41 134 72 -85 -115 18 134 57 -95 -86 15 93 -4 -89 -67 55 77 -49 -109 -45 70 97
2601 97 -46 -136 -74 76 111 -21 -136 -71 72 98 -11 -110 -33 73 49 -49 -74 29 109 48 -82 -92 38 134 70
2626 70 -96 -123 14 126 72 -77 -115 3 88 28 -81 -70 26 66 -11 -103 -55 70 77 -45 -143 -74 78 102 -23 -142
2652 -142 -93 58 92 -19 -115 -60 50 67 -45 -84 0 72 46 -66 -70 31 135 60 -68 -98 25 130 87 -61 -95
2677 -95 17 127 76 -43 -64 36 101 37 -51 -26 80 106 -8 -90 -41 102 131 -1 -126 -65 94 114 -9 -119
2701 -119 -64 61 84 -16 -90 -41 66 57 -59 -94 -6 94 44 -84 -115 6 125 69 -83 -118 -8 125 68 -54
2725 -54 -95 17 93 37 -48 -50 55 85 17 -85 -40 81 115 -9 -104 -56 63 128 3 -116 -79 36 99 -1 -94 -62
2751 -62 42 55 -49 -92 -27 69 34 -91 -134 -20 91 43 -107 -149 -29 73 47 -82 -130 -41 55 30 -74 -89 -10
2776 -10 53 -17 -84 -69 42 83 -14 -119 -59 62 116 2 -109 -80 59 118 29 -83 -56 66 75 -3 -58 -21 68 67 -40
2803 -40 -95 3 114 75 -70 -111 1 114 81 -53 -110 -18 77 67 -34 -82 -4 81 36 -54 -57 42 87 16 -81 -64 69
2830 69 113 7 -109 -72 68 138 35 -81 -56 57 100 26 -53 -19 84 92 0 -55 11 118 86 -31 -69 26 125 100
2856 100 -36 -90 -7 119 101 -31 -76 0 94 71 -38 -53 37 86 27 -69 -51 55 116 17 -93 -81 61 119 21 -102
2882 -102 -67 38 98 27 -73 -54 42 84 3 -74 -13 78 59 -39 -86 5 108 92 -39 -105 -14 101 103 -20 -95 -23 79
2909 79 71 -20 -69 -15 72 26 -67 -73 30 66 -11 -103 -91 24 97 -5 -136 -125 -1 72 7 -119 -103 -10 40 -29 -107 -69
2937 -69 22 26 -67 -132 -40 48 33 -93 -142 -53 74 59 -58 -131 -50 60 67 -40 -84 -23 56 41 -57 -63 33 91 32 -66 -55
2966 -55 59 116 28 -72 -63 59 124 60 -54 -71 43 113 41 -38 -31 54 87 10 -58 5 97 81 -14 -70 -3 112 112 -13
2994 -13 -91 -2 82 104 4 -84 -13 76 67 -17 -63 26 86 51 -51 -61 45 99 20 -79 -79 24 114 45 -80 -86 9 86 36
3023 36 -65 -81 8 61 -8 -77 -36 47 51 -47 -105 -41 62 54 -45 -121 -76 58 77 -16 -111 -55 52 59 -30 -87 -32 51 24 -59
3053 -59 -72 18 83 16 -82 -86 13 104 40 -62 -87 13 93 50 -56 -75 19 101 39 -48 -37 57 86 9 -60 -5 88 97 -10
3082 -10 -78 -14 81 105 17 -81 -48 75 97 -3 -81 -45 65 62 -30 -50 7 72 23 -57 -71 15 87 30 -78 -97 -6 76 43
3111 43 -68 -109 -5 70 25 -68 -80 21 64 -13 -79 -45 46 55 -34 -104 -44 50 69 -22 -100 -58 44 79 -11 -92 -52 33 66
3140 66 -30 -71 -14 62 37 -44 -59 18 77 28 -50 -73 8 99 58 -43 -91 -5 87 64 -24 -58 26 81 27 -35 -18 53 79 4
3170 4 -57 -6 73 104 11 -74 -35 74 119 28 -69 -34 61 96 17 -48 -11 65 64 -15 -47 12 72 42 -48 -61 20 94 49 -51
3200 -51 -99 -1 82 54 -51 -84 -7 63 30 -65 -60 12 35 -8 -81 -42 25 59 -25 -95 -60 31 73 -16 -108 -86 33 55 -14 -90
3230 -90 -57 30 33 -35 -70 -23 47 28 -62 -81 -1 71 45 -58 -96 -21 84 63 -43 -84 -17 61 57 -37 -64 0 63 7 -63 -36
3260 -36 26 53 -5 -68 -38 34 77 14 -76 -67 43 101 13 -73 -47 41 71 11 -46 -8 60 58 -21 -55 7 73 49 -30 -73 11 97
3291 97 62 -30 -82 -3 84 75 -22 -52 15 72 36 -36 -34 35 63 14 -42 -38 39 81 8 -74 -57 47 98 13 -72 -66 36 80 14
3322 14 -61 -41 38 54 -18 -58 -7 60 52 -25 -77 2 67 69 -16 -77 3 81 74 -30 -61 -12 69 38 -30 -44 14 59 14 -49 -43 41
3354 41 74 17 -64 -51 44 84 18 -80 -79 21 81 16 -66 -70 36 46 -15 -62 -36 26 23 -47 -85 -27 55 39 -53 -109 -47 64
3384 64 49 -42 -97 -32 50 47 -18 -65 -13 43 18 -43 -51 22 58 6 -64 -58 30 87 13 -65 -71 24 100 38 -49 -55 40 79 18 -39 -31
3417 -31 34 43 -11 -56 -21 53 50 -21 -73 -12 68 69 -20 -82 -33 64 76 -15 -64 -12 58 42 -12 -41 8 61 40 -33 -49 46 99 29
3449 29 -52 -50 46 98 54 -45 -46 34 84 38 -29 -27 39 75 15 -29 -3 57 64 -8 -61 -12 77 72 1 -82 -32 58 77 -20 -82 -31 36
3482 36 61 -23 -54 -18 36 22 -41 -50 14 55 5 -73 -74 6 74 20 -67 -76 8 56 23 -50 -59 12 50 19 -35 -20 35 41 -19 -65 -15
3515 -15 63 71 -16 -82 -32 68 70 -9 -78 -42 57 53 -2 -56 -22 32 28 -33 -60 -4 45 3 -68 -75 -7 67 9 -75 -91 -7 56 17
3547 17 -69 -96 -18 47 6 -63 -66 -6 31 -16 -75 -52 34 53 -24 -81 -41 52 67 -16 -77 -56 43 60 9 -58 -32 40 38 -8 -36
3578 -36 9 60 42 -19 -41 30 74 35 -46 -59 21 81 54 -44 -64 3 82 55 -27 -38 8 46 18 -38 -41 31 51 -7 -65 -37 52
3609 52 53 -10 -61 -32 35 73 3 -56 -37 31 48 15 -45 -17 40 49 -9 -39 13 64 31 -33 -43 15 78 40 -24 -57 6 69 58
3640 58 -30 -49 6 52 15 -26 -38 27 64 0 -64 -25 50 66 -18 -84 -56 34 58 -10 -71 -54 21 42 4 -56 -26 26 38 -23
3670 -23 -56 -8 44 26 -47 -51 10 68 43 -42 -60 0 73 56 -25 -49 3 77 54 -19 -30 35 69 37 -20 -15 39 81 17 -52 -20
3701 -20 65 74 6 -57 -43 42 75 26 -51 -42 28 51 -12 -57 -26 33 20 -36 -69 -6 41 12 -53 -80 -25 42 20 -48 -89 -36 41
3732 41 28 -57 -75 -18 36 14 -42 -53 11 31 1 -67 -50 30 57 7 -68 -52 41 71 10 -66 -43 26 57 21 -37 -10 35 47
3762 47 1 -31 -1 49 39 -27 -51 -2 66 59 -31 -62 -13 61 49 -19 -52 -14 49 42 -16 -27 29 47 22 -21 -17 41 69 14 -34 -30
3794 -30 56 87 37 -30 -37 39 83 36 -36 -22 47 60 12 -20 24 63 45 -16 -42 13 67 54 -19 -50 -21 57 52 -23 -58 -29 46
3825 46 40 -40 -47 10 23 -2 -54 -46 5 34 -5 -65 -58 2 33 -6 -81 -78 -7 47 3 -64 -69 -8 30 -16 -59 -43 13 4 -36 -64 -16 36
3859 36 32 -27 -67 -21 54 57 -24 -56 -28 44 56 1 -40 9 36 35 -10 -34 14 38 6 -27 -26 22 62 19 -50 -61 22 71 23 -37
3891 -37 -42 17 65 21 -39 -24 33 40 8 -40 0 38 35 -7 -51 -3 49 54 -8 -55 -17 62 59 3 -49 -7 54 29 -6 -20 16 49 30
3924 30 -21 -21 21 58 23 -44 -45 22 70 38 -41 -53 12 63 13 -28 -47 7 37 2 -33 -10 25 32 -11 -46 -16 40 44 -17 -67 -33
3956 -33 44 43 -19 -64 -28 28 31 -16 -49 -13 24 19 -18 -30 5 43 13 -35 -34 13 55 21 -56 -61 11 57 30 -37 -43 5 46 22 -38
3989 -38 -37 13 35 -4 -48 -23 41 43 -8 -56 -26 48 39 -4 -56 -37 41 49 9 -43 -17 30 33 -12 -42 6 40 20 -30 -36 9 59 34
4022 34 -44 -45 14 61 38 -30 -50 20 52 26 -23 -24 20 48 12 -25 -1 52 48 9 -39 -16 43 61 1 -46 -24 40 62 -6 -43 -12
4054 -12 37 43 4 -26 -5 39 16 -23 -30 10 46 19 -35 -56 13 61 30 -40 -57 2 48 30 -34 -35 10 30 17 -26 -30 21 24 4 -50
4087 -50 -27 23 39 -18 -60 -46 40 53 -8 -57 -37 29 46 0 -45 -14 29 19 -37 -33 -11 30 16 -23 -54 2 47 21 -35 -54 -3
4118 -3 54 20 -21 -53 11 48 17 -19 -24 22 36 10 -25 -18 14 38 -8 -47 -32 37 61 4 -48 -37 35 53 10 -36 -19 23 30 -8
4150 -8 -44 -14 27 12 -15 -46 8 44 29 -32 -50 1 57 33 -32 -56 -9 43 25 -18 -27 4 27 19 -17 -14 16 35 -1 -40 -20 24
4182 24 56 6 -50 -27 31 69 19 -31 -14 41 46 7 -21 0 27 40 5 -30 20 40 35 -20 -42 4 46 51 -20 -41 3 54 29 -15
4214 -15 -28 3 47 26 -10 -16 14 36 3 -33 -18 33 53 10 -42 -18 30 65 19 -32 -25 24 52 14 -31 -10 16 36 -5 -33 3
4245 3 46 35 -13 -31 -5 46 39 -23 -47 -18 41 33 -30 -48 -12 28 17 -15 -34 -5 27 8 -31 -22 27 15 -3 -50 -30 11 46 -5
4277 -5 -45 -47 10 36 4 -35 -32 14 28 1 -11 -5 36 26 -9 -11 3 50 42 -18 -38 13 52 43 -9 -32 2 44 39 -2 -20 1 51 26
4311 26 -15 -20 25 48 19 -26 -28 20 50 19 -34 -42 13 45 14 -45 -47 12 27 0 -37 -27 3 11 -16 -47 -6 14 21 -32 -56 -13 34
4344 34 18 -28 -50 -22 22 27 -26 -36 -16 23 22 -9 -26 -3 38 17 -39 -24 21 47 18 -32 -27 23 45 5 -34 -30 8 38 7 -24
4376 -24 -23 19 24 8 -15 0 22 17 -17 -34 -4 46 49 -11 -49 -16 47 41 -24 -39 -13 34 30 2 -8 3 34 25 -12 -25 26 34 17 -25
4410 -25 -15 33 61 30 -28 -26 24 49 34 -21 -27 24 44 12 -19 -2 32 38 4 -24 -8 30 35 -12 -37 -29 19 33 -9 -72 -25 23 23
4443 23 -10 -47 -23 9 6 -37 -47 -13 21 -9 -52 -51 -10 32 0 -37 -45 3 30 19 -28 -29 8 29 10 -19 -11 16 28 -5 -23 -12 23
4476 23 28 -8 -27 -7 29 36 -4 -35 4 34 47 14 -36 -14 14 27 -7 -15 -8 31 11 -15 -28 18 35 10 -34 -31 17 33 23 -37 -32
4509 -32 7 36 8 -33 -31 -2 34 0 -29 -17 23 32 -1 -29 -8 31 46 0 -24 -11 45 49 6 -29 -7 42 42 16 -23 -1 41 33 -15
4542 -15 -23 20 47 25 -23 -32 0 54 21 -25 -47 4 43 16 -37 -35 0 15 8 -27 -20 9 21 -9 -37 -19 11 7 -11 -49 -18 24 39
4575 39 -12 -47 -37 13 36 7 -28 -13 20 12 -5 -24 -1 34 22 -13 -27 9 44 35 -29 -26 8 41 27 -17 -24 4 33 30 6 -17 11
4608 11 27 -7 -20 -16 10 22 -5 -43 -32 16 39 -8 -51 -29 14 22 -7 -40 -29 8 25 -8 -30 -4 17 15 -14 -29 -6 41 27 -18
4640 -18 -25 4 38 29 -14 -22 10 38 27 -7 -15 14 32 14 -6 -19 35 37 8 -22 -9 31 45 14 -28 -24 26 38 11 -38 -16 26 17 3
4674 3 -29 -23 20 24 -14 -22 -3 30 19 -34 -40 2 42 14 -25 -46 -6 33 10 -33 -44 2 31 13 -14 -11 -3 21 4 -19 -18 11 38 4
4708 4 -42 -22 16 50 10 -32 -23 32 41 6 -24 -20 16 25 14 -27 2 15 11 -12 -34 -10 33 22 -21 -42 -3 33 9 -28 -35 -12 33 10
4742 10 -20 -29 -1 18 17 -13 -16 5 28 6 -41 -30 13 37 7 -30 -19 24 43 22 -23 -14 15 42 8 -8 -6 13 29 0 -27 10 27
4775 27 30 -26 -38 -2 38 31 -10 -27 -6 26 16 -3 -28 2 16 4 -16 -24 -3 7 0 -22 -25 1 27 -2 -42 -49 9 36 13 -17 -24 23
4809 23 37 5 -17 -26 9 32 8 -28 -20 15 16 -1 -42 -5 49 27 -16 -36 -6 33 27 -17 -23 -6 36 22 -3 -27 -1 12 16 -19 -18 5
4843 5 26 3 -33 -27 11 28 2 -39 -45 14 24 1 -35 -33 -11 24 -4 -29 -7 6 16 -26 -42 -19 18 10 -14 -38 -21 31 21 -28 -22
4876 -22 -23 19 15 -8 -24 -13 14 10 -17 -28 7 34 2 -10 -24 15 34 3 -28 -28 16 38 26 -25 -19 8 29 16 -18 -7 22 22 1
4909 1 -19 5 25 28 -17 -30 4 37 34 -8 -35 -1 24 32 -3 -24 -13 15 20 -6 -23 4 25 1 -20 -20 10 27 20 -31 -27 -4 33 -3
4943 -3 -27 -32 6 31 6 -17 -15 2 17 -7 -14 -15 7 16 -13 -39 -17 18 18 -28 -49 -20 24 12 -23 -39 -18 3 17 -12 -33 -17 16 -4
4977 -4 -18 -29 -3 20 -2 -29 -38 -2 25 7 -37 -29 1 25 9 -23 -13 4 25 13 -14 -8 19 10 -6 -17 6 35 33 1 -32 -15 24
5010 24 24 -5 -28 -3 31 37 -2 -21 2 23 32 2 -22 -6 27 18 -8 -18 4 25 16 -25 -19 14 30 8 -22 -23 -5 17 0 -19 -20 -2
5044 -2 13 -8 -35 -25 11 18 -7 -33 -17 10 12 -16 -44 -33 15 17 -11 -39 -15 2 2 -11 -25 -14 6 0 -15 -36 -3 34 -3 -20 -38
5077 -38 4 27 9 -25 -25 -10 31 6 -18 -22 -15 22 11 -23 -18 0 12 -14 -39 -19 7 18 -20 -37 -23 14 25 -2 -25 -17 4 18 -3
5110 -3 -33 -12 17 6 -18 -27 -7 16 12 -16 -33 -5 27 18 -23 -33 -1 31 17 -18 -29 -5 14 0 -18 -13 4 22 5 -21 -12 16 28
5143 28 -11 -29 -19 18 15 -2 -22 -12 12 18 -12 -17 -16 6 6 -17 -26 -11 15 -2 -23 -34 -5 14 3 -22 -38 -10 10 2 -33 -35 -19 12
5177 12 12 -16 -19 -1 9 -7 -32 -19 5 19 -5 -20 -14 14 31 -6 -35 -22 14 35 1 -27 -17 8 33 -10 -12 5 12 15 -12 -29 -9
5210 -9 28 24 -17 -28 2 27 13 -13 -28 -8 8 1 -26 -25 -10 22 10 -28 -34 -7 23 -3 -45 -27 0 22 -14 -31 -33 9 22 -6 -28
5243 -28 -31 8 14 -13 -21 -7 7 16 -9 -13 -7 14 13 -19 -37 -9 33 18 -11 -22 -2 19 20 -18 -18 2 18 13 -9 -8 1 2 0 -12 -10 11 23 0
5281 0 -31 -28 7 10 1 -36 -22 5 32 1 -23 -20 3 19 -19 -11 -14 9 14 -9 -27 1 21 10 -24 -35 0 22 19 -19 -25 -8 23 12 4 -13
5317 -13 -2 15 14 -12 -17 -1 16 0 -26 -21 7 26 8 -27 -35 15 20 -3 -26 -20 1 13 -3 -23 -22 3 7 -14 -25 -14 11 6 -19 -25 -16 15
5353 15 9 -16 -44 -16 17 20 -7 -23 -10 8 -4 -17 -15 1 3 6 -14 -1 23 20 13 -3 -18 16 29 20 -21 -9 10 32 0 -17 -7 18
5387 18 25 0 -11 -3 26 11 -14 -20 -24 10 15 -8 -30 -14 21 2 -14 -26 -12 9 -5 -6 -20 -6 17 -2 -23 -25 -9 21 -3 -31 -22 2
5421 2 16 9 -27 -18 2 28 10 -10 -28 13 14 11 -14 -11 20 24 2 -13 -1 21 30 -13 -15 -2 13 13 -10 -26 -8 8 3 -14 -24 -13 6 2
5457 2 -16 -26 1 7 -15 -34 -33 -2 15 -7 -26 -22 9 5 0 -20 -25 -5 2 -3 -16 -17 2 9 8 -22 -9 14 14 0 -9 -15 23 30 -3 -28 -16 25
5495 25 20 7 -13 -5 13 10 -6 -11 -2 25 11 -14 -17 3 20 5 -31 -24 6 17 -7 -21 -32 3 19 9 -16 -23 1 5 0 -13 -17 -4 14 -16
5531 -16 -25 -20 13 9 -10 -35 0 14 22 4 -20 -2 7 6 -8 -2 0 10 17 -8 -12 12 20 25 -11 -11 13 27 15 -14 -25 5 24 8 -24 -15 -8 19
5569 19 -6 -23 -20 1 6 4 -31 -16 6 14 2 -40 -29 2 0 -14 -40 -25 -3 9 -11 -23 -11 -12 9 -2 -16 -11 8 5 -20 -24 -1 9 4
5604 4 -14 -22 4 12 26 -7 -10 13 30 27 -3 -8 0 22 11 -16 -7 9 23 -6 -20 -7 24 22 5 -15 -14 11 29 -7 -16 -21 7 8 -6 -18 -7
5641 -7 8 -1 -16 -23 -8 14 3 -14 -20 -3 15 16 -11 -25 8 4 21 0 -21 1 4 -7 -10 -12 17 18 -2 -8 -7 30 25 -8 -12 -12 11 12 -5 -31
5679 -31 -6 2 21 4 -11 -8 10 4 -4 -23 -2 9 -7 -25 -24 -12 5 -5 -25 -28 -15 11 10 -17 -21 -8 6 9 -24 -20 -9 6 -17 -21 -14 14
5715 14 14 -10 -26 -15 5 20 2 -29 -10 7 19 -1 -21 -8 18 19 13 -1 9 16 14 1 -13 13 28 28 4 -12 7 25 14 0 -17
5748 -17 -1 10 5 -4 -8 -3 13 0 -13 -20 4 10 -4 -18 -23 -4 26 2 -24 -26 -5 12 4 -24 -25 2 18 -12 -4 2 10 25 -10 -11 -14 28 11 -11
5786 -11 -18 14 15 8 4 -17 -1 9 13 2 -15 -1 0 -1 1 -9 2 15 -4 -34 -16 4 4 -9 -22 -16 -2 9 4 -20 -28 -14 8 -4 -21 -14 6
5823 6 -13 -2 -17 -9 3 6 -16 -30 -2 17 21 -2 -32 -11 8 15 -12 -20 -2 8 5 -14 -19 -6 17 4 -11 -12 20 22 5 -11 -10 10 24 5
5859 5 -18 -12 10 10 9 -15 -7 -1 1 9 -13 -8 2 6 -6 -20 -1 8 2 -17 -29 -10 -1 3 -9 -24 -20 2 15 -9 -1 -2 4 3 -13 -14 4 4 0 -11 -17 10
5901 10 16 9 -18 -12 -1 25 2 -10 -4 15 16 13 3 -2 15 21 -9 -4 -1 25 11 -13 -14 -8 19 18 -8 -26 -5 4 16 -6 -18 -14 8 9 -17 -14 5
5940 5 3 0 -20 -16 0 28 6 -22 -29 4 12 -1 -11 -17 3 9 11 -22 -20 5 5 -2 -19 -3 10 7 -16 -7 -3 24 15 -7 -27 -7 3 16 1 -16
5978 -16 -5 12 20 4 -12 -1 4 0 -24 -22 9 13 -7 -18 -23 7 18 0 -26 -12 -1 3 6 -12 -25 -6 3 -6 -21 -5 7 0 -21 -20 -4 14
6014 14 13 -14 -16 -14 7 11 -6 -22 2 15 13 6 3 -9 5 17 -1 0 15 17 11 -2 1 6 29 24 -7 -10 10 19 11 -5 -12 14 14 8 -10 -5 8 19
6054 19 -5 -25 -17 5 23 7 -26 -6 7 3 -5 -31 -16 3 5 -6 -17 -21 -8 -4 -5 -19 -7 1 9 -20 -22 -6 17 -5 -15 -18 -9 11 5 -17 -29
6091 -29 2 19 10 2 -7 2 17 -2 -23 -6 10 18 -7 -12 -14 13 15 -5 -19 -2 25 20 2 -26 -10 -1 7 -4 -9 -7 6 9 -6 -21 -13 8 12 -4
6129 -4 -15 -2 13 8 -14 -20 -12 9 12 -17 -10 3 18 5 -5 -7 9 3 -8 -9 2 13 14 13 -23 -13 21 23 18 -11 0 8 17 13 -14 -5 11 -3 3
6168 3 -7 4 11 16 0 -12 3 26 6 -15 -18 -7 17 19 -17 -17 1 17 -3 -11 -21 -7 10 -2 -9 -15 3 15 -5 -13 -2 7 11 2 -9 -2 18
6205 18 12 1 2 0 5 21 5 -9 -2 24 9 -2 -8 6 29 15 -8 -20 0 21 15 -4 -16 11 9 17 -11 -7 -5 16 0 -14 -10 4 9 5 -24
6242 -24 -8 4 6 -8 -28 -26 -7 11 6 -9 -13 1 10 -1 -6 -9 -1 13 -14 -7 -10 13 16 -14 -15 9 22 28 18 -11 12 13 18 4 9 14 28 4 5
6281 5 -8 11 8 24 0 -22 12 18 -7 -7 -2 3 25 -7 -11 -19 4 9 -8 -22 -16 7 8 -7 -10 -13 -4 1 -4 -22 -15 10 5 -21 -14 10 9 8 -3 -18 2
6322 2 15 17 8 -5 5 23 5 -7 4 9 28 5 -3 1 18 22 8 3 -6 19 25 2 -1 -4 13 21 5 -14 -15 -2 2 -8 -17 -3 19 3 -9 -25
6360 -25 -1 19 8 -1 -12 -4 7 0 -13 -7 3 7 13 -11 -2 0 2 2 -26 -8 15 20 12 -12 0 16 22 28 -9 -19 10 31 9 -8 3 9 17 19 -6
6399 -6 -3 17 12 9 -4 0 7 8 -3 -14 -14 8 16 -1 -25 -10 7 5 -10 -21 -9 4 -1 -17 -16 4 14 -10 -26 -30 0 4 0 -13 -18 -5 10 0
6437 0 -7 -2 2 20 1 -9 -7 11 10 0 -6 -2 23 19 13 -14 6 11 20 4 -14 -5 18 15 -3 -2 3 8 8 -3 -13 -4 9 18 -1 -10 4 18 4 -3 -14
6478 -14 8 22 0 -12 -23 7 6 -5 6 0 4 12 0 -10 -4 -2 14 -6 -9 -1 13 6 -8 -12 4 13 21 1 -17 3 20 21 11 -8 7 9 1 -5
6516 -5 -17 -1 13 12 -14 -8 7 13 17 -5 -12 7 18 7 -14 -4 8 9 -1 -6 -15 1 0 -5 -12 -19 7 5 -17 -24 -16 7 -4 4 -12 -12 5 2 -2 -8 2
6557 2 16 -2 -5 -6 8 16 22 -3 -3 6 34 17 10 -4 14 20 14 6 -4 19 12 11 5 7 13 5 -5 -25 -1 6 16 -3 -33 0 3 23 -8 -28 -13 5
6597 5 -5 -6 -24 -11 -6 14 0 -14 5 2 2 -7 -23 -5 7 4 -18 -9 -1 4 7 -7 -16 -18 1 3 -9 -20 19 12 3 -7 -1 16 11 15 -10 -6 31 34 -7
6638 -7 -5 9 2 16 10 -5 5 20 12 -4 7 5 14 5 -4 -9 2 14 0 -8 -3 -9 8 12 -3 -13 5 5 6 -8 -6 -5 3 4 -13 -3 17 19 5 0 -10
6679 -10 -7 6 -6 1 -12 10 24 11 -17 -2 9 28 11 -7 -11 2 5 -4 -10 -1 8 -1 -2 -15 -12 3 5 -22 -29 -2 4 4 -11 -18 -13 3 -12 -2 -29
6718 -29 -6 -4 -6 -22 -27 -9 2 -11 -16 -16 6 10 -4 -14 -10 -1 0 9 -10 -10 3 10 -1 -11 7 19 13 2 -3 12 12 20 10 0 1 21 18 1 11
6757 11 12 19 15 -1 0 4 11 9 -15 -4 -4 6 16 -10 -18 1 16 3 -9 -11 12 4 -11 -25 -11 10 -6 -2 -10 -7 -7 2 -1 -17 -3 3 6 -13 -24 -13
6797 -13 11 3 4 -12 0 21 20 4 -5 -3 15 4 -6 -2 1 11 8 -3 -17 5 11 4 -12 -12 1 9 -2 -9 -4 1 1 -12 -16 -12 1 0 -10 2 -11 3
6837 3 -2 -10 -16 -4 12 -4 -14 -6 -9 8 5 -10 -18 -10 5 2 -4 -4 4 14 -5 -1 -16 3 24 -5 -12 -14 6 20 15 -12 -1 18 15 4 -4 0 4 18 -7
6878 -7 -9 0 5 15 -7 -7 1 9 7 -5 -7 3 11 4 -6 -26 -13 -3 1 0 -5 0 2 -5 -10 -18 -14 6 -6 -16 -18 -12 6 -6 -26 -22 -7 -2 3 -12 -12 1 6 5
6922 5 -8 -7 5 5 12 5 16 15 11 -6 -4 1 16 16 -3 1 5 14 24 -8 -18 -5 17 6 -6 -12 -19 1 -3 0 -5 5 6 -7 -14 -11 -2 5 -6 -15 -16 -7 5
6965 5 -4 -8 -11 -7 0 -10 -16 -3 14 13 -5 -22 -2 11 8 -8 -17 5 5 6 -2 -11 -7 9 6 -7 -5 -8 12 2 -2 -2 3 10 -2 -13 -11 7 15 10 -8 -8 -6 2
7009 2 8 0 -6 -13 3 6 -20 -19 3 -5 -18 -25 -12 -10 1 -6 -20 -21 -3 9 -17 -19 -14 0 -2 -3 -10 -16 -1 -11 -18 -28 -1 8 10 -12 -6 3 16 13 2 -4 3
7052 3 9 8 2 -11 -5 5 7 6 -9 5 12 0 -11 -13 1 7 -2 -22 -9 3 2 -8 -21 -17 2 -4 -5 -12 7 4 -9 -4 -20 -12 14 -7 -14 -14 -8 -2 0 -12
7094 -12 -10 -1 11 6 -18 -8 4 7 2 5 -8 8 4 -7 -9 -1 6 13 -4 -3 -7 18 11 1 -10 -7 8 10 -1 -15 -16 -4 6 -4 -12 -9 -2 -6 -19 -9 0
7135 0 7 -7 -24 -24 -4 12 1 -19 -18 -11 -4 -1 -24 -17 -3 -4 -9 -7 -15 4 -7 -16 -14 -4 1 10 -6 -20 -17 2 6 5 -6 -17 -3 11 -1 -10 -7 18 9
7176 9 -11 -1 2 14 10 -8 -8 6 13 5 -5 -14 -13 19 1 -10 -28 -4 4 0 -10 -14 -2 -8 -11 -16 -17 -7 8 -14 -13 -12 -11 -2 -1 -20 -23 -16 6 -1 -17 -18
7218 -18 -13 -3 -2 -16 3 2 1 -9 -17 3 10 2 -10 -23 7 12 3 1 -9 -12 2 3 3 -1 4 9 6 -7 -1 1 -2 4 -17 -9 0 5 -1 -17 -21 -7 2 -5 -18 -19 -14
7263 -14 -12 -10 -21 -15 -16 -4 -10 -13 -8 5 5 -4 -11 -8 12 -3 2 -7 7 9 11 4 -6 8 4 12 11 -3 -2 6 2 -6 -5 2 10 4 -5 -11 12 1 -1 -18 -13 0 11 -3
7309 -3 -18 -19 1 -9 -9 -11 9 -7 -6 -12 -19 -13 4 -10 -18 -17 -18 -4 5 -18 -18 -17 -7 0 -6 -11 -9 1 4 -10 -25 3 5 -1 -6 -7 19 8 -1 -17 -8 3 11
7352 11 4 3 -4 9 12 5 -17 -12 -3 2 -2 -3 -5 13 9 2 5 -6 12 6 -1 -20 -3 3 1 -10 -11 -7 1 -4 -11 -11 9 3 2 -10 -12 0 5 -5 -9 -10 4 10 -1 -9
7398 -9 -6 3 16 5 4 -5 1 14 -6 -4 5 9 12 -17 -9 -8 12 11 -15 -6 -8 11 9 -7 -14 -6 14 0 5 -12 0 10 5 -12 -18 2 -6 -2 -12 -18 -1 -2 -8
7441 -8 -13 -18 -5 -2 -10 -20 -3 -6 -1 -23 -15 -12 -7 0 -15 -1 -1 18 14 -4 -10 -5 0 8 3 8 1 16 8 -2 5 5 8 8 -5 -13 5 9 1 0 5 3 9 7 -12 -7 1 4
7489 4 3 -22 -15 7 -2 -6 0 -1 -1 8 -10 -11 0 2 4 -14 -15 -7 0 -10 -16 -15 -14 8 11 3 -8 -19 3 17 -6 -12 -5 1 1 -13 -5 4 13 11 1 -6 -5 11 10 -13
7535 -13 -7 3 6 1 -3 -7 10 6 3 -6 -1 4 -6 -6 -21 -12 -5 -2 -13 -14 5 -5 -2 -8 -21 -29 8 7 -22 -6 -6 -14 6 -2 -18 -7 14 8 5 -12 -14 -2 7
7578 7 -10 -14 -6 8 12 3 0 -3 5 -1 -1 5 11 16 0 -10 0 16 18 5 -3 -3 6 17 -1 -8 -21 1 11 -4 -6 -17 -10 1 1 -6 0 4 0 -17 -27 -10 -1
7621 -1 -2 -12 -14 -6 -7 3 -7 -15 -2 6 0 -14 -7 1 4 5 -14 2 1 15 1 -7 -4 1 11 4 -11 -15 -5 11 6 2 2 8 13 9 -3 -17 10 -2 -14 -4
7663 -4 0 6 13 -8 -9 18 9 -3 -1 -11 -16 1 -5 -14 -22 -16 -1 -2 -14 -6 -2 3 -10 -16 -8 -6 6 -10 -16 -16 3 8 12 0 -8 1 7 5 -1 5 8 11 3 2 15 16 19 -13
7711 -13 -9 -1 15 10 -6 -13 6 9 9 -1 -5 -4 10 5 4 -4 -2 6 -5 -19 -1 3 6 -5 -11 -17 -5 6 6 -7 -16 1 2 -9 -9 -13 -2 0 -2 -15 7 17
7753 17 9 -10 -7 0 11 12 8 -1 3 6 9 9 -4 1 6 7 6 -3 7 12 8 -4 2 9 15 12 -14 6 11 22 -4 -9 -1 -12 9 6 -14 -9 -4 4 2 -4 -5 1 -6 -2 -15
7800 -15 -14 -12 0 -11 -19 -9 4 -6 -11 -6 -15 -1 5 -5 -13 -12 9 1 -4 -4 7 3 -3 2 0 8 10 1 -6 -13 6 9 0 -6 -4 7 6 -6 0 -7 0 7 -11 -2 -10 -2 2
7847 2 -19 -5 -5 -2 1 -7 -12 -16 14 0 -4 -16 -13 1 -1 -5 -1 -11 -1 -12 -7 -9 -7 7 -14 -4 -18 1 6 7 0 -9 14 8 6 -5 -1 3 14 1 -1 13
7889 13 9 10 -11 9 3 17 19 4 -1 -13 6 5 -4 -5 3 8 10 -8 0 -7 12 -14 -19 -13 7 2 12 -14 -13 1 -1 8 -23 -11 -5 3 -7 -16 -13 -8 -8 -4 -8 -16
7933 -16 -6 5 3 0 -7 5 -3 -6 -17 -5 2 8 -2 -8 5 8 16 8 2 2 12 5 1 -4 -6 9 14 -6 -3 3 9 8 -1 -13 -16 -10 -3 -5 -17 1 5 -11 -10 -13 -1
7978 -1 -4 -7 -18 -15 2 2 -12 -22 -12 6 -2 -20 -14 -6 -3 3 8 9 -10 8 3 -5 -6 4 13 2 8 -4 -3 6 -4 -8 4 2 11 17 -8 -1 10 16 -3 2 -2 4
8022 4 1 1 2 -9 9 3 3 -9 -1 4 10 -7 -3 -15 -1 2 -21 -6 -13 1 -5 -1 1 9 -2 7 -6 -15 1 3 8 -1 -7 6 1 -4 0 -3 0 15 19 5 0 3 3 14
8068 14 8 -11 14 12 2 -3 -10 19 13 8 5 3 7 14 8 5 -16 9 2 8 8 5 0 2 -7 -4 -2 0 -8 4 -4 -5 2 6 -5 -25 -6 2 0 -13 9 -5 13 9 -9
8113 -9 -8 7 6 -7 1 5 16 6 -2 -4 9 11 17 3 0 -7 20 10 -3 -10 11 17 12 -9 2 3 9 5 9 2 17 11 11 -7 0 4 4 7 -10 -9 1 5 2 -14
8157 -14 -11 -7 12 -17 -4 -3 0 5 -7 -11 -6 4 -2 4 9 1 0 1 9 10 0 3 4 1 7 6 12 17 5 -2 10 10 13 3
8191C
##END NTUPLES=NMR FID
##END=
