##TITLE=1H_AM A503
 CDCl3, 8 sc, 
 23.7.2019
##JCAMPDX= 6.0         $$ Bruker NMR JCAMP-DX V2.0
##DATA TYPE= NMR FID
##DATA CLASS= NTUPLES
##ORIGIN= UXNMR, Bruker Analytische Messtechnik GmbH
##OWNER= root
$$ XWIN-NMR		Version 3.5
$$ Tue Jul 23 15:05:22 2019 Russian Standard Time (UT+4h)  she@DPX200
##.OBSERVE FREQUENCY= 200.13155
##.OBSERVE NUCLEUS= ^1H
##.DELAY= (6, 6)
##.ACQUISITION MODE= SIMULTANEOUS
##.ACQUISITION SCHEME= undefined
##.AVERAGES= 8
##.DIGITISER RES= 18
##SPECTROMETER/DATA SYSTEM= spect
##.PULSE SEQUENCE= zg30
##.SOLVENT NAME= CDCl3
##.SHIFT REFERENCE= (INTERNAL, CDCl3, 0, 15.7039)
##AUDIT TRAIL= $$ (NUMBER, WHEN, WHO, WHERE, WHAT)
$$ ##TITLE= Audit trail, XWIN-NMR		Version 3.5
$$ ##JCAMPDX= 5.01
$$ ##ORIGIN= Bruker BioSpin GmbH
$$ ##OWNER= she
$$ F:/spectra/data/she/nmr/H-F/1/audita.txt
$$ ##AUDIT TRAIL=  $$ (NUMBER, WHEN, WHO, WHERE, WHAT)
(   1,<2019-07-23 15:04:25.87 +0400>,<she>,<DPX200>,
      <created by zg, POWCHK disabled, PULCHK disabled
       configuration hash MD5:
       00 E9 B6 7A A2 85 ED C7 34 08 36 98 17 FE 4E 26
       data hash MD5: 16K
       36 39 AC BA A0 33 3C 08 C5 5A 8D 9C 44 B7 59 7B>)
$$ ##END=
$$ 
$$ hash MD5
$$ 3E 40 16 10 09 0F FC 23 6F 30 C1 C6 F3 F3 58 23
##$RELAX= 
##$RELAX= 
##$RELAX= 
##$RELAX= 
##$RELAX= 
##$RELAX= 
$$ Bruker specific parameters
$$ --------------------------
##$DU= <F:/spectra>
##$EXPNO= 1
##$NAME= <H-F>
##$PROCNO= 1
##$TYPE= <nmr>
##$USER= <she>
##$AMP= (0..31)
100 100 100 100 100 100 100 100 100 100 100 100 100 100 100 100 100 100 
100 100 100 100 100 100 100 100 100 100 100 100 100 100 
##$AQSEQ= 0
##$AQ_mod= 1
##$AUNM= <au_zg>
##$AUTOPOS= <>
##$BF1= 200.13
##$BF2= 200.13
##$BF3= 200.13
##$BF4= 200.13
##$BF5= 200.13
##$BF6= 200.13
##$BF7= 200.13
##$BF8= 200.13
##$BYTORDA= 1
##$CFDGTYP= 0
##$CFRGTYP= 5
##$CHEMSTR= <none>
##$CNST= (0..31)
1 1 145 1 1 1 1 1 1 1 1 1 1 1 1 1 1 1 1 1 1 1 1 1 1 1 1 1 1 1 1 1 
##$CPDPRG= <>
##$CPDPRG1= <>
##$CPDPRG2= <>
##$CPDPRG3= <>
##$CPDPRG4= <mlev>
##$CPDPRG5= <mlev>
##$CPDPRG6= <mlev>
##$CPDPRG7= <mlev>
##$CPDPRG8= <mlev>
##$CPDPRGB= <>
##$CPDPRGT= <>
##$D= (0..31)
0 1.2 0 0 0 0 0 0 0 0 0 0.03 0 0 0 0 0 0 0 0 0 0 0 0 0 0 0 0 0 0 0 0 
##$DATE= 1563879865
##$DBL= (0..7)
120 120 120 120 120 120 120 120 
##$DBP= (0..7)
150 150 150 150 150 150 150 150 
##$DBP07= 0
##$DBPNAM0= <>
##$DBPNAM1= <>
##$DBPNAM2= <>
##$DBPNAM3= <>
##$DBPNAM4= <>
##$DBPNAM5= <>
##$DBPNAM6= <>
##$DBPNAM7= <>
##$DBPOAL= (0..7)
0.5 0.5 0.5 0.5 0.5 0.5 0.5 0.5 
##$DBPOFFS= (0..7)
0 0 0 0 0 0 0 0 
##$DE= 6
##$DECBNUC= <off>
##$DECIM= 24
##$DECNUC= <off>
##$DECSTAT= 4
##$DIGMOD= 1
##$DIGTYP= 9
##$DL= (0..7)
0 120 120 120 120 120 120 120 
##$DP= (0..7)
150 150 150 150 150 150 150 150 
##$DP07= 0
##$DPNAME0= <>
##$DPNAME1= <>
##$DPNAME2= <>
##$DPNAME3= <>
##$DPNAME4= <>
##$DPNAME5= <>
##$DPNAME6= <>
##$DPNAME7= <>
##$DPOAL= (0..7)
0.5 0.5 0.5 0.5 0.5 0.5 0.5 0.5 
##$DPOFFS= (0..7)
0 0 0 0 0 0 0 0 
##$DQDMODE= 0
##$DR= 18
##$DS= 0
##$DSLIST= <SSSSSSSSSSSSSSS>
##$DSPFIRM= 0
$$ [...]
##$SUBNAM2= <"">
##$SUBNAM3= <"">
##$SUBNAM4= <"">
##$SUBNAM5= <"">
##$SUBNAM6= <"">
##$SUBNAM7= <"">
##$SUBNAM8= <"">
##$SUBNAM9= <"">
##$SW= 24.9336996594482
##$SWIBOX= (0..15)
0 0 2 0 0 0 0 0 0 0 0 0 0 0 0 0 
##$SW_h= 4990.01996007984
##$TD= 16384
##$TD0= 1
##$TE= 0
##$TE2= 300
##$TE3= 300
##$TEG= 300
##$TL= (0..7)
0 120 120 120 120 120 120 120 
##$TP= (0..7)
150 150 150 150 150 150 150 150 
##$TP07= 0
##$TPNAME0= <>
##$TPNAME1= <>
##$TPNAME2= <>
##$TPNAME3= <>
##$TPNAME4= <>
##$TPNAME5= <>
##$TPNAME6= <>
##$TPNAME7= <>
##$TPOAL= (0..7)
0.5 0.5 0.5 0.5 0.5 0.5 0.5 0.5 
##$TPOFFS= (0..7)
0 0 0 0 0 0 0 0 
##$TUNHIN= 0
##$TUNHOUT= 0
##$TUNXOUT= 0
##$USERA1= <user>
##$USERA2= <user>
##$USERA3= <user>
##$USERA4= <user>
##$USERA5= <user>
##$V9= 5
##$VALIST= <valist>
##$VCLIST= <CCCCCCCCCCCCCCC>
##$VD= 0
##$VDLIST= <DDDDDDDDDDDDDDD>
##$VPLIST= <PPPPPPPPPPPPPPP>
##$VTLIST= <TTTTTTTTTTTTTTT>
##$WBST= 1024
##$WBSW= 4
##$XGAIN= (0..3)
0 0 0 0 
##$XL= 0
##$YL= 0
##$YMAX_a= 3910
##$YMIN_a= -4482
##$ZGOPTNS= <>
##$ZL1= 120
##$ZL2= 120
##$ZL3= 120
##$ZL4= 120
##$ABSF1= 10
##$ABSF2= 0
##$ABSG= 5
##$ABSL= 3
##$ALPHA= 0
##$AQORDER= 0
##$ASSFAC= 0
##$ASSFACI= 0
##$ASSFACX= 0
##$ASSWID= 0
##$AUNMP= <proc_1d>
##$AZFE= 0.1
##$AZFW= 0.1
##$BCFW= 1
##$BC_mod= 2
##$BYTORDP= 1
##$COROFFS= 0
##$CY= 11.3945322036743
##$DATMOD= 1
##$DC= 2
##$DFILT= <>
##$DTYPP= 0
##$F1P= 18.9103706918063
##$F2P= -1.10871071338519
##$FCOR= 0.5
##$FTSIZE= 0
##$FT_mod= 4
##$GAMMA= 1
##$GB= 0.15
##$INTBC= 1
##$INTSCL= 1
##$ISEN= 128
##$LB= 0.24
##$LEV0= 0
##$LPBIN= 0
##$MAXI= 10000
##$MC2= 0
##$MEAN= 0
##$ME_mod= 0
##$MI= 1.114404
##$NCOEF= 0
##$NC_proc= 0
##$NLEV= 6
##$NOISF1= 3.799351
##$NOISF2= 2.8
##$NSP= 1
##$NTH_PI= 0
##$NZP= 0
##$OFFSET= 15.70392
##$PC= 1
##$PHC0= -8943.886
##$PHC1= 20.00096
##$PH_mod= 1
##$PKNL= yes
##$PPARMOD= 0
##$PSCAL= 0
##$PSIGN= 0
##$REVERSE= no
##$SF= 200.130013532006
##$SI= 16384
##$SIGF1= 3
##$SIGF2= 2
##$SINO= 400
##$SIOLD= 16384
##$SREGLST= <1H.CDCl3>
##$SSB= 0
##$STSI= 0
##$STSR= 0
##$SW_p= 3612.71676300578
##$SYMM= 0
##$S_DEV= 0
##$TDeff= 0
##$TDoff= 0
##$TI= <>
##$TILT= no
##$TM1= 0
##$TM2= 0
##$TOPLEV= 0
##$USERP1= <user>
##$USERP2= <user>
##$USERP3= <user>
##$USERP4= <user>
##$USERP5= <user>
##$WDW= 1
##$XDIM= 8192
##$YMAX_p= 0
##$YMIN_p= 0
$$ End of Bruker specific parameters
$$ ---------------------------------
##NTUPLES= NMR FID
##VAR_NAME=  TIME,          FID/REAL,        FID/IMAG
##SYMBOL=    X,             R,               I
##VAR_TYPE=  INDEPENDENT,   DEPENDENT,       DEPENDENT
##VAR_FORM=  AFFN,          ASDF,            ASDF
##VAR_DIM=   8192,          8192,            8192
##UNITS=     SECONDS,       ARBITRARY UNITS, ARBITRARY UNITS
##FACTOR=    0.0002004,     1,               1
##FIRST=     0,             0,               0
##LAST=      1.6414764,     0,               0
##MIN=       0,             -4482,           0
##MAX=       1.6414764,     3910,            0
$$ Real data points
##PAGE= N=1
##DATA TABLE= (X++(R..R)), XYDATA
$$ plain form
0 0 0 0 0 0 0 0 0 0 0 0 0 0 0 0 0 0 0 0 0 0 0 0 0 0 0 0 0 0 0 0 0 0 0 0 -1 3 -4 4 -4 5 -6 6 -6 8 -8 10 -11 12 -12 13 -17 18
52 18 -22 26 -29 37 -50 68 -107 217 -1121 -4482 -1201 2484 1579 -702 -136 527 -939 -1664 229 1532
72 1532 546 -556 -489 -606 -547 658 1090 -694 -1515 732 2058 -571 -2762 -474 2451 1309 -1169
89 -1169 -769 551 -371 -1200 531 2099 763 -1182 -1178 -366 159 1113 1588 -101 -1920 -651 1571 724
107 724 -1344 -358 1909 782 -1971 -1413 1287 1347 -633 -598 842 318 -1382 -1091 619 1233 680 -75
125 -75 -1207 -1796 -117 2101 1297 -1401 -1511 662 746 -1079 -660 1549 1111 -1560 -1610 1011 1595 -547
143 -547 -1404 173 1218 453 -470 -765 -659 279 1570 1108 -983 -1555 76 896 19 110 1347 516 -2044
162 -2044 -1916 1316 2709 311 -1841 -986 512 521 146 236 -40 -517 -194 305 -82 -359 303 477 -590
$$ packed form
0@%%%%%%%%%%%%%%%%%%%%%%%%%%%%%%%%%%jMpQqRj1J2j2J4j6J8k1K3k4K5l0L5
52A8m0M8n5O6q7J18j75L24j338l361L281L685r05k281N66O63j466p25J893J303
72A532r86j102O7j17N9J205M32j784q21K247J326k629k191K288K925j142k478
89a169M00J320r22q29J731J568j336j945MQ12N25R54M75j689j819J269K222q47
107G24k068R86K267j127k753N58K700O0j980L5J440n24j700K91J710O14n53p55
125g5j132n89J679K218q04k698j10K173Q4j825M19K209m38k671n0K621N84k142
143e47q57J577J045p65r23k95J06R38J291m62k091n72J631Q20q77R1J237q31k560
162b044J28L232J393k398k152Q55J498Rl75R0k76m77L23M99l87k77O62J74j067
$$ plain form
181 -590 -746 678 914 -994 -1647 576 2092 287 -1873 -1163 686 885 49 -55 57 -336 -502 -15
199 -15 319 340 423 84 -835 -776 771 1363 -285 -1435 92 1621 327 -1539 -690 1323 1183 -491 -861
218 -861 54 305 -137 9 510 407 -206 -648 -621 88 1075 909 -749 -1638 -137 1505 698 -1101 -929
237 -929 549 634 -482 -514 430 343 -606 -610 425 754 -65 -827 -661 202 999 769 -566 -1431 -424 1176
257 1176 1075 -350 -765 50 276 -323 -134 861 746 -657 -1181 42 1224 825 -466 -976 -276 692
275 692 840 -36 -777 -314 588 447 -410 -389 405 334 -639 -573 681 970 -444 -1394 -340 1107 835 -532
295 -532 -1018 -186 589 373 -314 -484 6 351 -24 -457 -71 532 203 -685 -557 598 861 -284 -1033 -108
315 -108 1057 661 -601 -877 59 790 458 -227 -346 17 218 23 -66 207 383 -83 -632 -248 789 874
$$ packed form
181e90j56J424K36j908o53K223J516j805k160P10J849J99q36j04J12l93j66M87
199a5L34K1Q3l39r19N9J547N92j648j150J527J529j294j866Q49K013j40j674l70
218h61R15K51m42J46N01j03o13m42K7P09R87j66j658q89J501J642q07j799J72
237i29J478Q5j116l2R44q7r49mJ035L29q19p62J66Q63P97k30j335q65J007J600
257A176j01j425m15Q15K26n99J89R95j15j403n24J223J182l99j291n10P00R68
275F92J48q76p41M63R02j41q57K1P94p1r73O6J254K89j414r50J054J447k72j367
295e32m86Q32P75k16o87j70M90L45l75m33L86O03l29q88J28J155K63j145p49R25
315a08J165l96j262k76R36P31l32o85j19L63K01j95q9K73J76m66n49L84J037Q5
$$ plain form
335 874 -330 -1186 -396 932 949 -259 -946 -363 430 406 -87 -228 -31 -86 -353 -185 469 641 -241 -1135
355 -1135 -655 764 1197 -29 -1223 -746 584 891 4 -620 -224 228 38 -172 189 560 52 -782 -566
374 -566 623 1131 149 -1011 -686 614 1044 98 -752 -383 427 444 -114 -198 211 241 -281 -437 185 703
394 703 186 -671 -602 366 815 46 -830 -543 422 654 -77 -626 -264 312 230 -266 -294 104 201 -200 -366 104
416 104 501 73 -668 -551 404 876 110 -822 -598 454 815 67 -610 -320 304 344 -45 -49 280 165 -404
437 -404 -462 383 971 267 -881 -802 443 1110 308 -792 -693 242 646 164 -258 -93 95 -206 -397 120
457 120 693 284 -756 -903 193 1036 412 -832 -921 111 748 269 -383 -344 26 31 -163 -19 350 246
477 246 -360 -589 3 732 532 -425 -828 -52 804 542 -354 -562 120 499 92 -278 12 327 104 -238
$$ packed form
335H74j204q56P90J328J7j208o87N83P93k4m93j41J97n5k67J68O54J72q82q94
355a135M80J419M33j226j194M77J330L07q87o24L96M52j90k10L61L71n08q34K16
374e66J189N08r82j160L25J300M30r46q50L69Q10J7n58q4M09L0n22j56O22N18
394G03n17q57O9R68M49p69q76K87R65K32p31n49L62N76q2m96k8L98R7m01j66M70
416A04L97m28p41J17R55M72p66r32K24J052L61p48o77K90O24M0l89mL29j15n69
437d04n8Q45N88p04j148P9J245O67q02j100R9R35M04m82m22J65J88l01j91N17
457A20N73m09j040j47J096Q43o24j244q9J032O37m79o52L9L70Nj94J44L69j04
477B46o06k29N92P29k00r57m03P76Q56k62q96k08O82L79m07l70K90L15k23l42
$$ plain form
497 -238 -91 350 345 -175 -491 -80 574 535 -292 -764 -113 748 486 -520 -710 141 591 28 -471 -99 313
518 313 -40 -474 -134 455 288 -435 -630 26 655 395 -496 -861 -116 819 646 -423 -772 -32 478 85
538 85 -202 220 377 -331 -742 94 999 548 -609 -841 0 736 597 -75 -520 -326 299 507 42 -299
558 -299 4 232 -99 -266 310 570 -239 -951 -228 926 738 -452 -898 -231 410 407 82 -248 -365 -148
578 -148 137 87 -83 111 184 -343 -689 70 867 278 -853 -592 608 665 -398 -696 148 661 184 -332
598 -332 -203 52 92 138 117 33 60 111 -185 -404 200 899 277 -901 -660 697 908 -298 -760 149 658
619 658 -44 -505 -33 323 11 -185 91 141 -134 -240 -191 -101 233 609 95 -988 -865 550 1139 27
639 27 -896 -341 313 -37 -268 336 560 -264 -805 -185 520 428 22 -211 -327 -142 439 505 -323 -713 245
$$ packed form
497b38J47M41nn20l16M11O54l9q27m72O51Q61k62j006j90Q51M50n63m99L72M12
518C13l53m34L40N89j67p23j95O56O29k60q91l65P45R35j73j069l49P40N10l93
538H5k87M22J57p08m11Q36R05m51j157k32Q41P36j39o72m45J94O25K08m65l41
558b99L03K28l31j67N76K60q09p12P23J154j88j190m46O67O41ll25l30j17K17
578a48K85n0j70J94P3n27l46P59P97n89j131K61J200N7j063k98Q44N13m77n16
598c32J29K55M0M6k1q4K7N1k96k19O04O99o22j178K41J357K11j206m62R09N09
619F58p02m61M72L56l12j96K76N0k75j06M9R0L34L76n14j083J23J415N89j112
639B7r23N55O54l50k31O04K24q24n41O20P05r2m06k33j16J85N81O6q28l90R58
$$ plain form
660 245 962 145 -783 -254 546 156 -406 217 819 -25 -1012 -459 734 830 45 -436 -472 -270 288 641 121
681 121 -527 -228 337 -76 -603 87 871 124 -972 -437 718 338 -740 -432 698 596 -453 -715 -87
700 -87 249 239 271 28 -491 -409 279 346 -145 -36 470 16 -832 -330 928 731 -579 -706 435 644 -288
721 -288 -561 171 532 142 -47 -41 -327 -356 283 635 73 -296 -16 -63 -580 -142 1043 849 -819 -1365 34
742 34 1047 321 -463 -137 128 -313 -374 236 414 -62 -253 -65 -103 -123 218 220 -424 -402 615 781 -542 -1203
764 -1203 60 1140 364 -601 -214 307 -178 -463 349 869 141 -655 -454 88 319 452 360 -279 -665 9
784 9 638 71 -532 84 746 6 -855 -288 654 314 -435 -100 481 22 -654 -330 402 420 47 -144 -372
805 -372 -483 77 703 277 -603 -418 378 194 -532 -178 690 370 -649 -498 449 431 -402 -410 364 533 -29
$$ packed form
660B45P17q17r28N29Q00l90n62O23O02q44r87N53J193R6p85m81l6K02N58L53n20
681A21o48K99N65m13n27O90P84p47j096N35J155l80j078L08J130j02j049k62O28
700h7L36j0L2k43n19Q2O88O7m91J09N06m54q48N02J258j97j310j27J141K09r32
721b88k73P32L61l90j89Ok86k9O39L52n62l69K80m7n17M38J185j94j668n46J399
742C4J013p26p84L26K65m41o1O10J78m76j91J88l8k0L41Ko44K2J017J66j323o61
764a203J263J080p76r65L87N21m85k85Q12N20p28p96K01N42K31J33r2o39l86O74
784IO29n67o03O16O62p40q61N67R42l40p49L35N81m59o76L24P32J8l73j91k28
805c72j11N60O26m26q80J85P96j84p26L54Q68l20j019J51R47j8q33qP74J69n62
$$ plain form
826 -29 -388 -300 -102 300 671 259 -590 -560 258 459 -79 -7 505 85 -881 -559 840 1016 -245 -911 -178
847 -178 461 157 -152 10 49 -119 -30 98 -100 -194 99 171 -184 -140 340 154 -679 -589 561 931 -157 -947
869 -947 -321 442 286 -67 64 92 -258 -344 79 329 192 59 -87 -332 -233 363 520 -191 -542 141 649
890 649 -20 -679 -145 637 351 -311 -252 167 95 -166 -8 255 147 -144 -250 -196 48 408 319 -363 -652 58
912 58 646 127 -607 -269 473 269 -398 -327 227 190 -272 -190 280 273 -224 -464 -141 291 464 148 -442 -583
934 -583 55 668 339 -346 -367 122 151 -148 28 441 187 -500 -465 283 620 127 -405 -312 108 358 228 -152
956 -152 -358 -90 305 250 -142 -181 74 41 -257 -87 412 325 -402 -617 46 617 265 -369 -439 -27 254 150
978 150 -84 -166 -18 92 -49 -187 0 266 91 -332 -227 343 396 -210 -511 38 569 224 -375 -326 204
$$ packed form
826b9l59Q8J98M02L71m12q49L0Q18K01n38P2N12m20r66L22J399J76j261o66P33
847a78O39l04l09J62L9j68Q9J28j98r4K93P2l55M4M80j86q33R0J150L70j088p90
869i47O26P63j56l53J31K8l50q6M23K50j37j33j46k45R9N96J57p11l51O83N08
890F49o69o59N34P82k86o62N9M19p2k61J58K63j08k91j06N4K44L60q9o82k89P10
912E8N88n19p34L38P42k04o67P1N54l7m62Q2M70pm97k40L23M32J73l16n90j41
934e83O38O13l29o85k1M89K9k99J76M13k54o87L5P48L37m93n32R3M20K50j30l80
956a52k06K68L95n5l92l9K55l3k98J70M99q7p27k15O63N71l52o34p0M12K81j04
978A50k34q2J48J10j41j38J87K66j75m23J05N70N3o06l01N49N31l45n99M9N30
$$ plain form
999 204 375 60 -203 -94 125 121 -42 -62 112 190 -64 -299 -74 388 324 -261 -484 28 522 206 -374 -396
1021 -396 74 296 72 -139 -94 -2 -74 -123 19 237 158 -238 -426 -65 443 395 -225 -590 -176 402 369 -95
1043 -95 -301 -86 106 20 -20 127 168 -102 -334 -88 398 448 -106 -536 -233 395 519 -24 -408 -179 228 219
1065 219 -61 -108 105 85 -190 -185 203 376 -3 -459 -281 305 446 -43 -453 -225 251 275 -122 -297 -31 189
1087 189 20 -189 -66 186 80 -226 -230 141 314 -29 -366 -183 293 349 -98 -393 -121 313 293 -85 -247
1108 -247 -28 194 93 -66 2 149 46 -178 -115 252 342 -47 -438 -228 330 478 -13 -432 -258 207 317
1129 317 5 -183 -64 44 -52 -91 120 264 -15 -411 -321 257 535 37 -517 -397 194 441 70 -307 -209
1150 -209 87 84 -57 14 180 61 -257 -265 154 460 171 -369 -395 145 491 166 -301 -248 142 267 2 -111
$$ packed form
999B04J71l15k63J09K19mj63k0J74P8k54k35K25M62o4n85k23N12M94l16n80k2
1021c96M70K22k24k11M5R2p2m9J42K18p9l96j88L61N08m8o20l65M14N78l3m64
1043i5k06K15J92q6m0J47M1k70k32K46M86N0n54m30L03O28J24n43l84K29M07r
1065B19k80m7K13k0k75NL88J73l79m56J78N86J41m89m10K28M76K4l97j75K66K20
1087A89j69k09J23K52j06l06mL71J73l43l37J83M76N6m47k95K72M34k0l78j62
1108b47K19K22j01j59O8J47j03k24O3L67R0l89l91K10N58J48m91m19J74M65J10
1129C17l12j88J19J08r6l9K11J44k79l96R0N78K78m98n54J20N91K47l71l77R8
1150b09K96lj41P1J66j19l18qM19L06k89n40k6N40L46l25m67N3L90J25k65j13
$$ plain form
1172 -111 53 147 -60 -184 30 269 146 -205 -273 57 320 158 -249 -313 41 329 117 -261 -209 121 187 -103
1194 -103 -213 31 179 -39 -222 -33 200 88 -233 -244 78 295 83 -280 -313 85 392 157 -292 -297 123
1215 123 277 9 -142 74 165 -142 -276 124 456 160 -363 -357 152 429 180 -228 -299 8 294 201 -106 -200
1237 -200 30 107 -77 -87 213 216 -262 -462 48 558 238 -423 -470 33 323 169 -82 -166 -142 -59 39 46 35 61
1261 61 -38 -249 -202 205 398 -34 -446 -154 394 292 -240 -291 125 281 43 -123 -23 49 11 26 80 57 58 9
1285 9 -161 -158 184 430 57 -454 -253 382 335 -231 -323 176 325 -102 -306 6 215 17 -111 -5 37 -49 -98
1308 -98 -87 -2 182 244 -138 -541 -238 479 514 -208 -510 -43 253 -47 -171 204 276 -169 -380 16 345 144
1330 144 -131 -130 -38 97 232 76 -269 -241 289 473 -61 -429 -70 288 47 -142 199 317 -229 -561 -45
$$ packed form
1172a11J64R4k07j24K14K39j23l51o8L30K63j62m07o4L54K88k12l78N2L30O6k90
1194a03j10K44J48k18j83J89K33j12l21j1L22K17k12l63l3L98L07k35m49nM20
1215A23J54k68j51K16R1l07j34M00L32k96n23ON09K77k49m08p1L07K86r3l07r4
1237b00K30P7j84j0L00Lm78k00N10N10l20o61m7N03K90j54k51q4K4Q3R8Pj1K6
1261F1r9k11M7M07J93m32m12K92N48j02n32n1M16J56k38j66J00P2l8J5N4k3Jm9
1285Ij70LL42K46l73n11K01O35m7n66r2M99J49m27k04L12K09j98j28J06M2q6m9
1308i8J1Q5J84O2l82m03L03P17L5p22l02M67K96l00j24L75P2m45k11L96L29k01
1330A44k75JR2J35J35j56l45K8N30J84n34l68L59L58k41j89L41J18n46l32N16
$$ plain form
1351 -45 545 367 -146 -324 -223 -40 207 296 -11 -290 -109 165 -63 -270 94 385 -63 -494 -86 412 90
1372 90 -433 -150 422 255 -323 -358 36 196 140 104 -34 -238 -127 161 120 -65 97 288 -92 -506 -81 580
1394 580 319 -379 -271 321 279 -303 -272 272 361 -32 -190 -76 -95 -61 196 270 -58 -209 -48 -70 -226 83
1416 83 548 217 -611 -608 231 536 -26 -311 7 104 -196 -205 177 200 -99 -145 24 -2 -81 53 70 -156 -68 368
1440 368 253 -438 -551 253 689 108 -392 -120 149 -108 -147 335 471 -81 -463 -206 180 256 240 81 -251
1461 -251 -328 119 368 -27 -302 123 372 -136 -497 -9 443 57 -346 -14 317 -68 -463 -130 328 243 -57
1482 -57 -170 -223 -208 77 344 75 -312 -131 177 -34 -311 47 457 98 -427 -208 314 167 -247 -92 325
1503 325 236 -211 -257 -35 121 208 268 8 -375 -239 253 290 -34 -33 210 -54 -465 -135 536 419 -328 -479
$$ packed form
1351d5N90j78n13j78J01J83K47Q9l07k79J81K74k28k07L64K91m48m31M08M98l22
1372I0n23K83N72j67n78l5L94J60n6l6j38k04J11K88m1j85J62J91l80m14M25O61
1394E80k61o98J08N92m2n82L1N44Q9l93j58J14j9L4K57P4l28j51J61k2j56L09
1416H3M65l31q28LQ39L05n62k85L18R7l00rL82K3k99m6J69k6p9J34J7k26Q8M36
1440C68j15o91j13Q04M36n81n00K72K69k57l9M82J36n52l82K57L86P6j6j59l32
1461b51p7M47K49l95k75M25K49n08l61M88M52l86m03L32L31l85l95L33M58q5l00
1482e7j13n3J5K85K67k69l87J81L08k11k77L58M10l59n25K19N22j47m14J55M17
1503C25q9m47m6K22J56Q7O0k60l83J36M92L7l24JK43k64m11L30O71j17p47j51
$$ plain form
1525 -479 60 301 -11 -162 0 66 -49 -22 14 -110 -117 88 116 -116 -85 140 -15 -401 -158 488 438 -350 -605
1548 -605 -31 386 134 -105 29 41 -186 -183 139 270 82 -61 -113 -146 3 280 217 -183 -252 190 324 -108
1570 -108 -338 94 386 60 -269 -59 168 0 -146 49 218 34 -177 -159 -44 52 191 130 -191 -313 51
1591 51 284 -21 -306 -29 297 24 -325 -122 231 118 -182 -93 128 51 -195 -151 67 199 131 -51 -262 -220
1613 -220 149 386 81 -296 -158 174 104 -123 15 258 55 -320 -174 288 300 -96 -286 -40 187 158 3
1634 3 -142 -139 32 198 67 -148 -126 48 -7 -120 25 240 29 -377 -284 206 362 -9 -306 -174 76 117 32
1657 32 -32 -62 -58 -3 -9 -17 45 94 -35 -203 -67 228 171 -179 -235 102 295 26 -238 -105 151 133 -45 -77 27
1682 27 66 -1 -57 -23 75 100 -48 -159 -22 206 132 -182 -217 113 263 -12 -279 -115 172 140 -87 -151 -3 48
$$ packed form
1525d79N39K41l12j51J62O6j15K7L6j24pK05K8k32L1K25j55l86K43O46n0p88k55
1548f05N74M17k52k39J34J2k27LL22J31j88j43n2l3J49K77o3m00o9M42J34m32
1570a08k30M32K92l26l29K10K27j68j46J95J69j84k11J8J15R6J39o1l21j22L64
1591E1K33l05k85K77L26k73l49K03L53j13l00Q9K21p7k46M4K18J32o8j82k11M2
1613b20L69K37l05l77J38L32p0k27J38K43k03l75J46M62J2l96j90K46K27k9j55
1634Cj45LJ71J66j31k15K2J74n5j13J45K15k11m06R3M90J56l71k97J32K50M1q5
1657C2o4l0MN5oqO2M9j29j68J36K95n7l50n6L37J93k69k64J33K56j8j78l2J04
1682B7L9o7n6L4R8K5j48j11J37K28p4l14l5L30J50k75k67J64K87l2k27o4J48N1
$$ plain form
1706 48 -33 -68 35 100 -2 -175 -165 64 232 78 -240 -259 58 277 83 -192 -159 53 91 -16 3 91 35 -116
1730 -116 -131 94 246 105 -161 -216 33 263 169 -108 -228 -24 178 98 -55 -60 29 -2 -111 -32 156 136 -117
1753 -117 -246 -49 232 189 -127 -241 -55 167 107 -95 -134 20 83 -44 -107 8 141 17 -161 -101 146 173
1775 173 -68 -220 -40 193 126 -106 -169 27 169 44 -125 -99 70 118 -26 -91 38 118 8 -111 -30 146
1797 146 117 -100 -186 12 216 113 -142 -206 -10 171 93 -80 -105 10 37 -37 -31 66 60 -86 -202 -49 201 170
1821 170 -111 -282 -96 180 178 -54 -188 -69 70 48 -20 -6 44 -35 -136 -65 141 202 -41 -258 -133 173 242
1844 242 -11 -221 -106 110 126 -29 -68 35 48 -62 -79 75 166 11 -192 -136 108 201 20 -200 -135 81 147
1867 147 -23 -154 -47 84 35 -96 -69 83 78 -97 -133 17 129 2 -149 -98 100 119 -38 -156 -79 117 141
$$ packed form
1706D8q1l5J03O5j02j73J0K29J68j54l18j9L17K19j94k75L3K12L8j07J9Q8n6j51
1730a16j5K25J52j41k66n5K49K30r4k77j20K04K02q0j53nQ9l1j09P9J88k0k53
1753a17j29J97K81m3l16j14J86K22o0k02l9J54O3j27o3J15J33j24j78O0K47K7
1775A73k41j52J80K33o7k32o3J96J42j25j69K6J69M8j44o5J29Q0j10j19Q1J76
1797A46k9k17q6J98K04j03k55o4J96J81p8j73k5J15K7p4OR7oj46j16J53K50l1
1821A70k81j71J86K76kk32j34J19J39k2o8J4N0p9j01P1K06O1k43k17J25L06O9
1844B42k53k10J15K16J6j55l9J03J3j10j7J54R1j55k03N6K44R3j81k20O5K16O6
1867A47j70j31J07J31m9j31K7J52nj75l6J50J12j27j51N1J98J9j57j18P7J96K4
$$ plain form
1890 141 -20 -156 -65 111 101 -65 -80 56 71 -65 -92 79 163 -31 -206 -80 147 169 -25 -183 -109 93 151
1913 151 31 -137 -113 43 55 -53 -34 80 36 -174 -176 114 266 -7 -293 -194 123 202 14 -120 -83 -17 14 27
1937 27 16 15 14 -59 -118 -15 170 144 -143 -232 27 253 79 -195 -130 116 143 -37 -56 20 29 -43 -27 63 77 22 -55
1964 -55 -98 -35 138 174 -47 -232 -51 190 108 -140 -95 123 91 -138 -143 67 109 -28 -97 4 20 -29 -46 -20 10
1989 10 63 74 -91 -226 -25 249 151 -189 -206 99 162 -64 -110 92 135 -90 -157 50 178 18 -92 -32 59 88
2013 88 53 -45 -147 -21 227 185 -141 -246 28 175 -18 -74 122 100 -200 -280 75 319 89 -192 -159 -32 51
2036 51 89 69 -73 -130 -35 88 -40 -119 60 141 -83 -202 45 210 -60 -262 1 283 89 -211 -153 59 90
2059 90 33 64 7 -104 -70 71 54 -17 69 123 -100 -268 12 322 122 -225 -109 188 71 -215 -87 221 145
$$ packed form
1890A41j61j36R1J76j0j66j5J36J5j36k7J71Q4j94j75J26K27K2j94j58P4K02N8
1913A51j20j68K4J56J2j08J9J14m4k10kK90J52k73k86R9L17P9j88j34L7O6L1J3
1937B7j1jjp3n9J03J85k6k87q9K59K26j74k74O5K46K7j80j9P6Rp2J6R0J4n5p7
1964e5m3O3J73L6k21j85J81K41q2k48M5K18l2k29nK10M2j37o9J01J6m9j7K6L0
1989A0N3J1j65j35K01K74r8l40j7L05O3k26m6K02M3k25o7K07J28j60j10O0R1K9
2013H8l5r8j02J26K48m2l26j05K74J47j93n6J96k2l00q0L55K44k30k81L3J27Q3
2036E1L8k0j42n7R5J23j28p9J79Q1k24j19K47J65k70k02K63K82j94l00N8K12L1
2059I0n7L1n7j11L4J41j7p1Q6N4k23j68K80L10k00l47J16K97j17k86J28L08p6
$$ plain form
2082 145 -113 -136 -19 -14 -15 96 85 -77 -105 6 -23 -121 69 252 23 -343 -207 229 220 -136 -175 104 101 -151 -129
2107 -129 81 95 -61 -37 80 -2 -111 -18 58 -11 20 181 30 -301 -212 250 343 -31 -246 -25 78 -82 -41
2130 -41 232 202 -151 -271 -32 145 97 58 1 -133 -154 69 154 -73 -174 77 185 -115 -266 22 199 -41
2152 -41 -185 77 184 -107 -285 -45 205 99 -63 -77 -88 -106 51 176 51 -147 -29 89 -76 -166 118 307
2174 307 4 -286 -64 206 55 -159 15 219 53 -211 -108 87 91 67 83 -32 -181 -83 157 117 -69 -17
2196 -17 115 -53 -244 -20 284 117 -246 -179 121 104 -138 -117 82 72 -37 -30 -17 -105 -84 83 114 -55 -96 23
2220 23 -52 -171 2 310 158 -276 -312 82 250 39 -72 41 15 -142 -68 146 154 11 -56 -36 -63 4 145 99
2244 99 -112 -105 135 147 -140 -199 102 214 -29 -165 4 82 -77 -118 76 158 -26 -146 -92 -13 31 96 54 -113
$$ packed form
2082A45k58k3J17NjJ11j1j62k8J11k9r8J90J83k29l66J36M36rl56l9K79lk52K2
2107a29K10J4j56K4J17q2j09R3P6o9L1J61j51l31Q9M62R3l74k15K21J03j60M1
2130d1K73l0l53j20K39J77m8l9n7j34k1K23Q5k27j01K51J08l00j51K88J77k40
2152d1j44K62J07k91j78K40K50j06j62j4j1j8J57J25j25j98J18J18j65r0K84J89
2174C07l03k90K22K70j51k14J74K04j66k64J03J95Mk4J6j15j49R8K40m0j86N2
2196a7J32j68j91K24L04j67l63O7L00j7k42K1J99j0j09PJ3q8K1J67L1j69m1J19
2220B3p5j19J73L08j52m34l6L94J68k11j11J13k6j57P4K14Qj43o7K0k7O7J41m6
2244I9k11PK40J2k87n9L01J12k43j36J69P8j59m1J94Q2j84j20N4P9M4O5m2j67
$$ plain form
2268 -113 -173 25 104 -44 -124 57 154 -79 -221 -13 170 45 -116 -36 85 -22 -123 -17 119 73 -10 -44 -83
2291 -83 -43 117 189 -1 -155 -36 144 39 -93 12 165 1 -174 -48 155 88 -117 -102 74 105 6 -69 -79
2314 -79 -51 66 110 -6 -144 -86 43 22 -62 21 107 -64 -228 -100 196 174 -95 -205 -37 68 36 -9 7 -23
2338 -23 -54 -15 15 24 27 40 -25 -90 12 137 58 -146 -92 120 162 -32 -133 8 111 29 -44 4 42 3 -58 -17 33
2365 33 55 33 -30 -94 -23 107 60 -92 -84 71 99 -66 -137 -2 108 26 -110 -69 27 33 -33 -26 14 14 -26 -66 -40 59 101
2394 101 0 -132 -72 91 144 -17 -133 -34 85 54 -54 -13 61 16 -60 -23 85 112 -16 -106 -59 80 131 33 -109
2419 -109 -92 43 109 28 -55 -29 21 -13 -37 31 83 23 -113 -107 47 134 23 -111 -130 5 85 35 -64 -62 -8 12 -20 -36
2447 -36 31 37 -45 -97 -19 101 69 -60 -111 -1 121 52 -59 -61 31 75 6 -55 0 68 44 -42 -39 62 85 1 -72 -16 80
$$ packed form
2268a13o0J98P9j48q0J81R7k33j42K08J83j25j61Q0J21j07j01J06J36m6q3l4l9
2291h3M0J60P2j90j54J19J80j05j32J05J53j64j75J26K03o7k05J5J76L1r9p5j0
2314g9K8J17M4j16j38N8J29k1q4Q3Q6j71j64J28K96k2k69j10J68J05l2m5J6l0
2338b3l1L9L0RLJ3o5o5J02J25p9k04N4K12M2j94j01J41J03q2p3M8L8l9o1M1N0
2365C3K2k2o3o4P1J30m7j52QJ55K8j65p1J35J10q2j36M1R6Oo6PM0%m0m0K6R9M2
2394A01j01j32O0J63N3j61j16R9J19l1j08M1P4m5p6L7J08K7j28r0M7J39N1r8j42
2419a09J7J35O6q1q3K6N0l4k4O8N2o0j36OJ54Q7j11j34j9J35Q0n0r9KN4K0l2j6
2447c6O7Oq2n2P8J20l2j29n1J10J22o9j11kR2M4o9o1N5O8k4q6LJ01K3q4p3N6R6
$$ plain form
2476 80 56 -62 -83 39 111 2 -99 -70 51 84 -20 -86 -40 29 17 -32 -39 21 23 -54 -65 13 90 27 -113 -115 19 109
2504 109 30 -102 -105 3 60 44 -27 -5 9 -24 -43 4 93 52 -70 -116 3 132 95 -51 -112 -14 93 77 -13 -26 10
2531 10 10 -22 -1 57 65 -38 -116 -32 94 94 -27 -130 -62 58 64 -25 -76 -22 33 1 -49 -8 63 4 -85 -74 22 76 -14 -92
2561 -92 -42 60 55 -31 -64 -12 59 43 -27 -50 23 76 12 -59 -14 65 48 -52 -39 56 69 -27 -80 14 93 56 -55 -70 12
2590 12 88 43 -31 -62 -13 49 23 -30 -18 16 -10 -71 -34 90 79 -64 -150 -41 104 69 -45 -81 -46 14 22 -3 -6 -17 -24
2619 -24 -35 -43 15 77 18 -104 -97 72 144 -1 -116 -44 87 64 -14 -34 22 10 -23 0 44 43 -6 -57 -57 15 97 77 -69
2648 -69 -109 6 110 35 -70 -16 63 -4 -91 -44 73 64 -49 -60 18 16 -15 -24 -21 5 13 14 -41 -74 23 113 26 -100 -66 88
2678 88 60 -62 -55 68 70 -64 -80 39 67 -17 -42 27 38 9 -13 -38 -41 41 111 43 -120 -108 66 101 -16 -56 52 33
$$ packed form
2476H0k4j18k1J22P2j09j01K9J21L3j04o6M6O9j2m9pO0Kp7j1P8P7o3j40kJ34R0
2504A09p9j32lJ08N7j6p1K2J4l3j9M7Q9m1j22m6J19J29l7j46o1R8J07j6r0j3L6
2531A0%l2K1N8Qj03p8Q4J26%j21j03O8J20Oq9n1N4N5l2n0M1P1n9q9J1R6N4r0p8
2561i2N0J02nq6l3N2P1j6p0k3P3N3o4p1M5P9j7j00J3R5J3r6n3R4P9l7j11j5Q2
2590A2P6m5p4l1M9O2k6n3J2L4k6o1L7J24j1j43q6J09J45l5j14l6L5O0Qk5lj1p
2619b4j1qN8O2n9j22PJ69P2j45j15P2J31k3p8k0N6j2l3K3M4jm9n1%P2Q2k0j46
2648f9m0J15J04p5j05N4P9o7q7M7J17rj13j1P8kl1rLK6QJn5l3R7R0q7j26L4J54
2678H8k8j22PJ23Kj34j6J19K8q4k5O9J1k9k2k5lQ2P0o8j63J2J74L5j17m0J08j9
$$ plain form
2706 33 -126 -95 112 150 -20 -134 -58 33 38 24 15 -48 -70 -1 38 -37 -53 37 53 -59 -78 65 89 -70 -127 62 159
2733 159 -2 -142 -47 67 43 5 25 -16 -88 -65 52 53 10 33 26 -86 -104 67 167 16 -130 -41 90 -5 -99 8
2759 8 130 25 -106 -66 22 19 -8 32 39 -53 -64 11 -2 -36 36 111 -21 -164 -59 135 68 -96 -60 93 41 -114 -77
2786 -77 90 56 -36 1 28 -27 -67 15 70 12 10 55 -34 -153 -25 186 153 -101 -159 15 49 -37 4 131 66 -149 -125
2813 -125 55 108 17 -8 -6 -64 -49 43 76 -61 -70 67 70 -93 -123 65 103 -44 -69 69 84 -93 -143 59 150 29
2839 29 -69 -54 -46 -48 49 110 16 -90 -22 40 -26 -55 121 146 -59 -183 -7 143 31 -81 20 109 -34 -135 -22
2864 -22 89 39 -7 30 -19 -99 -14 102 37 -50 3 72 -48 -141 12 151 32 -138 -51 89 14 -106 -31 101 48
2889 48 -56 -44 0 -31 -15 86 76 -59 -75 18 -3 -45 44 150 23 -190 -117 122 150 -8 -61 21 2 -80 -10 100
$$ packed form
2706C3j59L1K07L8j70j14P6R1Nj4ro3k2O9L9p5j6R0J6j12j9J43K4j59n7J89R7
2733A59j61j40R5J14k4l8K0m1p2K3J17Jm3K3pj12j8J71J00j51j46Q9J31r5r4J07
2759HJ22j05j31M0Q8lk7M0Pr2j1P5j3l4P2P5j32j43J05J94o7j64L6J53n2j55L7
2786g7J67l4r2L7K7n5m0Q2N5n8kM5q9j19J28K11l3k54n8J74L4q6M1J27o5k15K4
2813a25J80N3r1k5Kn8J5R2L3j37rJ37Lj63l0J88L8j47k5J38J5j77n0K02R1j21
2839B9r8J5QkR7O1r4j06O8O2o6k9J76K5k05j24J76J50j12j12J01Q9j43j01J13
2864b2J11n0m6L7m9q0Q5J16o5q7N3O9j20r3J53J39j19j70Q7J40p5j20P5J32n3
2889D8j04J2M4l1J6J01j0j35j6R3k1m2Q9J06j27k13P3K39K8j58n3Q2j9q2P0J10
$$ plain form
2915 100 60 -46 -53 5 -2 -9 65 33 -65 -40 86 62 -114 -88 90 109 -48 -92 22 31 -63 -50 77 90 -62 -106 -37 23
2943 23 30 45 20 -67 -97 15 72 -6 -42 43 66 -80 -107 62 141 -4 -90 7 65 -23 -47 40 79 12 -36 -15 -3 -3 45
2972 45 76 -23 -88 7 87 -21 -86 16 83 -18 -108 -14 80 2 -83 -7 68 27 -60 -53 -2 10 36 45 -22 -96 -55 54 30
3001 30 -34 2 27 -47 -108 9 127 63 -106 -88 29 62 4 -22 7 -12 -26 8 22 11 2 20 -7 -30 19 67 4 -97
3029 -97 -15 99 74 -66 -88 21 60 -11 -27 30 12 -52 -49 0 26 -3 -21 -51 -57 -21 47 15 -53 -55 33 30 -64 -62 23 52 -43
3060 -43 -72 -11 45 6 -28 -16 13 -1 -21 -12 -3 11 23 -6 -43 -15 52 59 -34 -60 29 73 18 -53 -2 49 21 -27 3 50 21 -37
3092 -37 -25 20 46 26 -22 -71 -41 40 49 -18 -64 -37 8 -10 -17 9 29 -24 -82 -31 51 40 -35 -79 -37 23 33 -1 -41 -40 0 12
3124 12 -2 -5 18 21 -36 -28 30 75 23 -47 -45 42 72 14 -16 -11 34 24 -6 -6 15 15 -13 -26 -2 42 47 -16 -47 -8 38 23 -27 -33 14
$$ packed form
2915A00m0j06pN8ppP4l2r8K5J26k4j76K6J78J9j57m4J14Rr4J3J27J3j52m4O9O0
2943B3PJ5k5q7l0J12N7p8l6Q5K3j46k7J69P9j45q6R7N8q8k4Q7L9o7m8K1J2%M8
2972D5L1r9o5R5Q0j08o5J02O7j01r0R4R4p8q5P6P5m1q7PN1J2K6Ro7p4M1J09k4
3001C0o4L6K5p4o1J17J18o4j69J8J17L3n8k6K9j9j4L4J4j1rJ8k7k3M9M8o3j01
3029i7Q2J14k5j40k2J09L9p1j6N7j8o4LM9K6k9j8l0oL6O8l2o8kQ8lr4KQ5K9r5
3060d3k9O1N6l9l4J2K9j4k0RRJ4J2k9l7K8O7Pr3k6Q9M4n5p1N1N1k8m8L0M7k9n8
3092c7J2M5K6k0m8m9L0Q1Ro7m6K7M5j8pK6K0n3n8N1Q2j1p5m4M2O0J0l4m0JM0J2
3124A2j4lK3Ln7QN8M5n2p0KQ7L0n8l0NM5j0l0%K1%k8j3K4M4No3l1L9M6j5n0oM7
$$ plain form
3159 14 20 -18 -49 -8 24 -3 -41 -47 8 41 0 -40 -17 10 6 -26 -25 8 31 -14 -53 -23 40 35 -18 -70 -25 39 33 -1 -17 6 25
3192 25 14 3 36 38 14 -35 -23 45 82 9 -54 -35 23 60 17 -28 -21 7 12 -15 9 34 10 -53 -46 11 50 15 -68 -72 -10 35 24
3225 24 -35 -47 -6 1 -15 -16 5 7 -23 -55 -15 41 41 -21 -44 -12 23 38 -23 -25 3 18 1 -15 13 29 19 -16 -32 24 46 24 -26
3258 -26 -18 34 38 -11 -27 17 31 -6 -28 -5 42 23 -17 -41 -15 12 20 2 -39 -7 -3 -1 -24 -16 39 12 -54 -56 25 46 5 -50 -43 10
3292 10 39 3 -15 -12 -6 1 2 7 7 17 -20 -53 -7 51 57 -25 -59 4 68 45 -5 -2 21 -1 -13 15 33 11 -27 -34 -2 33 54 24 -33
3327 -33 -45 17 53 1 -43 -17 32 -10 -27 6 32 17 -55 -34 15 13 -23 -26 -13 -6 -3 8 -20 -33 9 29 -7 -30 2 36 16 -67
3359 -67 -13 57 47 -37 -39 21 32 1 1 35 21 -5 -12 3 9 37 52 -6 -57 -37 52 53 -21 -24 17 8 -46 -17 62 42 -40 -60 8 39
3393 39 4 -11 1 -16 -17 16 16 -37 -45 24 36 -30 -12 21 19 -59 -40 51 74 -24 -94 -18 52 20 1 19 -4 -55 -22 32 37 13 13
$$ packed form
3159A4Ol8l1M1L2k7l8oN5L3m1m0K3K7ml2JL3K3m5l9L0O3nn3n2M5O4ol4j6K3J9
3192B5j1j1L3Kk4m9J2O8L7p3o3J9N8L7m3m5PK8Nk7K4K5k4o3PN7L9l5q3mO2M5j1
3225B4n9j2M1Pj6jK1Kl0l2M0N6%o2k3L2L5J5o1kK8J5j7j6K8J6j0l5j6N6K2k2n0
3258b6QN2Mm9j6M4J4l7k2K3M7j9m0k4K6K7Qj8m1L2MKk3QN5k7o6kQ1K1m1n5PN3
3292A0K9l6j8LOPJN%J0l7l3M6N8Oq2l4O3O4k3n0LK3k2j2K8J8k2l8pL2L5K1l0n7
3327c3j2O2L6n2m4K6M9m2j7L3K6j5p2K1M9kl6lJ3PLJ1k8j3M2K0l6k3L2L4k0q3
3359f7N4P0j0q4kO0J1l1%L4j4k6pJ5OK8J5n8n1K0Q9Jp4lM1rn4K9P9k0q2k0O8L1
3393C9l5j5J2j7jL3%n3qO9J2o6J8L3kp8J9R1K3r8p0P6P0l2j9J8k3n1L3N4Nk4%
$$ plain form
3426 13 5 -38 -39 49 90 -10 -70 8 67 -5 -49 16 69 -14 -68 -8 45 -6 -19 14 13 -20 -26 -1 -2 -25 14 49 -6 -85 -11 53
3458 53 7 -51 3 71 -8 -94 -32 70 47 -10 8 11 -30 -44 29 60 -2 -17 2 -31 -70 10 103 43 -75 -60 50 50 -20 11
3488 11 80 23 -68 -38 57 51 -14 -3 38 -11 -34 18 28 -19 -21 43 50 -60 -69 36 59 -30 -30 40 10 -89 -83 64 80 -14 -70 -33
3520 -33 -33 -29 28 64 4 -56 -25 11 -4 -1 69 47 -60 -88 17 68 -5 -44 35 37 -40 -70 21 61 5 -16 18 -5 -48 -8 48
3551 48 23 -7 19 45 -27 -72 8 90 25 -70 -14 42 -21 -47 24 97 11 -57 -34 -5 -2 2 59 35 -61 -60 3 27 -9 30 68 -32
3583 -32 -107 -30 93 64 -47 -15 41 5 -44 -2 62 14 -35 -22 19 -8 -20 32 30 -25 -15 47 3 -68 -42 75 80 -29 -55
3612 -55 2 7 -35 1 81 44 -57 -69 4 43 16 30 21 -38 -56 13 54 7 -24 20 9 -51 -48 55 60 -34 -39 1 29 -16 -25 26
3644 26 37 -20 -34 2 2 -26 23 35 0 -31 21 27 -25 -37 37 72 -17 -66 9 43 5 -22 34 49 -23 -54 -3 38 28 10 2 -26
$$ packed form
3426A3qm3jQ8M1j00o0P8N9p2m4O5N3q3n4O0N3n1j3L3jl3oK5jk3L9L5n5p9P4O4
3458E3m6n8N4O8p9q6O2J02k3n7J8Lm1j4P3L1o2j5J9l3l9Q0R3o0j18J5J10%p0L1
3488A1O9n7r1L0R5oo5J1M1m9k3N2J0m7kO4Pj10rJ05K3q9%P0l0r9OJ47J6r4n6L7
3520c3%MN7L6o0o0L1L6j5LP0k2j07k8J05N1p3l9P9Kp7l0R1M0n6k1L4k3m3M0N6
3551D8k5l0K6K6p2m5Q0Q2o5r5N6N6o3k6P1P3q6o8K3K9LMN7k4r6JO3K4l6L9L8j00
3583c2p5P7J23k9j11L2N6l6m9M2O4m8m9J3M1k7j2N2kn5J0O2m4p1K6J17Nj09k6
3612e5N7Nm2L6Q0l7j01j2P3L9k7J4rn9j8O9M1m7l1M4j1o0LJ03Nr4nM0K8m5rN1
3644B6J1n7j4L6%k8M9J2l5l1N2On2j2P4L5q9m9P5L4l8k7N6J5p2l1N1M1j0j8qk8
$$ plain form
3676 -26 -51 4 51 36 -18 -13 9 -33 -42 26 66 15 -58 -29 38 31 -7 -2 28 8 -8 4 25 -12 -3 26 12 -15 -3 27 -12 -40 1
3709 1 69 19 -60 -43 22 29 -13 -10 13 -19 -27 -12 32 32 -12 -14 -20 -24 0 39 18 -23 -28 16 18 -8 -10 40 23 -39 -35 22 27 -5 -33 8 13
3746 13 -6 -5 2 2 -1 21 21 -10 -7 20 14 -18 -15 37 44 -9 -33 14 32 14 -5 -2 11 -14 -18 5 34 7 -6 -18 -20 5 20 21 -25 -52 -12
3783 -12 13 5 -20 13 12 -19 -22 16 41 8 -29 -24 19 30 3 0 -4 -5 17 16 -4 7 3 9 5 3 10 22 -12 -34 -2 27 27 -3 -19 -17 0 6
3821 6 12 0 -16 -1 -3 0 3 24 4 -23 -29 -11 20 9 -14 -16 0 3 -2 -12 5 5 -9 -21 0 11 14 -5 -5 2 14 19 5 -15 3 2 9 -1
3859 -1 10 24 5 -29 -19 20 39 13 -1 -1 9 24 3 5 -5 -2 -9 -14 4 27 10 -13 -21 -10 19 25 -17 -25 -6 11 10 3 3 5 -13 -22 -1
3896 -1 18 15 -20 -44 -26 10 31 -5 -15 -25 -7 -2 0 -1 -10 -1 -8 -10 -5 30 9 -18 -26 3 25 17 1 -1 11 18 13 4 3 12 13 -8 -3 21 16 -3 -20
3937 -20 -4 4 17 -10 -10 -8 0 -3 -16 -1 9 -2 -24 -13 0 11 3 -24 -14 -16 12 6 -13 -18 5 -19 -13 -6 23 21 -9 -10 -11 29 20 7 -8 -10
$$ packed form
3676b6k5N5M7j5n4NK2m2rO8M0n1p3K9O7pl8NL0k0j6J2K1l7RK9j4k7J2L0l9k8M1
3709AO8n0p9J7O5Pm2LK3l2qJ5M4%m4komK4L9k1m1nM4Kk6kN0j7o2MN7Nl2k8M1N
3746A3j9JP%lK2%l1LK7ol2LN2Pn3k4M7J8j8j9LJ3k5mK3K9k7j3j2kK5J5Jm6k7M0
3783a2K5qk5L3jl1lL8K5l3l7NM3J1k7lmjK2jk0J1mOmkPJ2l4k2L2K9%l0j6KJ7O
3821FOj2j6J5kLLK1k0k7oJ8L1j1k3kJ6Lnj0J7%j4j2K1J1Lj9%PJ2Nj4k0J8jPj0
3859aJ1J4j9l4J0L9J9k6j4%J0J5k1Kj0LpnJ8K3j7k3qJ1K9Om2qJ9J7jp%Kj8rK1
3896aJ9ll5k4J8L6K1l6j0j0J8NKjrRpkNL5k1k7qK9K2qj6kJ2PnrjRJk1NK4nj9j7
3937b0J6QJ3k7%KQlj3J5J0j1k2J1J3J1qk7J0kK8oj9nK3k4OPK9kl0jjM0rj3j5k
$$ plain form
3975 -10 8 18 15 8 8 -2 14 -4 20 29 9 -19 -14 11 38 12 -7 6 1 2 18 6 2 -14 -15 -18 17 16 -11 -23 -29 -18 18 26 -9 -16 -13 8
4013 8 -2 -14 -9 3 -28 -34 -12 19 5 -18 -3 -16 3 9 11 -8 -14 2 12 16 -8 1 17 8 1 5 26 3 -27 -16 19 10 1 11 18 1 -10
4050 -10 0 18 12 4 1 -20 -18 -1 33 6 -17 -17 7 9 -24 -6 20 -9 -34 -27 22 18 -17 -28 -5 6 -5 9 -5 -27 -20 11 21 4 -8
4085 -8 12 7 -21 -4 49 45 -33 -21 14 48 14 2 14 -6 -13 6 35 25 -15 -6 8 -3 -3 43 26 -21 -34 3 32 -7 -14 5 19 -26
4119 -26 -30 2 13 -17 -32 10 15 -16 -10 6 -6 -22 6 28 -9 -49 -7 31 -5 -28 12 24 -23 -58 5 63 13 -20 -1 11 -19 -8
4151 -8 42 31 -1 -13 1 3 -2 27 63 12 -37 -13 47 22 -14 -6 43 4 -46 -4 29 11 -22 -5 24 -4 -34 2 5 -18 -9 22 -3
4184 -3 -45 -37 29 31 -11 -8 12 -6 -63 -18 58 35 -26 -22 -3 -4 -12 27 45 -9 -30 -2 31 1 7 41 25 -28 -30 15 32 -12 -27 28 39
4219 39 -17 -25 33 30 -1 -8 28 11 -25 -18 32 24 -8 8 11 -29 -36 8 49 -13 -26 1 19 -24 -36 33 35 -19 -49 -10 16 0 7 42 1
$$ packed form
3975a0J8J0lp%j0J6j8K4Rk0k8NK5K7k6j9J3nJJ6j2mj6jlL5jk7j2oJ1L6Ql5pLK1
4013Hj0j2NJ2l1oK2L1j4k3J5j3J9OKj9oJ6J0Mk4RJ6rpMK1k3l0J1L5rrJ0Pj7j1
4050a0J0J8oqlk1KJ7L4k7k3%K4Kl3J8K6k9k5PM9ml5j1K3J1j1J4j4k2PL1J0j7j2
4085hK0nk8J7N3mp8J2L5L4l4j2J2k0pJ9K9j0m0RJ4j1%M6j7m7j3L7K9l9pJ9J4m5
4119b6mL2J1l0j5M2Nl1OJ6j2j6K8K2l7m0M2L8l6k3M0J2m7l5O3N8n0l3J9J2l0J1
4151hN0j1l2j2J4KnK9L6n1m9K4O0k5l6QM9l9n0M2L3j8l3J7K9k8l0L6Lk3RL1k5
4184cm2QO6Km2LK0j8n7M5P6k3o1MJ9jqL9J8n4k1K8L3l0OL4j6n3kM5J7m4j5N5J1
4219C9n6qN8ll1pL6j7l6PN0ql2J6Lm0pM4M1o2j3K7J8m3j2O9Kn4l0L9K6j6PL5m1
$$ plain form
4254 1 -36 -29 29 23 -17 -4 35 -15 -41 -3 57 18 -31 6 39 -2 -31 15 40 4 -15 5 29 -24 -21 20 29 -1 -14 7 5 -38 17
4287 17 56 27 -32 -35 15 10 -9 14 39 -9 -57 -31 21 17 -7 -6 6 -31 -38 25 39 -7 -26 -4 2 -31 -12 21 13 -32 -28 11 5 -31 -13
4322 -13 16 24 -18 -8 18 3 -15 2 29 -3 -16 4 8 -22 -6 30 36 -32 -54 1 42 -5 -14 23 7 -37 -25 21 25 -1 -18 -12 -6 -21
4356 -21 10 34 -5 -24 -9 15 -15 -14 4 27 -14 -39 -2 19 -8 -29 -9 12 -12 -25 -5 0 -17 -9 17 15 -13 -11 -2 1 -13 12 38 -6
4390 -6 -40 -10 23 17 -8 -8 8 -25 -26 5 30 7 -20 -14 -7 -8 1 15 1 -23 -18 8 17 -11 -10 -3 -7 -29 -8 15 -2 -24 -12 16 11 -16 -9 2
4428 2 -14 -17 8 14 -20 -8 0 2 -13 -10 9 -12 -24 -24 8 18 -10 -16 11 -1 -8 -7 19 -3 1 -13 -4 3 3 6 0 -22 -23 7 24 8 -16 11 8
4467 8 -4 -6 -5 13 -2 -20 -7 10 6 -16 -16 -17 -8 5 -6 1 -14 -10 1 17 3 -5 -3 -16 -15 9 33 -2 -22 -12 7 -2 16 5 -5 -5 -8 3
4505 3 8 7 -9 -4 -13 -16 3 20 -4 -19 -16 -1 -10 -9 -10 -6 1 -6 4 6 9 -12 -13 -6 -5 2 0 1 -9 -4 -6 0 -6 -6 -7 -7 -4 5 10 1 -15 -13 2 0 0 3 -23 -6
$$ packed form
4254Al7PN8om0J3L9n0k6L8O0l9m9L7L3m1k9M6K5l6j9K0K4n3LM1Rl0j3K1km3N5
4287A7L9k9n9lN0nj9K3K5m8m8K6N2mk4JJ2l7pO3J4m6j9K2Ol3J9L3qm5ML9ol6J8
4322a3K9Qm2J0K6j5j8J7K7l2j3K0Ml0J6L6Oo8k2N5M1m7rL7j6m4J2M6Mk6j7OOj5
4356b1L1K4l9j9J5K4l0JJ8K3m1k5L7K1k7k1K0K1k4j3K0Nj7QK6kk8KRLj4K5K6m4
4390fl4L0L3ok5%J6l3jL1K5k3k7OPjRJ4j4k4NK6Rk8JPmk2K1K3j7k2J2K8nk7PJ1
4428Bj6lK5Ol4J2QKj5LJ9k1j2%L2J0k8oK7j2pJK6k2Mj4RP%Lok2jL0J7j6k4K7l
4467Hj2kJJ8j5j8J3J7mk2%jRJ3j1Pj5MJ1J6j4qKj3JK4K4l5k0J0J9rJ8j1j0%lJ1
4505CNjj6NrlJ9J7k4j5LJ5rJjMPpJ0KLk1jPJPkJj0NkOo%j%LRNrj6KJ5k%Lk6J7
$$ plain form
4553 -6 -5 -5 0 4 -10 -2 -5 -17 8 15 -20 -12 -10 0 2 12 2 2 -1 -9 -15 9 6 -13 -8 -4 10 15 -7 -5 -7 -5 0 6 0 -5 -1 -2 6 0 11 9 1 -12 -2 9
4599 9 8 7 -8 -10 -10 -2 -4 -6 3 -17 -13 -8 -9 4 -5 -20 -18 -4 1 -2 -17 -6 -8 -10 3 2 -3 4 -9 -11 7 7 -2 -3 -15 -8 -6 4 -3 -4 -17 -7 3 5 -3 1
4645 1 -12 -11 -13 10 17 1 -9 -13 -1 -2 6 3 0 -3 6 6 -10 -7 7 1 -16 -1 13 8 -2 -14 -3 -3 -17 -5 -2 0 -10 -9 6 -3 -3 -6 -18 -18 10 8
4687 8 9 -9 -17 -5 7 -2 8 -3 -3 -7 -7 1 5 -7 -16 -6 5 10 11 19 -8 -13 7 22 2 -4 -10 -15 7 -5 3 20 1 -16 1 19 9 0 -4 -1 -15
4728 -15 2 -2 7 -5 4 -6 -3 -13 -11 -7 -18 -22 -14 9 -5 1 2 1 -6 -3 -6 11 -11 -20 -15 4 5 -10 -4 -9 -1 -13 16 25 -8 -11 7 13 -2 16 12 0
4770 0 -26 -10 30 8 -5 -12 -1 -9 -9 -1 13 2 -13 0 5 -16 -13 0 0 -25 -23 4 0 -24 -22 1 13 -8 -21 2 -12 -7 -14 -4 -1 -12 -6 4
4808 4 -2 -13 -1 13 -7 -30 -14 20 13 4 -2 -3 -29 -15 11 23 -2 -6 -7 10 -2 -2 16 5 -19 -21 6 2 -6 -10 15 -2 -27 -7 4 -7 -22
4845 -22 -2 22 -7 -28 -19 5 -15 -18 3 2 -16 -26 1 5 3 4 9 -13 -26 -17 32 19 -9 -10 17 -4 -18 -6 22 4 -32 -12 0 11 -10
$$ packed form
4553fJ%NMj4Qlj2K5Pl5QKJ0KJ0j0%lqoK4lj9NMJ4Nk2KkKNOonMjQoJ1kqj3J0J1
4599Ijjj5k%QkkRk0MNjJ3rj5KJ4Nlj5J1kkJ3jnPj3kJ8%rjj2PKJ0pjj3J0J0KqM
4645Aj3JkK3Pj6j0mJ2jQlllR%j6LJ4oj7J5J4nj0j2J1%j4J2LKj0JJ5r%lj2%K8k
4687HJj8qJ2J2rJ0j1%m%QMj2rJ0J1NJQk7nK0J5k0oonK2j2QJ7j9j7J7J8j0rmLj4
4728a5J7mRj2Rj0Lj0KMj1mQK3j4OJjpLlJ7k2rNJ9Jj5OnQj2K9Rl3lJ8Oj5J8mj2
4770@k6J6M0k2j3pJ1q%QJ4j1j5J3Nk1LJ3%k5KK7mk4KK3J2k1j3K3j4NpJ0Lj1OJ0
4808Doj1J2J4k0k3J6L4projk6J4K6J2k5mjJ7j2%J8j1k4kK7mqmK5j7k5K0J1j1j5
4845b2K0K4k9k1RK4k0lK1jj8j0K7MkJNk2j3RM9j3k8jK7k1j4J2K8j8l6K0J2J1k1
$$ plain form
4880 -10 4 27 -20 -19 -2 19 -10 -11 11 5 -12 -12 22 18 -20 -16 1 8 -30 -16 6 1 -6 -10 3 -8 -30 -16 26 4 -18 -1 -11 -24 -26 2
4916 2 19 -16 -29 -21 -3 -27 -19 12 11 -25 -24 0 28 -6 -5 9 -5 -19 -11 10 7 -8 2 10 -4 -23 17 21 3 -10 0 18 -8 -19 12
4951 12 31 -6 0 -7 4 -28 -11 9 8 -18 -11 9 -7 -19 -7 21 -3 -36 -28 3 -1 -14 -3 -3 -29 -44 -7 5 -11 -14 -4 1 -21 -14 22
4986 22 11 3 -15 7 9 -25 0 21 14 -8 -1 8 10 -16 -3 19 8 -9 -16 28 6 -13 15 22 6 -18 -4 0 -3 -7 24 19 -21 -35 9 7 -1
5023 -1 -7 -6 -14 -44 -13 10 14 -24 -12 -6 -15 -25 -10 5 -21 -29 -6 -8 -10 -13 0 15 -4 -22 10 11 -14 -12 1 4 -7 -5 0 0 0 -4 18 12 -11 -7 13
5064 13 12 -5 -4 18 -13 -16 4 22 -3 -18 -10 -13 -7 -21 -6 15 -17 -16 -5 5 -12 -4 -1 5 -17 -16 8 2 -20 -13 7 -6 -10 -8 14 -5 -16 -13
5102 -13 9 1 -12 -13 19 -2 3 14 4 1 -1 0 10 -6 -1 -8 -9 -15 0 27 22 -6 -7 1 7 1 5 13 -6 -13 -4 5 -6 2 -10 -8 -10 -8 -1 6 -16 -8 -9 7
5146 7 1 -11 1 -9 -17 -9 0 9 -8 -9 -16 1 2 6 4 -7 -18 0 9 1 -13 -3 -2 -5 15 6 12 -15 -14 -9 -3 3 0 5 9 -1 -1 16 16 2 -2 8 5 4 3
$$ packed form
4880a0J4K3m7JJ7K1k9jK2oj7%L4ml8MJ7Pl8J4K2npmJ3j1k2J4M2k2k2J7j0j3kK8
4916BJ7l5j3QJ8k4QL1jl6JK4K8l4JJ4j4j4QK1lj5J0Qj4j9M0Mj8j3J0J8k6j1L1
4951A2J9l7OpJ1l2J7K0jk6PK0j6j2J2K8k4l3QL1mj3J1%k6j5L7J2j6lJ0Nk2PL6
4986B2j1qj8K2Kl4K5K1pk2PRKk6J3K2j1j7pM4k2j9K8Pj6k4J4MlmL1nm0j4M4kq
5023aoJql0L1K3Ml8J2Orj0J5J5k6qK3kklJ3J5j9j8L2Jk5KJ3Lj1KN%%mK2ok3MK0
5064A3jj7JK2l1lK0J8k5j5QlOj4J5K1l2JJ1J0j7QLOk2JK4ok2PK0j3mKK2j9j1L
5102a3K2qj3jL2k1NJ1j0lkJJ0j6NpjoJ5K7nk8jQOoMQj9pRRj1Qj2KkKPPk2QjJ6
5146Goj2J2j0qQRRj7jpJ7JMkj1j1J8Rqj4J0JlK0rOk7JNOOlNMj0%J7%j4mJ0ljj
$$ plain form
5191 3 13 7 -12 1 4 -2 -8 -5 6 -14 -11 -7 -2 -12 -9 -9 -11 -7 -6 -7 -16 -14 -23 -6 1 -14 -19 -20 -10 -5 -4 -1 -3 -5 3 -5 23 -3 3 -7 -16 -1 1 5 -4 -15 -15
5238 -15 -3 -11 0 -9 -9 -8 6 9 11 5 -9 -2 5 14 1 8 4 -9 -15 -8 2 -9 -2 -7 -12 -14 4 9 -1 -9 -8 1 -4 -11 -1 -21 -8 -8 -10 -9 -19 -14 -12 -5 -5 -16
5284 -16 -10 -9 -8 -10 10 20 -9 -6 -6 -3 2 10 6 -6 -16 -18 -4 9 8 3 1 1 -2 -8 -1 8 -12 -11 -11 -6 -6 0 -10 -13 1 3 -1 5 -9 -5 -3 9 -1 6 8 -7
5330 -7 -24 -3 -8 -6 -5 -7 -9 -13 1 -2 -10 -12 -11 -10 -6 -5 -5 0 -3 -2 -1 -6 16 -8 -6 -13 2 7 10 15 8 2 4 10 10 1 5 -7 -8 6 -4 -3 1 -3 -11 -9 2 0 -7 -19
5380 -19 -17 -1 -2 4 -7 -8 -16 -14 -2 10 6 -17 -10 8 2 -11 -5 -6 -17 -25 2 8 -10 -1 -4 -8 -8 -14 -5 -3 -11 -18 -8 -4 -4 -15 4 -8 -5 -7 1 -3 -6 -2 1 12
5426 12 7 8 1 2 -8 -3 3 -9 -10 -9 -9 -4 -3 -2 -19 -23 -21 -18 0 8 2 -8 -8 -18 -3 -2 -7 -11 -14 -12 -9 -13 -2 5 -13 -18 0 1 -2 -3 -1 -3 -14 -5 0 6 -16 -15
5474 -15 -13 4 -10 -5 -8 -6 -5 6 24 4 -5 -5 9 0 1 3 10 -2 -14 4 4 -4 -7 -9 11 -17 -9 18 9 -7 -21 -6 5 -10 -11 6 -10 -8 -3 -2 -7
5515 -7 -19 -12 6 -5 -24 -6 4 -14 -16 6 20 4 -11 -5 8 -12 -10 2 10 -13 -10 -2 -6 -4 -9 -3 -9 -23 -5 13 1 -13 -4 16 4 -20 9
$$ packed form
5191CJ0oj9J3LooLJ1k0LMNj0L%kMJjrKrJ7Pj5njJ0NJLkkQqK8k6Oj0rJ5KMrj1%
5238a5J2qJ1r%JJ4LKoj4PPRj3Pmj3oPJ0j1PnnkJ8Nj0qJRnpJ0k0J3%kJj0NKP%j1
5284a6OJJkK0J0k9L%LNQmj2j0kJ4J3jnk%loPRk0J%N%Oj0lJ4KmOj4MKJ2j0PKj5
5330gj7K1nKJkkmJ4lqkJJMJ%NlJJnK2k4KpJ5NLNpoKO%rMj2jJ4j0JMmqKJ1kpj2
5380a9KJ6jOj1jqKJ2J2mk3PJ8oj3Ojj1qK7Oj8Rlm%oRKqpJ0M%j1J9j2LkQmlMLJ1
5426A2nJpJj0NOj2jJ%NJJj7mKLJ8Qoj0%j0J5JnmlKLmJ1Pj8nJ8JljKkj1RNOk2J
5474a5KJ7j4NlKJJ1J8k0r%J4rJKPj2j2J8%qlkK0k8QK7rj6j4J5J1j5jJ7j6KNJn
5515gj2PJ8j1j9J8J0j8kK2J4j6j5OJ3k0KJ2Qk3LQmKnOoj4J8J8j2j4RK0j2k4K9
$$ plain form
5552 9 15 -3 -25 -1 24 3 -6 9 -2 -1 -3 15 16 -11 -8 7 2 -17 -6 -4 0 -9 -3 2 1 -16 -12 1 10 -9 -3 9 -13 -8 -1 11 -5 -13 1 1 -7
5593 -7 3 6 10 -18 -17 2 -1 -5 22 5 11 -10 -2 3 5 -14 -5 8 -12 -8 -9 12 -7 -10 -1 19 2 -19 -6 6 2 -2 4 3 -21 -12 4 9 -6 -4 -8 -8
5635 -8 -42 -9 5 -3 -9 -24 -11 0 -2 16 13 7 -10 -7 7 0 -19 -1 2 -15 -17 12 12 2 -9 5 14 -7 -6 11 16 -2 -4 15 1 -25 -17 16
5673 16 12 -12 -4 13 -7 -1 4 18 6 -13 -9 1 -10 1 1 7 -15 -23 -14 -11 -5 2 -6 -4 -33 -28 6 9 -7 -11 -5 -10 -17 -12 -3 -6 -24 -16 -8 -10 -13 -7 14 -6
5717 -6 -12 13 3 -18 -12 -2 15 5 -6 -1 3 -19 4 6 0 -18 -18 -8 -2 -4 -2 -3 -7 -17 -4 13 -2 -10 2 3 -12 -7 -6 7 -1 -9 -4 3 -10 -6 2 -4
5759 -4 -19 -15 -10 -7 -11 -14 3 -9 -5 14 -4 -10 -12 -6 2 -12 -4 1 -3 -2 3 6 24 -5 -20 6 1 4 7 8 1 -13 -9 14 2 -5 0 5 -9 -2 0 6 0 -3 -6 3 2
5806 2 -4 -12 -5 -2 -29 -7 -5 -18 -16 -10 -1 -8 -9 -8 10 -13 -8 7 -5 -13 -11 -1 -1 -7 -10 -3 -5 -9 -1 -6 13 -1 -5 -5 -10 -9 -2 8 -3 5 -11 -4 6 -2 1 10 -17
5853 -17 -15 -3 0 -7 -13 -6 -4 -5 0 4 -1 -8 -3 -5 8 -6 -10 -8 -11 -14 -4 -4 -13 -17 -17 -8 -8 -5 0 -15 -12 -3 -12 -8 0 2 -2 -11 -2 8 -4 -5 -4 -3 -13 -1 9 -3 -10
$$ packed form
5552IOj8k2K4K5k1rJ5j1JkJ8Jk7LJ5nj9J1KMrONjj7MJ3Rj9OJ2k2NPJ2j6qJ4%q
5593gJ0LMk8JJ9lmK7j7Ok1QNKj9RJ3k0MjK1j9lRK0j7k1J3J2mmOjk4RJ6Nj5Km%
5635hl4L3J4qoj5J3J1kJ8loj7LJ4pj9J8Lj7kK9%j0j1J4Rk1JJ7Nj8kJ9j4k6QL3
5673A6mk4QJ7k0ONJ4j2j9MJ0j1J1%Ok2qRLOPqKk9NL4Lj6mOnpNRlj8QQklOK1k0
5717foK5j0k1OJ0J7j0j1NMk2K3Koj8%J0OkKjmj0J3J7j5qJ2Jj5NJJ3qqNPj3MQo
5759dj5MNLmlJ7j2MJ9j8okOQj4QNmJNLJ8k9j5K6nLLJpj4MK3j2pNNj4PKOollRj
5806BoqPLk7K2Kj3KORpjJJ8k3NJ5j2qKJ0%olPkmQnJ9j4m%nJPJ0j1Qj6PJ0qLRk7
5853a7KJ2LpoPKjNMnpNkJ3j4mKllJ0%rm%R%LNj5LRrMQKmrRJ0j2jJJj0J2J0j2p
$$ plain form
5902 -10 4 1 -2 1 -7 4 3 4 -4 -3 -1 -5 -8 4 -5 -8 -16 1 -14 -3 12 2 6 -9 -12 -14 -19 3 -7 -15 -14 -9 -12 -12 -7 3 -8 -18 -19 -2 -5 -8 -11 -16 -3
5947 -3 -5 1 3 -4 -9 0 8 2 8 -4 -6 -3 3 0 8 4 5 2 -12 4 6 2 -7 -13 0 15 3 -2 0 -16 2 -8 4 15 0 -10 -2 2 0 3 15 -3 -14 2
5991 2 2 8 -12 0 -10 -17 0 0 1 -6 -20 -11 -12 -8 1 -9 -3 -1 -4 3 7 -7 -18 -5 -7 -10 -13 4 -4 0 -3 15 10 15 5 -2 -9 -6 3 2 -2 -9 -15 -19 -1 -15 3
6038 3 -4 -13 -7 -2 -5 -9 -4 -9 -2 -8 -4 -2 -5 -12 1 -4 -4 5 -1 -2 0 -3 -1 8 2 -6 -9 2 5 0 4 -1 -10 -13 -3 8 2 3 4 4 4 7 -4 1 0 7 8 4 11 13 -2 6 3 -2 15
6093 15 5 -8 -3 -10 -8 8 4 -13 2 -3 12 -5 -9 -8 -12 -4 -11 -3 -10 -9 -10 -13 -8 -5 -5 2 -2 -4 -1 5 6 -3 -2 -7 0 7 3 2 4 -5 -6 9 -5 -6 -7 7 -4 -14
6141 -14 6 8 -2 0 18 5 -3 -4 -3 -6 -3 -9 -4 14 -3 -1 4 -13 -4 4 9 0 -5 2 7 -4 -19 -3 -20 -11 -9 2 1 -3 -16 -13 -9 -8 -12 -4 -8 -10 -11 0 3 0
6187 0 -1 4 1 7 0 2 -7 -8 3 -10 -3 -5 -1 -5 6 0 10 9 -1 -3 -1 3 -6 -7 3 -2 -8 -1 4 3 -6 -5 -5 -3 -8 -1 16 4 -14 -3 1 2 -6 3 -4 -5 -12 -1 1 -7
6237 -7 -14 -13 -11 -3 -22 1 -3 -4 -2 -2 12 -10 -24 -10 -6 -4 -6 1 -9 -3 -6 11 5 -1 -9 -8 -3 -3 6 15 -3 -12 -3 -9 -9 -5 5 3 -8 -16 -4 -4 -1 4 -1 -4 -8 1 6
$$ packed form
5902a0J4llLqJ1jJqJKmlJ2rlqJ7j5J1J5j0Mj5lknK2j0qJNl%NJ0j1j0jJ7lllnJ3
5947ckOKpnRQoOj2kLOlQmJlj4J6KmroJ3J5j2nKj6J8j0J2J1j5j0QMkLJ2j8j1J6
5991B%Ok0J2j0pJ7%Jpj4RjMRj0OKlPMj4j1J3kllJ7qMlJ8nNj0ppLRjmpomJ8j4J8
6038CprONlmNnPoMKlpJ3n%RojKlKRoqlJ1LnMnrlJ0J1oJJ%%Lj1NjPJmPKj5QlnJ7
6093A5j0j3NpKJ6mj7J5nJ5j7mJmQpQpJjlNL%PmkLOJrJnPPmjKrjJ5j4jjJ4j1j0
6141a4K0Kj0KJ8j3qjJlLoNJ8j7KNj7RQNrnPNj1j5J6j7RKJ1jmj3LMJmQmkjJ1Ll
6187@jNlOpKrjJ1j3PkMmJ1oJ0jj0kKMrjJ0noPNjrJ%KnPJ7j2j8J1MJqRpjpJ1Kq
6237gpJKQj9K3mjK%J4k2j4J4MKkPj0OlJ7ooqJN%RRj8rRo%MJ0kj1qJ2%LNnlmRN
$$ plain form
6286 6 1 -8 -7 4 -8 -17 -10 10 -3 -13 -8 1 -20 -17 -4 -3 -2 -8 -12 1 -16 -13 -4 -3 -12 -8 -7 3 -4 -1 12 10 -9 -3 7 4 -1 -1 1 2 -8 1 16 7 -5
6331 -5 -4 1 -6 -11 3 13 1 -11 -1 -9 -5 -3 10 7 -6 -8 -3 6 -2 -6 6 -2 -7 0 7 6 -1 0 7 6 -13 -19 8 -2 -6 1 10 -11 -8 0 -8 3 -16 -3 2 -8
6377 -8 -15 -1 7 -7 2 6 -4 -12 -6 7 4 13 -5 2 -12 -13 -7 -6 -4 2 -2 2 -6 -5 9 5 1 -14 3 -8 -4 -11 -1 -5 -17 -9 -10 2 -6 -11 -4 -15 -16 1 12
6422 12 4 -5 -10 1 -17 -8 -6 14 -9 -13 -5 -3 -17 -3 -4 7 2 11 7 5 -8 1 12 2 10 -6 7 -5 5 -4 11 -4 0 -2 5 -9 -4 -2 10 -3 -1
6463 -1 8 3 -4 -18 -10 -17 -20 -5 -6 -4 -4 -14 -1 -7 -1 -9 -2 -16 -17 -7 -2 8 -7 -7 -7 -1 6 5 -6 3 -17 -4 -8 -7 1 3 -2 -4 6 6 0 -16 -7 -3 15 2
6509 2 2 -1 1 -6 -4 -7 7 5 -8 1 -11 -4 4 -9 -7 0 7 5 0 3 -8 -10 -4 -21 -12 -7 -13 -18 -9 0 -14 -15 -4 -11 -4 -11 5 2 7 7 0 4 -11 -4 7 -3 -4 -1 10
6558 10 -1 7 12 11 0 4 16 4 -2 -5 3 -1 1 7 3 -12 -4 -2 4 -1 -7 2 9 -4 -8 10 7 8 3 0 11 1 -4 -8 -7 -11 -4 -8 0 -4 -9 -1 -5 -2 -5 -2 7 -14 -16 7
6608 7 -3 -1 -3 -9 -6 -9 -5 -7 -8 -18 -1 8 8 6 -3 6 0 -1 5 14 -4 0 -11 5 7 -1 -5 -2 -1 1 -3 3 -7 10 1 -6 10 -13 0 -6 -12 -15 -2 -11 -4 -3 -11 -11 -8
$$ packed form
6286FnrJJ1j2rPK0j3j0NRk1LJ3JJomJ3j7LRJrMJJ0pLJ3kj9OJ0ln%KJj0RJ5rj2
6331eJNpnJ4J0j2j2J0qMKJ3lj3kNRqmJ2qnPPjpJPjj9oK7j0mPRk1LQqJ1j9J3Nj0
6377hpJ4Qj4RMj0qOJ3lRj8Pj4jOJKOmMqJJ4mmj5J7j1MpJ0mj2QjJ2qnPj1jJ7J1
6422A2qrnJ1j8RKK0k3mQKj4J4jJ1nRmkj3RJ1j0Qj6J3j2J0rJ5j5MkPj4NKJ2j3K
6463aRnpj4QplJ5jK%j0J3oOqPj4jJ0NJ0j5%%OPjj1Rk0J3mJQKnkJ0%oj6RMJ8j3
6509B%lKpKlJ4kj3Rj2PQj3KPPknLj1kOj7RNonRRj4jJ1pPpJ6lN%pMj5PJ1j0jLJ1
6558A0j1QNjj1MJ2j2olQmKOmj5QKOnoRPj3mJ8lJnlJ1j0nmJmPmQmnQmLlLRk1kK3
6608Gj0KkoLlMkjj0J7R%krRojORj8Mj1J6KqmLJKmOj0J7rpJ6k3J3oolJ3rPJq%L
$$ plain form
6657 -8 -9 -9 -1 -7 -11 -3 0 -2 -7 0 -3 3 -6 -4 -5 -9 -10 -17 -5 -4 -13 5 5 2 12 -3 12 3 -4 1 -18 1 -6 11 9 3 3 5 6 -3 -8 -5 11 -1 2 -3 1 -9 -9 -8
6707 -8 5 -3 -9 -12 -12 -14 -7 -11 -14 -6 -17 -11 1 -5 -3 -19 2 -3 -5 6 -9 -6 -11 -14 -3 -6 -9 0 -3 -2 2 2 7 4 0 9 5 13 9 13 6 5 -7 4 -5 -1 -1 2 -3 -2 3
6758 3 3 1 -2 -5 -18 0 -5 -5 -8 -4 -3 -9 3 -8 -15 -4 -2 -8 -11 -10 -6 -7 -19 -12 -16 -1 -7 5 -5 -7 1 4 -6 -6 -9 -2 -2 0 -8 -7 -8 2 0 -1 5 10 6 4 3 9
6808 9 1 3 3 7 -3 -1 -11 -8 -2 2 -12 -2 -5 -6 -4 -7 -5 2 2 -10 2 -5 4 -5 8 0 0 -11 -4 1 -1 1 2 -9 -7 -8 2 11 -3 8 3 -9 1 12 17 5
6854 5 -4 7 -3 8 4 23 8 1 2 10 4 -3 -1 8 2 -2 9 2 1 -11 -5 4 -13 -10 5 -1 -3 12 2 -9 -7 -8 -3 0 1 -2 -3 -3 -15 -14 2 -16 -10 -3 -11 -4
6900 -4 -22 -6 -7 -4 -15 2 4 -7 1 5 2 -6 -3 -7 -6 -1 -14 -1 9 3 -2 4 11 -5 -4 4 9 1 2 5 3 -4 -3 11 -3 -9 -5 0 0 -8 -7 -5 -3 3 -6 0 0 -9 7
6949 7 4 -8 -8 -6 -6 -5 -7 2 5 -7 -2 -4 0 -6 0 -3 -11 -7 -4 4 1 -9 -3 3 -1 -10 -1 -1 -1 -9 -9 12 1 6 5 1 0 7 14 12 4 -4 3 -11 9 7 0 -4 -17 -1 2 5
7001 5 -12 -3 -6 -6 -9 -1 5 -3 -1 -9 -4 -16 -16 -4 -13 -15 -14 -7 0 -1 -11 11 10 -12 -7 -4 -6 -12 -4 7 6 -3 -6 5 1 -4 5 -4 -7 -18 -1 0 -12 -5 7 -4 -6 -1
$$ packed form
6657hj%QomQLknPlOrKjmjpJ2JrJ8%lJ0j5J5rpNj9J9pJ7ko%KJrnLJ6j2LnMj0%J
6707hJ3qol%kPmlQj1OJ2oKj6K1nkJ1j5LnlJ1llRlJM%NlmRmQmMpjj2J1rM%LnJN
6758C%kllj3J8n%lMJoJ2j1pJ1KolJMjj2PmJ5oJ2j0kQLj0%lP%KqJjJ0kjONmkjO
6808IqK%Mj0Kj0LOMj4J0ljKlKP%j2J2pRrJ3q%j1PNkKJj1KjJ0Rj4J1nj2J0J1Nj2
6854ErJ1j0J1mJ9j5pJQopKRomJ1pjj2ORj7LJ5okJ5j0j1KjNLJlj%j2JJ6j8OPqP
6900dj8J6jLj1J7Kj1QMlqLmJNj3J3J0onOPj6JQNqJLkpJJ4j4oMN%qJKKOrO%rJ6
6949Glj2%K%JkRLj2NkMoOlqMLQlj0OOmrR%%q%K1j1NjmjPPkqqPj4K0kpmj3J6LL
7001Ej7Rl%lQOqKqNj2%J2rkJPPjj0K2jk2NLkoQJ1jrlJ1mnRrlj1J7Jj2PJ2j1kN
$$ plain form
7049 -1 -10 -6 -4 -8 12 15 -1 -8 -1 -4 -4 -11 2 -9 -6 -19 11 3 -8 1 -7 -2 -7 -15 -13 -3 -10 -12 -6 -7 -5 -3 -11 -4 -8 -8 -9 -13 9 8 -6 -6 -3 0 2 5 -5 -12 7
7098 7 -6 1 -10 3 -11 -3 3 -6 -7 9 12 -1 11 1 5 2 -11 1 10 14 -10 0 -2 3 3 14 -1 -6 -4 4 -10 -1 -6 4 -10 -9 -12 7 5 -21 -7
7139 -7 -6 -12 -16 -2 5 -5 -7 3 -3 -10 1 0 -4 -13 -8 4 -1 -6 4 4 3 -4 0 4 2 -3 -2 4 3 -9 6 5 1 -10 16 4 0 0 4 5 3 8 11 16 -3 -5 0 11
7187 11 6 -2 -9 -5 5 -5 6 -4 -13 -14 -12 2 -8 -11 1 11 1 -2 -1 -6 -8 7 -11 -6 -17 -7 6 -13 -10 -5 4 3 -4 -2 -9 2 -7 4 -8 -1 6 13
7229 13 2 3 -3 -7 -8 -2 1 8 6 4 1 4 1 8 12 -1 -14 -12 -8 -6 -6 -9 -4 2 1 -16 0 -9 1 -3 2 13 5 2 0 1 -19 0 -6 -10 -6 -7 2 -9 -11 -1 -10 14
7277 14 6 8 12 -3 16 9 10 -9 -6 5 -2 -14 -17 -4 8 0 -2 -5 0 -3 -10 5 0 1 4 7 -2 4 11 2 -8 -7 -3 -9 -5 6 2 -7 -12 -11 5 1 5 -9 -1 -4 8
7324 8 -7 5 -15 -12 -10 -5 -6 -9 -5 -3 -11 0 0 -15 -14 -12 9 10 -6 8 2 13 -1 -3 6 9 3 -1 6 6 4 1 5 -3 8 2 1 13 -6 6 -6 -2 3 5 3 2
7370 2 2 -12 -4 0 -4 -7 -3 -7 2 4 -7 -10 4 3 -10 -1 1 -2 -6 3 -4 -7 1 0 -8 -5 2 -2 -14 -11 2 3 -6 -4 12 1 -5 0 -4 -8 -1 6 -3 5 -2 -6 -4 -6 -3 -2 -8 -1 -5
$$ packed form
7049arMKmK0Lj6pPl%pJ3j1Lj3L0qj1RqNnqKJ0pkOjKKqPm%jmK2jj4%LLKLj0pJ9
7098Gj3Pj1J3j4QOrjJ6Lj3J2j0Mlj3J2RMk4J0kN%J1j5nKQj4RnJ0j4JlJ9kk6J4
7139gJomJ4Pj0kJ0opJ1jmrNJ2nnJ0%jpMMknJOjj2J5jmj1K6j2m%MJkNLNj9kNJ1
7187A1nqpMJ0j0J1j0rjKJ4j0lJ2J0j0lJnkJ5j8Nj1J0J3j9LNRjpKpJ1rJ1j2PPP
7229A3j1JomjOLPkklLlPMj3j3KMK%lNOjj7J6rJ0mNJ1qlkJk0J9omMjRj1kJ0rK4
7277A4qKMj5J9pJj9LJ1pj2lJ3J2qklNlpJ5nJLLrOPrj0JMoMJ1mrnJJ6mMj4QlJ2
7324Hj5J2k0LKNjlMKqJ1%j5JKK1Jj6J4oJ1j4kRLomP%klMqJ1ojJ2j9J2j2MNKkj
7370B%j4QMmlMmRKj1lJ4jj3RKlmRplQjqLPmj2LJ3JrKJ6j1oNmmPPrQpmKkLJoPm
$$ plain form
7423 -5 5 0 4 -9 -1 -9 5 0 -5 9 -17 -5 -15 -14 5 -8 -17 -4 -8 -2 -9 0 -5 -9 -4 3 0 -4 -16 -10 -12 -4 0 -18 3 -11 3 4 -3 -4 1 -2 1 -5 1 0
7469 0 -15 3 -3 -5 7 -6 -5 7 -11 8 7 7 0 2 9 6 -4 3 -2 -4 1 -21 -11 -3 0 0 -10 0 0 -9 -11 -2 -11 1 -7 -7 -9 -6 -15 -16 -13 -7 -10 1 -13 4
7515 4 1 -3 -4 -10 6 -2 10 9 8 2 -5 -3 -1 7 -6 -1 -4 -18 -4 10 -1 -7 2 -3 6 2 2 -1 3 1 -1 6 4 -7 -1 0 -7 -3 -2 4 -1 10 4 -8 -11 -6 -14 11 -3
7564 -3 -6 10 11 -12 -9 -5 -1 -9 -2 3 3 3 5 5 -1 6 -10 9 13 5 16 12 4 -3 1 5 4 9 -10 8 -6 -7 3 15 5 5 18 10 -3 -3 -8 2 -3 -12 7 -3
7610 -3 -7 -11 -2 -11 -3 -12 -4 -3 -14 -4 2 -5 -12 3 2 0 -14 1 4 -5 -6 -2 -2 -6 -10 -9 -12 -14 -2 -4 2 -10 -5 7 5 -1 -2 4 0 4 11 10 13 2 1 -4 -5 -3 0 -1 -4 -11
7662 -11 9 -3 9 5 -3 0 -11 -4 -7 -5 -6 -7 -12 2 -1 -11 -4 -6 -1 6 -3 0 -1 11 2 5 -2 -8 -4 -6 -5 -6 3 4 -5 12 -1 20 -9 5 0 -3 3 -3 4 8 7 -2
7710 -2 10 -3 1 19 7 -8 4 8 0 -7 8 -3 13 9 -4 2 5 -8 -9 -1 -11 -6 -9 -14 -5 -14 2 -6 -5 2 -1 -6 -17 -3 -6 -10 -14 2 -6 1 -2 2 3 -7
7754 -7 -9 -3 6 7 10 10 10 -10 0 0 13 7 12 0 -8 7 4 15 4 4 12 1 -11 2 12 12 4 3 8 2 -11 -1 9 13 1 -1 6 5 0 -8 3 -6 -12 -2
$$ packed form
7423eJ0nMj3QqJ4nnJ4k6J2j0JJ9j3rJ3mOpRnmNPlmj2OkQMj8K1j4J4JpjNlLoOj
7469@j5J8okJ2j3JJ2j8J9j%pKPlj0PnkNk2J0QL%j0J0%rkRrJ2q%kLrjLOlJ1j4J7
7515DlmjoJ6qJ2jjopKKQj3Nlj4J4J4j1oRnRm%lMkkPkj1OJpMJOnJ1oj2lNqK5j4
7564clJ6Jk3LMMqPN%%K%oPj6J9MqJ1mqpMMjNj9J8j4jJ0J2j0%J3qj3%nJ0nrJ9j0
7610cmmRrQrQJj1J0OppJ5jkj4J5LrjM%mmJlkJ2kOj2NJ2kojOmMPjLj1jnjKLjlp
7662a1K0j2J2mqLj1PlKjjnJ4lj0PkNPrLjJ2rLpoMkJjRJrJ7j3K1k9J4nlOoPMjr
7710bJ2j3MJ8j2j5J2MqpJ5j1J6mj3OLj3jQj0NlnRrJ6qJPlnj1J4lmmJ6qPlMJj0
7754gkORJL%%k0J0%J3oNj2qJ5lJ1j1%Qj1j2J3J0%qjNoj3J0J0Mj2kPjnqJ1roJ0
$$ plain form
7798 -2 1 -1 4 3 2 1 -5 3 -2 -9 -2 5 -2 -3 3 -2 13 4 3 8 6 5 6 6 -2 -7 -2 13 0 -8 10 6 3 -5 -17 -3 4 -12 3 3 -3 1 3 4 6 -7 3 1 -15 0
7848 0 -12 -6 -1 -2 -11 8 -12 10 7 1 8 10 7 5 -2 -4 -4 -10 -1 5 -9 -19 -14 4 -10 4 -20 -3 2 -11 -7 3 -15 -2 0 -6 5 -2 0 6 7 -4 -3 10
7892 10 -3 2 -5 6 4 5 -9 -6 5 -1 -1 7 3 -9 3 -8 3 -11 -8 -17 -14 -11 0 6 5 -10 0 -5 0 -5 5 1 7 4 -2 2 -7 9 -16 -5 -7 -18 -6
7935 -6 -1 -2 -17 -11 3 8 2 9 1 -17 2 2 6 0 -6 -12 3 7 -9 -1 0 3 11 4 2 0 1 -3 -3 10 6 3 -11 1 2 -6 0 -7 -2 -4 9 0 4 -3 6 -4 4 2 -9
7984 -9 1 1 -14 -2 6 -3 -7 -5 -14 5 -1 6 1 2 -6 -7 4 10 14 -6 2 -8 -3 2 -3 -7 -6 7 11 -7 1 6 -6 5 -7 5 -4 -3 8 1 -7 -3 7 -1 -11
8029 -11 5 1 5 -11 -3 -8 -9 -4 -10 -9 0 2 -13 6 -7 -1 5 0 -1 -6 -10 -10 -4 1 2 -5 -5 2 13 -1 -4 0 2 5 -6 10 13 -4 3 4 7 4 2 -6 -7 4 12 2
8077 2 6 -3 5 2 -3 7 2 -6 -7 0 -1 1 0 1 -2 -2 -1 -4 4 -9 3 -6 -6 1 9 -1 2 -2 -4 -5 -8 -2 -11 -6 -10 -4 -2 -11 -6 -1 7 2 2 2 7 3 -3 5 6 5 5 0 -1 3 -7 1
8133 1 -2 6 12 0 -2 -11 -2 6 0 4 7 13 -5 13 2 5 1 2 3 -7 -2 -10 4 -3 13 3 6 4 -5 1 5 -2 -7 -7 -3 -3 -7 -1 3 0 -10 -20 3 -6 1 -4 -7 -3 8
$$ packed form
7798bLkNjjjoQnpPPpjOnJ5rjNkjJ%qnNJ5j3qJ8mlqj2J4Pj6J5%oMKJKj3J0kj6J5
7848@j2ONjrJ9k0K2loPKlkpk%oROj4j0NJ8j4J4k4J7Nj3MJ0j8J3KoJ1pKOJj1JJ3
7892A0j3NpJ1kJj4LJ1o%Qmj2J2j1J1j4LrLLJ1Ojj5J0nNnJ0mOloMrJ6k5J1kj1J2
7935fNjj5OJ4NoPqj8J9%MoooJ5Mj6QJLQpkkJm%J3mlj4J2JqOpNkJ3rMpRj0Qkj1
7984iJ0%j5J2QrmKrJ9oPnJqjJ1OMk0Qj0NNnmJJ3Mj8QNj2J1j2J2rJJ1pqMJ0qj0
8029a1J6mMj6QnjNoJRKj5J9j3OOnjnm%ONJp%PJ1j4lMKLj1J6Lj7PJLlkqjJ1Qj0
8077BMrQlnJ0nqjPjKjJl%JlQj3J2r%PQj0LmkjlOrNmOKrNNQn%%NmoQJj%njMj0Q
8133AlQOj2krRQoMLOj8J8j1LmJJj0NqJ4pJ6j0LkrOMpn%M%mOMlj0j0K3rPnlMJ1
$$ plain form
8182 8 6 -1 1 -3 7 -6 -2 -4 2
$$ packed form
8182HkpKmJ0j3MkO
8191B
$$ Imaginary data points
##PAGE= N=2
##DATA TABLE= (X++(I..I)), XYDATA
$$ plain form
0 0 0 0 0 0 0 0 0 0 0 0 0 0 0 0 0 0 0 0 0 0 0 0 0 0 0 0 -2 4 -8 8 -8 8 -8 8 -8 9 -12 14 -16 16 -17 20 -22 25 -28 28
46 28 -34 36 -42 45 -53 60 -68 78 -93 112 -140 184 -265 467 -2080 -798 3910 1543 -1294 -1148 355
67 355 -737 -1018 728 1846 140 -1128 -692 -22 61 803 844 -651 -1258 859 1828 -686 -2468 172
85 172 2877 1164 -1774 -1176 675 225 -622 797 1825 52 -1868 -1125 477 911 942 744 -751 -1910
103 -1910 -327 1775 722 -1460 -542 1603 453 -2096 -1255 1610 1461 -887 -1015 550 197 -1285
119 -1285 -659 1179 1309 -45 -921 -1186 -913 729 2159 769 -1863 -1541 989 1190 -767 -607 1396
136 1396 910 -1537 -1328 1336 1666 -708 -1394 493 1406 135 -915 -619 34 740 1274 399 -1422 -1443
154 -1443 556 1381 142 -337 550 22 -1836 -1216 1794 2424 -528 -2424 -833 1076 757 -148 -130 -153
$$ packed form
0@%%%%%%%%%%%%%%%%%%%%%%%%%%kOj2J6j6J6j6J6j6J7k1K6l0L2l3L7m2M7n3N6
46B8o2P0p8Q7r8J13j28J46j71K05k52L24m49P32k547J282M708k367k837J46J503
67C55j092k81J746J118j706j268M36O70Q3P42M1j495o07K117R69k514j782K640
85A72K705j713k938N98J851m50q47J419J028j773j920P43J602M34L1j98j495j159
103a910J583K102j053k182R18K145j150k549Q41K865j49k348j28J565l53j482
119a285O26J838J30j354q76k65K73J642J430j390k632L22K530K01j957J60K003
136A396m86k447K09K664L30k374o86J887R13j271j050K96O53P06N34q75j821k1
154a443J999Q25j239m79Q87n28j858O20L010O30k952j896J591J909l19r05J8k3
$$ plain form
172 -153 -484 -197 329 33 -308 216 369 -526 -683 605 828 -833 -1251 855 1915 -171 -2035 -756
190 -756 1329 1139 -174 -382 -1 -195 -292 242 583 351 122 -157 -691 -401 933 1226 -471 -1429 151
209 151 1526 150 -1537 -469 1474 944 -947 -1069 221 548 -81 -124 342 152 -479 -691 -275 417
227 417 927 392 -1056 -1428 237 1611 483 -1313 -903 743 771 -462 -510 460 388 -565 -444 614 765
246 765 -254 -845 -283 645 992 352 -843 -1180 120 1489 935 -699 -989 99 527 -45 -38 665 368
265 368 -864 -1000 439 1324 404 -939 -1016 74 905 620 -404 -915 -225 680 419 -512 -503 300 307 -513
285 -513 -419 645 684 -681 -1254 86 1329 608 -898 -1005 160 872 347 -458 -476 158 486 68 -363
304 -363 -15 495 170 -550 -312 702 737 -434 -903 187 1125 414 -870 -791 412 955 250 -528 -478 101
$$ packed form
172a53l31K87N26k96l41N24J53q95j57J288K23j661m18K106J060k086j864J279
190g56K085j90j313k08L81j94r7N34L41k32k29k79n34K90J334K93j697r58J580
209A51J375j376j687J068J943n30j891j22J290L27o29m3M66j90o31k12M16O92
227D17N10n35j448l72J665J374j128j796M10J646K8j233m8R70p2r53J21J058J51
246G65j019n91N62R28L47o40j195l37J300J369n54j634k90J088M28n72PP03k97
265C68j232j36J439Q85r20j343p7J090Q31k85j024n11O90R05k61r31RQ03Pq20
285e13R4J064L9j365n73J340J243p21j506j07J165P12n25q05j8O34L28m18m31
304c63L48N10l25p20K38J014L5j171m69J090R38p11j284P9J203N43p05p78N0N79
$$ plain form
324 101 326 61 -126 52 164 -194 -503 -56 700 487 -656 -1088 -29 1090 645 -683 -1045 -95 708
343 708 403 -292 -376 -28 43 -136 -35 425 381 -401 -901 -170 1024 977 -403 -1233 -365 965 898 -241 -735
364 -735 -105 449 185 -139 144 412 -81 -692 -275 782 947 -201 -1099 -450 836 923 -207 -907 -283
383 -283 572 422 -248 -328 130 143 -323 -383 253 604 -28 -776 -475 500 717 -170 -888 -365 595 617 -249 -665
405 -665 -140 439 232 -282 -227 216 245 -176 -265 215 492 -6 -592 -287 623 819 -100 -863 -362 695 810
426 810 -104 -695 -215 463 393 -95 -141 153 55 -391 -281 489 764 -105 -1024 -592 687 1032 -71 -1045 -610
447 -610 469 703 -3 -472 -223 64 -108 -211 220 547 -14 -856 -626 533 1039 89 -1033 -732 492
466 492 929 154 -580 -371 174 242 -15 52 295 108 -349 -369 271 741 279 -610 -679 256 924 366 -597 -585
$$ packed form
324A01K25k65j87J78J12l58l09M47P56k13j143m32J059J119m45j328l62R50Q03
343G08l05o95q4L48P1j79J01M60m4p82n00P31J194m7j380q30Q68J330o7j139m94
364g35O30N54k64l24K83K68m93o11M17J057J65j148q98O49J286Q7j130p00O24
383b83Q55j50o70q0M58J3m66o0O36L51o32p48L01R75K17q87p18N23R60K2q66m16
405f65N25N79k07n14N5M43K9m21q9M80K77m98n86L05R10J96r19p63N01J057J15
426H10r14n91M80O78p0m88m6K94r8m46J10P70K75q69r19M32J279L45j103r74M35
447f10J079K34p06m69K49K87j72j03M31L27n61q42K30J159N06r50j122L01J224
466D92M37p75p34K09N45O8k57O7K43j87m57k0O40M70m62q89o9R35O68n58r63J2
$$ plain form
488 -585 263 592 28 -380 -66 295 72 -274 -108 272 176 -284 -425 49 513 244 -510 -671 90 745 272
509 272 -708 -649 322 680 -50 -589 -118 387 46 -370 -54 448 185 -465 -417 270 671 183 -595 -613 263
530 263 930 412 -633 -727 211 709 149 -301 77 288 -261 -517 285 917 251 -833 -722 316 836 347
550 347 -403 -607 -166 398 410 -133 -414 -53 223 -80 -260 186 386 -320 -815 -9 957 482 -739 -898
570 -898 49 665 372 -155 -347 -267 16 261 163 -47 34 94 -266 -424 294 876 133 -868 -446 742 693
591 693 -444 -665 298 723 49 -455 -187 174 166 91 85 -17 -41 10 -152 -233 242 690 2 -960 -518 810
613 810 823 -498 -876 150 669 -112 -597 -10 397 7 -261 26 126 -152 -244 -33 120 276 357 -150 -891
634 -891 -496 866 1125 -218 -1058 -255 595 239 -160 267 410 -351 -692 110 794 403 -239 -344 -177 77
$$ packed form
488e85Q48L29n64m08L14L61k23l46J66L80r6m60j41M74M64k69p54j61P61O55m73
509B72r80N9R71L58p30n39M71N05l41m16L16N02k63o50M8O87M01m88p78j8Q76
530B63O67n18j045r4R38M98n60m50L78K11n49k56Q02O32o66j084J11J038N20m89
550C47p50k04M41N64J2n43k81L61K76l03j80M46K00p06m95Q06R66m75j221j59
570h98R47O16k93n27j92Q0K83K45r8k10Q1O0l60j58P18N82p43j001M22J188m9
591F93j137k21R63M25o74n04K68L61qp5oj02k4N1j62q1M75M48o88r62M42J328
613H10J3j321l78J026N19p81m85N87M07l90k68K87J00k78r2K11J53J56Q1n07p41
634h91L95J362K59j343q40Q03Q50l56l99M27J43p61l41Q02O84l91o42j05J67K54
$$ plain form
654 77 440 344 -393 -603 327 887 -49 -924 -251 662 253 -420 39 550 -227 -981 -213 936 669 -407
674 -407 -766 -364 73 427 479 -102 -664 -245 382 55 -445 113 746 -8 -961 -316 824 397 -675 -326
694 -326 760 500 -628 -677 227 595 261 53 -139 -410 -193 453 465 -157 -166 312 22 -643 -131 945 579
715 579 -741 -728 481 649 -372 -593 284 580 -25 -362 -190 -189 -139 359 507 -147 -556 -131 45 -268 18
736 18 852 455 -1040 -1208 408 1268 205 -736 -281 219 -123 -237 332 458 -118 -359 -31 58 -5 216
756 216 216 -282 -271 559 606 -602 -981 370 1236 231 -843 -327 399 32 -323 339 732 -127 -851 -371
776 -371 390 467 249 17 -444 -601 119 679 74 -567 -23 578 -95 -846 -172 757 296 -558 -221 421 11
797 11 -627 -184 563 424 -164 -340 -275 -173 288 681 141 -679 -395 481 341 -371 -119 645 283 -680 -413
$$ packed form
654G7L63r6p37k10R30N60r36q75O73R13m09o73M59N11p77p54P68J149k67j076
674d07l59M02M37L54N2n81n62M19O27l27n00N58O33p54r53O45J140m27j072L49
694c26J086k60j128m9R04L68l34k08j92k71K17O46J2o22rM78k90o65N12J076l66
715E79j320J3J209J68j021k21Q77K96o05l37J72JN0M98J48o54m09M25J76l13K86
736A8Q34l97j495j68J616Q60j063r41M55N00l42j14N69J26n76k41L28Q9o3K21
756B16%m98J1Q30M7j208l79J351Q66j005j074N16P26l67l55O62L93q59p24M80
776c71P61P7k18k32m61j57P20N60o05o41N44O01o73p51O74R29m61q54L37O42m10
797A1o38M43P47j39n88j76O5J02M61L93n40q20K84Q76j40p12K52P64l62r63K67
$$ plain form
818 -413 595 529 -389 -391 425 513 -208 -506 -170 182 400 458 -34 -701 -480 423 573 -96 -221 207 -56 -761
840 -761 -291 931 824 -607 -1076 -32 678 200 -296 -120 50 -79 -67 82 -65 -167 102 203 -131 -158
860 -158 228 115 -513 -327 687 796 -391 -977 -81 767 392 -200 -113 58 -146 -185 231 411 110 -118
880 -118 -166 -207 -50 400 417 -254 -508 156 579 -122 -665 -49 673 251 -506 -367 210 170 -144 -59 188 41
902 41 -245 -236 -35 148 280 96 -436 -516 194 656 45 -637 -206 533 259 -438 -318 325 288 -217 -183 275
924 275 223 -253 -349 74 436 346 -74 -479 -355 286 682 201 -500 -383 217 272 -82 -6 320 66 -511 -343
946 -343 416 570 -66 -547 -265 239 337 49 -291 -346 -14 333 162 -244 -259 55 76 -183 -53 332 177 -459
968 -459 -503 217 656 130 -522 -398 158 377 143 -149 -158 29 119 -2 -97 63 242 42 -291 -114 380 342
$$ packed form
818d13J008o6r18kQ16Q8p21k98L36L52K18N8m92o67K21R03J50o69j25M28k63p05
840g61M70J222j07j431m69J044P10m78m96J76J70j29J2J49j47j02K69J01l34k7
860a58L86j13o28J86J014J09j187n86Q96Q48l75n92Q7J71k04l9M16J80l01k28
880a18m8m1J57M50J7o71k54O64M23p01n43O16P22m22p57J39N77m0l14Q5K47j47
902D1k86RK01J83J32j84n32q0P10M62o11o82M31P39k74o97J20O43l7n05L4M58
924B75n2m76r6M23L62r0m20m05J24O41L96m81p01J17O00N5l54P6L26k54n77J68
946c43P59J54o36m81K82N04R8k88l40n5L32L47j71m06j5L14K1k59J30L85j55o36
968d59m4P20M39n26o52J24N56K19k34k92rJ87R0j21r5J60J79k00l33J77M94l8
$$ plain form
990 342 -269 -448 158 578 112 -466 -283 301 377 -42 -292 -83 164 121 -61 -76 75 104 -128 -261 12 371
1012 371 174 -387 -438 157 513 77 -485 -363 202 362 24 -222 -113 28 -14 -51 92 194 38 -265 -291
1033 -291 126 487 242 -356 -532 40 558 346 -228 -365 1 239 117 -13 64 90 -127 -235 51 403 269
1054 269 -281 -509 -51 501 395 -224 -504 -116 326 214 -160 -183 53 67 -157 -133 178 257 -144 -461 -149
1075 -149 386 364 -189 -480 -105 362 244 -205 -299 39 250 28 -187 -35 188 83 -197 -134 209 306 -60
1096 -60 -315 -53 359 284 -184 -356 21 394 241 -182 -270 39 254 77 -113 -46 109 25 -166 -70 226 233 -174
1119 -174 -417 -89 397 362 -190 -502 -163 310 281 -115 -272 -81 81 -7 -69 82 163 -107 -369 -158 371 462
1141 462 -103 -561 -257 369 460 -38 -374 -150 190 167 -24 -13 116 10 -236 -127 260 415 19 -441 -281
$$ packed form
990C42o11j79O06M20m66n78J83N84P6m19k50K09K47m3j82j5J51K9k32j33K73L59
1012C71j97n61n1N95L56m36n62J22N65J60l38k46J09J41m2l7J43J02j56l03k6
1033b91M17L61k45n98j76N72N18k12n74j37L66K38j22j30P7K6k17j08K86L52j34
1054B69n50k28M58N52j06o19k80L88M42j12l74k3K36J4k24K4L11P9m01l17L12
1075a49N35k2n53k91L75M67j18m49r4L38K11k22k15J52K23j05k80O3L43R7l66
1096f0k55K62M12p5m68j72L77L73j53m23q8L09K15j77j90O7J55q4j91R6K96Pm07
1119a74k43L28M86l5n52l12L39M73k9l96j57J91J62q8o2J51Q1k70k62K11N29R1
1141D62n65m58L04O26R1m98l36K24L40k3j91J1J29j06k46J09L87J55l96m60J60
$$ plain form
1162 -281 300 480 33 -404 -228 213 273 -40 -181 13 109 -65 -155 60 233 33 -270 -228 129 311 33
1183 33 -316 -273 135 332 26 -322 -189 181 210 -111 -209 50 181 -43 -191 12 212 57 -209 -133 186 298
1205 298 2 -294 -192 213 407 53 -358 -235 235 345 -11 -183 25 137 -111 -182 185 402 9 -441
1225 -441 -276 273 423 10 -347 -270 115 324 103 -231 -233 49 140 -42 -90 126 114 -279 -358 176 513 76
1247 76 -530 -398 217 438 94 -226 -211 -57 68 111 78 4 4 -44 -151 -69 252 329 -116 -421 -37 455 242
1270 242 -321 -289 205 318 -34 -195 -23 111 41 15 35 24 -9 -48 -107 -69 185 301 -94 -478 -158 408 307
1293 307 -312 -342 186 303 -170 -337 46 262 13 -179 -39 44 -42 -89 2 64 134 125 -170 -404 -35 556 415
1316 415 -340 -536 64 398 39 -155 144 207 -205 -351 117 407 114 -228 -154 42 137 145 3 -245 -146 303
$$ packed form
1162b81N81J80m47m37J76M41O0l13j41J94R6j74r0K15J73k00l03M2L57J82k78
1183C3l49M3M08J97l06l48J33L70K9l21r8K59J31k24j48K03K00j55k66P6L19J12
1205B98k96k96J02M05J94l54m11J23M70J10l56j72K08J12k48p1L67K17l93m50
1225d41J65N49J50m13l57P7L85K09k21l34kK82R1j82m8K16j2l93p9N34L37m37
1247G6o06J32O15K21l44l20J5J54J25M3l3p4%m8j07Q2L21P7m45l05L84M92k13
1270B42n63L2M94J13l52j61J72J34p0k6K0j1l3l9n9L8K54J16l95l84L20N66j01
1293C07o19l0N28J17m73j67L83K16k49j92J40Q3q6m7R1O2P0rk95k34L69N91j41
1316D15p55j96O00L34l59j94K99O3m12j46M68K90k93l42P4J96R5Qj42k48R9M49
$$ plain form
1338 303 365 -188 -486 -40 366 88 -197 61 170 -266 -472 111 591 222 -377 -428 -95 136 239 183 -125
1359 -125 -335 -77 210 30 -193 99 316 -113 -455 -17 465 89 -423 -95 452 193 -381 -324 196 316
1379 316 114 -24 -105 -210 -57 229 179 -70 -10 165 -121 -399 52 584 212 -489 -321 332 264 -312 -264 303
1401 303 317 -157 -315 -75 29 21 176 159 -161 -294 -54 69 -64 119 383 8 -653 -427 451 611 -98
1422 -98 -442 -20 191 -101 -138 203 213 -110 -165 67 64 -59 47 98 -79 -50 259 138 -406 -395 420 677 -57
1445 -57 -580 -176 243 34 -83 247 295 -244 -526 -98 322 271 46 -125 -315 -246 172 350 -61 -326 53
1466 53 298 -164 -463 56 480 48 -401 -75 294 -42 -386 -18 418 210 -203 -248 -87 -4 201 309 11
1487 11 -333 -127 232 60 -201 79 410 27 -459 -155 393 219 -243 -117 309 155 -281 -248 111 229 139
$$ packed form
1338C03O2n53k98M46M06k78k85K58J09m36k06N83M80l69n99n1L33K31J03n6l08
1359a25k10K58K87j80k23K92K17m29l42M38M82l76n12L28N47k59n74N7N20J20
1379C16k02j38q1j05J53K86n0k49O0J75k86k78M51N32l72p01J68O53o8n76M8N67
1401C03J4m74j58K40J04qJ55j7l20j33K40J23j33J83K64l75o61K26Q78J60p09
1422i8l44M22K11k92l7L41J0l23n5K32lj23J06N1j77K9L09j21n44J1Q15K57p34
1445e7n23M04M19k09j17L30M8n39k82M28M20n1k25j71j90O9M18J78m11k65L79
1466E3K45m62k99N19M24m32m49L26L69l36l44L68M36k08m13m5J61Q3K05J08k98
1487A1l44K06L59j72k61K80L31l83m86L04N48j74m62J26M26j54m36L3L59J18r0
$$ plain form
1508 139 83 -141 -375 -138 313 294 -123 -182 83 -68 -355 -31 532 284 -465 -510 161 390 -17 -240 -11
1529 -11 93 -45 -45 29 -53 -71 101 129 -101 -104 113 22 -251 -28 483 315 -430 -564 150 542 136 -224 -62
1552 -62 50 -113 -94 223 255 -16 -180 -136 -57 66 239 114 -263 -275 172 286 -158 -344 93 369 -29 -351
1574 -351 -88 191 27 -152 36 154 -44 -216 -111 58 111 128 22 -229 -221 123 294 -34 -300 -7 306
1595 306 35 -307 -68 302 146 -165 -90 162 81 -150 -79 174 221 46 -148 -219 -64 264 348 -37 -360 -142
1617 -142 231 147 -120 -44 177 -10 -313 -123 303 229 -220 -319 4 227 109 -106 -177 -96 91 168 17 -188
1639 -188 -119 88 65 -91 25 166 -29 -332 -168 314 350 -100 -357 -117 194 178 8 -58 -55 -11 26 39 23 43
1663 43 72 -28 -141 1 231 130 -183 -201 158 284 -32 -275 -72 205 124 -91 -106 19 61 -11 -68 -19 66
$$ packed form
1508A39n6k24k34K37M51j9m17n9K65j51k87L24N63k48p49m5O71K29m07k23K29
1529a1J04j38%P4q2j8J72K8k30lK17r1k73K23N11j68p45j34P14L92m06l60J62
1552f2J12j63J9L17L2k71j64M4P9J23J73j25l77j2M47J14m44j86M37K76l98l22
1574c51K63K79j64j79J88J18j98j72J05J69N3J7j06k51QL44J71l28k66K93L13
1595C06k71l42K39L70j56l11P5K52q1k31P1K53M7j75j94p1J55L28Q4l85l23K18
1617a42L73q4k67P6K21j87l03J90M26p4m49r9L23K23j18k15p1Q1J87P7j51k05
1639a88O9K07k3j56J16J41j95l03J64M82L6m50k57K40L11j6j70o6LM4L7J3j6K0
1663D3K9j00j13J42K30j01l13j8L59J26l16k43K03K77q1k15j5J25M2p2n7M9Q5
$$ plain form
1686 66 62 -91 -148 6 176 55 -211 -172 139 231 -69 -288 -62 230 129 -128 -158 31 97 5 -39 53 80 -13
1710 -13 -139 -68 156 247 18 -241 -163 178 308 43 -218 -124 129 149 7 -27 57 18 -109 -61 132 196 22 -227
1734 -227 -171 112 267 96 -217 -232 32 202 72 -121 -111 20 18 -74 -10 129 69 -166 -207 33 242 108 -196
1757 -196 -245 23 220 96 -124 -135 57 115 -19 -82 32 125 4 -134 -30 183 152 -87 -174 34 229 114
1779 114 -128 -143 86 195 29 -146 -60 118 120 -50 -98 31 104 -25 -115 -12 133 67 -136 -166 71 202 58
1802 58 -195 -194 65 191 53 -138 -115 22 58 -13 -28 51 40 -85 -137 48 221 115 -161 -232 21 270 169 -121
1826 -121 -192 -4 151 92 -25 -1 46 -15 -77 11 176 157 -88 -212 -25 242 227 -70 -229 -48 169 132 -70
1849 -70 -94 25 41 -47 -66 69 112 -51 -203 -87 146 167 -56 -226 -106 130 142 -59 -152 -22 105 33 -96
$$ packed form
1686F6mj53n7J54J70j21k66L9L11R2l00k19K26K92j01k57l0J89O6r2m4R2K7r3
1710a3j26P1K24R1k29k59P8L41J30k65k61R4K53K0j42l4Q4l9j27M8J93O4j74k49
1734b27N6K83J55j71l13j5K64J70j30j93J0J31kr2O4J39o0k35m1K40K09j34l04
1757a96m9K68J97j24k20j1J92N8j34o3J14R3j21j38J04K13l1k39q7K08J95j15
1779A14k42j5K29J09j66j75Q6J78Kj70m8J29P3j29r0J03J45o6k03l0K37J31j44
1802E8k53JK59J26j38j91K3J37L6p1j5P9j1j25n2J85J73j06k76p1K53K49j01k90
1826a21p1J88J55n9j17K4M7o1o2Q8J65j9k45j24J87K67j5k97j59J81K17l7k02
1849g0k4J19J6q8j9J35M3j63j52J16K33K1k23j70J20K36J2k01r3J30J27p2j29
$$ plain form
1872 -96 -56 98 65 -86 -91 77 141 -4 -143 -48 136 129 -51 -131 -25 147 120 -48 -138 3 151 96 -65 -72 71
1897 71 83 -53 -62 98 131 -51 -191 -14 177 146 -87 -187 -49 129 135 -25 -154 -86 78 80 -40 -61 48 17
1921 17 -136 -104 153 230 -81 -304 -105 218 218 -48 -178 -78 52 65 54 -1 1 -4 -38 -48 47 167 85 -148 -190 99
1947 99 274 42 -226 -95 171 152 -58 -102 22 46 -29 -17 66 41 -30 -83 -64 17 122 100 -117 -217 -9 216
1971 216 84 -168 -112 123 99 -131 -120 99 138 -52 -112 3 37 -7 -20 7 32 53 19 -87 -147 54 257 118
1995 118 -216 -190 143 208 -63 -130 103 124 -80 -123 103 184 -3 -136 -15 92 62 1 -72 -111 21 207 107
2018 107 -182 -232 80 204 -5 -109 54 61 -187 -202 155 312 -10 -275 -160 65 123 79 22 -82 -135 23 113
2041 113 -2 -96 51 129 -91 -167 67 207 -57 -234 43 283 52 -248 -131 150 142 -3 12 -15 -89 -40 97
$$ packed form
1872i6M0J54l3j51nJ68O4j45j39R5J84pj80q0J06J72k7j68r0J41J48n5j61pJ43
1897G1J2j36rJ60L3j82j40J77J91l1k33j00J38J78Oj60j29O8J64Kj20k1J09l1
1921A7j53L2K57P7l11k23J99L23%k66j30J00J30J3j1n5Knl4j0R5J20q2k33m2K89
1947I9J75k32k68J31K66j9k10m4J24K4p5J2Q3k5p1n3J9Q1J05k2k17j00K08K25
1971B16j32k52N6K35k4k30J1K19L9j90o0J15L4m4j3K7K5K1l4j06o0K01K03j39
1995A18l34K6L33O5k71o7K33K1k04m3K26Q1j87j33J21J07l0o1p3l9J32J86j00
2018A07k89n0L12J24k09j04J63Pk48j5L57J57l22k65J15K25N8m4n7j04n3J58R0
2041A13j15r4J47P8k20p6K34J40k64j77K77K40k31l00J17K81qj45J5k7p4M9J37
$$ plain form
2064 97 91 -22 10 65 -99 -206 76 314 59 -275 -106 195 94 -193 -75 220 120 -174 -173 46 49 8 65 52
2088 52 -102 -123 19 32 -39 58 182 -25 -322 -106 299 234 -158 -181 123 120 -111 -112 149 131 -66 -57 74 16 -68
2113 -68 3 102 22 0 95 -9 -235 -123 310 322 -140 -315 -29 160 -14 -33 162 101 -230 -268 56 218 84
2136 84 -47 -63 -118 -96 93 171 -70 -170 71 154 -125 -253 66 240 -28 -200 44 173 -97 -246 36 272
2158 272 102 -142 -116 -28 -2 92 181 9 -164 -53 109 -8 -91 119 252 -52 -299 -33 252 87 -167 -5
2180 -5 193 -3 -231 -78 139 130 5 -10 -77 -146 -33 173 112 -108 -82 60 -38 -182 25 281 82 -285 -166
2203 -166 176 144 -112 -101 107 101 -61 -59 9 -26 -26 111 111 -61 -96 30 25 -73 54 267 69 -302 -261 184 304 7
2229 7 -143 -11 24 -95 -26 157 134 -66 -126 -39 0 35 119 36 -139 -118 128 118 -156 -176 128 210 -72 -221 -9
$$ packed form
2064I7oj13L2N5j64j07K82K38k55l34J69L01j01k87J18K95j00k94JK19Lm1N7j3
2088E2j54k1J42J3p1R7J24k07k97K16M05o5l92k3L04lk31jK61j8j97RJ31n8q4
2113f8P1R9q0k2R5j04k26J12M33J2m62j75K86J89j74j9J95o1l31l8L24J62j34
2136H4j31j6n5K2J89P8k41j00K41Q3k79j28L19J74k68j72K44J29k70j49K82K36
2158B72j70k44K6Q8K6R4Q9j72j73J11J62j17q3K10J33l04k47K66K85j65k54J62
2180eJ98j96k28J53K17rj25j5o7o9J13K06o1k20K6J42r8j44K07K56j99l67J19
2203a66L42l2k56J1K08oj62KO8l5%J37%j72l5J26nr8J27K13j98l71M1M45J20k97
2229Gj50J32L5j19O9J83k3k00o0Q7L9L5Q4q3j75K1K46j0k74k0L04Q2k82j49K12
$$ plain form
2254 -9 114 -54 -99 76 128 -68 -176 -67 67 68 64 10 -123 -130 69 152 -17 -106 67 138 -72 -177 58 233 63
2279 63 -139 -26 101 -1 -80 32 125 55 -63 -77 -51 10 113 138 -52 -189 -20 156 44 -105 -1 115 -10
2302 -10 -170 -18 167 65 -147 -104 95 97 -43 -103 -50 22 81 88 -42 -140 -54 86 66 -39 -10 75 -57 -165 -4
2327 -4 229 140 -156 -200 35 159 51 -22 0 2 -22 5 43 22 24 22 -2 -46 27 123 29 -149 -76 132 131 -91 -149 17
2355 17 111 15 -76 -20 18 -8 -57 -27 27 27 -5 -62 -72 3 90 32 -94 -94 86 94 -71 -119 40 141 10 -107 -56 78
2383 78 63 -10 -28 14 30 -23 -30 13 64 64 -30 -116 -24 127 136 -43 -129 -2 128 64 -54 -28 58 7 -65 -13 85 53 -74
2412 -74 -125 -26 98 110 -37 -138 -79 74 103 -10 -109 -55 18 -2 -31 28 62 -2 -116 -60 88 132 -11 -140 -83 61
2438 61 110 30 -68 -46 33 47 1 -18 30 25 -17 -61 7 116 52 -98 -94 45 113 26 -83 -52 53 57 -9 -56 -3 55 12
$$ packed form
2254iJ23j68m5J75N2j96j08J09J34Jmn4j33pJ99Q3j69q9J73P1k10j05K35J75j70
2279F3k02J13J27j02p9J12R3p0j18j4K6O1J03K5j90j37J69J76j12j49J04J16j25
2302a0j60J52J85j02k12M3J99Kj40o0N3P2N9Pj30r8Q6J40k0j05K9Q5j32j08J61
2327dK33q9k96m4K35J24j08p3K2Kk4K7L8k1Kkk4m4P3R6r4j78P3K08jk22n8J66
2355A7R4r6r1N6L8k6m9L0N4%l2n7j0P5Q7n8j26%J80Qj65m8J59J01j31j17N1J34
2383G8j5p3j8M2J6n3pM3N1%r4q6R2J51Rj79q6J27J30o4j18K6Q6n1p2N2R8l2j27
2412g4n1R9J24J2j47j01N9J53K9j13r9N4P3k0k9N9L4o4j14N6J48M4j43j29N7J44
2438F1M9q0r8K2P9J4m6j9M8nm2m4O8J09o4j50MJ39O8q7j09L1J05Mo6m7N3N8m3
$$ plain form
2467 12 -58 -45 42 57 -37 -81 -9 54 23 -79 -72 45 76 -34 -116 -44 57 65 -49 -92 -29 52 20 -29 -39 21 23 -47 -48 48
2497 48 97 0 -89 -56 74 133 14 -97 -68 61 95 37 -35 -1 20 -2 -20 39 87 26 -84 -87 53 133 39 -104 -122
2524 -122 1 95 32 -67 -70 -18 14 -25 -14 39 26 -59 -94 -3 104 66 -64 -117 -21 87 46 -44 -77 0 47 1 -45 8
2552 8 56 11 -69 -32 69 91 -19 -82 -12 90 57 -35 -52 25 65 33 -55 -45 55 80 -5 -66 -17 65 43 -48 -34 43 40
2581 40 -48 -74 8 77 5 -85 -74 20 78 9 -72 -75 1 40 21 -37 -34 6 3 -51 -15 79 60 -86 -126 14 135 63 -74 -94
2611 -94 -3 67 41 8 -2 -6 -4 -3 3 42 62 7 -91 -44 98 113 -44 -130 -13 107 67 -41 -61 24 22 -20 10 42 15 -43
2641 -43 -74 -35 42 72 21 -99 -117 24 113 6 -97 -35 58 4 -86 -42 83 40 -74 -74 24 34 -10 -26 2 12 -1 -1
2669 -1 -27 -42 39 106 24 -97 -37 110 83 -59 -34 77 65 -61 -60 42 73 -27 -47 28 47 -3 -28 -27 -14 46 72 0
$$ packed form
2467A2p0J3Q7J5r4m4P2O3l1j02PJ17L1j10q2P2J01Qj14m3O3Q1l2m9j0O0Kp0jR6
2497D8M9r7q9L3J30N9j19j11K9J29L4n8p2L4K1k2j8N9M8o1j10lJ40Q0r4j43j8
2524a22J23R4o3r9lN2L2l9J1N3j3q5l5R1J07l8j30n3R6J08m1r0l3P7M7m6m6N3
2552HM8m5q0L7J01K2j10o3P0J02l3r2j7P7M0l2q8J0J00K5q5o1M9Q2k2r1J4P7l
2581D0q8k6Q2O9p2r0J1R4N8o9q1lP6L9j9n8LM0ln4L6R4j9j46m0J40J21p2j37k0
2611i4R1P0k6l3j0mKJOL9K0n5r8M7J42J5j57q6J17J20m0j08k0Q5km2L0L2k7n8
2641d3l1L9P7L0n1j20j8J41Q9j07j03O2R3n4r0M4J25m3j14%R8J0m4j6K8J0j3%
2669ak6j5Q1O7q2j21O0J47k7j42K5J11j2j26JJ02L1j00k0P5J9n0k5JJ3O0K6p2
$$ plain form
2697 0 -126 -75 81 111 -44 -83 3 12 -93 -56 119 120 -91 -183 -28 97 50 1 -25 -48 -47 17 42 -25 -57 31 58 -51
2725 -51 -69 62 82 -59 -97 71 151 -22 -151 -27 117 72 -15 8 -12 -55 -19 75 62 -13 -17 -16 -76 -71 84 152 0
2752 0 -153 -38 100 22 -100 -3 111 3 -135 -70 52 35 -21 8 -7 -73 -54 37 31 -39 15 87 -32 -145 -18 155
2778 155 79 -111 -48 109 50 -104 -61 104 80 -49 -23 23 -2 -49 46 88 10 -18 14 -25 -99 27 191 105 -152 -161
2804 -161 55 122 -3 -5 87 17 -152 -109 88 124 -3 -72 -22 -41 -29 56 61 -64 -78 56 54 -91 -115 55 120 -40
2830 -40 -107 56 60 -100 -119 85 156 -3 -113 -53 11 15 56 99 -6 -113 -39 60 16 -26 76 106 -91 -177 23 168
2856 168 26 -111 -6 92 -50 -127 3 117 23 -67 -29 -25 -73 -5 85 26 -70 -38 33 -30 -100 31 144 2 -156
2881 -156 -60 96 28 -109 -27 105 37 -80 -57 28 16 -11 66 41 -65 -72 31 41 -13 44 102 -27 -176 -58 174
$$ packed form
2697@j26N1J56L0j55l9Q6Rj05L7J75Jk11r2J55J25m7m9k6k3JO4K5o7l2Q8K7j09
2725e1j8J31K0j41l8J68Q0j73j29J24J44m5q7K3k0m3L6R4j3p5mJo0NJ55O8j52
2752@j53J15J38p8j22R7J14j08j38O5J22j7n6K9j5o6J9R1op0N4P2j19j13J27J73
2778A55p6j90O3J57n9j54M3J65k4j29K6M6k5m7R5M2p8k8L2l9p4J26J64q6k57r
2804a61K16O7j25kR2p0j69M3J97L6j27o9N0j9J2Q5Nj25j4J34kj45k4J70O5j60
2830d0o7J63Mj60j9K04P1j59j10O0O4MM1M3j05j07P4R9m4m2J02L0j97q6K00J45
2856A68j42j37J05R8j42p7J30J14r4r0L8Mm8O8R0n9r6L2P1o3p0J31J13j42j58
2881a56R6J56o8j37Q2J32o8j17K3Q5j2k7P7k5j06pJ03J0n4N7N8j29j49J18K32
$$ plain form
2906 174 148 -73 -98 18 24 -51 5 107 43 -92 -68 30 23 15 31 23 -50 -42 67 36 -111 -73 97 96 -73 -118 22 61
2934 61 -41 -33 84 60 -83 -121 10 74 42 13 -5 -75 -64 43 88 -12 -54 20 34 -78 -86 77 124 -24 -121 -8
2960 -8 80 -1 -56 38 65 -7 -66 -12 17 6 44 44 -35 -72 14 62 -4 -69 21 78 -25 -101 -5 93 1 -84 -6 56 4 -83 -53
2991 -53 17 45 16 19 -41 -79 -11 75 28 -39 -20 28 -39 -66 33 134 32 -122 -74 61 79 -12 -29 3 6 -18 10 24 5
3020 5 -18 -4 -21 -20 22 42 -15 -81 -5 86 41 -79 -93 28 66 -8 -47 7 1 -44 -48 24 37 -1 -42 -42 -30 14 55 6 -78 -56
3052 -56 29 36 -32 -45 45 58 -38 -72 4 63 -1 -42 -10 19 15 -15 -6 24 17 12 -13 -38 5 58 43 -39 -56 27 62 -7 -62 -18 39
3085 39 17 -34 -12 21 4 -45 -27 18 46 7 -47 -58 -5 58 40 -28 -63 2 32 12 -1 16 34 -3 -66 7 75 50 -35 -60
3115 -60 0 45 51 -8 -28 -8 22 26 13 -15 13 8 -21 -23 35 61 1 -65 -32 55 65 -10 -50 -14 24 25 -7 -2 10 3 -34 -26 -4 26
$$ packed form
2906A74k6k21k5J16Op5N6J02o4j35K4R8pqJ6qp3QJ09l1j47L8J70jj69m5J40L9
2934F1j02QJ17k4j43l8J31O4l2k9j8p0J1J07M5j00m2P4J4j12qJ63M7j48r7J13
2960hQ8q1n5R4K7p2n9N4K9j1L8%p9l7Q6M8o6o5R0N7j03p6R6R8r2q5P8O2n2q7L0
2991e3P0K8k9Lo0l8O8Q6m7o7J9M8o7k7R9J01j02j54M8J35J8r1j7L2Lk4K8J4j9
3020Ek3J4j7JM2K0n7o6P6R1m5j20j4J21L8p4l9N4om5mP2J3l8m1%J2M4M1m9q4K2
3052e6Q5Po8j3R0J3r6l4P6N9o4m1L2K9ml0RL0pnk5k5M3N3j5q2j7Q3L5o9n5M4N7
3085C9k2n1K2L3j7m9J8M5K8l9n4j1N3O3j8o8l5O5L0k0j3J7J8l7o3P3O8k5q5k5
3115f0O0M5On9k0K0L0Mj3k8K8nk9kN8K6o0o6L3Q7J0p5m0L6L8Jl2NJ2pl7QK2L0
$$ plain form
3149 26 13 -39 -41 7 47 7 -34 -42 19 16 -22 -41 1 45 0 -53 -26 24 42 -3 -36 -8 16 16 -2 -7 17 31 -5 -40 6 56 42
3182 42 -26 -43 -1 55 40 -15 -39 1 18 -4 -5 12 17 -25 -35 -15 49 55 -26 -66 -25 52 40 -9 -42 -37 17 16 -10 0 22 -9 -51
3215 -51 -35 15 36 -5 -57 -52 20 65 6 -31 -22 12 31 0 -7 12 17 -18 -18 6 55 30 -27 -42 7 59 39 -14 -19 8 33 4 -4 6
3249 6 15 -2 -21 -25 18 33 -19 -47 -28 17 25 -41 -29 0 15 -13 -40 -9 27 7 -32 -42 -7 30 16 -8 -32 -6 21 7 -16 -1
3281 -1 26 5 -45 -35 40 55 3 -51 -28 23 45 4 -14 -6 9 13 27 19 16 16 -13 -28 16 57 27 -33 -52 22 56 22 -38 -39 3 1
3315 1 -13 9 18 -15 -44 -33 -8 28 9 -16 -61 -46 37 43 -8 -51 -12 22 -1 -38 12 48 4 -38 -8 35 30 -26 -23 6 13 12 4 -5 -18
3350 -18 14 41 8 -38 9 51 6 -40 -5 70 26 -57 -30 26 33 -10 -14 26 5 -26 -13 9 13 27 4 -24 -48 -17 58 37 -43 -32
3382 -32 15 3 -35 -18 53 34 -54 -75 17 55 6 -19 7 13 2 30 34 -2 -7 29 42 -8 -20 26 34 -23 -7 67 69 -46 -76 13
$$ packed form
3149B6j3n2kM8M0m0m1qO1ll8j9M2M4m5n3K7N0J8m5l3K8K4%j8nK4J4l6l5M6N0j4
3182D2o8j7M2N6j5n5k4M0J7k2jJ7Nm2j0K0O4Oq1m0M1P7j2m9l3NN4jk6J0K2l1m2
3215e1J6N0K1m1n2NP2M5n9l7RL4J9l1pJ9Nl5%K4M9k5n7j5M9N2k0n3nK7K5k9qJ0
3249FRj7j9mM3J5n2k8J9M5Qo6J2K9J5k8k7L1L6k0l9j0L5L7j4k4k4K6K7j4k3J5
3281aK7k1n0J0P5J5n2n4K3N1K2m1j8QJ5MJ4ql%k9j5M4M1l0o0j9P4L4l4o0jM2k
3315Aj4K2Rl3k9J1K5L6j9k5m5J5Q3On1m3L9L4k3l7N0L6m4m2L0M3nn6LK9Pjqrj3
3350a8L2K7l3m6M7M2m5m6L5P5m4q3K7N6Pm3mM0k1l1J3K2MJ4k3k8k4L1P5k1q0J1
3382c2M7j2l8J7P1j9q8k1R2L8m9k5K6Oj1K8Ml6nL6J3n0j2M6Qn7J6P4Kj15l0Q9
$$ plain form
3414 13 76 29 -13 5 -6 -37 -4 54 37 -12 -31 -24 -30 -28 53 47 -47 -92 -2 60 -13 -37 18 62 -19 -76 -15 51 5 -34 2 5 -31
3447 -31 -24 18 -1 -14 18 47 -6 -66 -6 71 26 -44 5 62 -1 -77 -7 89 54 -37 -8 12 -13 -17 48 66 -4 -37 -16 -3 -18
3478 -18 36 84 9 -102 -66 59 57 -34 -25 39 -9 -87 -36 54 32 -41 -37 7 -4 -36 2 25 -23 -22 42 25 -57 -55 51 68 -19
3509 -19 -35 38 28 -70 -35 97 83 -37 -77 -11 15 -2 45 58 -10 -59 -24 43 14 1 56 44 -61 -68 47 98 10 -60 12
3538 12 52 -35 -68 26 68 -8 -34 -2 -7 -35 -13 44 13 -50 1 17 -34 -74 12 100 5 -81 -27 46 -16 -47 26 83 1 -72 -22
3569 -22 22 22 21 43 20 -70 -53 30 47 7 24 39 -30 -95 5 99 56 -59 -50 21 11 -40 8 72 2 -54 -19 34 -9 -21 20
3600 20 34 -28 -18 17 13 -53 -12 78 48 -63 -70 16 17 -15 -1 57 8 -79 -54 44 63 4 -10 -7 -42 -33 32 71 1 -34 11 21
3632 21 -33 -25 71 69 -35 -62 20 52 -21 -27 30 29 -26 -43 11 29 -5 17 40 -7 -45 -12 29 -12 -32 40 43 -26 -74 -12 47 -2
$$ packed form
3414A3O3m7m2J8j1l1L3N8j7m9j9PoKQ1or4m5R0O2p3k4N5M4q1n7O1O6m6l9L6Ll6
3447c1PM2j9j3L2K9n3o0O0P7m5p0M9N7o3p6P0R6l5r1K9K0k5mO5J8p0l3K1J3j5
3478a8N4M8p5j11L6J25kr1RO4m8p8N1R0k2p3MM4j1l2L8K3m8JO4j7q2KJ06J7q7
3509a9j6P3j0r8L5J32j4j20m0O6K6j7M7J3o8m9L5O7k9j3N5j2j05pJ15N1q8p0P2
3538A2M0q7l3R4M2p6k6L2nk8K2N7l1o3N1J6n1m0Q6Q8r5q6N4P3o2l1P3N7q2p3N0
3569b2M4%jK2k3r0J7Q3J7m0J7J5o9o5J00R4m3j15RP1j0n1M8O4p0n6L5N3m3j2M1
3600B0J4o2J0L5mo6M1R0l0j11pQ6Jl2J4N8m9q7K5R8J9n9j4Ll5RO5L9p0l5M5J0
3632B1n4QR6kj04k7Q2L2p3oN7jn5j7N4J8l4K2K3m7l8L3M1m1k0P2Lo9m8O2N9m9
$$ plain form
3664 -2 -49 4 20 -26 -61 4 46 18 -13 -18 -33 -35 2 56 26 -40 -23 10 -4 -19 39 63 3 -65 -16 60 39 -25 -4 12 5 -15
3696 -15 13 9 0 -13 24 31 -13 -8 19 0 -35 7 53 6 -59 -42 48 43 -20 -28 1 -10 -35 -9 44 10 -23 -39 -28 3 -1 22 15 -32
3730 -32 -33 31 19 -9 -11 30 14 -42 -21 26 26 -31 -30 1 17 -12 -12 0 1 -12 -4 11 -5 2 2 19 -17 -12 26 12 -22 -28 16 34 3 -17
3766 -17 1 11 -9 -6 1 27 2 -16 -7 -3 10 27 8 -23 -26 -2 23 -7 -13 1 -6 -14 -29 14 37 -10 -44 -35 20 30 2 -27 -21 2 14
3801 14 21 7 -14 0 9 14 -9 8 16 -13 -27 1 32 15 -17 -34 -12 12 -5 -8 -13 -14 -15 -1 1 16 7 -6 -16 -16 11 18 -4 -28 -12 6
3837 6 7 -19 -18 -1 8 -12 -11 6 20 6 -12 -22 -2 16 19 -11 -10 -6 -1 -5 -1 4 9 -3 -25 -5 14 26 -9 -21 -14 5 15 -4 -16 1 -4 -11
3875 -11 7 8 21 12 -27 -15 -1 25 11 -14 -29 -4 8 6 1 -9 -7 -12 -13 3 22 8 -9 -20 -2 31 27 -9 -21 -8 25 16 -3 -7 2 4
3911 4 5 9 16 26 -4 -23 -16 24 31 5 -26 -13 4 15 -1 -10 -1 1 -5 -14 5 19 2 -15 -30 -2 8 16 -18 -20 -10 5 -5 -4 2 -1 -12 -25
$$ packed form
3664bm7N3J6m6l5O5M2k8l1nj5kL7N4l0o6J7L3j4j5N8K4o0o8M9P6k1o4K1J6pk0
3696a5K8mrj3L7Pm4NK7j9l5M2M6m7o5J7R0no3qK9j1k5K6N3l4l3j6J1L1mK3pm7
3730c2jO4j2k8kM1j6n6K1M7%n7JL1J6k9%J2Jj3QJ5j6P%J7l6NL8j4l4oM4J8l1k0
3766a7J8J0k0LPK6k5j8RMJ3J7j9l1lK4K5l0oJ4pqj5M3K3m7l4RN5J0k8k9OK3J2
3801A4Pj4k1J4RNk3J7Qk9j4K8L1j7l2j7K2K4j7lnjjJ4KJ5rj3j0%K7Pk2k4J6J8
3837FJk6JJ7Rk0JJ7J4j4j8j0K0J8Ll0JMNmMNNj2k2K0J9J2l5j2PJ9J0j9j2J7np
3875a1J8JJ3rl9J2J4K6j4k5j5K5J2knj0KnjJ6J9j4j7j1J8L3ml6j2J3L3rj9mRK
3911DJMPJ0l0j9PM0Pk6l1J3J7J1j6rRKorJ9J4j7j7j5K8J0Ql4kJ0J5j0JOlj1j3
$$ plain form
3949 -25 -18 19 13 1 -26 -16 10 21 5 -8 0 -2 -7 -22 6 24 15 -11 -9 12 26 18 -18 -16 -1 10 5 6 -5 -3 -4 3 -1 16 2 -11 -42 -26
3987 -26 15 25 -12 -26 -15 0 5 -9 -6 -12 -4 -23 -9 15 7 1 -18 -20 5 34 26 -12 -26 6 22 -8 -12 13 7 1 -24 13 28 13 -21 -19
4023 -19 15 13 11 0 -8 -2 -2 14 10 -14 4 9 -8 -5 5 40 -2 -28 -13 17 6 -11 -13 -8 -13 -29 -2 13 11 -14 -15 -8 -14 6 25 -2 -26 -18
4061 -18 21 14 -9 -4 15 11 -18 -8 15 21 -16 -14 15 13 -2 6 3 -15 -6 17 28 -3 -14 17 13 -22 10 40 8 -42 -38 25 47 2 -25 -2
4097 -2 5 -20 12 39 13 -29 -11 5 -2 -3 18 14 -28 -34 17 38 -7 -25 -5 10 -14 -26 4 27 -17 -19 20 12 -3 -21 18 13 5 21 27 -7
4133 -7 -39 15 48 16 -19 2 14 -19 -32 28 59 7 -28 -3 21 1 0 33 24 -27 -32 7 14 4 8 20 -14 -58 -15 27 23 -40 -14 26
4167 26 -14 -38 -13 23 3 -32 -1 17 -8 -27 -2 18 -9 -7 21 0 -40 -17 42 39 -15 -18 16 8 -15 2 65 32 -35 -36 26 30 1
4200 1 22 11 -9 -42 3 31 12 -8 13 8 -42 -35 32 38 -31 -39 8 5 -43 -38 23 14 -19 -29 0 3 -34 -18 16 7 -33 -7 2 -26 -31 30
$$ packed form
3949b5PL7oj2k7J0K6J1j6j3Qknj5K8J8rk6KK1J4ql6KJ5J1nJj1KjPmJ7j4j3l1J6
3987b6M1J0l7j4J1J5Nj4LoQj9J4K4qoj9kK5K9ql8j4L2J6l0mK5ook5L7J5j5l4K
4023a9L4kkj1qO%J6mk4J8Nj7LJ0L5m2k6J5L0j1j7kNnj6K7J5kk5jPoK0J9k7k4Q
4061a8L9pk3NJ9mk9J0K3Ol7KK9kj5Qlj8RK3J1l1j1L1ml5L2L0l2n0MO3K2m5k7K3
4097bPk5L2K7k6m2J8J6pjK1mm2oN1K1m5j8K0J5k4j2L0K3m4kL9qj5j8L9nqJ6Ol4
4133gl2N4L3l2l5K1J2l3j3O0L1n2l5K5K4k0jL3rn1nL9Pj0MJ2l4m4M3M2mo3K6M0
4167B6m0k4K5L6k0l5L1J8k5j9K5K0k7KK8k1m0K3N9ln4lL4qk3J7O3l3o7jO2Mk9
4200AK1j1k0l3M5K8j9k0K1nn0PO7Oo9qM7lm8NO1rl3j0K9Ll7J6L4rm0K6Rk8nO1
$$ plain form
4236 30 42 -8 -51 -11 16 -10 -23 34 38 -17 -47 4 31 12 0 22 0 -34 -3 44 25 -2 -4 15 -12 -44 12 47 3 -43 -8
4267 -8 31 -8 -22 4 40 -8 -29 7 8 -17 -17 22 17 -24 -19 3 3 -26 1 46 11 -39 -20 16 13 -11 2 37 -20 -55 -12 37 28 -14
4301 -14 2 6 -13 -6 31 42 -8 -22 20 9 -6 3 38 27 -28 -36 26 15 -15 -15 31 19 -22 -13 6 4 -13 6 18 -4 -25 -7 11 0
4335 0 -15 14 7 -17 -44 6 34 -8 -23 0 2 -24 -20 27 19 -20 -22 -4 -5 -13 10 37 -5 -34 -16 12 0 -10 22 22 -18 -35 15 27 5
4370 5 -12 9 34 -2 -19 12 2 -7 -4 24 8 -16 -18 8 5 -18 6 11 -13 -35 -13 40 26 -29 -18 10 -10 -11 -2 26 -8 -32 -18 9
4404 9 -8 8 1 -5 -19 -18 6 8 -6 -11 25 -4 -17 -7 27 15 -20 -8 5 17 -18 -13 -6 0 -3 6 11 -5 -11 15 27 -6 5 5 -2 -32 -9 21
4442 21 20 -3 -27 -11 14 0 -6 6 -3 -17 -17 1 7 -11 5 -14 -27 -10 7 8 -13 -21 -3 16 -6 -23 -7 2 -1 -11 4 18 -1 -15 2
4477 2 6 9 15 1 -18 -8 9 10 -2 10 1 1 -13 -17 16 22 4 -21 -1 11 15 4 9 5 -11 -6 0 7 12 -18 -12 -2 0 -4 2 -17 -20 -14 -1 -4 -12 -18 -19
$$ packed form
4236C0J2n0m3M0K7k6j3N7Mn5l0N1K7j9j2K2k2l4L1M7j9k7kJ9k7l2N6L5m4m6L5
4267hL9l9j4K6L6m8k1L6Jk5%L9nm1NK2%k9K7M5l5n0J9L6lk4J3L5n7l5M3M9rm2
4301a4J6Mj9PL7J1n0j4M2j1j5RL5j1n5qO2j1l0%M6j2m1RJ9kj7J9J2k2k1J8J8j1
4335@j5K9pk4k7N0K8m2j5K3Kk6MM7ql9kJ8jqK3K7m2k9J8K8j2j0L2%m0j7N0J2k2
4370Ej7K1K5l6j7L1j0rLK8j6k4kK6lk3K4Nk4k2K2N3j4n5J1K8k0jRK8l4k4J4K7
4404Ij7J6poj4JK4Kj4nL6k9j3J0L4j2l5J2J3J2l5NPOlRNj6oK6J2l3J1%pl0K3L0
4442B1jk3k4J6K5j4oJ2rj4%J8Oj8J6j9j3J7J7Jk1qJ8J9k2j7J6Rlj0J5J4j9j4J7
4477BMLOj4j9J0J7Jj2J2r%j4mL3Oj8k5K0J2Mj1Nmj6NOPNl0OJ0KmOj9lOJ3lqoj
$$ plain form
4520 -19 -9 -9 2 5 0 -18 -14 4 0 4 -2 -7 -10 10 11 5 -4 -4 8 -3 -5 8 7 4 -15 -20 -5 9 5 -8 -21 -11 -2 -7 5 2 -10 -10 0 6 6 3 2
4563 2 -3 -17 19 9 3 -12 -9 2 12 4 11 3 -3 -10 -11 15 1 3 -14 -7 -12 5 0 -1 -2 8 8 18 6 7 8 -9 -13 10 21 21 0 -8 -4 4 14 4
4605 4 9 -5 -4 9 15 20 6 -4 -6 -9 7 13 9 -7 -13 4 9 -1 8 -1 -10 -8 3 4 4 -3 6 -1 -8 -4 9 0 -4 -9 2 7 19 3 5 1 2 7 0 4 -4 -21 -10
4652 -10 0 5 3 -3 -10 0 7 4 -4 -12 3 -6 -7 5 18 10 -7 -7 -2 10 6 1 4 -9 -2 -2 7 12 -5 -13 -2 -9 13 -3 5 -17 -12 17 3 0 -3 3 12 -2
4696 -2 8 7 9 -7 -3 -1 10 5 8 2 -14 3 9 18 2 -12 -4 -2 -5 1 7 -3 -12 -15 -3 4 3 -5 -7 5 -7 -6 16 8 -9 -7 -9 9 -3 -4 -2 -6 -14 -6 8
4741 8 14 -3 -8 11 -2 -5 -1 9 4 -10 5 12 6 -16 6 9 -5 9 13 8 -14 3 5 11 10 6 9 -6 -23 -6 19 31 6 -15 -8 4 -5 9 20
4780 20 -2 -20 -7 10 0 -10 -2 11 0 -8 21 29 -11 -15 13 23 -10 0 16 4 -11 -5 12 7 -17 3 14 8 -1 22 10 -4 -12 8 23
4815 23 14 -11 2 8 -16 -3 14 21 -4 -23 -5 12 -7 2 19 2 -14 -15 26 16 -14 12 10 -7 -16 -2 17 -5 -26 2 18 0 -15 0
$$ packed form
4520a9J0%J1Lnj8MJ8mMonlK0Jor%J2j1kJ3jlj9nJ5J4mj3j3J0RnJ2lj2%J0O%lj
4563Bnj4L6j0oj5LJ1J0qPqopjK6j4Kj7PnJ7njjJ0%J0j2JJj7mK3J1%k1qMQJ0j0
4605DNj4JJ3ONj4j0klJ6Omj6oJ7Nj0RrrKJ1J%pRppMJ3rmnJ1NJ2j6KmJNpMqj7J1
4652a0J0NkopJ0PlqqJ5rjJ2J3qj7%NJ2mnLj3P%RNj7qJ1pK2j6Qk2NK9j4llORj4
4696bJ0jKj6MKJ1nLoj6J7ORj6j4QKlOOj0rlJ2PjqkJ2j2JK2qj7KkJ8j2jKmqQJ4
4741HOj7nJ9j3lMJ0nj4J5Pok2K2Lj4J4Mnk2J7KOjmLj5j7J7K5J2k5k1PJ2rJ4J1
4780B0k2j8J3J7j0j0QJ3j1qK9Qm0mK8J0l3J0J6j2j5OJ7nk4K0J1orK3j2j4qK0J5
4815B3rk5J3Ok4J3J7Pk5j9J8J7j9RJ7j7j6jM1j0l0K6kj7rJ4J9k2k1K8J6j8j5J5
$$ plain form
4849 0 11 -6 -2 13 25 -12 -29 3 20 -2 0 -2 -8 -19 -4 28 25 3 -7 9 5 -7 18 31 1 -24 0 15 7 -9 6 5 -16 -18 12
4884 12 17 -1 -16 -1 6 -22 -22 15 22 -15 -3 25 3 -13 -10 25 21 -4 -4 20 8 -23 6 43 6 -14 3 5 -10 -14 17 34 -2 -21 -7
4919 -7 17 -2 0 25 14 -36 -25 7 22 -1 -6 5 -4 -11 5 22 17 -16 -7 9 -3 -21 -7 16 3 -24 4 15 -21 -32 3 15 -14 -23
4953 -23 -3 -6 -18 -7 8 7 -11 -28 -15 1 -2 0 20 -8 -43 -17 29 22 7 3 19 -15 -23 11 26 4 0 -25 1 -8 -11 17 25 -8 -10 9
4989 9 13 -9 -5 27 13 -16 -13 9 8 -13 7 29 5 -8 -8 -2 3 -6 19 18 -11 -18 -7 8 -7 -11 17 -4 -22 -23 11 25 -6 -13 0 -3 -25 -1
5027 -1 26 16 -13 -11 4 4 -9 8 27 -13 -16 -1 16 -1 -3 8 22 -9 -24 4 25 -16 -28 16 2 -16 -27 5 -6 -6 -7 8 -2 -30
5061 -30 -2 1 10 -6 6 6 -23 -17 4 27 10 -20 -1 2 4 -4 11 11 -9 -27 14 12 -4 0 15 2 -13 2 14 15 -2 10 16 13 -4 16 22
5098 22 6 -10 11 10 -3 -4 -3 8 8 13 1 -3 -3 1 13 16 -4 -9 -6 -12 -14 2 11 18 -9 -21 0 13 -2 9 5 -8 -16 3 6 4 -18 -5 3 -6 3
$$ packed form
4849@J1j7MJ5J2l7j7L2J7k2Kkoj1J5L2lk2j0J6mj2K5J3l0k5K4J5qj6J5jk1kL0
4884A2Nj8j5J5Pk8%L7Pl7J2K8k2j6LL5mk5%K4j2l1K9L7l7k0J7Kj5mL1J7l6j9J4
4919gK4j9KK5j1n0J1L2J5k3nJ1rpJ6J7nl3RJ6j2j8J4K3j3k7K8J1l6j1L5J2k9r
4953b3K0lj2J1J5jj8j7J3J6lKK0k8l5K6M6pj5mJ6l4qL4J5k2mk5K6rlK8Ql3kJ9
4989IMk2ML2j4k9LK2jk1K0K2k4j3%ONrK5jk9pJ1J5j5mK8k1j8jL4J4l1pJ3lk2K4
5027aK7j0k9KJ5%j3J7J9m0lJ5J7j7kJ1J4l1j5K8K1m1j2M4j4j8j1L2j1%jJ5j0k8
5061c0K8LRj6J2%k9OK1K3j7l0J9LKqJ5%k0j8M1kj6MJ5j3j5J5J2Jj7J2Olj7K0O
5098B2j6j6K1jj3jJJ1%Nj2m%MJ2Lk0nLokJ6RPk7j2K1J3j5J1mj3qJ9Lkk2J3QrR
$$ plain form
5139 3 8 15 -12 -7 15 6 -2 -1 4 2 3 0 9 8 -1 -5 2 16 12 -5 -1 -7 -9 13 14 8 -3 -5 6 13 3 13 7 -6 -11 5 10 10 10 -3 -3 -10 1 -1 12 -16
5185 -16 -1 0 -19 -7 0 7 -10 -8 -1 9 11 7 9 16 6 11 9 12 -1 3 -1 14 18 1 4 -14 -2 10 -2 5 11 -2 8 5 3 1 3 1 -1 -1 5 4 5 -6
5229 -6 -8 -1 2 5 3 -6 7 -2 -2 4 6 -11 -6 1 1 1 2 1 -16 -17 -21 -17 3 1 2 2 -2 4 8 5 -1 -5 5 8 9 12 -5 4 6 8 16 16 -6 -4 7 15 12 9 14 12 6 1 1
5282 1 6 -3 8 -3 -1 11 8 5 5 -1 -12 5 2 7 -5 -19 -3 7 4 7 -13 -6 -11 -3 4 -2 11 10 -3 2 12 5 7 4 -1 -1 8 11 10 -1 -2 2 11 8 12 10 1
5329 1 5 -3 11 18 -1 4 -3 -3 -12 7 -6 0 8 1 8 8 4 -3 -14 1 -3 6 3 2 5 -7 9 6 0 -1 -7 -1 3 9 3 3 -1 3 -3 15 8 2 1 6 11 -3 10 10 2 -6
5379 -6 -4 11 8 11 2 2 1 9 17 23 6 -4 3 0 9 5 10 6 3 1 -3 3 6 -3 0 12 5 -6 3 -5 -4 -10 -2 5 -8 -6 -7 5 -2 -4 -6 -14 -18 -12 0 -9 -5 -13 0 2 -7 2
5431 2 3 3 4 -8 -3 -2 11 6 2 -13 -5 17 19 2 -2 -6 6 0 18 16 -5 12 -9 5 2 6 -3 -4 2 -8 9 10 4 -3 15 -2 5 16 7 11 -5 -3 11
5474 11 10 3 -2 -3 15 3 -3 7 9 -11 3 15 7 4 -2 22 1 -1 2 16 6 -10 -2 -4 8 3 9 3 -5 -9 15 13 3 5 24 4 -12 -3 13 17 0
$$ packed form
5139CNPk7NK2rqJNkJlRjrmPJ4mj7MokK2Joj1kJ1Pj0J0oj3nJ6N%%j3%pJ1kJ3k8
5185a6J5Jj9J2PPj7KPJ0KmKPj0NkLj3MmJ5Mj7Lj8J2J2j2POj3J0lkkKkk%OjJj1
5229fkPLLkrJ3r%OKj7NP%%Jjj7jmMK0kJ%mOMlomJ0LJLj7RKKQ%k2KJ1QllNkon%
5282ANrJ1j1KJ2ll%oj1J7lNj2j4J6J0lLk0PnQPoJ3jj3NJ0pKln%RLjj1jMRlMkr
5329AMqJ4Pj9Np%rJ9j3OQpP%mpj1J5mRljLj2J6lojoOMOo%mMoJ8pojNNj4J3%qq
5379fKJ5lLr%jQQOj7j0PlRmNmlkmOLrLJ2pj1RqJoQPj3KjJ2pkkqmOJ2rMqJ3KrR
5431BJ%Jj2NJJ3nmj5QK2Kj7mmJ2oJ8kk1J7k1J4lMrjOj0J7JopJ8j7PJ1rMj6KJ4
5474A1jpnjJ8j2oJ0Kk0J4J2qloK4k1kLJ4j0j6QkJ2nOoqmK4kj0KJ9k0j6RJ6Mj7
$$ plain form
5515 0 2 7 7 -11 16 6 -3 -11 18 4 1 -12 3 8 6 16 1 20 4 9 16 7 0 -2 10 4 1 10 26 12 -14 -12 10 1 -7 6 17 6 -12 -1
5555 -1 9 0 -11 -2 13 -2 -7 3 5 8 -9 19 9 -5 2 10 9 5 4 9 17 -20 -10 14 5 -7 0 11 0 -2 2 27 -5 -9 2 7 2 -6 20 11 6 -6
5597 -6 -1 13 1 3 8 10 -18 2 18 13 -1 3 6 13 -4 3 10 -9 -11 19 13 -10 -10 0 12 5 -1 5 12 -6 -5 9 24 7 2 -5 -3 -8 10 16 18 -11 -3
5640 -3 0 10 -1 11 10 0 -19 -10 19 -3 -18 -9 -5 -6 -20 1 19 -13 -9 -1 9 -2 8 7 2 -10 -9 3 10 -18 -10 9 12 -12 1 14 -4 -18
5678 -18 10 18 4 -17 -14 21 8 6 18 17 -8 -18 0 16 -5 -6 11 6 -11 -3 23 22 -2 -8 5 -6 3 2 21 14 -12 -8 7 18 -1 -2 11
5715 11 9 -14 -1 6 -14 -5 2 9 -2 -13 -8 4 -12 -4 12 -1 1 6 14 10 -4 -17 10 -3 -12 2 -3 6 -2 -8 3 -7 -18 2 12 -11 -4 -7 5
5754 5 4 -6 10 11 -12 -8 7 7 -5 -6 14 11 0 -9 5 0 4 -2 11 7 1 -1 7 0 -10 9 6 -14 -7 -1 2 -2 -2 0 9 0 -8 2 6 -8 -9 -6 2 -9 5
5799 5 5 2 -20 -5 7 -3 5 -4 1 1 9 2 -8 8 -6 -4 5 -13 -19 -3 -5 2 -9 7 3 -9 -11 -11 4 -7 6 16 -4 4 4 5 12 -3 -9 -4 -4 -11 -18
$$ packed form
5515@KN%j8K7j0rqK9j4lj3J5NkJ0j5J9j6NPrpkJ2olRJ6j4k6KK2rqJ3J1j1j8J1
5555aJ0rj1RJ5j5nJ0KLj7K8j0j4PQjmjNQl7J0K4rj2PJ1j1kMK5l2mJ1NnqK6rnj2
5597fNJ4j2KNKk8K0J6nj4MLPj7PPj9kL0ok3%J0J2poOPj8JJ4J5j7npKnJ8OKk9Q
5640cLJ0j1J2jj0j9RK9k2j5RMjj4K1J8l2MQJ0j1J0jnj2JJ2Pk8QJ9Lk4J3J3j8j4
5678a8K8Qj4k1LL5j3kJ2jk5j0J8J6k1jJ7nj7QK6jk4oJ3j1RjJ9pk6MJ5J1j9jJ3
5715A1kk3J3Pk0RPPj1j1NJ2j6QJ6j3KNQmj4j3K7j3rJ4nRqoJ1j0j1K0J0k3PlJ2
5754Ejj0J6Jk3MJ5%j2jK0lj1rJ4nMoJ3mokQpj0J9lk0POLm%KRrqJ0Mj4jLQj1J4
5799E%lk2J5J2j0QrN%Qpj0J6j4KRj8oJ6kPj1J6mj2k%J5j1J3J0k0Q%JPj5oN%pp
$$ plain form
5842 -18 -5 -4 -21 -14 -7 -6 -5 0 -8 -9 -14 3 -1 -4 -7 -10 -6 -3 6 -7 -6 -5 -7 8 4 -10 8 2 1 -6 15 -12 4 -2 -3 1 13 2 -12 3 9 -12 -3 15
5886 15 -4 -5 7 12 0 12 -7 2 -9 -3 4 -3 9 6 -10 -2 -10 3 8 3 -5 -13 -6 5 -7 -13 -3 -2 -1 -6 -12 1 -20 -15 1 0 2 -2 -3 -13 0 0 -2
5929 -2 -1 -13 -15 2 -5 -2 11 -8 2 0 0 9 4 1 0 -17 -11 5 -2 -2 -5 -9 -6 4 -7 -2 -6 -9 -12 -6 -5 -12 -5 -11 -9 -10 -2 3 -2 -3 -19 -2 5 -3 -2 -2 -8 1 -3 2
5979 2 -11 -12 -7 -11 -4 7 1 -3 8 -5 -2 3 3 -3 -4 -4 4 14 0 -1 -1 -3 -5 11 10 7 2 -8 -6 4 4 15 3 -6 -7 -6 1 -1 1 -16 -8 -9 -8 -10 -3 -1 -11 -6
6027 -6 -1 -6 1 -14 -7 -6 -1 -3 -3 -6 -4 -13 3 12 6 -9 -9 -13 0 -10 -3 8 -11 1 -15 6 -4 -16 5 0 1 5 2 0 -3 2 -4 11 5 1 11 11 -1 10
6071 10 -5 12 -14 -9 -3 -4 -1 -1 -4 -21 -14 -8 -3 -6 13 -5 2 -1 0 11 -9 -3 -7 12 10 10 4 -6 -3 1 14 9 4 -1 -4 0 7 3 10 5 6 -4 0 3 -2 2 2 -2
6119 -2 2 7 0 1 4 -12 -6 -4 -2 -5 -9 4 -1 -3 7 -5 -10 -14 -1 -15 0 1 0 -9 -8 2 -2 -7 -2 1 -9 -7 -3 -4 0 -8 -17 4 7 1 10 0 6 2 19 9 16 3
6167 3 11 3 -5 -1 16 8 -8 -4 3 11 7 6 12 -1 -8 7 8 4 14 -5 2 4 -6 -2 -5 -6 -10 10 7 -2 -3 5 -4 -2 -2 -2 1 8 -1 4 15 1 4 2 -5 -21 -5 0 -5
$$ packed form
5842a8J3Jj7PPJJNqjnJ7mlllMLRj3JJkJ5mj4J8ojpK1k7J6ojMJ2j1j4J5Ok1RJ8
5886A5j9jJ2Nj2J2j9Rj1OPpJ2lj6QqJ3NnqqPJ1j2oJ0JJnoJ3k1NJ6jKmjj0J3%k
5929bJj2kJ7pLJ3j9J0k%Rnljj7OJ6p%lmLJ0j1NmllOJpPoKjQNnjj6J7PqJ%oRmN
5979Bj3jNmPJ1omJ1j3LN%oj%QJ0j4j%kkJ6jlnj0KJ0%J1j2rjJPkKj7QjJkPKj0N
6027fNnPj5PJNk%lKrJ6Roj5%mJ3j0PJ1j9J2j6K1j0j2K1nJMlklNoJ5omJ0%j2J1
6071A0j5J7k6NOjL%lj7PONlJ9j8PlJJ1k0OmJ9k%oj0LMJ3nnnlMPmPnJj0MLnM%m
6119bMNpJLj6OKKlmJ3nkJ0j2nmJ3j4J5JjrJJ0mnNLj0KMjMqrK1LoRj0OmJ7j0Pj3
6167CQqqMJ7qj6MPQmjOj3pJ5JmJ0j9PKj0MljmK0lrjQrK%%LPrNJ1j4Lkpj6J6Nn
$$ plain form
6216 -5 -12 -4 2 6 7 5 8 5 -10 -9 15 0 4 4 1 -5 -1 12 15 -2 -6 0 9 -3 -9 4 -8 4 -14 -6 -7 -10 -11 -4 -11 -12 -3 3 -1 -6 -5 9 3 -12 11 -6 3
6263 3 -6 3 1 1 -3 -7 7 11 12 6 -8 -18 -8 -2 8 -1 -8 -1 2 -4 2 5 8 0 -6 3 -4 9 8 7 10 -6 2 8 -6 -10 -1 9 -5 -1 4 0 -16 -8 -2 -7 -10 1 -5
6312 -5 -5 -12 0 0 6 -24 -8 3 7 -3 6 -3 -8 -32 -9 16 -6 -11 1 -10 -14 -5 0 -5 -7 -7 -8 -1 -14 -3 7 4 -4 -1 1 -6 -11 -7 17 2 -2 -10 12 11
6356 11 2 0 7 -5 -13 -6 7 3 -1 15 11 6 -2 -3 8 -9 -8 0 -10 -7 6 -4 8 -6 -18 -1 1 -14 -2 2 5 -1 -5 8 2 1 -2 8 -2 -6 -8 4
6398 4 -1 2 13 5 10 0 -14 12 6 0 12 2 -10 -1 11 12 -2 -6 2 -20 -8 -4 -1 -3 -3 5 6 -13 -4 -2 14 -7 -14 -9 -2 2 -10 2 2 -10 -6 -4 0 -13
6442 -13 -17 -7 -9 -26 -12 -5 -4 -12 -7 6 -5 1 0 19 1 -11 -6 -9 -8 -8 4 3 -12 -12 -1 1 -12 0 -7 10 -3 0 4 7 4 -2 0 -6 -2 -10 6 -1 -15
6485 -15 5 -6 4 -7 -9 -1 -4 -6 -11 3 4 -1 2 1 -2 -2 -1 -6 -7 -1 -5 9 -2 -2 -9 -4 -7 -13 9 -7 -11 -18 -10 -10 6 -9 -2 -10 -6 -13 3 8 -8 -7 -1 -11
6531 -11 0 1 2 -14 -24 -4 -9 -11 -17 0 -5 -7 -5 -3 -11 -6 -9 -5 -2 0 -11 -9 -8 1 -7 -9 3 -21 3 -3 -16 -2 -16 -10 0 -5 -4 -3 1 -7 -8 -4 -13 6 -1 -10
$$ packed form
6216epQOMJkLlj5JK4j5M%loMJ3Lj7mORj2oJ3j2J2j8QjljPpjROmnJJ4oj5K3j7R
6263CrRk%mmJ4MJoj4j0J0OJ0rpPLoOLLqoRpJ3jjLj6QOj4mRJ0j4MNmj6QOnlJ1o
6312e%pJ2%Ol0J6J1Mj0Rrnk4K3K5k2nJ2j1mRNnk%jPj3J1J0lqLKpnMK4j5mqK2j
6356A1rkPj2qPJ3mmJ6mnqjJ1j7JQj0LJ3j0J2j4j2J7Kj5J2MLomJ3ojlJ0j0mkJ2
6398DnLJ1qNj0j4K6ooJ2j0j2RJ2Jj4mQk2J2MLk%QJj9RKJ6k1pNPMj2J2%j2MKMj3
6442a3mJ0kj7J4PJqNJ3j1OjJ9j8j2NlJ%J2jj5%J1Kj3J2pJ7j3LMLloKoMqJ6pj4
6485a5K0j1J0j1kQlknJ4JnLjl%JnjOmJ4j1%pNloK2j6mpQ%J6j5PqMpJ6Nj6JOj0
6531a1J1JJj6j0K0nkoJ7nkKKqNlMLKj1KJRqkJ2k4K4oj3J4j4OJ0nJJMqjMrJ9pr
$$ plain form
6577 -10 -11 -9 5 -3 -1 0 2 0 -11 -11 0 -6 -1 -9 -3 2 -1 -11 11 -1 -4 0 10 2 -4 7 -5 0 -2 7 -8 -11 3 1 -6 -7 -5 -5 -12 -3 -13 -16 -9 -13 -15 -12 -6 -3
6625 -3 -9 -5 -23 -21 -7 -10 -9 -8 -10 -9 -19 -3 -3 -9 -14 -3 -12 -6 -9 -3 0 -11 -15 -1 11 6 6 1 -5 1 0 3 -3 10 -6 -2 6 1 1 -7 1 -8 -8 -3 -14 -3 -8 -14 -7
6674 -7 -5 -5 -12 -7 -18 -3 -10 -6 -5 -15 -5 -15 -4 -4 -11 -7 -7 -4 -4 10 -5 -10 0 3 -2 2 -3 2 0 0 -8 4 3 10 7 -7 -13 5 -6 0 -1 1 15 1 -5 6
6720 6 -2 -10 -3 1 10 7 -6 -4 8 -1 7 9 9 -4 -6 -9 -7 -21 7 0 -9 -4 -9 -3 -8 -2 -11 -3 -4 -2 0 -9 -19 -3 -7 0 1 -7 -6 -1 5 12 9 -5 -11 7 4 2 6 -5 11
6771 11 3 2 7 14 14 7 3 -6 1 3 6 -4 0 3 1 4 11 -5 -3 -2 -4 -4 0 -3 -7 -7 -1 -5 0 -11 8 -6 -7 -8 -8 -3 -11 -8 -14 1 -13 7 1 -7 -9 1 -11 -2 2 0
6821 0 -7 2 -1 0 4 -2 -7 -3 2 7 10 6 -9 -9 1 4 -3 -1 -6 3 -9 1 -1 3 -5 -5 -5 -9 -5 -5 -3 -3 -4 -7 -1 -5 -4 11 -8 -2 -7 -5 -1 -8 -9 -5 -3 -3 -8 -3 2 -4 -7 5
6875 5 -2 -15 -11 -9 -12 -10 5 -4 -13 -2 5 12 12 9 9 14 -3 17 -2 2 19 -5 2 7 8 4 3 -1 6 1 1 6 3 7 9 7 -1 -9 -4 0 -2 3 -7 5 -4 -7 -1 7 3 1 -3
6926 -3 -15 -3 -5 -1 1 -8 2 -3 -9 -8 7 -7 -10 5 0 -1 3 -1 -4 -9 -5 -13 12 -4 0 7 -1 2 -2 5 6 -3 5 9 -6 0 6 16 -1 4 1 1 -5 4 13 12 9 -9 0
$$ packed form
6577a0jKJ4qKJKkj1%J1oNqONlj0K2j2lMJ0qoJ1j2NkRj5lJ4kpjK%pRj0lPmkLOL
6625coMj8KJ4lJJkJj0J6%onJ1rOlOLj1mJ4J2n%noOjLoJ3j6MQn%qQr%Nj1J1noP
6674gK%pNj1J5pMJj0J0j0J1%pM%L%J4j5nJ0LnMnNk%qJ2jPlj4oJ8j1OjKJ4j4oJ1
6720FqqPMRlj3KJ2rQK%j3klKj4K8prNnOnOrQjKKrj0J6mPJqJNOPlj4oJ8lkMj1J6
6771A1qjNP%pmrPKLj0MLkLPj6KJk%Mlm%OmNj1J9j4jj%NqLoJ5j4K0oqkJ0j2RMk
6821@pRlJMonMNNLmj5%J0LpKnRj2J0kMq%%mM%K%jlOmJJ5j9OnKMpjMK%nNNolJ2
6875Epj3MKlKJ5rrJ1PP%l%Nj7K0j9MJ7k4PNJmjmPn%NlMKkqqNMkNj0J2rlOQmkm
6926cj2J2kMKrJ0noJJ5j4lJ5njMmlnMqK5j6MPqLmPJrQMj5OOJ0j7Nl%oRRjlj8R
$$ plain form
6975 0 -6 -10 -11 -3 -1 0 -1 -3 -1 -2 -3 11 -1 -7 -17 6 15 -4 3 -6 7 -17 -4 5 -1 5 -11 -8 -4 -9 6 -6 -5 -12 2 16 5 -11 7 -6 0 -7 4
7018 4 12 -6 -7 3 5 0 -3 -1 7 -11 4 8 4 -8 -1 -9 -1 -8 1 11 -14 -10 1 -6 -7 -9 3 4 -2 -11 5 -2 2 -15 -5 2 1 -13 9 3 -15 1 11 8
7062 8 -4 -3 -4 2 4 -7 -2 8 6 4 18 -1 -9 -2 15 8 -4 7 -3 7 -8 8 7 -1 -7 6 1 -5 2 12 8 5 0 7 0 -8 3 -3 -8 -5 -13 -13 9 -5
7106 -5 -3 9 -9 -4 0 -3 1 -5 7 2 0 3 -9 4 -7 -4 0 18 2 9 -3 -13 -2 12 13 -9 -12 14 4 2 2 3 -9 -11 -5 -5 7 5 -2 -5 -6 -13 2
7149 2 -4 6 -7 -1 -6 -14 -4 1 -10 -7 -7 -7 9 -5 -3 -6 3 6 -10 -4 -9 -12 4 -2 2 -2 -4 3 -9 0 -6 -6 -6 -3 2 -7 7 11 -2 -6 -9 4 -10 2 5 10 16
7196 16 5 11 13 -6 0 -6 6 5 11 -5 -2 3 5 -10 -6 -7 4 -15 -6 6 -12 -9 -17 -3 -7 -11 -7 -11 4 -1 -3 -2 -7 3 -6 4 -8 2 -1 2 -4 -13 3 -3
7240 -3 2 7 7 -2 -3 -1 9 13 3 4 7 -1 3 -4 10 6 3 7 13 14 2 8 -2 4 -2 10 -1 0 -4 -2 7 12 0 -6 -13 -6 -7 -2 -10 -8 0 1 0 -14 4 3 -7 3 1
7289 1 7 -4 -6 -14 11 8 -1 -1 12 3 -1 -6 -2 4 -4 7 4 0 4 3 9 5 -7 10 7 -4 4 -6 -11 1 -9 3 4 -1 -3 4 4 7 6 8 1 1 8 1 3 -7 1 1 -2
$$ packed form
6975@omjQKJjkKjjJ4j2oj0K3Rj9PrJ3k4J3RoOj6LMnJ5j2JpJ4J4j1j6J8j3OpJ1
7018DQj8jJ0KnlKQj8J5Mmj2PqQpRJ0k5MJ1pjkJ2JorJ6pMj7J0Pjj4K2oj8J6J0l
7062Hj2JjOKj1NJ0kkJ4j9qPJ7pj2J1j0J0j5J6jqoJ3noPJ0mlnPpqJ1onLq%K2j4
7106eKJ2j8NMlMoJ2nkLj2J3j1LMJ8j6Pj2j0J1J4Jk2lK6j0k%Jj2kO%J2kpljpJ5
7149BoJ0j3OnqJ0Nj1L%%J6j4KlRLj6OnlJ6oMmkPj2Ro%%LNrJ4Mj3mlJ3j4J2LNO
7196A6j1OKj9OoJ2jOj6LNKj5MjJ1j9RJ2j8LqJ4mmMmJ5nkJnJ0rJ0j2J0lLorJ6o
7240cNN%rjKJ0Mj0JLqMpJ4mlMOJj2Oj0OoJ2j1JmKRNj2opPjNqKQJjj4J8jj0J0k
7289AOj1kqK5lr%J3rmnMOqJ1lmMjOmj2J7lj1Qj0nJ2j0J2JnkP%LjKp%PpKj0Q%l
$$ plain form
7338 -2 -6 -8 -9 2 -7 0 -11 7 2 -3 -3 -3 -1 0 9 10 -2 -1 -4 2 4 -2 9 5 9 4 7 15 9 16 14 3 5 8 1 -2 3 -5 1 7 13 -5 5 -12 -9 6 4 6 15 2
7388 2 -6 2 9 -3 2 9 4 14 -1 5 0 14 9 0 -2 -2 6 7 4 7 8 8 0 -8 11 5 4 -1 11 2 2 8 3 2 10 1 9 13 5 20 7 17 15 3 8 8 10 7 6 -2 -9
7439 -9 -6 -2 7 4 5 -6 3 9 6 -10 -4 6 -5 4 6 5 -5 -4 8 -9 -6 -1 4 -4 -4 19 -5 0 9 3 1 -2 3 6 9 -8 -3 -1 0 7 5 -3 -2 17 -3 -6 2 20
7487 20 7 9 2 5 16 1 7 7 12 13 3 2 8 6 8 11 1 3 7 15 -1 2 4 -8 -1 -13 -11 1 -5 5 7 -1 4 -11 6 -5 0 -3 -5 4 -9 -2 3 -7 -13
7532 -13 -10 -5 -2 3 -2 -7 19 3 -7 -2 6 5 -6 6 3 9 9 7 9 7 2 10 6 12 5 10 2 12 16 8 0 -3 7 11 0 7 21 6 9 13 12 -2 -4 -4 -7 -7 5 -4
7580 -4 -3 -1 5 -6 -2 -3 -1 -1 0 -4 -4 -2 1 4 -3 -3 4 8 -9 0 1 10 7 5 -8 0 -7 5 19 -3 0 10 1 1 0 6 4 2 -1 6 -1 5 -6 -7 -4 -6 -6 -3 5 -2 12 -5
7632 -5 -1 -6 10 -1 -3 -4 16 3 -11 -4 -8 -15 -7 0 -15 0 -16 7 -6 -4 -8 -8 -2 -14 -2 2 -3 -3 -4 1 6 -2 -1 18 3 -1 3 10 13 -7 6 -5 -9 11
7676 11 -1 7 12 15 6 9 10 -1 11 9 12 7 18 12 5 -4 7 5 4 9 -4 2 -4 -1 -1 2 -4 -8 9 -13 1 -18 2 -1 -12 -5 -13 -1 -5 -3 -3 2 -1 14 13 8
$$ packed form
7338bmkjJ1rPj1J8nn%%KJRJj2JlOKoJ1mMnLQoPkj1KLplNqOOOj8J0j7LJ5kKRj3
7388BqQPj2NPnJ0j5OnJ4nrk%QJlLJ%qqJ9ojnJ2r%OnjQrQMqJ5j3J0kj2N%Kljqp
7439iLMRlJj1ROlj6OJ0j1RKjj0JJ2j7LNNq%K3k4NRoklNLLj7NKJPkqJJ9k0lQJ8
7487B0j3KpLJ1j5O%NJj0jOkKLj0KMQj6LKj2Pj2KJ2oJ0KqNj5J7j1NlkRj3PNj0o
7532a3LNLNnnK6j6j0NQjj1J2lO%kKknQmOpNqJ0MqqlJ0Mj1PJ4j5LMjj4k%l%J2r
7580dJKOj1MjK%Jm%KLLp%PMj7RJRlkj3QpJ2J4k2LJ0r%jOkklPpOj1jLk%LQpJ4j7
7632eMnJ6j1kjK0j3j4PmpQPj5J5j6K3j3Km%Oj2J2Mn%jNNqJJ9j5mMPLk0J3j1mK0
7676A1j2QNLrLJj1J2kLnJ1oprJ1kjNj3OoL%LomJ7k2J4j9K0lj1PqJ2mK%NlJ5jn
$$ plain form
7722 8 -1 6 3 14 3 -5 7 12 0 15 2 0 -4 -8 8 -13 7 6 7 9 0 4 -16 2 5 7 15 -4 3 6 5 10 -6 13 3 0 13 2 -4 -16 6 1
7764 1 -3 5 2 1 2 -10 -4 5 2 1 -11 1 -4 7 2 3 -9 3 -3 -2 6 3 4 7 -2 11 10 -8 2 3 4 3 9 10 5 9 10 2 -2 -11 -3 7 12 5 13 8 4 -6 4
7813 4 1 11 -4 -6 10 4 -10 -2 -5 3 -9 -6 0 -4 -5 9 -5 -6 2 -13 -2 6 -11 6 -7 -2 -1 0 -10 -1 -1 17 -2 0 5 7 8 -3 12 5 6 -1 8 2
7857 2 5 -11 7 17 4 -2 7 9 -4 -4 6 9 6 1 9 3 2 -5 2 -4 -1 -9 -3 -2 -6 18 3 -4 3 13 2 8 8 14 3 -5 1 11 7 -3 -1 -1 6 10 9 -10 4
7904 4 0 0 13 -3 2 7 6 -5 10 8 -3 -1 -15 3 14 -4 3 -6 12 8 2 1 10 6 0 1 -3 5 7 2 3 3 -2 1 -17 1 9 -2 -2 -6 -19 -1 0 -4 -2 -2
7950 -2 -12 -4 4 0 -8 -17 -5 -4 -9 -4 2 1 -7 -2 7 -2 16 5 3 5 5 -2 -2 4 9 2 2 10 -10 -2 4 -5 0 3 10 12 0 11 7 -2 10 8 1 -6 -1 -7 13 2 -8 1
8000 1 5 3 -1 -1 -1 -6 3 1 -21 -2 -2 -7 6 -7 -2 -8 -2 -3 -9 5 5 -6 -8 1 2 4 2 4 -2 4 5 -5 9 4 8 7 5 8 0 -2 -5 -5 5 0 5 5 -3 2 -3 8 7
8051 7 -2 0 -1 -12 6 4 -6 9 -6 10 6 5 7 8 -1 0 -1 0 9 -1 -8 -3 -10 10 -8 -6 -15 -1 14 8 7 8 -6 6 -6 -14 6 9 6 0 1 -6 3 21 -1
$$ packed form
7722HrPlJ1j1qJ2Nj2J5j3kmmJ6k1K0jJKrMk0J8LKQj9PLjNj6J9j0lJ3j1oj2K2n
7764AmQljJj2ORljj2J2nJ1nJj2J2oJQlJLrJ3jj8J0JJjOJnMJqmrQJ0NpQnmj0J0
7813DlJ0j5kJ6oj4QlQj2LOmjJ4j4jQj5J1Qj7J7j3NJJj0R%J8j9KNKJj1J5pJpRo
7857BLj6J8J0j3oRKj3%J0LlnQojpPoLqOJmK4j5pPJ0j1O%Oj1qOJ0mj0K%PMjj9J4
7904Dm%J3j6NNjj1J5kj1Kj4J8J1j8PrJ8mojRmoJmQKnJ%nLj8J8Qj1%mj3J8JmK%
7950bj0QQmqrJ2JnNOjqNRrJ8j1kK%p%ONp%Qk0QOrNLPKj2J1mrJ2kppNoK0j1j0R
8000AMkm%%nRkk2J9%nJ3j3NoOjoJ4%j1kRJKkKoOJj0J4nMjkLqkl%J0nN%qNnJ1j
8051GrKjj1J8kj0J5j5J6mjKJrJjJRj0pNpK0j8KrJ4J5ojJj4J2j2qK0LloJpRJ8k2
$$ plain form
8096 -1 -10 -2 4 5 11 8 -1 -5 -6 10 -1 -7 -11 -3 5 -2 3 -13 -2 -4 -5 1 -8 -7 -7 -18 -7 5 -4 -5 -3 -15 7 -7 4 2 -2 0 -13 -5 -11 -11 -6 -4 -6 -13 -6 -1 -4
8145 -4 -2 -7 0 -2 -7 -1 -8 -5 9 -10 -4 5 -7 1 8 0 8 3 7 5 -7 8 4 -2 -5 1 3 -1 6 -1 2 -7 6 2 -20 -3 -1 -6 -6 -4 -13 3 -12 1 -18 0
$$ packed form
8096arQOJOlrmjJ6j1omQQpNj6J1kjOrJ%j1J1J2rjKj2K2j4J1kmKj3Qo%NKkpPNl
8145dKnPknOpLJ4j9ORj2QPqQnMkj2J5molOKmPpLrJ3mk2J7Kn%KrJ6j5J3j9J8
8191@
##END NTUPLES=NMR FID
##END=
