##TITLE=1H_AM A501.B
 CDCl3, 8 sc, 
 26.7.2019
##JCAMPDX= 6.0         $$ Bruker NMR JCAMP-DX V2.0
##DATA TYPE= NMR FID
##DATA CLASS= NTUPLES
##ORIGIN= UXNMR, Bruker Analytische Messtechnik GmbH
##OWNER= root
$$ XWIN-NMR		Version 3.5
$$ Fri Jul 26 14:37:43 2019 Russian Standard Time (UT+4h)  she@DPX200
##.OBSERVE FREQUENCY= 200.13155
##.OBSERVE NUCLEUS= ^1H
##.DELAY= (6, 6)
##.ACQUISITION MODE= SIMULTANEOUS
##.ACQUISITION SCHEME= undefined
##.AVERAGES= 8
##.DIGITISER RES= 18
##SPECTROMETER/DATA SYSTEM= spect
##.PULSE SEQUENCE= zg30
##.SOLVENT NAME= CDCl3
##.SHIFT REFERENCE= (INTERNAL, CDCl3, 0, 15.7039)
##AUDIT TRAIL= $$ (NUMBER, WHEN, WHO, WHERE, WHAT)
$$ ##TITLE= Audit trail, XWIN-NMR		Version 3.5
$$ ##JCAMPDX= 5.01
$$ ##ORIGIN= Bruker BioSpin GmbH
$$ ##OWNER= she
$$ F:/spectra/data/she/nmr/H-F/1/audita.txt
$$ ##AUDIT TRAIL=  $$ (NUMBER, WHEN, WHO, WHERE, WHAT)
(   1,<2019-07-26 14:36:40.81 +0400>,<she>,<DPX200>,
      <created by zg, POWCHK disabled, PULCHK disabled
       configuration hash MD5:
       00 E9 B6 7A A2 85 ED C7 34 08 36 98 17 FE 4E 26
       data hash MD5: 16K
       86 23 ED 47 D0 F2 88 B5 90 73 4E 9F F2 C5 E7 9D>)
$$ ##END=
$$ 
$$ hash MD5
$$ 93 B9 A0 C6 D0 C0 BB EC BE 70 86 0B 5B 20 E7 48
##$RELAX= 
##$RELAX= 
##$RELAX= 
##$RELAX= 
##$RELAX= 
##$RELAX= 
$$ Bruker specific parameters
$$ --------------------------
##$DU= <F:/spectra>
##$EXPNO= 1
##$NAME= <H-F>
##$PROCNO= 1
##$TYPE= <nmr>
##$USER= <she>
##$AMP= (0..31)
100 100 100 100 100 100 100 100 100 100 100 100 100 100 100 100 100 100 
100 100 100 100 100 100 100 100 100 100 100 100 100 100 
##$AQSEQ= 0
##$AQ_mod= 1
##$AUNM= <au_zg>
##$AUTOPOS= <>
##$BF1= 200.13
##$BF2= 200.13
##$BF3= 200.13
##$BF4= 200.13
##$BF5= 200.13
##$BF6= 200.13
##$BF7= 200.13
##$BF8= 200.13
##$BYTORDA= 1
##$CFDGTYP= 0
##$CFRGTYP= 5
##$CHEMSTR= <none>
##$CNST= (0..31)
1 1 145 1 1 1 1 1 1 1 1 1 1 1 1 1 1 1 1 1 1 1 1 1 1 1 1 1 1 1 1 1 
##$CPDPRG= <>
##$CPDPRG1= <>
##$CPDPRG2= <>
##$CPDPRG3= <>
##$CPDPRG4= <mlev>
##$CPDPRG5= <mlev>
##$CPDPRG6= <mlev>
##$CPDPRG7= <mlev>
##$CPDPRG8= <mlev>
##$CPDPRGB= <>
##$CPDPRGT= <>
##$D= (0..31)
0 1.2 0 0 0 0 0 0 0 0 0 0.03 0 0 0 0 0 0 0 0 0 0 0 0 0 0 0 0 0 0 0 0 
##$DATE= 1564137399
##$DBL= (0..7)
120 120 120 120 120 120 120 120 
##$DBP= (0..7)
150 150 150 150 150 150 150 150 
##$DBP07= 0
##$DBPNAM0= <>
##$DBPNAM1= <>
##$DBPNAM2= <>
##$DBPNAM3= <>
##$DBPNAM4= <>
##$DBPNAM5= <>
##$DBPNAM6= <>
##$DBPNAM7= <>
##$DBPOAL= (0..7)
0.5 0.5 0.5 0.5 0.5 0.5 0.5 0.5 
##$DBPOFFS= (0..7)
0 0 0 0 0 0 0 0 
##$DE= 6
##$DECBNUC= <off>
##$DECIM= 24
##$DECNUC= <off>
##$DECSTAT= 4
##$DIGMOD= 1
##$DIGTYP= 9
##$DL= (0..7)
0 120 120 120 120 120 120 120 
##$DP= (0..7)
150 150 150 150 150 150 150 150 
##$DP07= 0
##$DPNAME0= <>
##$DPNAME1= <>
##$DPNAME2= <>
##$DPNAME3= <>
##$DPNAME4= <>
##$DPNAME5= <>
##$DPNAME6= <>
##$DPNAME7= <>
##$DPOAL= (0..7)
0.5 0.5 0.5 0.5 0.5 0.5 0.5 0.5 
##$DPOFFS= (0..7)
0 0 0 0 0 0 0 0 
##$DQDMODE= 0
##$DR= 18
##$DS= 0
##$DSLIST= <SSSSSSSSSSSSSSS>
##$DSPFIRM= 0
$$ [...]
##$SUBNAM2= <"">
##$SUBNAM3= <"">
##$SUBNAM4= <"">
##$SUBNAM5= <"">
##$SUBNAM6= <"">
##$SUBNAM7= <"">
##$SUBNAM8= <"">
##$SUBNAM9= <"">
##$SW= 24.9336996594482
##$SWIBOX= (0..15)
0 0 2 0 0 0 0 0 0 0 0 0 0 0 0 0 
##$SW_h= 4990.01996007984
##$TD= 16384
##$TD0= 1
##$TE= 0
##$TE2= 300
##$TE3= 300
##$TEG= 300
##$TL= (0..7)
0 120 120 120 120 120 120 120 
##$TP= (0..7)
150 150 150 150 150 150 150 150 
##$TP07= 0
##$TPNAME0= <>
##$TPNAME1= <>
##$TPNAME2= <>
##$TPNAME3= <>
##$TPNAME4= <>
##$TPNAME5= <>
##$TPNAME6= <>
##$TPNAME7= <>
##$TPOAL= (0..7)
0.5 0.5 0.5 0.5 0.5 0.5 0.5 0.5 
##$TPOFFS= (0..7)
0 0 0 0 0 0 0 0 
##$TUNHIN= 0
##$TUNHOUT= 0
##$TUNXOUT= 0
##$USERA1= <user>
##$USERA2= <user>
##$USERA3= <user>
##$USERA4= <user>
##$USERA5= <user>
##$V9= 5
##$VALIST= <valist>
##$VCLIST= <CCCCCCCCCCCCCCC>
##$VD= 0
##$VDLIST= <DDDDDDDDDDDDDDD>
##$VPLIST= <PPPPPPPPPPPPPPP>
##$VTLIST= <TTTTTTTTTTTTTTT>
##$WBST= 1024
##$WBSW= 4
##$XGAIN= (0..3)
0 0 0 0 
##$XL= 0
##$YL= 0
##$YMAX_a= 11630
##$YMIN_a= -10372
##$ZGOPTNS= <>
##$ZL1= 120
##$ZL2= 120
##$ZL3= 120
##$ZL4= 120
##$ABSF1= 10
##$ABSF2= 0
##$ABSG= 5
##$ABSL= 3
##$ALPHA= 0
##$AQORDER= 0
##$ASSFAC= 0
##$ASSFACI= 0
##$ASSFACX= 0
##$ASSWID= 0
##$AUNMP= <proc_1d>
##$AZFE= 0.1
##$AZFW= 0.1
##$BCFW= 1
##$BC_mod= 2
##$BYTORDP= 1
##$COROFFS= 0
##$CY= 11.3945322036743
##$DATMOD= 1
##$DC= 2
##$DFILT= <>
##$DTYPP= 0
##$F1P= 20.1537800932815
##$F2P= 0.134698688090026
##$FCOR= 0.5
##$FTSIZE= 0
##$FT_mod= 4
##$GAMMA= 1
##$GB= 0.15
##$INTBC= 1
##$INTSCL= 1
##$ISEN= 128
##$LB= 0.24
##$LEV0= 0
##$LPBIN= 0
##$MAXI= 10000
##$MC2= 0
##$MEAN= 0
##$ME_mod= 0
##$MI= 1.114404
##$NCOEF= 0
##$NC_proc= 0
##$NLEV= 6
##$NOISF1= 3.799351
##$NOISF2= 2.8
##$NSP= 1
##$NTH_PI= 0
##$NZP= 0
##$OFFSET= 15.70392
##$PC= 1
##$PHC0= -9127.173
##$PHC1= 5.000969
##$PH_mod= 1
##$PKNL= yes
##$PPARMOD= 0
##$PSCAL= 0
##$PSIGN= 0
##$REVERSE= no
##$SF= 200.130013532006
##$SI= 16384
##$SIGF1= 3
##$SIGF2= 2
##$SINO= 400
##$SIOLD= 16384
##$SREGLST= <1H.CDCl3>
##$SSB= 0
##$STSI= 0
##$STSR= 0
##$SW_p= 3612.71676300578
##$SYMM= 0
##$S_DEV= 0
##$TDeff= 0
##$TDoff= 0
##$TI= <>
##$TILT= no
##$TM1= 0
##$TM2= 0
##$TOPLEV= 0
##$USERP1= <user>
##$USERP2= <user>
##$USERP3= <user>
##$USERP4= <user>
##$USERP5= <user>
##$WDW= 1
##$XDIM= 8192
##$YMAX_p= 0
##$YMIN_p= 0
$$ End of Bruker specific parameters
$$ ---------------------------------
##NTUPLES= NMR FID
##VAR_NAME=  TIME,          FID/REAL,        FID/IMAG
##SYMBOL=    X,             R,               I
##VAR_TYPE=  INDEPENDENT,   DEPENDENT,       DEPENDENT
##VAR_FORM=  AFFN,          ASDF,            ASDF
##VAR_DIM=   8192,          8192,            8192
##UNITS=     SECONDS,       ARBITRARY UNITS, ARBITRARY UNITS
##FACTOR=    0.0002004,     1,               1
##FIRST=     0,             0,               0
##LAST=      1.6414764,     0,               0
##MIN=       0,             -10372,          0
##MAX=       1.6414764,     11630,           0
$$ Real data points
##PAGE= N=1
##DATA TABLE= (X++(R..R)), XYDATA
0@%%%%%%%%%%%%%%%%%%%%%%%lRj4J6j6J6j6J6j6J9k5L0l2L3l7M2m6N1n6O2p0P8
45D1q6R5j06J19j33J49j70J94k24K64l16L92n13P30j255M821P089l242k047l88
65E414J775l16Q7J803K867k88k829k201R41J263o00j740J61J244j59k588k080
82B754p5J54j398j365Q37J581j205l734k674K80J288J53j17O72k2k393l125m56
100h845K412K359J95q74k27l1p94p65R49K227J325m14o02P53J114k76j018L87
118b125K086J632O6l51K31k30j258o07J744K716J004j239j887j064k89K29J010
135A668J699J029q59k311j640J63J129N90j3K93K45o47j225n28N34M21k75O5R54
154A292Q62n76j537r30K73R58R79R09M85o73j817j579P5J757J842O07p45j238
$$ y = [0, 0, 0, 0, 0, 0, 0, 0, 0, 0, 0, 0, 0, 0, 0, 0, 0, 0, 0, 0, 0, 0, 0, 0, -3, 6, -8, 8, -8, 8, -8, 8, -8, 11, -14, 16, -16, 17, -20, 22, -24, 27, -29, 33, -37, 41, -45, 50, -56, 63, -70, 79, -91, 103, -121, 143, -173, 219, -294, 436, -819, 4002, 11091, 7849, 5802, 5414, 7189, 6873, 6960, 8763, 11630, 11342, 8513, 6312, 7253, 8516, 7916, 6176, 6337, 7581, 7422, 4834, 2754, 2679, 2833, 1435, 70, 907, 2488, 1283, -2451, -5125, -4845, -3557, -3404, -3521, -2849, -2871, -5264, -8389, -8845, -6433, -4074, -3879, -4753, -4980, -5011, -5805, -6570, -5621, -3394, -2069, -2483, -3085, -2332, -1218, -1494, -2512, -2125, -39, 1593, 1659, 1308, 1539, 1309, 51, -556, 1188, 3904, 4908, 3669, 1782, 718, 429, 658, 1668, 3367, 4396, 3537, 1226, -414, -251, 878, 1468, 1455, 1748, 1993, 1346, 121, -407, 127, 548, 273, 338, 1292, 2154, 1578, 41, -889, -616, 342, 1321, 2230, 2715, 2042, 225, -1354, -1279, 478, 2320, 2927, 2182, 944]
172I44j248r08j60R71J436M49r35j236n50j59m24l29K92N97J63l10m12m37p58
191c014p48K4J032J360N91o37j412j049j56Q57J520J579P32p64j659j078N10J511
209h01J456R41L00l45q35n52K93Q92P44L69K43K76M7l38o02m38O4O01Q33N36o9
230C615q76j367j137qJ220J364L65q75j504j476q18L31J247J186N5j057j319r43
248a997k55K75N93M84J53k68l81m17l73k27p4K82O11Q07L71n38j063p88K2P34
268b049J269J162K54r68j510q22M41J285J450Q08k44j056j131m07M93J017R08
285I00M27j86m39l44k01m9M4L61N87N07K50o1n24q05n55L87J134J103L71n44j144
306A219j177l11P81J410J016j3r88j358r37N3Q40R49M19k32o64q58o19j39J68
$$ y = [944, -304, -1212, -1372, -401, 1035, 1484, 549, -687, -1237, -1396, -1820, -2149, -1857, -1260, -1097, -1407, -1819, -2256, -3014, -3762, -3738, -2706, -1346, -755, -1392, -2804, -3853, -4009, -3152, -1632, -53, 679, -85, -1744, -2822, -2312, -801, 655, 1596, 1896, 1551, 716, 164, 457, 1349, 2093, 2462, 2705, 2981, 3028, 2690, 2088, 1650, 1714, 2315, 3148, 3684, 3615, 2739, 1372, 235, 227, 1447, 2811, 3176, 2301, 797, -679, -1497, -1166, 81, 1267, 1322, 265, -1054, -1997, -2252, -1977, -1384, -900, -747, -1015, -1396, -1813, -2186, -2413, -2487, -2205, -1594, -787, -416, -954, -2017, -2805, -2783, -2049, -780, 382, 636, -332, -1842, -2664, -2223, -938, 512, 1320, 1076, 20, -1111, -1518, -1025, -8, 900, 1327, 1141, 702, 358, 157, 108, 152, 513, 1100, 1607, 1857, 1796, 1272, 467, -88, 299, 1433, 2536, 2907, 2363, 1219, 42, -269, 512, 1922, 2938, 2925, 1937, 579, -358, -305, 535, 1484, 1903, 1671, 1007, 149, -470, -609, -441]
325d41J85J23J50J43k44o49p65n55r1M75Q68O33k30r85j156o76L00J087J262N25
345d1n79j183r98k31P01J252J088K51n42p62m14qM65O55O43L58R1Kj12k65l17
366E4J9M81Q03P58L01m19r19q12m4Q24J076P93l8r68j302p00K91R56R62L40m07
387B049j031j032l98K47N63M63J18j94m55m90l95l55j54P1M50N24J68l29p47q86
407a813m57L13R85R58K39o20j053q94j60P60J267Q28m9p77r45n30J62P99Q95M91
427C99n4l46l87k90o9K11L21L83M26L73K3n09o15m15J56O55R34O63j39r01j003
448a84m66M00J011R80L63n72j046q31j29N71Q48O16N7n38o97m54p9J25K92L50
468F17K41P2j65l44n34n28j48M25P44N53M5o32j008q04l4P53R54N80k09q93j070
$$ y = [-441, -256, -133, 17, 160, -84, -733, -1498, -2053, -2144, -1669, -801, -168, -398, -1383, -2539, -3215, -2915, -1828, -566, -41, -620, -1803, -2801, -3032, -2331, -1079, 9, 260, -282, -1044, -1458, -1466, -1001, -346, 297, 655, 746, 748, 636, 371, 54, 73, 554, 1357, 2115, 2416, 1997, 1078, 266, 222, 1046, 2122, 2915, 2877, 1909, 607, -93, 198, 1154, 2116, 2456, 2049, 1018, -14, -412, -165, 398, 861, 979, 785, 330, -160, -555, -910, -1064, -993, -543, -19, 149, -180, -927, -1813, -2270, -1957, -972, -14, 225, -395, -1448, -2342, -2502, -1742, -475, 353, 304, -473, -1418, -1948, -1786, -987, -92, 399, 345, -1, -388, -678, -747, -536, -215, 168, 594, 967, 990, 481, -134, -549, -393, 262, 1196, 1859, 1720, 819, -184, -650, -250, 761, 1741, 2104, 1532, 486, -345, -474, 97, 945, 1561, 1618, 1080, 383, -71, -150, -25, 267, 617, 858, 930, 765, 421, -113, -641, -789, -364, 380, 933, 978, 346, -662, -1466, -1500, -747, 207, 787, 578, -315, -1385]
489a385n55L16Q68P76K68l56p28p04k25L03N12M06J91O8j44k58l30j94l5K61N97
510c48P34L41k57o52o84j93N05J038R87K51n49q89o55N6P28J021O84q8o84p37
530F09l84J54M98N78L15j48l40l80l32l10q4J25K78K93J87j88o81q37n70R3N93
551e31P12L84l56r61j017m16L73Q21P83K09n12q85o61m6N17P29N12J14k39m20
571h90k71L4K14K97M13M17L28M3k39m13l57L6N54Q79O42N6n34q24n98P2P42R61
593A562M74k49p99q42m46K62O69O08J14l89o05n65k53P4K77K39J11M3j16l27m66
614f24l75j23K23N49N91K25l68q08o96j34M82Q88P82J68n84q59n42Q6O40Q59N12
635H92p9n81n80k44J38L66M37K80J1j87k61k59k81j11J37L83M40K35j71n78p49
$$ y = [-1385, -1940, -1624, -756, 20, 288, -68, -796, -1500, -1725, -1422, -910, -504, -313, -245, -389, -647, -977, -1171, -1206, -945, -348, 386, 727, 470, -182, -866, -1059, -554, 484, 1471, 1722, 1173, 284, -371, -315, 413, 1434, 2118, 2030, 1346, 609, 225, 379, 877, 1455, 1770, 1622, 1282, 902, 570, 260, 176, 301, 579, 872, 1059, 871, 190, -647, -1217, -1124, -531, 181, 565, 209, -752, -1769, -2185, -1812, -991, -208, 1, -511, -1396, -2057, -2103, -1586, -857, -345, -231, -470, -890, -1161, -1127, -913, -616, -203, 214, 542, 585, 346, -67, -424, -388, 166, 1045, 1687, 1743, 1209, 385, -213, -141, 601, 1562, 2036, 1787, 988, 146, -300, -38, 631, 1239, 1353, 964, 359, -206, -459, -385, -108, 131, 242, 285, 169, -158, -624, -999, -1122, -899, -350, 241, 466, 98, -710, -1406, -1540, -1058, -170, 612, 780, 196, -663, -1205, -1119, -479, 380, 892, 813, 232, -348, -592, -454, -88, 349, 629, 640, 453, 192, -67, -348, -459, -322, 61, 501, 736, 565, -13, -762]
656g62m31K13P09P47L11k77q02q04k84M62Q02O84J55l96o48n43J01M87N56L65
676F45J04j58k73k37o1P2K10L39M14K60n2l81n43m10MM89P61M94j36p00q56n48
698e63O8O31P33L11l79p77p27l42J62M80M57M2l27m76l99k04mK07K29J84J47J2
720e35k38m13l70n3M01O19O17K52l21o54n29L3N83Q72P17J42m54o77l51K10O20
741D71O95L98Ol90m65j46J34K82K79K44N3q6k26l28l22j94P8L83M28J36k80o79
763D71p48m02J81O20O05J35m52q05p57k58L42N95M37j7m02n55m02q1K64M00K32
784e97K0j00j57k25j69LJ51K80M19L49pl34n03k68J32N55P48N33o3n66o15l42
806g56K74O72P20L64k00n43m79j14J97M68L76J74j27l15k52j26n2J06J89K67J38
$$ y = [-762, -1193, -980, -271, 476, 787, 510, -292, -1096, -1380, -918, -116, 568, 723, 327, -321, -864, -763, -276, 280, 645, 749, 591, 318, 81, 20, 92, 302, 641, 1055, 1315, 1263, 882, 339, -71, -67, 422, 1183, 1677, 1541, 841, -15, -563, -495, 136, 869, 1180, 801, 24, -703, -1045, -883, -403, 54, 96, -231, -707, -1106, -1310, -1314, -1107, -878, -694, -547, -535, -773, -1186, -1556, -1609, -1208, -589, 28, 280, -41, -695, -1224, -1191, -608, 264, 981, 1123, 669, -8, -359, -149, 471, 1166, 1564, 1570, 1180, 715, 569, 703, 985, 1264, 1508, 1561, 1475, 1249, 921, 599, 405, 483, 866, 1294, 1430, 1150, 471, -277, -679, -498, 122, 727, 862, 410, -395, -1152, -1410, -1068, -473, -36, -53, -455, -1010, -1412, -1493, -1229, -829, -597, -577, -677, -834, -1059, -1228, -1225, -1074, -794, -375, -26, -33, -367, -870, -1138, -1006, -451, 297, 830, 767, 201, -414, -756, -482, 190, 910, 1274, 1074, 531, 52, -62, 135, 603, 979, 1153, 1026, 711, 459, 333, 281, 387, 576, 843, 981]
827I81l0k67m63m11j36L31N16M19M3m65p82n80o5M57O41M25r5n46o58m63P3M35
849f40M31K09p5l28l58j90j1J80J81K05J65K4j51k94k12j20J60M78N08K38j68
870B32n19n02j78L24P05O48K31l11n68m88r5M05N88M95J9k42l96k76j3J70L09
891E38K67N0l3q9k96k25j51R3K61L30K54j00m46n76k98N7M51N80K99j77o13o60
913d84l38K06M84N27K04k36n04m68j36J46K55K92J33q0k26k09j54j01OJ68L06
934b09K14K2k16l75m05o3L27N93M08K9l70n72m36QM92O21M19o2l82m87k96J09
956f31L94M22K24J7j58k26j53j9J47J95K15K34R6j03k72k82r2J78M22M67J72k17
978A030n08m86j75K70O09M73Q9m02n62m57r7K36M21L37m7k99l95k87j08J5J29
$$ y = [981, 951, 684, 221, -190, -326, 5, 521, 940, 983, 518, -264, -844, -909, -452, 189, 614, 519, -27, -685, -1148, -1075, -640, -209, 0, -75, -403, -761, -951, -962, -782, -601, -396, -231, -207, -358, -652, -864, -984, -824, -346, 162, 400, 232, -287, -789, -967, -643, 62, 710, 941, 630, 62, -426, -521, -116, 472, 967, 986, 744, 348, 72, 59, 229, 538, 805, 855, 822, 733, 437, 212, 61, 154, 415, 745, 999, 899, 453, -123, -421, -364, 87, 667, 966, 789, 176, -484, -822, -616, -132, 395, 599, 363, -141, -609, -745, -599, -344, -52, 81, 1, -225, -434, -588, -689, -683, -515, -209, 5, 27, -189, -564, -969, -1032, -705, -112, 296, 325, -45, -617, -1053, -1045, -553, 68, 487, 425, 43, -444, -740, -631, -237, 185, 409, 426, 268, 42, -111, -130, 17, 212, 427, 661, 757, 654, 382, 100, 8, 186, 608, 1075, 1247, 1030, 522, 36, -139, 131, 740, 1213, 1302, 900, 338, -119, -216, 20, 441, 778, 731, 432, 37, -250, -358, -343, -214]
999b14J61P7o1j41k54l19k32N1K09L24K15q2l99n00k68R6N01N38K72j76m47n31
1021a180j43K40N35M99J99j11l26k68k2J64L39K63K27P3l1j28j30n4O0K49L31
1042G86L03O5k23l77k84l2L22N16L68l2l88n78l93K6L56N15K22j52m04m71l23
1063a78j0K08K69R7j11j64k49k61j76j7O9J67J05P7j51l62l37j31J26L96L33J51
1085a49k40m69m14n7L25N21M33J15k81m40k91K9K96M27L57Q7j27k30j43rR0J86
1107A6K66K09J12k7j32k75j41J02L22L95J88m6l65m26k35J45M55M53J46j86m82
1128D94m64j74J85L83L15R8k05l16l47j20KJ60J50R3L7j07k24k51j66l9J18K71
1150a07K27J5k80l74l12%K65M26K76n4l88m23k94P8L73M16K30p2l01l26j75N0
$$ y = [-214, -53, 24, -37, -178, -432, -751, -983, -932, -723, -399, -184, -266, -665, -1165, -1433, -1337, -836, -298, -26, -202, -649, -1180, -1323, -1083, -548, -49, 150, 39, -287, -555, -577, -413, -74, 189, 416, 489, 458, 330, 200, 146, 206, 455, 786, 1089, 1154, 931, 554, 270, 238, 560, 1076, 1444, 1412, 1024, 446, 53, 79, 435, 950, 1172, 1020, 616, 145, -178, -188, 20, 289, 386, 275, 111, -138, -399, -575, -592, -523, -356, -251, -174, -325, -687, -1024, -1155, -1029, -633, -300, -149, -389, -858, -1272, -1329, -1004, -483, -50, 65, -216, -656, -947, -918, -622, -195, 162, 249, 122, -108, -251, -260, -170, 16, 282, 491, 603, 576, 444, 169, 28, 130, 452, 847, 1035, 989, 624, 198, -37, 108, 563, 1016, 1162, 976, 494, 30, -144, 41, 424, 739, 837, 632, 316, -31, -151, -149, 11, 161, 254, 291, 184, -40, -291, -457, -496, -378, -107, 120, 135, -145, -519, -831, -831, -566, -140, 136, 82, -306, -729, -1023, -945, -572, -156, 74, 2, -299, -625, -800, -750]
1172g50K49K69J70N2n9j19j63r6J8J40K79K50J36o6k81k69p4K10L98M06J57j77
1194F80m32l59KL06M74L49K7k18m50k35OJ87L02K05L0j37k14j98j28m4O2J61J28
1217E04O6j10k61l50k26rK27K80J48j67l54m42k68J07L42L85Q9k23l96l23j91
1238a172K01L11L07J06j09k04k15j14Q1J85K28J98J26K4j26j79r4M9K48L47L22
1259E20M7j86l20k13P2L39M34K85j3l06l87j94R6L08L36J97j00k71l03j46j6J18
1281B97K12Q3L0o3k11k17j99q3Q7J84K00M7j56l39l20j36J75L28K53L0k13l92
1303d03l32m3K54L52K33jj99l26k30rJ68K70J76O1o6j60j53j00J9O6K08J97J18
1326A00k4k39k35j25N7L11L63J89q8l12k79j48J93L46L52J25j35l07k31p5J69
$$ y = [-750, -501, -232, -62, -10, -69, -188, -351, -447, -429, -289, -10, 240, 376, 310, 29, -240, -314, -104, 294, 700, 857, 680, 248, -111, -109, 197, 671, 1020, 1047, 829, 379, 144, 150, 337, 639, 844, 874, 737, 523, 325, 197, 153, 215, 376, 504, 570, 460, 199, -151, -377, -386, -159, 121, 269, 102, -252, -694, -962, -855, -513, -128, -39, -262, -658, -981, -1172, -971, -660, -353, -247, -356, -560, -775, -889, -808, -623, -395, -197, -71, -47, -173, -352, -446, -397, -149, 198, 520, 567, 381, 61, -152, -80, 259, 693, 978, 965, 659, 272, 78, 174, 482, 818, 1015, 915, 644, 341, 195, 179, 297, 509, 592, 622, 559, 348, 131, -68, -151, -64, 120, 320, 367, 211, -128, -448, -584, -409, -81, 172, 202, -11, -403, -735, -778, -524, -172, 61, 60, -139, -465, -695, -704, -536, -266, -90, -29, -95, -255, -408, -508, -489, -423, -215, -18, 100, 76, -163, -398, -523, -466, -155, 208, 397, 309, -3, -282, -430, -237, 109, 461, 586, 451, 144, -87, -162, 7]
1347GL05K42Q9r0j29j54j11J3R4J51J59J04j4j58k40j94l1J73K74J55Nl01l36
1370A3k91J3K54K70J52r3l35l74j90P8K09K00J16p5k45k50j43MO5J68J46P2l2
1393b68j21j53j56qJ19K65K72Q7r9k48k44j8K31L59L04Q6j80k68j98qK80L01K50
1416E85qj50k19j57rJ39J98J57O9n2j27j77j21p3N7J87J96Q6p0k64k77j60M0K45
1440I5K64J32j30l11l32j02R1K69K68O3j65k84j87j08R6J94J94O9q6j52j65j02
1462c89m9R3J28J54J33m6j69k21k06M9J57K69K03rj87l03j89P1K37L02J51o0k01
1485h2k40j32J01K46K33J20mj37j38o5%J13J49J70J31Or3j82j26OJ18K49K33R2
1509G68j85k66k35n6J34L00K08Pk28k93k06m5J18K50J37o6k21k15j94o9P1J01
$$ y = [7, 312, 554, 643, 553, 424, 270, 159, 172, 266, 417, 576, 680, 666, 508, 268, 74, 43, 216, 490, 645, 650, 349, 13, -278, -265, -11, 259, 411, 318, -17, -391, -581, -503, -294, -94, 22, -53, -298, -548, -691, -687, -622, -454, -308, -236, -268, -389, -542, -698, -706, -587, -322, -50, 37, -62, -310, -554, -572, -341, 18, 322, 408, 228, -40, -238, -246, 34, 335, 585, 577, 427, 208, 51, 42, 181, 379, 536, 605, 553, 426, 249, 128, 55, 112, 299, 495, 581, 511, 247, -30, -190, -150, 95, 359, 491, 361, 50, -282, -384, -293, -24, 244, 307, 142, -142, -329, -437, -341, -147, 47, 116, 30, -122, -287, -389, -438, -345, -217, -63, 70, 24, -145, -366, -572, -523, -366, -97, 106, 97, -90, -393, -582, -511, -274, 28, 179, 119, -82, -322, -454, -353, -107, 126, 246, 242, 105, -33, -98, -98, 15, 164, 334, 465, 471, 378, 196, 70, 76, 194, 443, 676, 768, 583, 317, 82, 26, 160, 460, 668, 675, 447, 154, -52, -97, 21, 271, 408, 342, 121, -94, -288, -357, -286, -185]
1531a85Q0M5o2j47j57j88n5N5J91J91J01q1k37k33r1R2K71K88J68p2k56k07o5
1554e54K01K70K46J11q6j80j03NR9J85J98Q8k0p3j05q5k2N2J44J93Q8o0j48k18
1578B26j86j0K02K42J06m4k27k95k04K3J88K20R6j09j88k62j37L5J59J12J02n0
1600aj22j64j38ON6J41Q8J10K2j35k00j32rJ42K37K07M9j41k39k12j4J75K85K00
1624B11Lj70k27j46J6J55K05J57nj32j20q6l1L8J54J07P7j8m0j65j17m0J05K02
1648A33J87J00q6k26k00o6J00K33K45P8j08k04k11m2J04K37J14O6j12j59j48p4
1670c9O9Q3J13P4k0j50j33r7j13L4J18J48N9o9j97k31j49J4J68K22J17p0k16k17
1694d82j18L9J56K30J10m1j41j68q9M6J75J48J20J7l9j12n5j2O8J46J57J28M7
$$ y = [-185, -105, -60, -122, -269, -426, -614, -669, -614, -423, -232, -131, -212, -449, -682, -773, -681, -410, -122, 46, -26, -282, -489, -554, -353, -83, 163, 274, 188, 8, -95, -90, 9, 194, 392, 480, 460, 387, 282, 197, 175, 227, 371, 564, 652, 592, 444, 226, 40, 30, 232, 474, 580, 536, 309, 14, -190, -167, 21, 241, 337, 228, 40, -222, -359, -324, -165, -53, 49, -1, -123, -287, -425, -419, -363, -222, -134, -24, -2, -137, -337, -469, -478, -336, -99, 108, 157, 16, -223, -435, -449, -274, 11, 211, 214, 44, -183, -329, -313, -158, 47, 204, 199, 67, -53, -139, -170, -132, 22, 129, 206, 188, 148, -17, -134, -174, -69, 133, 320, 420, 334, 108, -92, -158, -58, 175, 420, 498, 390, 186, -25, -67, 37, 274, 388, 454, 342, 183, 35, -39, 30, 113, 226, 300, 280, 130, -3, -100, -213, -179, -61, 87, 146, 77, -120, -351, -500, -486, -318, -96, 21, -49, -265, -482, -600, -561, -405, -175, -65, -106, -247, -415, -504, -458, -283, -135, -15, 2, -37, -149, -204, -216, -148, -2, 155, 283, 330]
1717C30p4j89p9k5J92K07K09M0j39k19j83PJ48K19J71Kj77j77j62j2Q5J34R7o
1741C99r5j72j30p4J2N9J06L6rj23j72j92l0K1K01J46M3j16k07k06r1P9K06K08
1765a01L5q6j88j85l2J04J67J80K6m6j00j05k3P4J13J16Q4N5n2o2j23PN4J72J75
1790B59J35m6j48j44j03P8J86J86J65l7j88j60j05P3J32J87R4o4j42j43o9k7Q5
1813B04J21O9k0q3j15j62p8K2R7Q3P6n1j35k13j57k1J00J63J27j5j49k55j41l7
1837e70J36J72J08Oj10j52j29J6R7J31P7Q6n5n6r3m2O0R7J61J06N4o5r1q9oJ12
1863c9J76K03O4q0j49j33l0J11K20J92M5q7j46j34m4M6J58R4M3n0j18j19j26K9
1887A26M4Q5L3j1m7j44j42j12L2J03J04O9p1j64k26j16K4J66J51P1l9j94j49j14
$$ y = [330, 256, 67, -12, -37, 155, 362, 571, 611, 472, 253, 70, 77, 225, 444, 615, 617, 440, 263, 101, 89, 174, 308, 405, 399, 304, 132, 2, -72, -60, -1, 105, 141, 132, 9, -163, -355, -385, -364, -163, -17, 26, -90, -297, -503, -594, -515, -309, -101, -66, -152, -340, -525, -557, -453, -286, -106, -80, -126, -226, -331, -354, -280, -167, -51, 33, 88, 36, -26, -149, -142, -88, 84, 259, 394, 348, 200, 56, -47, 31, 217, 403, 568, 531, 343, 183, 78, 151, 283, 470, 564, 500, 358, 215, 146, 119, 204, 325, 394, 374, 291, 176, 14, -64, -42, 55, 138, 214, 163, 28, -185, -342, -363, -263, -100, 27, 12, -137, -392, -533, -570, -434, -262, -154, -148, -258, -410, -539, -523, -426, -295, -218, -132, -187, -243, -336, -378, -318, -221, -60, 46, 100, 35, -56, -145, -151, -39, 137, 340, 404, 324, 175, 42, 12, 123, 343, 535, 580, 493, 347, 213, 169, 215, 373, 467, 510, 460, 342, 223, 97, 126, 170, 255, 288, 277, 230, 86, -56, -168, -136, -33, 71, 140, 69, -95, -321, -437, -413, -247, -96, -25, -64, -258, -407, -521]
1911e21K7J72J17J08j3j18j19p2K3R2J01J08L7l9l3j00o2N0J23J42J10J6o4j41
1935e6j04K5J45K04J34qr3j69j15K7J44J69J03jp5j20j07oM1J27P8N7n6j09j02
1960A33n9k5P9R7R7oj06j37j53MK9J32R8N0j01k05j30r0Q3J33J08M8j13j67j29
1985c30o2K9J45M5N2l4r4j00p4nM0J40Q5N8o7r5q8l4N8J47J19P2j1q1j59m1O8
2012b17J81J86P9Rj21j09m7N8J33J47P7J4q0r2m5j1P0J04R8K4m2j16p5l2k3O5
2038B35J05P1l0j12j65j31j8J00J39L7k3j26j63j21o2O8J10P8J0j46j10j11n5
2061d20N1Q2N5J8J0q7q3p5oQ3J31R3M3p0j11p9QP8J91J21N9n9j17j02j3R2J59
2088E2J63O9p3p4p3l2N2J06J03P8Mq8q5n7k2P2P3R9K8m5j20j20n3K0J06J05M3
$$ y = [-521, -494, -322, -205, -97, -110, -228, -347, -419, -396, -304, -203, -95, -58, -97, -130, -230, -292, -242, -119, 23, 133, 149, 85, -56, -160, -135, 10, 214, 348, 340, 247, 78, -37, -10, 134, 303, 406, 405, 330, 210, 103, 97, 138, 265, 343, 400, 344, 235, 133, 74, 49, 128, 225, 322, 316, 210, 73, -80, -76, -47, 85, 183, 233, 132, -73, -203, -293, -210, -77, 31, 79, -34, -201, -330, -392, -363, -218, -173, -121, -155, -249, -349, -423, -428, -388, -248, -163, -105, -172, -267, -355, -389, -331, -184, -65, 7, -4, -85, -244, -285, -217, -36, 150, 229, 238, 117, 8, -39, 19, 152, 299, 376, 390, 310, 218, 173, 162, 232, 336, 434, 458, 416, 300, 225, 193, 170, 235, 340, 411, 381, 269, 104, -27, -45, 55, 194, 231, 208, 82, -81, -202, -264, -196, -86, -8, 2, -144, -254, -365, -420, -369, -287, -232, -214, -204, -291, -374, -449, -455, -372, -241, -148, -105, -175, -286, -365, -357, -279, -88, 33, 92, 33, -84, -186, -199, -107, 52, 215, 284, 211, 137, 64, 32, 84, 190, 293, 371, 375, 287, 202, 145, 123, 195, 268, 367, 395, 350, 230, 110, 57, 77, 183, 288, 331]
2115C31o7j39j62q1M2J14J02M7p5j31j17q6pQ4P8N8kj13n8j07j0J3Q3Q6K9rr8
2142a95p9p4J6R8J06J05pj01j06m8jJ13J54J08k1o5j37n4PR9J14J07L9n5j20o3
2168f0j5O0J05Q3P6Mp6o1j02K1O8R4N2N5p8q2q8m5Q1J05R5K5o1j56r7n4O6J06
2196A21R4Mn0j31r1n3J9M1J15K5k5o8j10o2k6KJ04P5j1j9p2j47n5K0J05J02K2
2223g1m3q6j03o2M7J22J08O6n5p7r0m9N6Q2J18O3L3m4q4n7J6M9J28M6R0K0o1q6
2251G6l7L1R2J14P5j2r5p8n4J3O3J22L4ko4j12r6qP3N8O3j4p6r8q8p1J9O1P8J8
2281H5m7q4q4j17k9L9Q8M6M1r3j22r1mL3J15N9N6o0j09p4nR0Q3J12M6j7r2n2j6
2310b03N3Q0N7J31Kl2o2o4M1M5R6R4N1k4o0q7k5J5J00J06L1m7o3j28m5N2L8J25
$$ y = [331, 264, 125, -37, -118, -76, 38, 140, 187, 112, -19, -136, -222, -229, -145, -67, -9, -11, -124, -182, -289, -299, -286, -203, -117, -88, -97, -195, -274, -348, -332, -234, -128, -23, -30, -131, -237, -285, -286, -173, -19, 89, 68, 3, -134, -188, -181, -82, 32, 139, 178, 123, 3, -60, -75, -15, 90, 173, 249, 253, 177, 116, 14, 35, 103, 197, 249, 304, 226, 144, 56, 11, 92, 197, 292, 317, 256, 100, 3, -51, 15, 121, 215, 219, 169, 38, -53, -106, -87, -46, 69, 94, 69, 1, -109, -171, -197, -195, -91, -16, -27, -46, -118, -265, -320, -300, -195, -93, -71, -114, -200, -303, -365, -318, -196, -88, -22, -77, -154, -244, -293, -237, -155, -37, 26, 59, 15, -69, -126, -110, -61, 67, 113, 203, 223, 162, 76, 39, 70, 162, 276, 351, 339, 244, 166, 112, 125, 188, 310, 344, 342, 278, 166, 70, 62, 135, 193, 256, 242, 166, 68, -20, -91, -72, -11, 67, 85, 38, -46, -130, -247, -276, -237, -149, -103, -62, -155, -277, -368, -372, -339, -224, -165, -109, -169, -278, -352, -357, -267, -184, -72, -26, -43, -135, -187, -203, -150, -70, -13, 118, 120, 88, 26, -38, 3, 48, 144, 238, 289, 265, 205, 118, 93, 108, 208, 314, 345, 298, 235, 107, 62, 114, 152, 277]
2338B77Rl0j00j01l6l3N9N7N6kn8q1r8m6J7M6J05J3l5r1p4q8NR9N9M8No9r4n0
2368b31JL2R8R7Mq8p6n5l5Q3O4Q6L3m2o0n0l4J0Q0R0M4Lk9p5m4k7R0P6Q8L1m5
2399A19q9p6KQ6O4J00lk1p3o8l5O4J13O3J7j1n6r6o7K1M3O4Q5%r3q2q2qOP3P6
2430A36j1m0j04o9o5L3K0Q8K7m3j07q2m1RN4Q6L7l3o0o9n4kP6M4P4K3n0n0l9k9
2460b41M8P3Q9O1Kn0n1MOP8J03M8M0j00k8j9K5K0J13N9J9n6p3l9l4N3P8P4Qp3
2490B37o9m0o8KK6Q6M8o2p5q2p2j7NQ9M7on6r6q8NQO6P5j8m2o5o3k0MQ3P5K9l4
2523h8n9n8j5K7O4M5N6K9l9m2n7%K7J15P7L9l8m9p2rJ7Q1R2K2Mo7p7OJ0K7Q6K0
2555A74J2o8n8m1qJ5Q5N0J3n1q8l6n2K9N8N8K1j6o0r1n1K5M5M6N5nq0r4j7ML8
$$ y = [277, 286, 256, 156, 55, 19, -14, 45, 102, 158, 156, 98, 17, -81, -127, -110, -64, 41, 54, 19, -72, -146, -234, -229, -130, -71, -23, -18, -87, -181, -231, -230, -198, -100, -3, 1, -87, -163, -218, -253, -170, -106, -20, 13, -29, -89, -139, -173, -163, -83, 7, 51, 54, 25, -50, -94, -121, -31, 45, 133, 164, 119, 30, -46, -44, 42, 106, 206, 203, 182, 109, 41, 6, 70, 183, 246, 263, 252, 196, 100, 33, 54, 97, 161, 246, 246, 153, 71, -11, -19, -13, 60, 136, 125, 85, -19, -88, -153, -120, -100, -12, 15, -28, -135, -217, -258, -249, -195, -109, -72, -105, -165, -234, -288, -290, -214, -170, -96, -73, -123, -173, -212, -241, -193, -120, -31, 30, 32, -18, -69, -65, -59, 19, 122, 170, 210, 110, 82, 63, 88, 108, 221, 280, 299, 243, 170, 131, 97, 150, 228, 302, 310, 237, 168, 128, 60, 62, 88, 174, 222, 160, 85, 3, -69, -86, -81, 8, 55, 49, -7, -103, -191, -186, -178, -112, -37, -55, -97, -162, -225, -245, -241, -158, -83, -54, -88, -147, -205, -220, -193, -129, -84, -28, 1, -38, -80, -137, -137, -110, 5, 82, 121, 83, 34, -38, -47, -30, 51, 143, 165, 169, 102, 25, 31, 41, 68, 154, 174, 186, 118, 60, 19, 11, 26, 111, 161, 174, 123, 35, -1, -53, -24, 34, 92, 113, 97, 37, -54, -105, -80, -35, 11, 66, 61, -19, -113, -130, -126, -88]
2586h8O5N6l3k8q0n6j9R6L2N9%Kq2m6j4K1L9M8P7k3l1o3o6K7N5P5N9Rl4m7n2k0
2618f2O1L8O1M8m6o0k4n3L8M4P1J3J2n2m8m3pO1M0K9nnr1m9k1M1M5P8L9p3q8l4
2650d2rJN8N1M3l0o8o0k8mL2P0J8Qn2o6m5J2K2N1K9oj9m4m1k2kP5N9K9n5l5k9
2683i9m9K0L3P4L7L3m2q1k7oN3Q2M0pk0k4l5k5L4M8P7K1j8%r2mK4M6K7P6Kk1j11
2716F6m2MM0N2P5jp6j8j01j8K4N3J8K2n2n1p2jJ2MN4K1j8o8o9n2J1M2O4K8qo1
2748a18k6p6J3J7R7L7J6j0n3m3j3L1N3Q3L0Lk7n9l2M2O5M8N4jkp0k2KK6Q9K0L0
2780B04m1o1l8l7L3L6O2M1o0k1q7m0j3M9M1j0J9m2n7p3k3L1N5K3Ml6l6q5j0L2
2810a40N5L0K5k1l5n6k0L5K6O1L1Okq5k0k6Q7L3O6J5k9l4m1l6M7N9N9Lj6l2m4
$$ y = [-88, -23, 33, 0, -28, -108, -164, -183, -87, -55, 4, 4, 6, -76, -122, -136, -115, -76, -28, 49, 26, -5, -68, -134, -107, -52, 23, 82, 91, 57, 10, -42, -62, -1, 37, 98, 146, 100, 40, 16, -37, 1, 45, 116, 129, 141, 89, 41, -2, -9, 52, 92, 121, 116, 111, 20, -29, -50, -9, 36, 114, 153, 80, -8, -42, -51, -50, 8, 59, 102, 72, 4, -56, -84, -88, -56, 14, 32, 40, -12, -78, -123, -111, -89, -38, -9, -15, -34, -78, -119, -141, -143, -68, -9, 20, -35, -70, -99, -148, -128, -95, -21, 16, 49, 7, -74, -101, -107, -54, 28, 68, 61, 41, 17, -18, -43, -9, 39, 116, 137, 119, 119, 27, 23, 47, 93, 120, 196, 198, 177, 66, 24, 28, 68, 120, 195, 194, 118, 100, -1, -19, 5, 58, 76, 98, 46, -5, -77, -78, -66, -62, -8, 13, -5, -73, -142, -194, -183, -141, -77, -49, -57, -118, -144, -220, -207, -190, -93, -56, -40, -50, -103, -146, -159, -128, -75, 8, 38, 41, 14, -45, -77, -35, 30, 78, 132, 131, 129, 59, 37, 39, 65, 154, 174, 204, 163, 102, 64, 27, 60, 96, 158, 199, 139, 118, 31, -9, -22, 27, 68, 58, 77, 35, -22, -95, -118, -87, -32, -9, -5, -41, -77, -162, -172, -140, -85, -55, -30, -51, -86, -142, -162, -127, -101, -40, -9, -3, -5, -90, -110, -136, -49, -16, 50, 65, 36, 2, -39, -75, -28, 31, 90, 93, 77, 45, 1]
2841Aj9K5L2N7J5ql6l9j6JL7K2K0J1k4m2k5o1L7M4N0J9n3j4q0k3K2L5M7L8ql8
2873B7m8n4K0K9M6J4nj0l8n5j2M2M1J1J2j6n2l3l0L9M0M2K3m2j3p5kjM3M1M4L
2905C1o1j3p9M1k4M9P7J1j2m4j3n2L4L5Q6Nj5l9l1m0L9O5L7J4Mk9l3l4mL7M0M2
2937A24K2j6p5l0l4K7M4M7K8l2m4m6k2RJ5N0j1ll2n7l9j1NM4M9k8l2m3k4m9L4
2968a30J4O4J6m0k7o7QjL7O2L4nm7m6oK2K5M9M9K4l9j2l3jM2M1L2L3rm1j1jj2
3001B4O6M4L3nl3o1j0L4QL2L7mk8m3p2J6J2L1J9ql4jp9qk0L5ML1l5k9m7j4j8M0
3035h3K5M0k6m6l4j6j8L0L1M9J0l3pm9LKM2N5L4qkn0j1mK5N0J7K3j7k8l9RJ7M3
3069C4O0K1m0j0m9KK7L3L8K7l9l6m1k%M1N2jJn8m0j4%oO1L3nk6o6j3m2K8L6K1
$$ y = [1, -18, 7, 39, 96, 111, 103, 67, 28, 12, 13, 50, 72, 92, 103, 79, 37, 12, -49, -12, 32, 82, 101, 48, 34, -46, -69, -47, -12, 35, 73, 65, 27, -21, -75, -55, -26, 20, 34, 29, 19, -19, -74, -86, -44, -3, 8, 20, 4, -48, -81, -111, -72, -32, 10, 33, -9, -22, -97, -99, -100, -57, -16, 28, 31, -30, -43, -122, -81, -105, -56, 21, 32, 20, -24, -37, -89, -55, -20, 66, 71, 56, 17, -14, -54, -15, 50, 87, 101, 105, 76, 43, 9, 5, 42, 82, 124, 146, 130, 55, 25, -9, 18, 62, 109, 137, 105, 61, 15, -7, 2, 17, 67, 56, 53, 21, -36, -75, -86, -81, -37, 12, -16, -48, -91, -115, -164, -130, -116, -52, -36, -76, -103, -170, -162, -163, -126, -64, -30, -35, -82, -128, -134, -112, -87, -38, 11, 35, -4, -16, -49, -50, -8, 33, 65, 98, 89, 48, 37, 36, 24, 90, 134, 167, 162, 129, 68, 58, 92, 100, 132, 169, 165, 137, 94, 22, 38, 50, 81, 100, 92, 58, 57, -22, -30, -50, -15, -11, 20, -15, -44, -91, -105, -123, -83, -58, -18, -44, -90, -124, -140, -158, -128, -97, -48, -38, -71, -78, -127, -124, -122, -80, -25, 9, 1, -1, -51, -62, -66, -41, 9, 26, 49, 32, 4, -35, -26, -9, 34, 94, 115, 75, 65, 16, 18, 45, 78, 116, 143, 104, 68, 27, 25, 25, 66, 118, 117, 118, 60, 20, 6, 6, 0, 61, 94, 89, 63, -3, -16, -58, -30, 6, 27]
3103B7lk8k8pm0j4L4M7K1k1k4k9l3j7J5L7M0ok7n3m0J7K4L1M5mok1j7l8O0J3J1
3136c4L8rrl6pJ0N7M6J8j6mom2J5L8N3Okpj5l2j6MJ9N6J3j0l6l8k5j1M8qK2j3
3171F7Jl7k0l9J6PM9j8l9j8m2mqK9K4j7Jj7m7l0O1J5qK3J8k8m2pJ7M2pK8J9pn0
3206f8jK6k3O2K2J5j2k4rk3M2L0LL7kj8l9J0QJ4M5njj6k2k7OKK6K1Rj0n2j6j6
3241fj4L6J5K6J2o8j8j6lL3J7J3qj8j3l8j8J2K7RPKl2l5pK5J4K2J8Jl7ol0J8K1
3276c9K1lJ7Lk5m9ML1M9lL1j5m0j4OrO3PK8om0j1j1j0L4L6QNk3k0pnLL9J9Nrj6
3314E4m9lJ5M0MK4k8j5l1j3NoK3L9j3j2k5l1k6M3jK8%l3ol4j8j1M9OJ4Rn3j1j3
3349g9J1QJ3K5k9nj0k3KML9K9pqlk6qL8J2J4J5K2k9k4Mj7L3M1L1mj2n5K1pM3K0
$$ y = [27, 24, -4, -32, -39, -79, -93, -59, -12, 9, -12, -36, -65, -98, -115, -100, -63, -23, -29, -56, -109, -149, -132, -108, -77, -32, -36, -42, -63, -80, -118, -58, -45, -34, 4, -5, -14, -50, -57, -47, 10, 56, 74, 58, 54, 48, 6, 21, 59, 112, 118, 116, 109, 94, 62, 46, 50, 69, 125, 138, 128, 92, 54, 29, 18, 66, 58, 80, 67, 68, 31, 11, -28, -12, -5, 44, 26, -13, -31, -73, -77, -85, -56, -32, -49, -48, -65, -112, -142, -81, -66, -74, -51, -33, -61, -103, -110, -93, -51, -58, -30, -11, -18, -68, -69, -43, -66, -4, 18, 33, 21, -3, -12, -35, 7, 37, 40, 77, 75, 57, 18, 28, 36, 50, 95, 90, 89, 73, 51, 24, 30, 32, 58, 79, 88, 78, 26, 10, -6, -20, 16, 31, 57, 69, 1, -17, -33, -36, -3, 14, 27, 19, 1, -12, -50, -68, -56, -29, -20, -13, -11, -43, -78, -85, -60, -46, -24, -6, -5, -42, -48, -78, -60, -39, -18, -21, -4, -1, -26, -75, -71, -40, 9, 6, 37, 22, -18, -32, -26, -35, 28, 35, 63, 57, 17, 6, -5, -15, 19, 55, 63, 68, 45, 25, 18, 13, 16, 55, 74, 79, 70, 54, 5, 2, 17, 57, 61, 85, 57, 42, 11, -2, 3, -3, 20, 59, 46, 34, 9, -22, -48, -5, -6, 22, 22, -11, -17, -51, -69, -80, -31, -25, -11, -2, -55, -66, -79, -68, -60, -47, -22, -51, -56, -66, -89, -87, -83, -44, -15, -22, -30, -33, -59, -67, -29, -17, -3, 12, 34, 5, -19, -15, -32, 1, 42, 73, 69, 57, 2, 23, 16, 59, 79]
3385G9kL1j7j5m0j0LM3j1L0j3ql7l5K8K5oMml1j5l0j4RJ8J7npl0k2rj9L6J5Jk0
3421f1om1Nj4M0J9K4j0j0k7lJ1K3K8J9j1J6j1j8k0K4L8L0qj3Ml2QK4RK7OK6k9
3455F7k7k1j3K3L5L1qj5l7j5nJ1PL4k0j4l5mj1J0J2J9j2jm7oj0pL5K4kJ0k6l2
3489e0mkJ4K9L8l0lk2k4qK5K5NJ6j9Qojk9M0J2J6qJl0Pk0L0KK4L5n0l4j0J6J3
3525FrK6L3kj9l8Lj4K6MNK8k1k6pl3K4L0jJ8l7j7K2l3L7j1L2J9lj9l4K4k9OL9
3560B9L7l6k2lk1k5M1K1L%l0k4rK5lK7pJ4k2k7j6nrN2kj5J0j1k0j6K0J1PPMk9
3596d4j7L6j5pM3J0Kkk8J0J7lJ7N4k0K7l2j9j6QK6K5kJ2k6k2J6Ql1M4OqRo2LO
3632B5qJ8NK5m5%m2k3NJ2J5Jll2k8LPj4K2rL0j4k4k7RJ6J4RL0rl9l0QL1L5K2j8
$$ y = [79, 77, 108, 91, 76, 36, 26, 29, 72, 61, 91, 78, 70, 33, -2, 26, 51, 45, 49, 45, 14, -1, -31, -45, -36, -18, -1, -6, -13, -43, -65, -74, -93, -57, -42, -41, -61, -67, -108, -103, -117, -77, -58, -34, -44, -54, -81, -84, -73, -50, -22, -3, -14, 2, -9, -27, -47, -23, 15, 45, 37, 24, 28, -4, 4, 28, 37, 64, 70, 96, 67, 40, 19, 6, 29, 64, 95, 87, 72, 35, 20, 15, 26, 33, 67, 47, 33, -2, -6, -17, -7, 5, 24, 12, 11, -36, -42, -52, -59, -24, 0, -2, 8, -18, -50, -54, -56, -42, -13, 25, -5, -8, -30, -54, -62, -37, -12, -7, 9, -10, -2, -8, -9, -38, 2, 14, 30, 22, 23, -7, 0, -20, 10, 12, 36, 71, 21, -13, -23, -7, 6, -3, 23, 56, 54, 35, -3, 0, -14, 12, 16, 21, 49, 28, 2, -5, -38, -14, 16, 15, 33, -4, -21, 1, -32, 5, -6, 26, 45, 42, 23, -11, 13, -16, -10, 29, 66, 30, 8, 5, -16, -41, 0, 21, 24, 24, -6, -30, -39, -14, -17, 10, 3, 17, -5, -32, -48, -53, -62, -10, -12, -27, -17, -28, -48, -64, -44, -33, -26, -19, -15, -44, -61, -25, -40, -47, -4, 6, 8, 6, -22, -12, 5, 2, 19, 73, 53, 80, 48, 29, 13, 21, 47, 72, 70, 82, 56, 34, 50, 58, 27, 71, 77, 69, 78, 16, 19, 25, 17, 35, 40, 65, 20, 20, -22, -45, -40, -28, -13, -12, -15, -47, -75, -72, -65, -79, -57, -66, -36, -50, -74, -101, -92, -76, -62, -53, -23, -32, -71, -101, -93, -62, -27, -5, -23]
3669b3J5k1kNK8PJ6K3NJ2n0J1J0mJ4M2j8J9l1ok0K7j7L8Ml1K2l6jk9J5K1l2K1
3703C4k6Mk4j1J6qK3jk5k0j8oKJ0LJ2J0k1m1Oj6L7NJ9j6Jj0%pJ0L4pJ1J7k1j3
3739c7MLlN0J2%j1l3J1lL2J1MPj0kJOl6L8K6kk9Nk1Pj1K4%mk1prrJ0J0J2Rjl3
3779@nj5rJ1J2Ql9L1k3m0RL3K6k2KJKj5lk3K3L7j7j5Mj8k2L5j5L0K0nj1k8KoL7
3816hpL4j5mk6j0J8j6L5J4j0J4j7L1jk8J4J3pL0l2KK4n0K8NN5l4kj0k6K1k0L1
3850D6pMMjl5j0QjqJ4qj6J9l1oK1njK3k9Jk6%K0k9L1Oj4j3j6J4K2l0K3M5l0l1
3887d6Rj1MRJ9K5K1j1k5j1PJ1PL5l1L0l4Qj7J7QL4J7l5j0mj1K0l4M6j7J5oj8j0
3922A1kk8K7Mllk3oJ0oK7J4j2J2m6J3j2NJ0JPL4l2k7J7j1j9O2l4NJ1j5%j9j0p
$$ y = [-23, -8, -29, -31, -26, 2, 9, 25, 48, 53, 65, 15, 26, 36, 32, 46, 88, 70, 89, 58, 52, 32, 59, 42, 80, 84, 53, 75, 39, 38, 9, 24, 45, 13, 34, 8, 12, -12, -23, -7, -15, 8, 7, -18, -38, -56, -62, -60, -50, -47, -35, -25, -46, -87, -81, -97, -60, -55, -36, -52, -51, -61, -61, -68, -58, -24, -31, -20, -3, -24, -37, -33, -30, -33, 17, 29, 29, 18, -15, -4, -7, 25, 36, 40, 47, 37, 35, 36, 42, 6, 44, 70, 68, 39, 44, 23, 30, 19, 43, 43, 39, 18, 11, 2, -7, 3, 13, 25, 34, 33, 0, -5, -20, -29, -18, -6, 2, -37, -6, -29, -69, -60, -27, -1, -23, -21, -20, -18, -33, -36, -59, -36, 1, -16, -31, -27, -45, -67, -32, -47, -17, 3, -2, -13, -41, -39, -45, -8, -15, 19, 4, 0, -26, -36, -18, -34, 1, 15, 5, 19, 2, 33, 32, 4, 18, 31, 24, 54, 22, 24, 48, -2, 26, 31, 86, 52, 50, 40, 14, 35, 15, 46, 39, 43, 47, 46, 11, 1, 9, 8, 0, 14, 6, -10, 9, -22, -28, -7, -12, -13, 10, -19, -18, -44, -44, -24, -53, -22, -16, -30, -43, -59, -45, -23, -53, -30, 15, -15, -46, -37, -48, -44, -35, -16, 9, 30, 19, -6, -17, -10, 1, 8, 43, 12, 42, 8, 16, -1, 16, 24, 58, 75, 40, 30, 26, 15, 35, 1, 47, 30, 45, 39, 21, 11, 9, -19, 8, 12, 9, 6, -17, -23, -13, -19, 8, 22, 10, 22, -24, -11, -23, -18, -8, -7, 0, 34, 2, -25, -8, -19, -38, 24, -10, -5, 6, -9, -9, -28, -38, -45]
3958d5N7l5K7l3k7K7QJK%K6r%k1mK8j8K2Qrk2jj8M1mJ3J3J8n4J7Ol6N5ROKk7k0
3996CkK2j0N4kj2j8ll4kK8Jj2J9j6K1k4k7j1K4J3k8J1Nlk6k9K2J7Mj5j7Omm2N0
4032c7oJ3K3m6QJ0l5J4kJ7M1J6k6l1KL2nJ2L5Pl3%l6QM8JJ4kj4J5j6lK7l1QK4
4068E2MpLn0J6K3J4Jqj6m2K1j1%J3J7m2L1m4J2l1K4k3L4Pl1j4Jqj5J1KM6nl7J7
4104c5j1k9N3jpK0j0Qj3jJ6RJ9OmQn5J9kK6K5kk7J0j7J7kLQqRj1K8o1qL3J0qJ8
4143C3j1k7J6nk8PPMmOKk7J2oJ9K0k9j3j4K2p%KL9j5NKLKoJ3qK1k7J7k7j9J9m
4182fJ1J9J1k6j0l4OL5k8L4Jnk9qJ1l5L0L6j3J9l8k5oQJ7J0K5l0JpkpJ5J3k1L3
4218EJ6ll5K0KNOj0K3j9J9l8K0RK4kJ4l3Lj1J3J0K3k5J1j3qp%k5J6RKK2l8l1J0
$$ y = [-45, 12, -23, 4, -29, -56, -29, -21, -20, -18, -18, 8, -1, -1, -22, -26, 2, -16, 6, 14, 5, -17, -18, -36, 5, 1, 14, 27, 45, -9, 8, 14, -22, 33, 42, 48, 50, 23, 3, 1, 23, 13, 67, 65, 53, 35, 32, -2, -4, 24, 25, 13, 32, 16, 37, 13, -14, -25, -1, 12, -16, -5, 0, -3, -29, -58, -36, -19, -15, -30, -47, -41, -45, -87, -37, -43, -30, -7, -53, -45, -35, -70, -56, -58, -41, 0, 16, -10, -41, -39, -7, -12, 0, 35, 42, 9, 9, -27, -19, 29, 30, 44, 42, 28, 43, 27, 24, 51, 20, 28, 52, 56, 49, 52, 2, 18, 41, 55, 56, 48, 32, -10, 11, 0, 0, 13, 30, -12, 19, -25, -13, -44, -20, -43, -9, -2, -33, -47, -46, -54, -69, -58, -56, -10, -15, -52, -35, -46, -75, -22, -23, -30, -10, -20, -12, -25, -26, -10, -1, 18, 24, 20, 28, -27, -8, -10, 16, 41, 39, 12, 22, 5, 22, 20, 23, 31, 23, 32, 21, 49, -12, -20, 13, 23, 15, 33, 22, -5, 11, 6, -22, -15, -8, -4, -8, -2, 0, -27, -15, -21, -2, 18, -11, -24, -38, -16, -23, -23, -21, 18, 3, 8, 10, 13, 15, 9, 22, 14, 35, 8, 25, -2, -21, -2, -6, 5, 24, 35, 9, -1, -35, -29, 6, -22, 12, 13, 8, -21, -29, -18, -53, -23, 13, 0, 19, -19, -44, -50, -42, -25, -15, 10, -20, -19, -26, -28, -35, -20, -7, -28, 5, 21, 18, -17, 3, 5, 10, 16, 6, 29, 10, 29, -9, 11, 20, 44, 42, 56, 23, 26, 15, 28, 38, 61, 36, 47, 34, 26, 19, 19, -6, 10, 19, 21, 43, 5, -26, -16]
4255a6ll1L0oj7Jj8kK8k8jJ9Kj7Pj6J2KJK0JJ6l7QQL3j3M2k0lmJ4k2K5j0L7MJ2
4293E8k2%Rjj7J2J8Kk1K0j3j0KkLmK9l2jl2PjljK3k0m3L2k5pK1l0M6l8OKk2J2
4331d3NRJjl4J7K1l7L2pK3rrpJ4QJ7j1K5RqJ9j7k1J8jpK3k4M5k8Rl4M8l2K5nJ6
4369D9k3J7m2L5k5nJ3pJ7rj5k9K2qL3k9Mk3PpJ1j5K9nk3pj8L0KJ6k3L8l2lK3j6
4405a8lJ1L0lQk2k0L0J0rk5M8pj6k2J3mMJ2nJ7K3n2rPK3l3K9opL6l8j2j8K2L0
4441B4j8K3k7k3Qj5K0J8j7K0mrqJqJ3NoKJ1j0Rj3J9k8L3rpK3rpJNNoKkl4j3L1
4481@K3j7K1l3J8k4J4j6K0k8M6j8j2j1kJ1l3K8K2j1j4J4k6%K0j9L3J5l8j3K2j1
4513a9L6j4nJ1Mk0%nj7J8L9k3NoNPpPOj1J2Lk7K6k1JK2j6K4k4J2mj5k0K1J1J%
$$ y = [-16, -19, -50, -20, -26, -43, -42, -60, -62, -34, -62, -63, -44, -42, -59, -52, -68, -56, -54, -53, -33, -32, -16, -53, -45, -37, -4, -17, 25, 5, 2, -2, 12, -10, 15, 5, 42, 46, 58, 36, 36, 45, 44, 27, 39, 57, 59, 38, 58, 45, 35, 37, 35, 38, 34, 63, 31, 30, -2, 5, 4, 1, 0, 23, 3, -40, -8, -33, -40, -19, -49, -3, -41, -35, -33, -55, -43, -38, -29, -28, -29, -63, -46, -25, -62, -30, -37, -14, -23, -32, -39, -25, -17, 0, -11, 14, 23, 15, 34, 17, -4, 14, 13, 6, 29, 5, 50, 22, 31, -3, 45, 13, 38, 33, 49, 26, 43, 1, 36, 11, 6, 19, 12, 29, 20, 5, -24, -2, -10, 23, -6, -2, -25, -18, -25, -14, -29, 0, -5, -28, -35, -53, -23, -21, -5, -28, 10, -22, -25, -2, -18, -21, -10, 20, 17, 25, 3, -17, 13, 23, 14, -11, 37, 30, 14, -8, 5, 1, 5, 17, 12, 29, 52, 0, -9, -2, 21, -12, 17, 11, 4, 40, 2, -10, -28, -6, 24, 6, 29, 2, -21, -13, -28, -8, 10, -7, 13, 9, 0, -8, -7, -15, -2, 3, -3, -1, 10, 0, 9, -4, 15, -13, 20, 11, 4, 27, 18, 11, 12, 17, 22, 16, 18, 16, -18, -31, 0, 23, 6, 27, -6, 12, -12, 2, -14, 6, -22, 24, 6, -6, -17, -19, -8, -41, -13, 9, -2, -16, -2, -28, -28, -8, -27, 6, 21, -17, -30, -8, -19, 17, 3, -2, 9, 13, -7, -7, -12, -29, -11, 28, 5, 10, 4, 9, 16, 9, 16, 22, 11, 23, 26, -1, 25, 4, 5, 27, 11, 35, 11, 23, 19, 4, -16, 5, 16, 17, 17]
4551A7ok3KJ1Qj6K7m0ml%lkQ%L3j5j9j6JJ5KK1J4J9j7m6J6K2j4lJ4K3rl0jL6l4
4589a2KK3mJ2j8K5jl9J9K5l7K2NKl0K5mlQK4k7l0J0j3K6Jk9L0jk7K4l1J4oJ3m
4625fjkJ2k1j3J2j4J6%klK6k2J1Oj9MQ%J0k0J0J7pLj6L5k1j7L0Pj3K5j0ok8PQ
4663FnK5kj1j4lJ8k3K5lnJ2Qj7J1j4Lj7J3PJ1k3mRk7RJ4lrPj8K7j5mjrK9k0mk6
4703d3K2jRjLJ0Ol3mK5j4RJ7l2J6MNm5J6J6J3KJ4mm%pPNLj4J2J0j7oL7j0mMJ3
4743C9k8Qk6nJ6Kj2K8pJ7l3K1k0Lj2K5j0k9QRJ0pJ4j7rK3l0j4J5J2j9L7k8K1o
4778dl5J1kJ8OJ2j6j5pJ0lK5pJ0Mj7PK3l7M4k7K5nkj6K3j5Lj1J9K6j0k4Qmk1P
4815CK4j5mj0K4k6j4L2MRl4j4j3j1N5k5kK9k6l%km2N7rJ6ok6J6qRJ6omJ9j6J6
$$ y = [17, 11, -12, -10, 1, 9, -7, 20, -20, -24, -27, -27, -30, -32, -24, -24, 9, -6, -25, -41, -40, -25, -23, -2, 12, 31, 14, -32, -16, 6, -8, -11, 3, 26, 17, -13, -14, 22, -12, -10, 13, 9, 21, 3, 28, 27, -12, 7, 32, -5, 17, 22, 24, -6, 19, 15, 12, 20, 44, 17, -13, -3, -16, 10, 11, -18, 12, 11, -16, 8, -23, -9, -15, -2, -6, -7, -9, 3, -18, -31, -19, -33, -17, -17, -19, -22, 4, -18, -7, -1, -20, -16, -8, -8, 2, -18, -8, 9, 2, 5, -11, 24, 3, -14, 16, 23, 10, 35, 25, 19, -9, -2, 6, 1, 26, 24, 13, -1, -4, 14, -9, 16, 13, 8, 20, 28, 11, 22, 8, 11, -6, 7, 14, 25, 2, -2, 7, -20, -11, 3, 0, -9, -2, -20, 7, -8, -12, -13, -22, 7, -13, -17, -43, -21, -22, -13, -14, -11, -1, 5, -28, -32, -7, -21, -12, 5, -27, -11, -7, -2, -47, -31, -15, -2, 0, 14, 10, 6, 6, -1, 6, 11, 14, 0, 12, 22, 5, -1, 36, 26, 22, 26, 39, 11, 19, -7, -12, 4, 6, -6, 22, 15, 32, -1, 20, 0, 3, -9, 16, 6, -23, -15, -6, 4, -3, 11, -6, -15, 8, -22, -36, -21, -9, -28, 9, -19, 2, -4, -39, -28, -30, -12, -6, 6, -10, -25, -32, -22, -25, 0, -7, 3, 7, -10, -3, 20, -17, 27, 0, 25, 20, 18, 2, 25, 10, 13, 2, 21, 47, 37, 13, 21, 17, -4, 3, 27, 12, 8, -2, 22, -4, -18, 14, 18, 27, -7, -21, -34, -45, 10, -15, -17, 12, -14, -17, -17, -19, -61, -4, -13, 3, -3, -29, -13, -21, -12, 4, -2, -6, 13, -3, 13]
4852A3j4OJ2Onj1J0J6m4OLj1M3ol6K2Ok7kJ9J9k6K2rl3pJ9K4l1K3jkj1j2K0jO
4889F%orQ%Kj4%lQJ6mmJ0Lk6J6K7Ll6J4Qj8kJ0LJ8k1j0Mj3L5n2K3J5lk0oJ3J4
4929Irl2M7lJ4o9K3J6k2j6J9L8k6pk%j4j3L7Ok1RkMj5J7ONJ4LkoKl6L8J2MnNJ9
4969D7j6J0k7J0K1J8m2K5rj1J3rj1L0l1J8j5k9L2k1j0J2j3j2j4J9k2QJ5j8Nj2
5001c9Noj0lK4Qmj0pOJK4pJ0mJ2j1oK1J3KrJ5rk3OJ2j7L6j9J5j3J3J0OKj2j4K4
5040D2Mj4j%qj2K4j0Opk6K0j3Pj3k0J7k6J9K5l1k9L5j2j3K5k4lRrRj1RKL0l2J2
5077a9Qj7J5qj0L2j0Noj7L8j2J8NJ6j2l5K2j3QK2j3J5k2Kj4NJ8J2%j4%Ol2J9j0
5113BJ8qk8K7l3jRK2l9J8J9j2Mj3J5oLj2PPPQl5PNK9J4m5lJ3pJ2qj1L2j2nj7K1
$$ y = [13, -1, 5, 17, 23, 18, 7, 17, 33, -11, -5, -2, -13, 30, 24, -12, 10, 16, -11, -13, 6, 25, -1, 21, 12, -21, -28, -9, 15, -16, 7, 6, 4, -7, -19, 1, 0, 6, 6, 0, -9, -1, -1, 1, -13, -13, -16, -8, 8, 4, 0, 10, 13, -13, 3, 30, 33, -3, 11, 19, 1, -1, 9, 12, 30, 9, -1, 3, -10, 25, -27, -4, 11, 8, -12, -18, -5, 9, 0, -32, 15, 12, 26, -43, -20, -4, -26, -42, -23, 15, -11, -18, -20, -20, -34, -47, -10, -4, -25, -16, -18, -14, -29, -12, -6, -1, 13, 16, 14, 8, 10, -26, 12, 24, 28, 23, 28, 47, 31, 41, 14, 24, 45, 63, 21, 46, 37, 26, 39, 30, 19, 49, 18, 36, 21, -8, 24, 3, -7, 5, -8, -20, -34, -15, -37, -29, -14, -32, -27, -39, -34, -40, -50, -53, -29, -21, -25, -35, -42, -36, -35, -11, -18, -8, -12, 0, -11, -17, 4, 17, 19, 10, 25, 16, -7, -1, 11, -6, 30, 11, 26, 13, 26, 36, 42, 44, 32, 18, 42, 46, 32, 31, 31, 23, 11, 35, 25, 31, 24, -2, 18, 5, 12, -1, -21, -4, -30, -11, 14, -17, -46, -11, -23, -36, -11, -35, -38, -29, -38, -29, -40, -31, -29, 1, -31, -19, -11, -28, -13, -21, -31, 1, -9, -4, -10, -27, 11, -1, 17, 22, 38, 26, -9, 13, 0, 8, 30, 17, 32, 10, 12, -2, 3, 21, 33, 33, 19, 19, 25, -7, 12, 2, 20, 12, -16, 11, -22, -23, -14, 8, -31, -13, 6, -6, -2, -15, 0, -6, -3, -15, -8, -1, 6, 14, -21, -14, -9, 20, 34, -11, -14, -1, -8, 4, -4, -15, 17, 5, 0, -17, 4]
5152D%j2LJ3K6k8J3m5L9k7%J7k3J0QJ3lk3OK0k8PP%Mj4Qk3K8nkLj1Rk2MJ3lQO
5192@jkK7j2j3K4%k8J5K5k5j6K6J9k5J8l3K2j0J4mqL0l8L6l6%J7l8J4J9k3nL1
5226B0m0oK0j0PoMnK2l8KNLnoK5k9mJ3NRj9K3k4K3jJ1k2J3J1J0nj7%K8n%OJ2o
5266B4LqnK5lPk5PJ0J5k5j6QrJ7jkpJ5l6L2j8K2prpk1jkK5l3kRMqj8MJ4J3j0j0
5307b9J1jk3qJ3J3Kk8M1k2J4Rl3K0M7m1K2k2J6qOJ4j9J8RJ6Qm3L0j7J2mj0L2l1
5342A4PJ6j6j8M6k9Mj1lL0k2Kj4J3kpJj4Oj6jJ8k0L5j1k5jJ3j2nj3L7NJ0j2k4
5378a9PMj8J8mJ3l7K4K2l1J7qj3J5J1pqoK%Kj1L8jk3J2j9K4k0J8J3k3K5j2NLj6
5415cK6pPl2KJ9l1L0JK1j2l6K5qj0K5j0j4nK3j1J5j4K5k0J9LJl6MJ3qJJ4l2K8
$$ y = [4, 4, -8, -5, 8, 34, 6, 19, -26, 13, -14, -14, 3, -20, -10, -2, 11, 8, -15, -9, 11, -17, -10, -3, -3, 1, -13, -5, -28, 0, -5, -7, -4, -15, -6, -28, -24, -11, -14, -6, 0, -1, -3, 24, 12, -1, 23, 23, -5, 10, 35, 10, -6, 20, 39, 14, 32, -1, 21, 11, 25, 21, 13, 43, 5, 41, 5, 5, 22, -16, -2, 17, -6, -11, 20, -20, -26, -6, -16, -9, -15, -11, -16, 6, -32, -30, -25, -22, -27, -33, -8, -37, -41, -28, -23, -14, -33, -10, -34, -11, -12, -1, -23, -10, 1, 11, 6, -11, -11, 17, 12, 12, 18, 30, 24, 27, 19, 14, 39, 36, 43, 18, 25, 35, 50, 25, 9, 17, 8, 25, 24, 22, 15, 30, -6, 26, 8, 30, 23, 14, 7, -14, -15, -17, 8, -25, -27, -18, -14, -22, -40, -36, -22, -9, -19, -29, -18, -19, -42, -50, -37, -24, -22, -50, -9, -31, -17, -8, -41, -21, 26, -15, 7, -15, 1, -7, -1, 13, -6, 12, 21, 37, 45, 2, 32, 15, 27, 23, 13, 45, 14, 21, 37, 21, 3, 49, 20, 24, 13, 10, 40, 18, 20, 6, 19, 17, 10, 11, -3, 3, -13, -14, 4, -16, 19, 8, -17, -18, -5, -17, -22, -35, 2, 7, 17, 5, -19, -12, -8, -26, -8, -12, 1, -36, -12, 10, -21, -4, -12, -25, -10, 1, -6, -14, -20, -18, -18, -16, -27, 11, 10, -13, -1, -20, 4, -16, 2, 15, -8, 17, 5, 10, 13, -3, 23, 16, 23, -9, -7, 12, -19, 11, 12, 33, 21, -15, 10, 2, -8, 17, 7, -7, -12, 11, 0, 15, 1, 26, 6, 25, 28, 29, -7, -3, 10, 2, 3, 17, -15, 13]
5451A3kk5J2POj2rnLj6RJ3j3lNRk1J8KK8j6Pk0Knj2J5mJ5l9L0J9KNl5MQJ5%J1
5491B1Jj5k8LK0j1Q%mMrJ6j7M0l1L6mj4j3K9k6J0MOk3j0QJ6pmk7J4QmKN%%k8J2
5531a2J7qm%nOk6QJ6kNJ2k8j%J1J4l5M1ok5J0klNJ5m4K2L6k2oPRK0k7J7j1Jrn
5571iK6k5K7Pok6K3plJ1j4L1k1J2J3l6QRJ5pjl2K1oj9JK3jk9K2J4l1LRPK6l4N
5609Fnj0plK5Klk1Nj9nLJ7JnlnK8k5J4Jnj7QJ3Kmj9L4j1lL1qkRoJ0Ok2J7pJ1j1
5652A7jmRk0L8l7L5l0%mJ0OKnj6mJ4Ok9J5J5j9j4J5k4K0j7J8mk4Qj6Q%PMMk4M4
5691CK3n7jJ7j6QM4m8L3l5PPL0l8N6k8JJJ5j7j5RjRNj3J6Nk0K1k0J4rLj4OkQr
5730bMj3J1Nj6qnK3PJ2l0J4j9nK0mJ3lk5OjJ7j8j2J6J9J6k0mj4K5Nj1j2K8j5J5
$$ y = [13, 11, -14, -2, 5, 11, -1, -10, -15, -12, -28, -19, -6, -19, -22, -17, -8, -29, -11, -9, 19, 3, 10, -10, -8, -13, -25, -10, -14, 1, -38, -8, 11, 13, 18, -17, -13, -5, 10, 10, 21, 22, 7, -21, -18, 2, -9, -1, -1, -5, -1, -10, 6, -11, 29, -2, 34, 30, 16, 3, 32, 6, 16, 20, 26, 3, -7, 1, 17, 10, 6, -21, -7, 1, -3, -1, 4, 4, 4, -24, -12, 5, -3, -7, -7, -12, -6, -32, -24, -8, -10, -5, 7, -21, -22, -22, -11, 3, -32, 9, 3, -22, -12, -14, -17, -12, 3, -41, -19, 17, -5, -11, -4, 5, 25, -2, 15, 4, 5, -4, -9, 17, -8, 19, 26, 20, -6, 17, 10, 7, 18, 4, 35, 14, 26, 39, 3, 11, 20, 35, 28, 27, -5, 16, 10, -9, -8, 15, 14, -15, 7, 21, -10, -7, 2, 9, 35, 1, 6, 1, -9, -16, -19, 6, 8, 5, -16, -11, -30, -35, -32, -15, -14, -19, -22, -27, 1, -24, -10, -9, -14, -31, -23, -10, -8, -12, -31, 3, -8, -11, 20, 12, 10, 19, 13, 23, 29, 7, 24, 17, 28, 17, 16, 12, 21, 1, 39, 2, 37, 7, 7, 3, 13, 19, 21, 16, 0, -4, 10, 16, -13, 2, 17, -2, -16, -1, -25, -5, -22, -4, -8, -32, -24, -40, -32, -32, -25, -21, -17, -41, 3, 26, -31, -32, -15, -31, -23, 21, -27, 6, -29, -22, -15, 15, -23, 33, 5, 6, 7, 22, 5, -10, -1, -2, 7, 12, -1, 15, 20, 0, 21, 1, 15, 6, 9, -5, 1, -1, 7, -2, 2, -11, 0, 5, -11, -19, -24, -1, 6, 18, -12, 2, -17, -22, -2, -6, 7, 4, -21, -15, -16, 1, -17, -29, -13, 6, 22, 2, -2, -16, 9, 14, 3, -9, 19, 4, 19]
5767A9j7NMNqLmJ6m%j5j6J5j2M4l6mj2Rj4J2j1M4n6Mj2L7l3J7J0mnLJ0j3j3K8
5804dj3K4ok5M4m7J9qRLjj3L1ko%KK5j5k6QJJ5mj1K4k4L7m5K2qqnL4oJk6j0Pr
5844a6J9j7J7j3qJ8j7lmJ4k1MLLJ8j9k0L4J0j8OJ4l6K9l4K6%KK0Jk1PKOJPMQk2
5883DjPj1J1LrK3j0j8K7m6L1Jj5K8lk4%J9k6J8mmMj2qLNJ3k4M0l7Mj1oK1k0J0
5921a7ljRJ2rLj6J6j7kj8L3PrlK6jk5J9k3J4k7K5KK1Rk7%%J0J6Lmm%k1mMOqK5
5962B1Nk9K1j7J2j8nJ4j2J0k2K5l0J6rLk0L4nkl%nk7K8Jj4J8J3J0j4l6L1qL7M
5998B7qk7J5J1kk2J1J7lKj4j1JmL6jl3J9Jj3l0K7J8j5j6nL8l3J9l6N8k6J4rj9
6033a3jmOkj6K7mj4J0j3K7opj2M2l4pK2J0j3K4l6K2l2K4ll4P1k0j6j3M1j4l3J2
$$ y = [19, 2, 7, 11, 16, 8, 11, 7, 23, 19, 19, 4, -12, 3, -9, 35, -1, -5, -17, -8, -22, -10, -21, 23, -33, -29, -41, -4, -37, -20, -10, -14, -19, -16, -6, -19, -32, -4, -17, 7, 1, -24, 20, -27, -8, -16, -7, -4, -5, -18, 13, 11, 5, 5, 7, 32, 17, -9, -1, 0, 15, 11, 0, 24, 0, 37, -8, 14, 6, -2, -7, 27, 21, 22, -4, -14, -7, -16, 3, -14, 3, -10, -18, 0, -17, -20, -24, -10, -31, -27, -24, -21, -3, -22, -42, -8, 2, -16, -10, 4, -32, -3, -37, -11, -11, -9, 11, 12, -9, -2, 0, 6, 7, 14, 18, 26, 4, 3, 10, -1, 10, 13, 4, 27, 17, -1, 26, -20, 11, 12, -3, 25, 22, -2, -2, 17, -9, 9, 5, 1, 5, -7, -15, -12, -7, 6, -18, 22, -15, -11, -22, -28, -7, -27, -17, -20, -21, -12, 0, -9, -6, -22, -6, -23, -25, -43, -10, -3, -12, -15, 11, 10, -15, 4, -19, -5, -32, -7, -5, 16, 25, -2, -2, -2, 8, 24, 27, 23, 19, 19, -2, -6, -2, 4, -4, 21, 26, -3, 18, 1, 13, -5, -10, 4, -8, 2, -20, 5, -25, -9, -18, -15, -35, -1, -6, -8, -11, -11, -16, -43, -15, -14, -28, -10, 3, 13, -1, -37, -6, -14, 23, 27, 19, -8, 7, 18, 16, -6, 5, 22, 19, 21, 7, -4, -3, -7, 29, 28, -5, 14, 15, 2, -28, -1, 17, 2, -14, -19, 19, -14, 5, -31, 27, 1, 15, 6, -13, -14, -18, -12, -14, -30, -3, -7, -21, -11, -24, 3, -3, -10, -22, 20, -14, -21, 1, 11, -2, 22, -14, 8, -24, 0, -3, -37, 34, 14, -2, -15, 26, 12, -21, -9]
6068iQNrPj0L6l2K4j5j3kKNJ4k3j1K4j9LQrrK4kj6oJ5jj2J1j0J7j9NJ7rK2l3K5
6107Cj7K0j3qL0nj6L7m2K9j6mpRJJ1pmmOk1L2k9K7k5K1J2j8J1j1j8J3J2l2N4m8
6143a7M3l8K1Nj8j3J3J4k9RJ1nMj1KQj8j0KJ9pJ9kk9J3%J4k1J9J2Qk7jRmK5k1
6180aJ6l3QK5k0J9j4K2ppJ1rJ5j5%J0j3j3J8k7KJ5ol%lK5j1Kopk2L2k9J4mn3O9
6218@l0J4j9J5K6k2rJ3k9L2LkPLk3K2k3K8Rj6j0qL0rjpKJ3k3M9l7J6J7j9jk9L7
6255A9qJ0k9NrK3k5J3J4l6J7mK3k0K1j7j0jqJ6K2l4Pj5OOJ3j3j0J9j1Lk3K2j7
6290c1QpJ9QoRj5K0jKj6j0nL6Ml4J2lJ3%PloQl4K2L3j4pJ0pP%qk2L3k6j1K6Pp
6331A1Kk4J5j0JpJRjqPj5%ML2k9k1J3mM0l1mMKKk3KJ0qJ9lJ0J3l1L1opJ8j2PJ
$$ y = [-9, -1, 4, -5, 2, -8, 28, -4, 20, 5, -8, -10, -8, -3, 11, -12, -23, 1, -18, -15, -7, -16, -25, -1, -3, -19, -25, -10, -11, -23, -12, -22, -5, -24, -19, -2, -11, 11, -22, 3, -14, 6, -7, -15, 15, 10, -6, 31, -11, 18, 2, -2, -9, 0, 1, 12, 5, 1, -3, 3, -18, 14, -15, 12, -13, 8, 20, 2, 13, 2, -16, -3, 9, -23, 31, -17, 26, -12, 9, 14, -4, -17, -4, 10, -19, -10, 1, -4, 0, -11, -9, -1, -19, -29, -27, -8, -15, 4, 2, -27, -14, -14, 0, -21, -2, 10, 18, -9, -10, -1, -5, 20, -1, 15, -18, -10, 15, -5, 14, 0, 22, 15, 8, 19, 10, 25, 10, 10, 20, 7, -6, 12, -15, -13, 2, -4, -7, -7, -10, 15, 4, 6, 0, -7, -29, 3, -26, -12, -16, -69, 0, -30, -16, -35, -20, 6, -16, -25, -12, -41, -9, -6, -8, -1, 2, -21, 1, -22, 6, 15, -1, -11, -19, 11, 2, 1, -6, -4, 9, -14, 35, -2, 14, 31, 12, 11, -18, 19, 11, 21, -8, -3, -12, 11, -14, -1, 13, -23, -6, -10, 13, -7, 14, -3, -13, -14, -22, -6, 16, -18, -11, -26, -20, -14, -1, -14, -24, -5, -16, -13, -36, -14, -31, -23, -30, -11, -3, -9, 0, -15, 5, 4, 6, -10, -20, -25, 11, 15, -19, -7, -10, 3, 3, 10, 7, 1, 9, -25, -3, 30, 16, 9, 19, 12, 19, 19, 11, -11, 22, -4, -15, 11, 18, 11, 13, -11, 4, -6, -5, -12, -11, -2, -3, -11, -4, -19, -19, -15, 17, -12, -33, -20, -24, 16, -15, -19, -15, -13, -11, -34, -32, -22, -30, -11, -14, -4, 9, -22, 9, 3, -4, 14, 2, 9, 10]
6372A0Rj7LnLkJ6k5J9%K0j7J8l0J0J0j4J0j4j6K6j8j4L0qk0K2j0j1K7k1j0J8L
6406Bk8J3j4QOk4pL5m%J2nJ2rj2nML6l8J3nRrK8KOqJ8j7pj0lJ0m0L3mKJ7j1Oj1
6447AJ2MMj4LlmoOmLpJ2j4j5KJ1k0mL5k8OJ3J5l4K4j3K3j3J2j2nPNK1oqJ1j8j9
6487a7M7j4rK7j3K1j7k3J6pMk2L6j2lK0k4Rj7Omj6jj4J9K6l4Nk0PJ1j5J6pqJ4
6523a3k5NJ3prj0M7l0kK8J5j3lK2j7Mj8L1j4NNPl5nJ9N2m1j0J0KJ1Jj1K4k1l1
6559a4M3j6%KjpK2l2oM8k5j0lj5J8MJ0l6J0pLj0mJ3K8m0K6l4K5k4J6j2J3rKnN
6596b2qOK6l0J8K9j2pJ4mj2%Rj1RJJ2l2M7l6K2j4JK4pj8Rj1K6j8%Rk9M1m1L6l2
6633eRkj7J8Qj9K0k4MKk8J9pKL6l9J1OPoL1m4j0J9pj1J0M%lj0POMK6rlO%j9J4
$$ y = [10, 19, 2, 5, 0, 3, 1, 17, -8, 11, 11, 31, 14, 32, 2, 12, 22, 8, 18, 4, -12, 14, -4, -18, 12, 4, -16, 6, -4, -15, 12, -9, -19, -1, 2, -26, -13, -27, -19, -13, -37, -44, -9, -13, -13, -1, -6, 6, -3, -15, -20, -16, 20, -18, -5, -10, -1, -10, 18, 20, 26, 18, 36, 19, 12, 2, -1, 9, -31, 2, -2, 0, 17, 6, 12, 1, 13, 17, 21, 7, 10, 7, 3, -3, 3, -1, 2, -5, 7, -7, -22, -20, -9, -29, -33, 2, -26, -20, -7, 8, -26, -2, -15, 8, -5, 7, -5, -10, -3, 2, 23, 17, 9, 20, 2, -17, 30, 16, 7, 34, 21, 42, 25, 2, 18, 11, 15, -7, 29, 17, 14, 34, 10, 19, 2, 8, 4, -12, -13, -27, -8, 18, -16, -11, -31, -24, -13, -28, -12, -19, -27, -13, -38, -33, -20, -27, -36, -46, 1, -29, -31, -3, 12, -1, -4, 18, 1, 5, -13, 18, 4, 9, 14, 21, -14, -19, 0, 52, 11, 1, 11, 13, 24, 25, 14, 38, 17, -14, 29, 13, 13, 15, 14, 7, 29, -3, -9, 39, 14, 4, 1, -14, 4, 8, 18, -18, -8, -15, -12, -22, -26, -13, 15, -25, 1, -33, -8, -32, -16, -28, -15, -24, -22, -27, -22, -30, -24, 2, -28, -10, 19, 7, 0, 14, 10, -2, -2, 7, -4, 5, 6, 18, -14, 33, -3, 19, 5, 6, 30, 23, 5, 14, 3, 29, 11, 11, 20, -9, 32, -9, 27, -5, 4, 2, -15, 3, 11, -8, 12, -12, -8, -6, -34, -15, -22, -20, 16, -23, -12, -6, 1, -5, 26, -18, -28, -9, -16, -27, -17, -13, -13, -16, -26, -19, -13, -9, 17, 8, 5, 11, 11, -8, 6]
6674Fkmj3L4k2K3j8K0MLn4K9J1qojL5j8j2J1kkk2J1MprLJ3j1NJ7k9lkJ1kmM8k0
6714A7l1j4rN0l4J1%J1%mj8K6J0qjJrRj5L7%J0l1K%Ok2K2J5m1OK5k3Qj1j0LnK9
6753A2Rl6J4j4Qj1nL5k6J7k7K4j4NJ3k9PJ5Lj6PNqk3K4qK5j7rK9j3L0l4J7lJ6
6789B2kJj7p%K1qNj8K6%k6LJ1l0N2l9PkK0j6OqrL7l6mLk3K3Ok5K2kj4K2pj6K0
6828bj6%koJ3K1p%j3nNJ4k4J1JKK8pmjj0K3r%k1L0qMj7K3KOMl1%K7pn7L7J6qj8
6870fJ5NK6m3j9L3k7JlRj2kL6Ol9K5l4L1j5JknKJJ7l3J7Rj6K3l4K3nJJ1LJ0kN
6909A3Mr%j7%K8k5%%J9JJ2n1K2OPKj6J3J2j4PoQj3mkRj1J4j6k9L6NNlJ5k5j5J7
6949aj6OOjKRqj2k6L3Lkll5J9J7J4k4RlPlJ0k4J4qOLlL2k2J1%j5mL7l1K7nMk9
$$ y = [6, 4, 0, -13, 21, -1, 22, 4, 24, 28, 31, -23, 6, 17, 9, 3, 2, 37, 19, 7, 18, 16, 14, -8, 3, 7, 0, -9, -6, 7, -4, 1, 18, -11, -14, -16, -5, -7, -11, 37, 17, -14, -28, -37, 13, -21, -10, -10, 1, 1, -3, -21, 5, 15, 7, 6, 7, -2, 7, -8, 29, 29, 39, 8, 10, 10, 16, -6, 16, 31, -10, -4, 21, -2, 6, -5, -15, -12, -17, 12, 21, -15, -1, -15, -7, -18, -23, 12, -14, 3, -24, 0, -14, -9, 4, -25, -18, -3, 0, -16, -9, -4, -12, -35, -11, -19, 6, -11, -20, 9, -4, 26, -8, 9, 6, 22, 20, 21, 4, -3, -3, 18, 10, 15, -3, 23, 23, -3, 0, 11, -19, 33, -6, 1, -1, 19, 3, 9, 1, -8, 29, -7, -11, -8, -31, -8, -2, -27, -5, -7, -21, 1, -6, -22, -2, -18, -18, -20, -26, -13, 8, 1, 1, -12, -17, -12, 2, -22, -11, -10, -8, 20, 13, 9, 8, -2, 21, 12, 12, -9, 21, 13, 17, 0, 23, 25, 31, 35, 4, 4, 31, 24, -33, 4, 20, 12, -6, 9, 14, 40, -3, -22, 11, -16, -15, -18, -9, -21, -23, 13, 19, -20, 5, -29, 2, -13, -12, -14, -19, -17, -16, 1, -32, -15, -6, -22, 1, -33, -10, -15, -14, -3, 0, 10, 8, 13, 17, 8, 8, -9, -9, 19, -6, -6, -6, 13, 14, 26, -25, -3, 3, 10, 12, -4, 9, 21, 7, 14, 8, 16, 3, -1, -3, 6, -5, 9, -7, -36, 0, 5, 10, 7, 22, -3, -18, -1, -17, -11, -5, -6, -4, 5, -3, -15, -41, -8, -5, -7, -10, -45, -26, -9, 5, -19, -10, -13, -6, -9, 1, -23, -9, -17, -11, -8, -11, 21, -1, 10, 10, -5, -9, 28, -3, 24, 19, 23, -6]
6990fJ9mk5M5k5%j1j7L7j2qJ1NLKJj3rOrJ6l0RJ6j3oj1M5l7%J2j0LLnJ1J5rm2
7029d3M6nLJrL2l0j2K6j6K0j5J7k0kJ7jk6L2k2J7Nk1NML9n9%L7l0J1pj0J5jj5
7065a7L2k4J6J8k5K2k0pK7j4k3J1OJm1K3LK1Lm2N7l0J1rJ1k3J3K4j3oj1J1J2j5
7099BK2k1jj4J1L%llmJ8j2K9k1j0Rk3OJ7j4L1j4rj1MJ5j2NroJ3k8K2QkK2k8Ok6
7138b8K7OrK3k8K6lLkNj5jQJj9J6J2qNpk3PK3Jnlk0M3Lj4qmj2J9m2K5j0L5qok2
7179iNnK5j3Nj5j6J6J3rj2ljlJ3j5NlKnK3l0J0J1lJ5qmqJ0J5J0l2J0j5J4NnLJ1
7219Gk5L7J4m0J9J5j3%olK5OQk7j9J7J2PQk9Mjjj8kK9Jn6L4K5m4J5nqk0J0MoO
7258b0P%m6L2K3j6j2JJ3k2K7Jk5K2J6j0P%j3J9k7L0K2l1j2K4pJ8Ojj0Rj1j3j0
$$ y = [-6, 13, 9, -16, 29, 4, 4, -7, -24, 13, 1, -7, 4, 9, 12, 14, 15, 2, -7, -1, -10, 6, -24, -15, 1, -12, -18, -29, 16, -21, -21, -9, -19, -16, -13, -18, -7, 8, -1, -43, 3, -2, 1, 2, -7, 25, -5, -17, 9, -7, 13, -2, 15, -5, -7, 10, 9, -17, 15, -7, 10, 15, -6, -1, 3, 42, -17, -17, 20, -10, 1, -6, -16, -1, -2, -17, 15, -9, 7, 25, 0, 22, 2, -5, 22, 8, -15, -4, 2, 3, -38, -15, -12, 9, 12, -30, 27, -3, 8, -1, 10, -13, 0, 24, 11, 5, -6, 5, 17, 2, 24, 3, 2, -12, -1, 2, 2, -1, -4, -8, 10, -2, 27, 6, -4, 5, -18, -12, 5, -9, 22, 8, -1, -12, -8, 7, -5, 0, -9, -15, -2, -30, -8, 0, -2, 20, -8, -2, -28, -1, 5, -4, 19, -9, 17, 14, 17, 15, 20, 5, 4, 12, 13, -6, 10, 22, 14, 19, 12, -11, -4, 19, 20, 15, 12, -8, 35, 38, 24, 16, 12, 0, 19, -23, 2, -8, 27, 19, 13, -9, -4, -9, 16, 3, 8, -7, -23, -7, 6, -3, -15, -18, -19, -22, -9, -24, -19, -22, -20, -25, -2, -32, -22, -11, -14, 1, -7, -11, -19, -9, 6, 16, -16, -6, -21, -7, -2, -7, -4, 7, -18, 19, 33, -7, 12, 27, 14, 14, 8, 5, 30, 36, 44, 17, -2, 15, 27, 34, 42, 13, 17, 16, 15, -3, -5, 24, 25, -31, 3, 28, -16, -1, -6, -14, -34, -24, -20, -26, -20, -13, -13, -59, -27, -4, -20, -32, -31, -18, -40, -13, -12, -37, -15, 1, -9, -2, -2, -15, 4, -23, 7, 29, -2, -14, 10, 3, 21, 27, 26, 16, 25, 14, 1, -9]
7293iLK5jj7lJ5j1jlJ3j5JJ7n0M9j0nj2j0K9j9RjNj2Rk5J3j6K9l2K1jj8K5j4J2
7330a0j0K5j5J2j8npK1oJ7qjK1j3k2L4jj2K1lj6j1K9Pqk2Rj8JK2LkkNj4J2k8K7
7368A4l4K7Lk3K6Pj4l4%ML0l8L9j8J3l5PoJ7J6j0KJ0lj5J1NLqj3K0K9n6J3J7j3
7404gJ2KK1k5j9Qj9M5j6qPRj1oK6l9mL2k0LK5l2OJ1jpNj4R%j7J2k0J0J1rK0l5
7442c5L4j0j0QK0nnqK1j3Nqj7JJ3rJ6RnJK6j7JKj0K6j2KJ4k3Kk0JK1j2JOj1j0
7481a0J8kk4J9Lj2Rj8JqJ9lk2KOKj1K3j9K7Kl5pL8J4pJj1k9K4lrJ7Rmj2J5JMK3
7521C1k3j3J2lJ4R%ok8J5%J2j1mJ9j7J8j9Ok0K1k3k8J8J8K2j7MOj0k4K4k7lJ7
7556a0j0poNK7m2L5j3k2J6kRPL2j6jrjK2j6j6KPJ8nl2J2K8mj4oK3j6K5Jm%%j2
$$ y = [-9, -6, 19, 18, 1, -2, 13, 2, 1, -2, 11, -4, -3, 14, -36, 13, 3, -2, -14, -24, 5, -14, -5, -6, -1, -13, -4, -29, -16, -32, -3, -35, -14, -15, -33, -8, -22, -10, -20, 5, -10, 2, -16, -21, -28, -7, -13, 4, -4, -5, 16, 3, -19, 15, 14, 2, 23, 20, 4, -7, 22, 29, 21, -1, 8, -10, -9, 13, 16, 14, 12, 17, 3, 15, -13, 14, -20, 7, 10, -13, 13, 20, 6, -28, -28, -24, 6, -32, 7, -11, 2, -33, -26, -32, -15, 1, -9, -7, 3, 0, -15, -4, 1, 4, -4, -17, 3, 32, -24, -11, 6, -7, 5, 7, 28, 3, -16, -8, -27, 18, 2, -6, 1, 10, -1, -7, 19, -20, -24, 8, -12, -9, 16, -16, -10, 1, 0, -7, -2, -16, -7, -7, -24, -12, -32, -22, -11, -20, 0, -35, -1, -11, -21, -13, 7, 2, -3, -11, 10, -3, 2, -6, -23, -22, -9, -18, -2, 7, 2, 3, 29, 12, 13, 15, 5, 31, 19, 21, 35, 12, 14, -6, -5, 16, 4, 5, 11, 0, -10, 8, 6, -18, 1, 4, -8, 1, -17, -16, -24, -5, -8, -30, -28, -22, -20, -31, -8, -27, 0, 2, -33, -40, -2, 12, 5, 6, -5, -34, -10, -13, -22, -5, 4, 0, -12, 3, 4, 8, 31, 8, -5, 7, 4, 18, 27, 27, 21, -7, 8, 8, 20, 9, 5, 24, 7, 25, 6, 12, -8, 13, -10, -38, -20, -2, 20, 3, 7, 13, 3, -21, 3, -24, -27, -10, -20, -27, -33, -28, -1, -43, -8, -21, -43, -27, -29, -20, -13, 19, 3, 2, -7, -8, 14, -2, -18, -16, -9, 9, 4, -28, -16, 12, 8, -6, -12, 11, -5, 20, 21, 17, 17, 17, 5]
7595Ej2K7j0j7L3k1j1J7Lm0K0LJ9j1j4K7j6K7m2Qr%MrJ3J8ornj1J5Rl2J5jPJ3
7632Gj8J1Jj9J2kRkK9l8KJ8MlNj9KJ0k3J1kNJ9k9K6m7NL9K5m5J9jKnrQJ2rk6K2
7672Fj8J5k%j7PoJ7k1NJ9Nk2J4J1j5oj5Qmj6K7L0l5j1J6j6QJ5k0L7l3K2NmK4j8
7709A2Mj3K2k0MnkQJj5Oj3J6j3J3pqJ5k1K1Mj3KJ2k8K6j0J3j9k2J5j0LJ8j1J1
7745dQMl1K5K6k3k2L8m3J7k4M1lk9J7%j7L4l0J3PnJ7j9rJ2J2J4kk3OKRrkj8Ql
7783frJ4joKoJ2LJ5k8K4qqL3o3J8MJ8j0k1%KJ6pj2%J3K3j8J6Jj3J4k3K5l3J0N
7821dJ1Oj0lK2rj2JPj5QkK2jl3N4k6k1K3J3km2L6k3j4K3k2K1J4k3j2JPJ2qlQk2
7859a8j0J5rJ8j9J1kkJ4j8jK1J9j2j4J1l8L2j1RJ5k2LJ7kj5J0qNj0J0nLL7l8n
$$ y = [5, -7, 20, 10, -7, 26, 5, -6, 11, 14, -26, -6, -3, 16, 5, -9, 18, 2, 29, -13, -5, -14, -14, -10, -19, -6, 12, 6, -3, -8, -19, -4, 5, -27, -12, -13, -6, 7, -11, 0, 1, -18, -6, -8, 1, -1, 28, -10, -8, 10, 14, 11, 16, -3, -1, 9, -14, -3, -5, 0, 19, -10, 16, -31, -26, 13, 38, -7, 12, 11, 13, 8, -1, 7, 19, 10, -16, 6, -12, 3, 1, 1, -16, -9, -15, 2, -19, -14, 5, 10, -12, 2, 13, -2, -8, -23, -15, -19, -35, -8, 22, -13, -24, -8, -24, -16, -1, -21, 16, -17, 5, 10, 6, 30, 12, 16, 3, 25, 5, 9, 4, 2, 10, 11, -4, 2, -11, 5, -8, 5, -2, -10, 5, -16, 5, 9, -4, -2, 10, -18, 8, -2, 11, -8, -30, -15, -25, -22, -4, -15, -4, 4, 8, -23, 2, 28, 5, -17, 21, -22, -5, -29, 12, 9, -20, -3, -3, -20, 14, -16, -3, 4, -1, 16, -3, -12, 0, 12, 26, 24, 1, 7, 9, 18, 9, 7, -11, -3, -6, -15, -1, -2, -8, -6, -12, 0, 3, 18, -10, 14, 6, -2, 31, -32, -14, -10, 8, -2, -23, -23, -21, -5, -12, -24, -24, -11, 12, -6, 10, 11, -2, 12, -11, 14, -19, -9, -4, 7, 13, 3, 0, 22, 13, 1, 2, 9, -6, 2, 0, 22, 21, -12, 42, 16, -5, 18, 31, 29, -13, 23, 0, -14, 9, -13, 8, 22, -1, -13, -12, -5, 7, -1, -4, 4, -18, -28, -13, -22, -4, -23, -12, -14, -16, -2, -20, -21, 0, 19, 7, -7, 4, -34, -2, -13, -4, 11, -11, -8, 9, 7, -8, 2, -6, -1, -11, -1, -6, -3, 34, -4, -9]
7895iJ3j2J5pRpOqJ9LO%ql4J2K1k4jJ6pj1J1j4k1K8%Qj2J5qJ%mq%kK1k4rMQJ3
7937aj6nK0Rk3K3lj0jJNJ4k6K8j1K0l1J5k4K4J2J1j5pOk2K6k8J6J9j0k0OL2Lk3
7973A4J0Mm4K5jk2K6k0%J3l1K1j4L8j4k4k0QK8l0oL4l3M0j9L0k4k2M5pr%j8J2
8007a0jj2J3QK0k8J3OORj5j7J3J4k1K8J0m3K4ppMPl1J6kLK0k1%nkKjkLJ0ppJ3
8047Crj2J5pRj3jk3L0lKkj9J8k0QJ6k%J7Kj5J7J3j7j8mJ6OJ2k7K9qNNrJJj4j%
8088A%j3K1j3jL2l5LRLk2j3K5ppJLK4l8L2mj8nrRJ0lK7l3J1nj3K2jKk1J8Ok0L0
8128HJ2j8RMJ3n0J9K0k4K9k1MK2%l2RNK0l0RNlPj8J5j1qJprJ6l4J5rJ1J6j6j5
8166c6J4NJ2nrJ0j0NjPj6J6J3k6J2MqmJ2LLmpJ5P
$$ y = [-9, 4, -8, 7, 0, 9, 2, 8, 0, 19, 22, 28, 28, 20, -14, -2, 19, -5, -6, 10, 3, -8, 3, -11, -32, -4, -4, 4, -8, 7, -1, 0, 0, -4, -12, -12, -14, 7, -17, -26, -22, -14, -1, -17, -22, -2, 7, -16, 7, 4, -6, -7, -6, -1, 13, -13, 15, 4, 24, -7, 8, -16, 8, 20, 31, 16, 9, 15, -7, 19, -9, 7, 26, 16, -4, 2, 34, 37, 14, 24, 28, -16, 9, 8, -14, 12, -8, -8, 5, -26, -5, -19, 19, 5, -19, -39, -31, -3, -33, -39, -5, -38, 2, -17, 13, -11, -33, 12, 5, -4, -4, -22, -10, -11, -23, -10, -2, 18, -10, 3, 9, 15, 24, 9, -8, 5, 19, -2, 26, 36, -7, 17, 10, 3, 7, 14, -17, -1, -3, 0, 20, -1, -1, -6, -8, -6, -7, -9, -6, 4, -3, -10, 3, -6, -18, -3, -10, -1, -14, -15, -38, -8, -11, -9, -11, -30, -12, -32, -24, -8, -10, -10, 7, 9, -6, 11, 24, 7, -11, -15, 1, 7, 19, -8, 21, 13, 18, 23, 14, 15, 16, 2, 1, 1, 1, -12, 9, -4, -5, 27, -8, -5, 4, 7, -15, -28, -3, -10, -17, -16, -13, 11, -27, 5, 1, -17, -22, -31, -22, -12, -15, 12, -21, -10, -15, -28, -6, -7, -5, -26, -8, -2, -22, 8, 20, 2, 11, 15, 28, -22, -3, 17, -7, 22, 1, 5, 27, 27, -5, 4, 9, 29, -1, 8, 13, 10, 17, -1, 14, 3, -5, -4, -11, -20, -4, -38, -23, -32, -21, -5, -21, -36, -22, -17, -5, -10, -19, -9, -19, -14, -15, -8, -24, -8, 5, -21, -9, -5, -13, -17, -5, -2, 1, -3, -10, 5, 12]
8191A2
$$ Imaginary data points
##PAGE= N=2
##DATA TABLE= (X++(I..I)), XYDATA
0@%%%%%%%%%%%%%%%%%%%%Lj1J6j6J6j6J6j6J9k7L2l2L4m2M8m9N6o3O8p6Q4r4J05
43E5j15J27j42J58j74J95k19K45k78L18l66M31n18O36q23J156j926P404L302o311
63C155J260O50L33j503R74K55j810m282j689R36J363j430j874m09Q82r57k518
80f664j617R37R77n96p79J155J162j304k972o71K530K796O87k03L73j5j510j142
98f856J776L792K405n11j315j13O15J44K63J580K102O40j106r30O66R29l79q31
116B871N65J733O43j198j300l29k49p96j1J698J600p18k712k201l63P70R11R35
134A849P62l33j929k322o85J265J617M68n22k97j07p08r39Q7R75O49k36j02N58
153E0K56j004j391j44J119J278N37q1o05j285j515m72J245K115J095o97j728j467
$$ y = [0, 0, 0, 0, 0, 0, 0, 0, 0, 0, 0, 0, 0, 0, 0, 0, 0, 0, 0, 0, 0, 3, -8, 8, -8, 8, -8, 8, -8, 11, -16, 16, -16, 18, -24, 24, -25, 31, -32, 36, -40, 44, -50, 55, -60, 67, -75, 83, -91, 104, -115, 130, -148, 170, -196, 235, -283, 353, -470, 686, -1240, 6164, 9466, 3155, 4415, 5065, 5398, 3895, 4869, 5124, 3314, -968, -2657, -1721, -358, -1788, -3662, -4071, -3189, -4146, -6664, -8281, -7344, -6367, -6963, -7742, -6587, -5425, -6729, -9701, -10372, -7842, -5046, -4359, -4562, -4189, -4204, -5714, -6856, -5080, -1288, 1117, 606, -709, -822, -207, -63, 200, 1780, 3882, 4522, 3416, 2486, 3152, 4081, 3702, 2871, 3436, 5169, 5812, 4614, 3314, 2985, 2736, 1940, 1929, 3627, 5227, 4509, 1797, -404, -767, 3, 914, 1849, 2611, 2278, 349, -1973, -2658, -1393, 224, 692, 170, -127, -234, -942, -1881, -1794, -819, -170, -406, -508, 50, 306, -698, -2089, -2233, -1114, 164, 701, 620, 15, -1270, -2785, -3257, -2012, 103, 1198, 501, -1227, -2694]
171b694o26J67Q15J319R64k83j381j144M5N77K60J46O15O72P0m69k62n5j2J18
191a158Q52J374R72j70j162j108j25J073J636J360N69n65j486j505j21J419J704
208C559Q26k55q31r96r20k88N60P98K87l39m60l93m77o17o68j62K73M92K87l13
228C63q91j188r73k08Q49J399P23o90j545j403n25N06J283J409O55p15j417r49
246c317J0P17R46Q32L78j52l59l25r6Q6L25M33N28O11M14j71q46p59k0Q31J167
267A233R00K56p32j404j064J60J344J496P50k91j145j321o41L58J082J027L93
284B401k86p78o72k64N4J92K13L45L29M3k73n40o31m85O6P44R80L53n86j194j164
305a153m43N55J265J037L4j066j477j076p2Q47J146O50k58q33q46o20r5M11N17
$$ y = [-2694, -3320, -3153, -2338, -1019, -55, -338, -1719, -2863, -2818, -2241, -1981, -1835, -1220, -548, -478, -947, -1209, -1264, -1276, -1158, -306, 1068, 2040, 1870, 708, -400, -525, 548, 2184, 3544, 4113, 3548, 2062, 557, 436, 1855, 3559, 4385, 4130, 3299, 2303, 1383, 1095, 1655, 2453, 2740, 2401, 1941, 1548, 1071, 454, -214, -376, -103, 389, 676, 363, -528, -1716, -2689, -2897, -2048, -649, 74, -616, -2161, -3564, -4089, -3583, -2300, -891, -236, -951, -2368, -3317, -3307, -2590, -1644, -812, -434, -586, -945, -1270, -1366, -1280, -955, -522, 6, 617, 1031, 860, 14, -745, -765, 66, 1233, 2133, 2389, 1657, 253, -811, -651, 693, 2189, 2939, 2648, 1503, 182, -459, -101, 981, 2008, 2401, 2115, 1337, 665, 401, 455, 647, 860, 1205, 1534, 1577, 1304, 764, 133, -352, -286, 458, 1438, 1791, 1205, 11, -1153, -1596, -1041, 224, 1261, 1295, 229, -1248, -2324, -2396, -1549, -403, 247, -11, -844, -1690, -2310, -2405, -1994, -1477]
324a477L21O6j0m1l25m90l26J68N62Q16P12R9o42r41m94M02J146J326P49l34j129
345A58j019j98P74J294J189M25n86r99o89K3N53O79N42K66j49l60l46l03k60r7
365H97J72N56M40N8m76r44r04l23N54R27O58j58r68j342r19J00R62J094L51m87
385B48j064j090n43L22Q35P15K04k68m46m81l11o0J80K51M54M72K57j40n31n94
405a590k50L01R24J056M48m24r44q19r7P37J257J015J02q24j058n94K02Q07R86
424A235O07r9n82o15l45k0K31L74L56K07O4q8l82o38m58K8M97P41M83r1p82j106
446c83n98K94R03R18L26m77j108j007k37N89R55O71O1n50q76o38n5L33M71L21
466h7J83l7k50l72l78k82j09L22O86N74R9n17q40o93q1O79J043O98j09q14r90
$$ y = [-1477, -1156, -1090, -1100, -1141, -1466, -1956, -2282, -2114, -1552, -736, -24, 75, -567, -1508, -2002, -1600, -454, 872, 1621, 1287, 158, -861, -1059, -285, 1009, 2198, 2623, 2037, 1038, 349, 372, 925, 1604, 2146, 2412, 2263, 1903, 1557, 1254, 994, 897, 1069, 1625, 2065, 2123, 1647, 703, -201, -524, 30, 957, 1615, 1457, 489, -853, -1772, -1672, -710, 384, 735, 248, -816, -1906, -2449, -2127, -1292, -577, -373, -641, -1087, -1568, -1879, -1939, -1759, -1508, -1054, -582, -325, -465, -996, -1590, -1840, -1539, -615, 441, 889, 465, -479, -1298, -1395, -658, 599, 1614, 1716, 892, -166, -760, -558, 249, 1235, 1842, 1743, 1161, 546, 201, 181, 412, 786, 1142, 1349, 1413, 1325, 943, 305, -153, -125, 372, 1113, 1596, 1505, 723, -383, -981, -687, 216, 1134, 1460, 983, -125, -1132, -1369, -780, 175, 846, 907, 357, -519, -1157, -1212, -879, -408, -87, 96, 59, -191, -563, -941, -1223, -1332, -1010, -324, 250, 349, -168, -1008, -1701, -1782, -1103, -60, 638, 529, -285, -1275]
487a275n25K88R80J014M00l65p65o75k09L73P29O71K28j21j93k76k36j11J02L15
507C49M83N07L29k04o14o99k50L96Q09Q18K58n15j056p74r8N46R15O08q8q19j048
528a47n61Q0N51N55K92k28n68n87l89j45J9J67K82K62O2j87m46o46m39R6O48P99
550e30M72j65o76q72l49M07J009R18L55l70p29o63o3P26R01O58J31l28n05l48
570b1NL53M46L43K26J23o9l13m52l19n8K73O61N40Mo31q62p02j08N70Q52M75k81
593A055q73r09m82J78O88O96K21m41p13n77j82J77M31M39J81o5j54k38l02k40
613a110OL51N26N03K77j94o48o72j56M89Q66P37K19m71q69o50K1O50P82N10n7
634A110o12p54l69J60M71M61K52m4l38l81l01j17J7J66L38L79J96j54m85n55l79
$$ y = [-1275, -1800, -1512, -532, 482, 882, 517, -248, -923, -1132, -759, -30, 641, 869, 748, 555, 279, 43, -68, 34, 349, 832, 1339, 1668, 1464, 850, 151, -99, 297, 1106, 1924, 2182, 1667, 611, -163, -261, 285, 1200, 1808, 1720, 901, -147, -708, -628, -77, 478, 770, 542, -26, -613, -1002, -1147, -1128, -961, -679, -417, -355, -542, -988, -1634, -2073, -1977, -1329, -530, -58, -223, -899, -1771, -2120, -1713, -704, 214, 569, 199, -530, -1193, -1256, -530, 371, 1029, 1160, 832, 327, -21, -16, 337, 783, 1126, 1352, 1475, 1406, 1093, 641, 322, 264, 537, 1198, 1738, 1742, 1111, 249, -453, -561, 9, 861, 1336, 1055, 182, -727, -1209, -1031, -343, 353, 574, 133, -580, -1157, -1339, -1162, -731, -292, -111, -176, -330, -568, -870, -1110, -1104, -753, -227, 276, 553, 359, -289, -961, -1117, -628, 238, 975, 1194, 723, -146, -796, -775, -125, 657, 1167, 1110, 498, -256, -625, -465, 6, 467, 719, 675, 337, -44, -345, -462, -445, -279, 59, 438, 634, 480, -5, -560, -939]
655i39J62O98P91L96k47o71p35l49M54Q46P54J79m06p07n42l0M70O78M03Ml77
676H32m31l49j09Q6K59K07J94P6j56m43n49m25o9L70N66M87j11p04q45n24ON70
698a062P71L81k11p40p23k51K54O19O18K34k27m83l19l5K13M05M18K81J20k4j15
719A24k12j84O3L87N98N87J97j95n98n99r9N01Q10N98R8m88p58o17L6N05N84L42
741A680j82n69o11m08N6K92K27O7j04k63l90l96k36q7N3K72L29J50k79n95o45
762a639k96J94N91P25L16l63o75o24k06M07P59O48J85l28n32l16M0M09N71L94
782B60P8j39k04j29n6J35K26L29L30K12jk92m32l25J26M64O15M29n0n45p60m50
804a79J40O02O11L11k28o18o72k68K16M38L52Q4k42m54l75j55N3J37J70J67M5
$$ y = [-939, -777, -79, 712, 1108, 861, 190, -545, -894, -440, 406, 1160, 1339, 933, 226, -316, -346, 124, 802, 1205, 1209, 832, 401, 52, -57, 29, 288, 495, 689, 765, 609, 166, -383, -808, -877, -507, 59, 546, 435, -269, -1114, -1638, -1632, -1062, -291, 90, -121, -861, -1584, -1835, -1581, -962, -344, -110, -337, -820, -1139, -1174, -961, -556, -138, 143, 263, 239, 124, -88, -272, -209, 178, 776, 1363, 1560, 1365, 767, 168, 69, 570, 1380, 1978, 2076, 1588, 830, 213, 249, 754, 1338, 1680, 1498, 929, 318, -90, -34, 258, 485, 552, 448, 185, -205, -601, -837, -924, -871, -599, -270, -120, -399, -994, -1639, -1935, -1741, -1150, -425, -109, -472, -1147, -1771, -1977, -1570, -811, -163, 22, -306, -838, -1154, -1114, -705, -134, 260, 338, 199, -5, -134, -190, -55, 171, 500, 830, 1042, 1041, 749, 317, -8, 118, 582, 1197, 1626, 1576, 1031, 271, -179, -39, 563, 1174, 1485, 1257, 639, -33, -301, -85, 353, 705, 789, 547, 93, -282, -437, -384, -247, -77, 90, 135]
825A35j37k91l67l28p7K22N43M41M1m06o32n36j36N01P46N44Lm85o24m25P6N06
847f86O22L27o6l23l35j92J11L20L29J84J15j5j35k22j49K1J67L74M36K11j45
868I49n12n05j96K55O23N97K62l48o96n46j84L38N50N05K5l71n40l54p2K04L08
889B92K03L2j84k72j95k10o6M1K52K73J33j20l60n04l41P8M77N15L69j27n64o79
911i57l24K07N69N88K26j57m92m96j82K39M07L55J28j04k33k39q2K6J37J95K35
932D6K11pj90l17k33m1L03N06M66O2l76n44m13j6M52O83M53m5l92n33l13M5M21
955B28M94K37n7k90k74j55l7J73J98J58O7k0j62k83k88q7J13L22L31J29k31n70
977dn29k33K47M77M69J02l83o38n04j35K57M69L27L5l00m26l01k1J58K19J85R2
$$ y = [135, -2, -293, -660, -988, -1065, -843, -300, 141, 182, -224, -856, -1392, -1528, -1027, -281, 263, 266, -219, -843, -1268, -1192, -686, -64, 263, 197, -126, -461, -653, -542, -222, 107, 291, 406, 391, 256, 34, -115, -94, 73, 447, 883, 1094, 949, 437, -68, -264, -9, 614, 1211, 1473, 1125, 429, -117, -301, 37, 587, 1092, 1117, 746, 206, -148, -220, -16, 292, 495, 527, 343, 71, -124, -334, -400, -359, -107, 166, 299, 179, -181, -685, -1026, -948, -471, 44, 413, 286, -278, -957, -1281, -1074, -505, 83, 309, 152, -340, -836, -1018, -779, -372, -17, 111, 7, -226, -465, -547, -521, -384, -189, 46, 257, 250, 60, -257, -490, -531, -228, 278, 744, 806, 430, -114, -527, -543, -91, 592, 1045, 1000, 608, 75, -238, -193, 228, 722, 959, 902, 612, 338, 183, 146, 319, 517, 675, 742, 722, 560, 277, -11, -98, 15, 337, 668, 797, 566, -4, -533, -766, -519, -42, 427, 529, 146, -492, -996, -1131, -874, -405, -78, -43, -343, -769, -1070, -1091, -933, -714, -529, -437]
999d37m4j13j60j39o4R7L04L82K39k3k38m13k21J49N79N82L45r8m07m93k12K64
1021a21N73N52K24j12l73l54j48J73L33K83J19m7j77k04j84o8OJ81J54J36m3l14
1043E89l94l32q4J73M30L22j08m54n96m58l8L62N08K62j22m37n22k97J2K61L47
1064e76K26o6k03k78j26k8Q1J82K33J63O7o0j94k01q8K45M04M05J79j28m05l65
1086e33n2L62N85M57J55k49m55l55J0L32M63L20Q7k02l38k31k1J07J50J53J24
1107H69jj13k41k30j09jJ95K79J61j62l99m38k51P6L60M70J07k06n29m64k36J26
1129g37M34L91J10k34l50l18j62N8K52K54P8jr9j47j87p6pJ94K40K03N5j84l18
1152e51k24J5L12M33L31J9l34m28k78J23M01M88K89l7l48l23j90J00K60L29K11
$$ y = [-437, -481, -594, -754, -893, -957, -860, -556, -174, 65, 42, -196, -609, -830, -681, -102, 480, 825, 727, 320, -173, -385, -121, 452, 1004, 1228, 1116, 743, 389, 241, 414, 747, 1030, 1149, 1102, 925, 721, 537, 469, 475, 656, 810, 946, 903, 589, 195, -137, -221, -48, 382, 704, 596, 142, -454, -912, -950, -588, -80, 182, 60, -377, -899, -1196, -1184, -923, -576, -350, -416, -619, -897, -1023, -1051, -970, -788, -555, -392, -325, -385, -579, -780, -868, -623, -219, 186, 365, 237, -168, -533, -585, -223, 362, 819, 974, 725, 270, -85, -75, 257, 720, 1040, 1127, 925, 587, 356, 335, 442, 592, 745, 869, 868, 755, 514, 284, 175, 174, 369, 648, 809, 647, 248, -190, -441, -365, -5, 465, 572, 366, -163, -627, -863, -737, -303, 88, 198, -36, -386, -704, -866, -808, -556, -302, -224, -225, -324, -471, -658, -734, -741, -547, -307, -104, -49, -233, -551, -775, -760, -448, -15, 316, 335, 1, -427, -705, -582, -181, 307, 596, 559, 211, -112, -302, -202, 58, 387, 598]
1173E98M1j53j76j20m4L9J02K45J69O8p7k61k75o8J13L69K93Q5k07m29l80j28
1195a96K58M21L17k2l24m51l49p8K09K98K01jk10k83k75j52P3J04Q3J20K2p4k28
1218e37k45j48M1K10K95K05q1l33l37j21J19L94M43K16j52l57l04j02K37M41M05
1239B89J52q6k29j92l7Q3K45K25K24L1nj34j61r8NK18K36J96O3k19l92k30j8K27
1263C93L52K18n6l96m51k83M7K67L08J65j24l52l74k01j5J74K06J16k2j47j96
1284c71j62j37rJ08J98J74N4j38k12k58j09J88L31L02P6j52l60k34l7K42M23L08
1306B25N1k20l28k08k9K46L49K28N5j22j80j35o4L6J41J80J46J29m7j63k26j17
1328e3O2K33L18J76r1k95l10j41J38L39L27J26j49l96k85r8J72K32K40O1j36k41
$$ y = [598, 639, 486, 310, 190, 146, 185, 287, 532, 701, 769, 692, 431, 156, 88, 201, 570, 863, 948, 741, 312, -68, -196, 62, 483, 800, 778, 454, 3, -346, -424, -215, 83, 284, 283, 73, -210, -485, -637, -564, -460, -377, -257, -235, -309, -537, -782, -930, -889, -679, -384, -179, -260, -593, -930, -1051, -932, -538, -95, 121, -31, -388, -692, -794, -557, -116, 289, 441, 355, 126, -66, -103, -20, 225, 450, 674, 705, 700, 566, 405, 307, 312, 530, 766, 962, 1025, 806, 414, 184, 166, 393, 745, 963, 907, 511, 60, -223, -176, 91, 399, 564, 440, 88, -286, -487, -502, -328, -122, -6, -28, -175, -371, -533, -670, -679, -571, -373, -199, -145, -283, -495, -753, -862, -674, -343, -41, 35, -117, -477, -711, -748, -506, -83, 225, 276, 56, -272, -480, -509, -263, 86, 314, 369, 247, 67, -68, -132, -96, 45, 225, 371, 500, 453, 290, 64, -53, 9, 242, 560, 736, 645, 350, 40, -101, 37, 376, 703, 829, 680, 284, -1, -99, 73, 305, 545, 606, 470, 229]
1350B29k41j07j3R3J27J48Lp6j85k19k09m2J51K02J69k6k23l32k75J2K76K99K01
1373c8q0k85l35j72R7L01L23J52l6j87k46j16P3K07K06K10J11j5j04j49q2M3J54
1396C2K37K75Q7j12k47j68j02J86L09K97L8j87l33k38l4K17K67K19k3k51l09k06
1418d6k3J15K00J37J3j20j78j87j59m9P2J42J72P4r1k21k85j39N4K24K72J29o8
1441C8k84k90j32J41K99K86Q4j32k84k18o1J36K53K30P8o0j87j78p2J7J00J88
1463d8J45R6m2j35j79j46nK15K53K24J5k03k61j67L6K49L07J86l1k68k35j09O7
1486c6K80K55R0p3j58j79j19L5J28J45J24J0j3j56k05j38n8R7J67J83L7j84k88
1509e6k45j07J34K33K09ok25l32k14k4J78K07J48k0j96k32j35QJ04J72J74O6n7
$$ y = [229, -12, -119, -132, -39, 88, 236, 239, 163, -22, -241, -450, -492, -341, -139, 30, 4, -219, -551, -826, -814, -538, -239, -38, -118, -403, -738, -910, -813, -512, -189, -37, -73, -260, -506, -622, -549, -342, -136, 74, 185, 170, 66, -83, -165, -122, 32, 269, 544, 631, 519, 272, 104, 2, 188, 497, 794, 832, 645, 312, 74, 40, 257, 524, 743, 720, 469, 160, -46, -69, 46, 246, 383, 396, 276, 98, -89, -248, -297, -225, -83, 89, 163, 72, -149, -434, -573, -519, -295, -23, 106, 38, -246, -536, -668, -527, -228, 58, 142, 10, -274, -492, -553, -417, -164, 66, 144, 84, -103, -281, -353, -336, -236, -48, 97, 193, 151, 16, -163, -309, -314, -99, 154, 378, 393, 190, -71, -238, -202, 47, 354, 540, 509, 241, 6, -103, -36, 244, 499, 589, 516, 358, 179, 60, 95, 223, 368, 492, 502, 489, 333, 128, -10, -68, 29, 196, 379, 416, 232, -56, -301, -408, -274, -41, 168, 162, -63, -395, -609, -633, -455, -248, -100, -120, -316, -548, -683, -675, -571, -399, -225, -159, -216]
1532b16r0j36n8lJ48J95K13J26l6j38k06p5J15K86K85J39m7k17k26l8J15K98K12
1555F46R0j09k49j83m7J13J67J45Nm6j47k13j23n9Q7Q3J19P6j02k03k33j63m2
1578c88J62K11J58n3k36k94j53j2K24K61J28p9k00k29j17Q7K04K10Q6l1j17j54
1600c32o8J6J21J65J32R9j8j10j70j11K5J33K28J98O1j43k14k10l9J61K55K04
1622C83O0k02k30j58%J59K34J16K0j55j65j13j7R9J38J16N6k4j04j65q1m7Q1K01
1646B02J64J8p9j86k07j22R9K01K11P7j17k20k49o3P4K08J59L4j42j90j79p2Q7
1669b92J27J27M2m9j19j87q9m3J27P6J72Q7p2j58j61j17M9J54K70J79l6j57j90
1692b60p6M2K21K34J48l1j47j22p3P3J63J93J00Jj13j04p3MP9J29J13M4k0q2j94
$$ y = [-216, -306, -442, -500, -503, -355, -160, 53, 179, 143, 5, -201, -276, -161, 125, 410, 549, 502, 285, 59, 21, 136, 434, 646, 736, 627, 378, 195, 148, 261, 428, 573, 578, 532, 385, 172, 49, -10, 77, 160, 279, 355, 253, 50, -183, -346, -388, -226, -15, 143, 90, -146, -440, -593, -605, -381, -120, 8, -71, -271, -500, -617, -530, -326, -116, -30, -61, -178, -332, -400, -384, -263, -98, 34, 133, 115, 5, -165, -276, -251, -118, 110, 308, 369, 226, 12, -198, -237, -76, 179, 383, 443, 241, 11, -147, -147, 12, 246, 362, 382, 227, 62, -51, -68, 31, 169, 285, 341, 317, 213, 48, -33, -80, 1, 202, 366, 384, 305, 119, -88, -210, -111, 90, 301, 378, 261, 41, -208, -271, -197, 11, 170, 204, 62, -128, -307, -379, -292, -165, -38, 4, -45, -164, -351, -440, -483, -356, -280, -108, -21, -93, -251, -412, -529, -480, -326, -56, 123, 87, -70, -260, -336, -294, -73, 161, 309, 278, 131, 9, -64, 9, 172, 365, 465, 466, 353, 249, 176, 180, 259, 388, 501, 545, 525, 443, 249]
1717B49j64l5J50J49J63Qj77k54k17m6J39J41J40mj87k20j89k7J18J31P3J3j48
1740a94j58j26mM6J16J03L5qj18q4j31rJ05J81J87P8j01j63j63n6Q9K70K47N7
1764A99n9j54j46p5J60J95J88M8m3j30j05l0P3J61Q6O0jn9j16q7j9O1J26J42P8
1789E53o7j88j82j02PJ53K05J08r1j59k64j28L4J12J72O4n0j81j91q6K6O6Q7M0
1813f2k0q3j51r1l8N7Q1J10N4l3j06j76q7pJ64J77J42K6j19j94j05PJ56K20J60
1838H2K7q6j28r7j3J86J52J62jl0q3n8pK8J32J23O7jo7q6j15nN0J78J37L0q2k25
1866B70j69p1Q4J55J50J5j13j88j81j01N1J23J08k2o4j48j58p4oP9J39Rj5r5j23
1891c45j38l2N2J49J09N9k7j29j75o3N3J94J90J11qj59j51q2J16J48J65R3J7r3
$$ y = [249, 85, 50, 200, 349, 512, 520, 343, 89, -128, -174, -35, 106, 246, 242, 55, -165, -354, -381, -263, -132, -59, -46, -194, -352, -478, -482, -436, -320, -217, -182, -190, -308, -392, -523, -532, -427, -246, -59, 19, -82, -245, -408, -464, -375, -105, 142, 199, 140, -14, -160, -235, -75, 120, 308, 356, 313, 183, 78, 48, 121, 282, 368, 428, 427, 368, 252, 165, 146, 207, 333, 475, 553, 486, 298, 116, 14, 21, 174, 379, 487, 396, 237, -27, -155, -121, -9, 163, 227, 177, -4, -195, -281, -255, -189, -102, -62, -82, -165, -316, -407, -445, -388, -307, -197, -143, -176, -282, -458, -545, -552, -388, -211, -69, -43, -162, -356, -461, -454, -298, -78, 82, 109, 23, -105, -202, -215, -29, 123, 285, 284, 254, 171, 113, 106, 134, 266, 389, 456, 455, 388, 302, 187, 182, 232, 410, 547, 577, 495, 270, 101, 30, 114, 269, 419, 434, 321, 133, -48, -149, -98, 25, 133, 111, 47, -101, -259, -333, -339, -260, -121, -112, -127, -222, -345, -483, -515, -463, -314, -205, -146, -173, -302, -477, -540, -487, -293, -103, 8, 0, -159, -310, -392, -276, -128, 37, 130, 147, 54]
1915E4j16l7N2J09J02J02N6n1p9o6k8M8Q7J31N8Pj22j18j06RQ1J85J08Kj47k00
1941A21j33l4J12J91R1Nj51j41j35l6O7J17K8j5m8q5j54j8l0P2J11M0k3m8j57
1966b53j56K8N8J22J32L7o9j98j66J2M6J73J67L5o4j01j63lO5J34J20Q5k9o1q4
1991a33k3J8R1J18Q6M3m1o7q7J5N3J56J23R4o2q4j45o0L9J51J57P5qj82j45j23
2017E9N8J49P6Q3n3q6j60r5j2K1Q3M8Kq8q7j31n8j2O4P1O6n4j38j37j36L3Q3J61
2045a90Q4j3j26j62j02nJ37J33J19J3o9j21n8NM4J71R6L9Ol9n9k6J7Q4J45J02
2071B25L5n4r0p8kJ13J44J32J6r3r0j22n0R6J26J37K3q0j46j09n6L6J01P4L1n1
2097B68p9j20r9%N6L9N7Oq5j09j11l3N2M4J04K4m4j57j20q8P3J05J38L2j9j12
$$ y = [54, -62, -99, -47, 62, 164, 266, 322, 271, 192, 126, 98, 146, 233, 364, 422, 429, 307, 189, 83, 92, 173, 358, 466, 468, 321, 121, -12, -46, 66, 257, 348, 353, 202, 61, -74, -110, -43, 74, 102, 87, 39, -46, -200, -218, -248, -176, -65, -25, -48, -96, -253, -409, -381, -323, -201, -69, -32, -101, -299, -465, -453, -407, -234, -67, -32, -96, -197, -360, -363, -298, -164, -44, 41, 12, -49, -133, -156, -138, -47, 71, 157, 200, 159, 92, 5, 20, 73, 229, 352, 446, 384, 300, 155, 95, 134, 285, 442, 517, 509, 327, 182, 59, 117, 266, 342, 425, 372, 286, 126, 31, 19, 40, 123, 171, 173, 85, -2, -133, -191, -203, -139, -68, -2, -56, -194, -331, -467, -434, -351, -190, -106, -119, -245, -407, -509, -514, -377, -244, -125, -112, -181, -302, -360, -355, -311, -140, -44, -5, 1, -38, -97, -123, -106, -22, 123, 225, 260, 206, 116, 38, 36, 149, 293, 425, 441, 348, 258, 136, 86, 182, 308, 445, 468, 388, 242, 133, 77, 113, 214, 288, 319, 268, 189, 69, -30, -30, 26, 65, 122, 128, 43, -66, -177, -210, -158, -114, -10, 14, -30, -187, -307, -395, -322, -217, -79, -47, -66, -178]
2123a78j35q0O0R0R2J24k0n8q1p3kO3R9R6J9km1q7l2J9J01J34M6J2n1j31l0J1
2151c5Q4J50R5Lj01j37p8LR8J63Q2op3j17o1k6J2J17O2L6l2n9r6p6J5RQ1P8J1
2180B02p8j19r9o4P8J18Q9qq9j28j11o6R5J10P9J6q7p0j40l8L9P5R1L2j5n8j14
2207b60l4k0M9P6J07M8l9r1m5o2L5J42J07Q5n6r8p1m2O4J36J22R9o1n5j11k0M9
2234E4Q7J20P9om8j07n9KK5R1R9N0l5p0j32n6J6O7P0M0j8q3j29j42M0N6N8Q1o2
2263H8r8j48r8KM8O4Q5mj01p6j15j5K3P3M0N9qq6l8l5k4Q5J06J01k0j0q6q0L4
2292b34Q0J33J09K0l2n9o7J0R3J27P6N2k2r0p1l2N3P0Q6O6Ko6q1q5j4L6P6N0J2
2321B98m2p6j06q2J2Q1O3K8m4j35q5q7K0N8Q7M6n6j07j21m0%Q9Q4L4jn4p4r8J2
$$ y = [-178, -313, -393, -333, -243, -151, -27, -47, -105, -186, -259, -261, -198, -99, -3, 16, 14, -27, -114, -146, -127, -26, 108, 154, 166, 115, -16, -46, -35, 49, 199, 294, 297, 196, 59, -19, -16, 82, 245, 327, 321, 248, 131, 70, 44, 56, 173, 235, 271, 239, 180, 84, 8, 23, 32, 113, 191, 202, 124, 5, -94, -158, -80, 38, 127, 119, 30, -98, -209, -275, -180, -70, 9, 25, -62, -132, -272, -310, -271, -196, -105, -73, -88, -146, -260, -294, -314, -265, -189, -82, -34, -73, -164, -209, -271, -236, -94, 13, 98, 42, -56, -127, -169, -105, 31, 153, 252, 191, 136, 25, 5, 54, 141, 261, 340, 334, 286, 179, 120, 122, 147, 238, 337, 387, 352, 282, 150, 94, 110, 177, 247, 287, 269, 186, 57, -85, -45, 11, 69, 150, 88, -10, -158, -256, -254, -206, -142, -57, -61, -162, -238, -353, -368, -345, -272, -232, -173, -181, -267, -305, -340, -364, -279, -173, -72, -92, -102, -188, -268, -234, -154, -21, 88, 108, 76, 17, -50, -40, 53, 180, 256, 308, 286, 196, 125, 93, 146, 216, 302, 368, 370, 304, 223, 138, 124, 160, 236, 286, 298, 256, 180, 74, -8, 4, 85, 148, 176, 132, -3, -88, -175, -155, -97, -10, 36, -20, -127, -248, -288, -288, -199, -115, -81, -82, -136, -210, -308, -296]
2350b96J2Q9J00L2j6p3o3m0PR1J23P3rp1o5m8K3R9J05P0j9n1p9o4pQ8J07Q2J6
2379B16l7o9q4j3K8O9R2N3l4l3r8n6qO0Q8N9j2n4n3p4m4N6O7O0L5p3r5r0l7M9
2409c2Q1O5J9p3p4r0l2j5N5O8M2j4o6q5o6l7M9N5N7L0k5j09l9m3K9O1J06QJ2o8
2439a31r5MK2P3J04K8Qn8p9KK5Q2P6J00J3l0p4k6MQQ0J05K5j6l4r5m1K9N2Q0N3
2470B94Qr6p7p9NN3O3K3k4n0r7o1j4L5N4N7k8m6j15o1l5lQ5O2J7k8o2p7n3k7M3
2501b34R3O7Ok5o4p6k6R5N5Q9Kj9l7o2l6M8J00J00J2mm6p0LJ6P5N0O7J5n1m5p9
2532A9kP5L5O3K0ro8r1l9K8O7N5K5k6n1j04j5QO4K0L0Lq1o6m8J1M1N2K1J7m5r0
2564h1m9j6K0N7R2J0m2o4o9l5%O1Q6M1j4m7m4m2m3R7P5N0j3n5m7l9j2P9O6O4Q
$$ y = [-296, -284, -195, -95, -63, -79, -152, -215, -255, -248, -157, -34, 39, 30, -41, -106, -154, -131, -32, 73, 143, 124, 73, -6, -70, -77, 11, 118, 200, 216, 179, 110, 26, 13, 41, 110, 202, 255, 221, 188, 90, 34, 26, 86, 174, 233, 221, 167, 114, 40, -4, 52, 119, 179, 214, 141, 46, -44, -81, -32, 49, 114, 133, 60, -14, -104, -136, -151, -96, -28, 14, 0, -66, -151, -217, -254, -205, -150, -93, -63, -88, -197, -236, -279, -250, -189, -83, -75, -63, -131, -226, -222, -200, -127, -23, 5, 13, -45, -124, -122, -97, -15, 61, 161, 174, 144, 70, 44, 48, 56, 136, 241, 266, 250, 216, 121, 80, 109, 161, 241, 294, 302, 206, 129, 50, 55, 108, 171, 194, 170, 120, 23, -38, -52, -17, 37, 94, 66, 20, -95, -156, -191, -194, -109, -47, -30, -58, -120, -197, -250, -277, -234, -141, -74, -68, -93, -157, -233, -259, -164, -109, -20, -18, -37, -74, -136, -172, -124, -24, 76, 88, 84, 38, -32, -29, -13, 62, 112, 179, 194, 143, 98, 19, 17, 92, 127, 190, 210, 201, 133, 42, 3, 31, 98, 153, 178, 152, 101, -3, -18, -10, 54, 74, 104, 107, 26, -40, -88, -77, -36, 16, 37, 54, 9, -81, -130, -146, -126, -69, 23, 33, -9, -73, -142, -177, -177, -116, -30, 11, -3, -50, -94, -136, -179, -82, -7, 43, 30, -25, -72, -111, -123, -44, 22, 86, 94]
2595I4k1o2o2kK5M5P2N7k7k8p9m7LN6O7P9%n2p5n8J5RN3P7K6m7q0n9l0N7L4N7
2627I7mKm9o0l5lM1L8L5Mm8o9p1j2K6P5L8L1k6n9n4m6M5M7L6O4m1n3n0m8M5L6
2659f8O3J9ml8n8n9L9M8M1M2J2l2n3n5oL6N8R4K4nq0l0m1KO0R2L1Rl3n2l4k7O0
2692E5M5M9jk4n7m6j4L1O0O3om8k7n2k6JK2O9K8j6o8o5n8MK9N5L2j0l4o2r6NK7
2725a35M9M1mk7q1j4m3K8M8N4K2ok1q3k8M7K8Q6M6J3l8m6k8jM9R7M0M8n7n2qk6
2757bK2N8M5P1po5m4k2J6K9L4N3l5jp4l6k5K1O0K8J5p8k8p0nj3L5K9M9m8m5q9
2789a22l0J6J2P5L0j6l4p9k7K0J5M4N5Jl7j8l2J4m0J13L5L4J1o7k4k9K1O1O5J6
2819H3K5k2n2p0K0M4N2M4K6k4p0n0J6mM0M3L0k1n1o3j3J0O1OM9Oq0m1k3K0K5P
$$ y = [94, 73, 11, -51, -53, -28, 17, 89, 146, 119, 91, 12, -35, -32, 24, 91, 170, 170, 118, 43, -15, 0, 9, 62, 139, 165, 118, 38, -21, -51, 6, 40, 97, 93, 95, 46, -14, -49, -52, -11, 27, 62, 66, 18, -51, -122, -134, -108, -33, 5, 36, 10, -49, -103, -149, -104, -57, -21, 43, 2, -51, -101, -149, -104, -68, -5, 14, 10, -28, -86, -145, -106, -58, -17, 25, 37, 5, -48, -103, -109, -73, -15, 79, 103, 98, 18, -12, -53, -51, 9, 101, 132, 141, 108, 56, 22, -5, 55, 100, 149, 148, 124, 67, 21, 7, 38, 98, 161, 155, 107, 80, 28, 2, 3, 25, 94, 122, 106, 38, -27, -85, -81, -52, 3, 35, 25, -9, -71, -167, -162, -135, -86, -45, -49, -76, -157, -171, -214, -186, -138, -84, -62, -68, -89, -172, -200, -153, -125, -39, 7, 20, -18, -64, -92, -93, -44, 53, 93, 141, 84, 32, 24, -2, 20, 78, 123, 194, 187, 122, 78, 56, 72, 101, 135, 188, 153, 152, 78, 42, 17, 38, 98, 126, 141, 63, 35, -35, -40, -53, -18, 11, 60, 12, -33, -122, -152, -136, -124, -49, -19, -35, -69, -148, -175, -155, -140, -96, -41, -40, -77, -95, -127, -113, -153, -40, -5, 29, 40, -27, -51, -80, -59, 2, 67, 83, 108, 86, 34, -36, -16, 28, 80, 124, 150, 126, 56, 6, 22, 18, 58, 101, 131, 110, 59, -4, -17, -7, 54, 60, 109, 115, 35, -6, -29, -9, 16, 23]
2851B3N1k3oo0n7%M0N5J2J4k5j7o2n6L0N4L5Rj9m6j4n4OM3M1K6j0nn2l8jj0P0
2884d6K4L7l8jo9qN4OM9P0n1m3n1j2KM5O7M5Nk4m7m8J5K8Q7oM1m3lm9pL1QN1R
2919A28lk5o7j9k1N2N5Rom4o9mj5K1N3Qkl1l6p5k7K9MP6Pk6n6k6n2K6M0J5K4l0
2953h7k8rm9%L5O4L5k6J9n5k5j3M7O2L9L4Kn2l3l6J5R3M6PL1j6n9j1lL2M4O1L
2986A67k0l8n9K5L1J8M6k1on8m0j5pN5J0J8k4n6m1l0k4M8%K6ppj00l0k1L4K6K1
3018g9J0rm5l0l3K2M8L3K4j7j8k8j9MN0L2M9Qk3n3NK5K1J9L8L1k6j3l7J1K0N1
3050G1M5Jl3j9j9k3J7M5K0J6j4k1m2l1J0K6J6M8Mm2l6m6j9pO3K9K3l3m2l8k9P
3082e3J0M3K7J1o1l5rrL6j1P5l5j1k4n1%J3L3M0kk7mn0%OL3K6L4j2n7J8m4pL7
$$ y = [23, 74, 51, 45, -15, -72, -72, -32, 23, 35, 49, 24, 7, -55, -111, -81, -27, 8, 17, -2, -48, -62, -116, -110, -67, -26, 0, -10, -15, -67, -105, -106, -116, -46, -22, 15, -23, -24, -93, -101, -47, -41, 8, 78, 27, -16, -67, -79, -77, -32, 35, 80, 85, 61, 14, -34, -19, 9, 96, 90, 131, 88, 85, 36, 29, 60, 68, 119, 128, 125, 100, 33, 14, -7, 45, 100, 109, 103, 59, -10, -14, -29, -8, 45, 53, 51, 20, -16, -91, -118, -89, -85, -9, -2, -28, -84, -110, -162, -136, -96, -81, -57, -87, -115, -124, -173, -173, -138, -74, -39, -65, -46, -101, -126, -139, -92, -30, 9, 43, 45, -7, -40, -76, -61, 32, 78, 85, 116, 100, 41, 30, 27, 59, 103, 164, 167, 147, 109, 50, 75, 106, 124, 170, 149, 143, 85, 45, 30, 23, 78, 88, 106, 82, 26, -15, -45, -69, -21, -21, 5, -2, -9, -109, -139, -160, -126, -100, -79, -69, -78, -123, -153, -186, -164, -116, -83, -59, -76, -94, -122, -141, -137, -87, -55, -6, 2, -21, -74, -69, -44, -23, -4, 34, 65, 39, 26, -11, 0, 20, 71, 116, 117, 84, 65, 46, 23, 40, 85, 105, 121, 107, 86, 44, 13, 23, 49, 65, 113, 117, 75, 39, -7, -26, -33, 30, 59, 82, 49, 7, -31, -60, -53, -43, 0, 27, 38, -23, -58, -67, -76, -40, -51, 24, -11, -22, -46, -97, -97, -84, -51, -11, -13, -40, -44, -94, -94, -88, -55, -29, 5, -7, -64, -46, -90, -97, -60]
3116f0M4M3rj2o1m0L6J3O2QL7nl3j9l7K6N8L5kJ9l2m7J7j1PN3K3J7n1n2J3k7L0
3149D3K4L7Km3m1k4j8LK7J7J6l5Qn4m5%M6L4k6Qro2j7rL2J2K7Nn0ll8K3jL3L4
3184d4L4pl0l4kRK8N3K6jl3k3j7J0L7O0J0Lnm3k2K3nL9K6M3k1l2l8k3J6M8OOr
3219H8k7l5j7kL1L6K6n6nl2n0J2J5J0R%pmn3k1J2J5M8nJ9m4n6k6OL0L6K1nm1j9
3254i1pJ3J2J8O8m2J6l9k2K8j0M0L2mqqj6%%K3J2L1j0Ok8j7pRL0L3K3l1j1j5k2
3289FJ1N7j3Rl3rJ2m7LK1K4QJ8j9l2l4J5k4L4K4Qj3l7k4j9pK7K9QNm7nn3L1JK6
3325c9NK7k7l1j6LM2J2kJ0j6l7j8J2K5J6M0kpl3j2oK7PK7K0kJ6l2k2J3JK1J8K2
3360F2Qm6j4k3L7L6MRK0n7nk5L7J3J0J4jnn5j9rK9K1J0j0%n7j2j0jN2rJql2k8
$$ y = [-60, -16, 27, 18, 6, -55, -95, -59, -46, 16, 24, 61, 56, 23, 4, -33, -7, 51, 86, 84, 103, 71, 24, 41, 30, 37, 90, 113, 130, 79, 27, 40, 13, 43, 67, 104, 106, 63, 22, -2, -20, -17, 10, 27, 43, 8, 16, -38, -83, -83, -37, -3, -29, -21, -30, -92, -109, -118, -86, -74, -47, -42, -92, -95, -133, -110, -111, -78, -44, -10, -17, -47, -81, -83, -74, -46, 7, 33, 32, -1, -24, -41, -31, 6, 66, 76, 79, 74, 31, 9, 32, 27, 66, 92, 135, 114, 82, 44, 21, 37, 85, 91, 97, 88, 61, 26, 9, 7, 38, 74, 100, 44, 39, 7, -43, -31, -16, -6, 3, 3, -4, -8, -61, -82, -70, -55, -7, -12, 7, -37, -93, -119, -113, -83, -47, -26, -31, -72, -91, -98, -85, -73, -55, 13, -29, -13, -52, -74, -46, -56, -16, 16, 12, 4, -4, -20, -20, -20, 3, 15, 46, 36, 42, 14, -3, -10, -1, 29, 62, 85, 54, 43, 28, 6, 17, 74, 61, 70, 37, 28, 40, -7, -4, 17, 41, 49, 67, 48, 16, -18, -3, -27, 7, 31, 39, 26, -11, -35, -54, -61, -34, -5, 3, 8, -39, -44, -97, -66, -65, -39, -34, -7, -34, -65, -81, -78, -36, -24, -26, -16, -32, -69, -87, -75, -50, -34, 6, 4, -3, -36, -48, -54, -27, -20, 7, 27, 25, 41, 9, -13, 0, 1, 22, 40, 62, 70, 24, 10, -13, 24, 60, 64, 73, 93, 36, 31, 6, 43, 56, 66, 80, 79, 74, 19, 0, -9, 20, 41, 51, 41, 41, -16, -28, -38, -39, 13, 4, 5, -3, -35, -63]
3396f3j0nK6L0Pj9l9j9lJ2L%N5J5m9l6jOL2kM9J0k4k2pNK0QM0J7K2j5m9mL6j6
3432A0L1L0lJm9J1kJ8K4QL8l5l5nm0J8M6oL1k2l7l5l0L6K9j5K7j4j5m5j3kJ1M2
3466HjRpn4OLj2L6OOLm0j4pPK5K7okk2Kk0RJ8K7OL0k9J2l7j5J3J3J5L0k5KJ8m6
3505fLK2ML6nk9j3k2qK3M1Lmk1j6k9j3L4J6K1J5jl3m9J0OM0j2K1qj6k1k3K2Pj5
3541b0K8J3j8ql4%L8nK3mk5j5k3NlJ5J3L2k7l3j7OJ9j7J9K6rj1l3K2lKnN0k2J6
3577ek1J3j3mQK3K1MOl9KK8lQK8Pmn1PJ2%K3%K7Om1Qj3j0J4K5Nj0k2k4Pk9J6K5
3616C4j3Ol0pl1MOJ4J2K1m3j5l6J4J3k2K5Rpk4k6J9pJ3K5J0J4pm5L2oRK0J5Qj9
3652a5J5k3J8J5J6J7J3pQl9J2K5qK8J4rLk8oj7J9K5J8j9Jn5J8j2LjL1j0m5Rl9
$$ y = [-63, -73, -78, -52, -22, -15, -34, -73, -92, -95, -83, -80, -80, -25, -10, -59, -95, -96, -90, -58, -60, -11, -1, -25, -47, -54, -49, -29, -21, 19, 36, 58, 43, -6, -10, 26, 10, 41, 71, 68, 69, 20, 31, 29, 47, 71, 79, 117, 82, 47, 42, 2, 20, 66, 60, 91, 69, 32, -3, -33, 3, 32, 17, 44, 30, 15, -30, -43, -45, -34, 8, 7, 16, 9, -45, -39, -36, -48, -12, -6, 0, 3, -37, -51, -58, -51, -26, 1, -5, -7, -29, -27, -47, -38, -20, 7, 13, 43, 14, 26, -11, -26, -13, 0, 15, 45, 20, 22, 40, -6, -3, 19, 23, 59, 54, 25, 12, -10, -18, 5, 46, 49, 45, 24, 8, -21, -34, 0, 16, 37, 52, 51, 18, -31, -21, -15, 25, 13, 34, 26, 10, -11, -34, -12, -5, -20, 8, 21, 3, -5, -39, -39, -1, -6, 17, 13, -12, -27, -50, -45, -48, -33, -20, 12, -15, -48, -65, -59, -40, -57, -38, -12, -21, -32, -65, -43, -46, -44, -49, 1, -21, -5, -26, -13, -26, -30, -22, 1, 22, 26, 32, -7, -5, 23, 20, 28, 56, 63, 59, 8, 15, 27, 27, 50, 50, 77, 83, 42, 50, 37, 27, 41, 66, 71, 61, 39, 15, 22, -7, 9, 34, 21, 27, -3, -10, -41, -37, -31, -17, -5, 16, -27, -42, -78, -64, -51, -73, -48, -39, -46, -70, -96, -77, -84, -71, -46, -36, -22, -29, -74, -42, -48, -39, -19, -4, 4, -15, 0, -23, -5, 10, 26, 43, 56, 49, 57, 18, 30, 55, 47, 75, 89, 80, 83, 55, 49, 32, 51, 76, 94, 75, 76, 21, 39, 27, 30, 29, 60, 50, 5, 14, -25]
3687b5J9%lpK2k2k1j3jj5J1J4mj0J6k8j9jK2J7J3%jm2rj7P0j1L0Lqk9J1rJK3L0
3724GJ5k7K0j1k4J2nK8M3k6j1Rk6J6kJ9K3pRl9j4k3J7K7K4Kj5mk9Oj3K3mjJ0j3
3760A6j6l9P%J5jL2nk8nJ3k4RK2J4k4Nm8mJ1K9lJ2J9pl0%OrJ5K1j8K0j5l0Pj6
3797d9L7j8M5k7J1k0j3J4K9JJ4k8J0K5o0K5J0K4PJ4j9pk3Lj5L9QMqNk2J9l6K4
3831B3PL6km6Mk2pL0k1J9jk2Mj8MJ2j4mRlmk7k0J4QLQK1m3J3k6KK1Kj6K4Kl0K7
3870c3PoJ6K4nj8j3LK0j7nL8J6J9ql2KpK6K0J7j0J3m6Nj2J9K2J8kj6j2m3J0J1
3905B1LJ9k7Rpk5j4OML6l3lj9pjkJ7RJ2j3l8J7ok0OJ0KK7pol0ML3KNpJ9j9rJ7
3945a5Pk0K2L4k5J5j9mmKJK5LNmk5J%K4kJ0knmm0L7J8rqJj1Jnk0K2j4L6j3QkO
$$ y = [-25, -6, -6, -9, -16, 6, -16, -37, -50, -51, -66, -55, -41, -45, -55, -39, -67, -86, -87, -65, -48, -35, -35, -36, -78, -87, -104, -34, -45, -15, -12, -20, -49, -38, -47, -46, -23, 7, 22, -5, 15, 4, -20, -8, -13, 15, 58, 32, 21, 30, 4, 20, 18, 37, 60, 53, 62, 23, 9, -14, 3, 30, 54, 56, 41, 37, 8, 14, 1, 24, 20, 19, 29, 16, 0, -39, -32, -32, -17, -18, 14, 9, -19, -24, -11, -35, -26, -4, 10, -14, -9, -57, -61, -50, -21, -24, -12, 7, 0, -30, -30, -24, -33, -18, 3, -15, 5, -10, -40, -33, -49, -12, -30, 15, -12, -1, -21, -34, -20, 9, 10, 24, -4, 6, 31, -29, -4, 6, 30, 37, 51, 32, 25, 2, 5, -10, 29, 37, 41, 33, 38, 16, 35, -1, 23, 30, 66, 64, 18, 22, 0, -7, 23, 2, 21, 20, -2, 2, -16, -12, 0, -14, -18, -9, -12, -16, -43, -63, -49, -41, -38, -30, -9, -52, -39, -65, -63, -42, -40, -56, -32, -30, -60, -33, -26, -32, -16, 8, 3, -15, -28, -25, -5, -22, -27, 11, 27, 46, 38, 6, 8, 1, 27, 47, 64, 54, 67, 21, 26, 14, 33, 55, 73, 71, 55, 43, 0, 10, 21, 24, 43, 16, 25, 18, -7, -21, -15, -11, 25, -8, -11, -30, -37, -38, -40, -23, -14, -2, -15, -53, -36, -42, -62, -56, -46, -44, -17, -24, -30, -60, -56, -23, -21, -16, -23, -4, -23, -32, -15, -8, -28, -6, 28, 3, 18, -1, -5, -9, -7, -6, 19, 22, 27, 23, -2, -1, -1, 23, 21, 31, 29, 24, 20, -20, 17, 35, 26, 18, 19, 8, 9, 4, -16, 6, -8, 28, 15, 23, 21, 27]
3986B7j5j0J1K0Nl8K1k6jqJ4rJ3Nmk9R%j6QL1l7jL3j7l1k1K9K1jj0J3j6LrQj8
4023d6K7JJj6Nj3lN1j6J7rNk5QQJ2J1K8j7L0l5k3LmL5K6rNj3j7PqJ6j9L3Ml1j8
4061A1J4nJ1J3oj7kj9k8K8LrJ4noj9j5NJ9pkj3qK7m6jJ4PkL5Mj6Jl1J1K7J9J0
4099A6k7J1j9J0qPJ4jL1qk2j5J5LJ2J4J9rk1rRJJ5LoRKl7J5j2j8RJ5K%rk6%L7
4138B2k7JJ2k5K1j6j9K8j5LK1lk1j5K1m2L1JL1K5l3pl5J4J6%nJ3J1j9Nj2j3K3
4172hK3j7J6l0LOqQJ6J3J2l6Nj5j6J2J6kJ6opj5kjJ9pNJ2mj5j1K8mmmnJ8l1J8
4211bRpK8jkok0kKJ1J1LOj6j5L3m3L1k3qj9L8Pk0k1k4j5M2K8l4J6j0k6jK1mlK7
4249ik0j2K0k6RRJ1JMNj9k9K6lK3J8oJ0Loj1K2j3L4J8k6Kj3KllL3lj1K2j0m2Q
$$ y = [27, 12, 2, 13, 33, 38, 0, 21, -5, -6, -14, 0, -9, 4, 9, 5, -24, -15, -15, -31, -23, 8, -29, -30, 3, -14, -45, -66, -37, -16, -17, -27, -14, -30, -27, -36, -28, -46, -19, -18, -17, -33, -28, -41, -44, 7, -9, 8, -1, 4, -21, -13, -5, 7, 18, 46, 29, 59, 24, 1, 4, 0, 35, 61, 52, 57, 44, 27, 34, 26, 42, 23, 56, 60, 29, 11, 25, 20, 31, 44, 38, 21, 19, 0, -28, 0, 3, -6, 8, 3, -3, -22, -37, -32, -13, -20, -22, -35, -43, -16, -62, -63, -49, -42, -44, -9, -5, -21, -20, -51, -40, -13, 6, 16, -11, 0, -19, -9, -17, -10, 4, 3, 34, 26, 4, -11, 4, 7, 19, 33, 52, 43, 22, 13, 22, 23, 38, 41, 35, 44, 46, 9, 24, 12, -6, 3, 18, 20, 20, 11, -15, -15, 22, -5, -4, 8, -17, 4, -12, -31, -3, -18, -15, 6, 3, -18, -33, -12, -54, -23, -22, 9, 34, 1, -6, -41, -27, -11, -11, -16, -3, 8, -11, -6, -18, -31, -8, 15, -2, 14, -16, -13, -7, -15, -7, 9, 22, 34, -2, 3, -12, -28, -16, 0, -2, 14, 8, 1, -14, -16, -17, 2, -5, 0, 12, 8, -7, -18, 10, 6, 2, -2, -7, 11, -20, -2, 7, 0, 28, 27, 25, 19, -1, -3, -1, 10, 21, 24, 30, 14, -1, 32, -11, 20, -3, -11, -30, 8, 15, -5, -26, -50, -65, -23, 5, -29, -13, -23, -49, -50, -29, -33, -36, -9, -29, -41, -21, -47, -38, -29, -18, -17, -13, -8, -27, -56, -30, -33, -10, 8, 2, 12, 15, 9, -2, 20, 7, 41, 59, 33, 35, 22, 24, 21, 18, 51, 48, 37, 59, 49, 7, 15]
4287A5LK2Rlj5J2n1K3j3j2L8lm8L1m4kK1Kj1OKl5L7m1J7J5Jj3j0J7j4Jj7K8nL9
4323Bk4kj5L0k4K3K2j2j6J4j5kK3k4L0k1PK1Rl5kJ2J4RJ0jkk4K1j2k8K6J5Lnl5
4359hJ5oJ9ol5NJ9J0jj7j9Lj6J5J3mkrJ5Qj2j0%J3%j0mJ9j1jNK8j9k0NnPL9j3
4398A0K8k5m0K8j0JKK5lJ3k5j6j6M6j6K3l0J4J0omk1JlL2Kj9lJOk2RJ3qJ6j2j
4435@l5L6k4J2j0J7j4L3nk8J0J5J0lJ0m9L6LoJ3mmkl8K6j0RLk3K8Qj6j7jNLK7
4472A5%k2kqkj3JKK4Rlj2jj2nQj3L1M7o5K7Pk7J2K1j2jR%m1ML7nJ2kJ%j6KpK7
4513B7k3JK0jk2J6k0kL3j8Pl6K2k3KJJ8qpK9j7qPj9K5k7KNQnk4KK7k2J8Kj6On
4552b5J6KoJ1J7k9JJ0rJ0mL9n6K4K3k7mLJ5OJ4k1M3l2kj6QK8Nl5RJ2k5jj1M6k4
$$ y = [15, 18, 40, 49, 46, 31, 43, -8, 15, 2, -10, 28, 25, -23, 8, -36, -38, -17, -15, -26, -20, -18, -53, -16, -57, -40, -25, -24, -37, -47, -30, -44, -43, -60, -32, -37, 2, -22, -24, -39, -9, -33, -10, 12, 0, -16, -2, -17, -19, 4, -20, 10, -11, -4, 17, 26, -9, -11, 1, 15, 24, 34, 33, 31, 7, 28, 16, -12, 14, 29, 32, 27, -8, 7, 1, 20, 14, -21, -16, 3, 13, 12, -5, -24, -21, -37, -22, -9, -13, -15, -24, -9, -1, -13, -23, -23, -10, -10, -20, -24, -5, -16, -17, -12, 16, -3, -23, -18, -23, -16, 23, 10, 38, 13, -27, 1, -9, -8, -6, 19, 16, 29, 4, -12, -28, 18, 2, 25, -5, 9, 19, 13, 9, -12, -11, -14, 18, 20, 1, -2, -1, 5, -17, -8, 5, -3, 13, 1, 0, -35, 1, -23, -11, -21, -4, -18, 15, 10, -18, -8, 7, 17, 14, 24, -25, 11, 14, 8, 21, 17, 13, 11, -27, -1, -11, -2, 1, -22, 6, 14, -2, -19, -20, -15, -12, 15, 15, -7, -9, -17, -19, -32, -31, -29, -5, 4, 1, -11, -12, -24, -29, -21, -34, -3, 44, -21, 6, 13, -14, -2, 19, 7, 6, 15, 15, -26, -22, 15, 10, 22, 20, 21, 21, 5, 7, 0, 27, 4, 5, 25, 24, 2, 18, -2, -4, 29, 11, 18, -18, 4, -19, -17, -16, 2, -6, -13, 16, -1, -9, -2, -21, 4, -23, -21, -16, -8, -13, -37, -35, -8, -30, -12, -10, -26, -20, -25, -9, -7, -13, -2, 15, -14, -13, -3, -12, -2, -6, 33, -23, 1, 24, -3, -7, -4, 11, 17, 31, 10, 53, 21, 19, 3, 11, 39, 44, 9, 18, 30, 5, 4, -7, 39, 15]
4589A5K6l7k1Rj8K1LJ5Rl7J3jl3NK4k3lL7l8J1kMPmJ0J5j4j2J3k2J3j5OL7kj4
4625cNoj4J4J1J4Mj4J6l4NOj3K2K2%k6Pj2mL4MlJ0l7kKOmk2K6J6k9J2l2J7j4%
4663a6K0j6J8j5J1Jj7J1j3K1J6jk4k5K6k9L7mJ1j1j6L9m5RrJ9JK2m2j1J0KJ2r
4697a7J8kj0J5j9NnjK6Mj8j8MJ3qK2l0K4JJQl6L7j0nmL7rk7lKK8%nNll2K6k0j
4737gMK5JLk8j8J0KKKoK6m0NK9j6kj3j3L4oj1J9l0OqlL0j8J8rk5K3j1Pj3K9pj6
4776b5K2pJ9j8K2Nj2j9M5k9J6J4j0Lqj0NLrJ2nL6l6oqJ2j5lJ9KqrJmLRrk%k6K5
4817eJ5k9J7j2jQolj3Oj3PL6rLqm6R%kM9k3K8mj5Pl6N0k0J1nJ4nK5l0pL1l6K6
4856A4%j2j0J2j0J8K0%rj8J4l4%L7mJ0j4Nj3j0rPLlJ9Lj4rjMQOj1J9k1j5j9K8
$$ y = [15, 41, 4, -17, -8, -26, -5, -2, 13, 22, -15, -2, -3, -36, -31, -7, -30, -33, 4, -34, -23, -25, -21, -14, -18, -8, 7, -7, -19, -6, -28, -15, -30, -24, 13, 11, -3, 2, -4, -18, -4, 7, 21, 25, 11, 27, -7, -2, 4, -9, 13, 35, 35, 9, 16, 4, 0, 34, 38, 35, 45, 8, 6, 8, 14, 10, -12, 14, 30, 1, 13, -19, -2, -16, -16, 4, -12, 6, -9, 2, 3, -14, -3, -16, 5, 21, 20, -4, -29, -3, -32, 5, 1, 12, 1, -15, 24, -21, -12, -21, -2, -1, 21, -21, -32, -22, -20, -8, -17, 1, -1, -11, 4, -15, -10, -15, -16, 10, 14, -4, -22, -18, -5, -13, 9, -21, 3, 4, 5, 13, -23, 14, 4, -1, -5, 32, 23, -4, -7, -5, 23, 23, 18, 23, 20, -12, 14, -6, -7, -3, 22, 23, 26, -2, -20, -10, -8, -6, -4, -10, 16, -24, -19, 10, -6, -8, -21, -34, 0, -6, -17, 2, -28, -22, -30, -33, -3, -21, -3, -12, -37, -14, -25, -18, -31, -2, -9, -25, -3, -10, 9, -9, 13, 18, 6, -13, 32, 3, 19, 33, 23, 26, 18, 8, 13, 16, 7, 19, 14, 50, 14, 8, 0, 12, -3, -6, 13, 15, 7, -2, -1, -5, -2, 7, -2, -4, -4, -30, -5, 10, -19, -2, -14, -15, -7, -13, -16, -29, -23, -36, -29, 7, -2, 1, -7, -53, -44, -44, -46, 3, -20, 8, 4, -11, -4, -40, 10, -10, 1, -4, 10, 5, 30, 0, -7, 24, -12, 14, 14, 2, -8, 4, -6, 12, 32, 32, 23, 5, 19, -15, -15, 22, 18, 28, 14, 19, 6, -4, -13, -6, -3, -6, 13, 16, 2, -7, -8, -4, 4, 10, -1, 18, -3, -18, -37, -9]
4894i%j3K2Jj6K8l7K8k4J2Pj7M2l7%LQJ2l8K1k3J7j3pJ0qJ6NK7l0%qMJ1%j0%%
4932a6RpNk6L0J7qPnqk6L7j3K2LmNoJ1j9J4j1J1l7K3Pj2%K2j2lPJ9l0KOl1L6j7
4971BK1k8J2ko0K4K7j1MJ2j9J6k4j9J7K1k1j1J6j6K0j9%%K6noJ9J9j6k1KJ6j5
5005a9J1mPMqJ9J3rL5k2pLOqj4LNM3m2lmLOpK2j5nJj4K0Kj2kj1oj2J1qporK8q
5048b0Qk6%J8J6l3J5K0j3J3k6J4onL3l1J0Lj1kPJL1J1k1K1k7J0pK2k0J5J7kk8
5083GNJ2jK1mj7Ok7j8rN3k4rK0oMJj0j6oK5Ll7K3Mk0K3rqJ8j0lpJ5pk2PlKK2Q
5124Fm7K7J1j1Rk1M5m6K9j5j2K7pJ1J1k9L2k5mkjL4Jk9k4N5k7oMOpK2j9qMj4j1
5161c1L3K4j5j5j0J8j5lK1Lj4j4J5J6mj0jMJ0J2kqj0J2j2L2qPJ1%n0ORj8PK1J5
$$ y = [-9, -9, -22, 0, 1, -15, 13, -24, 4, -20, -8, -1, -18, 24, -13, -13, -10, -2, 10, -28, -7, -30, -13, -26, -33, -23, -31, -15, -10, 17, -13, -13, -21, -17, -6, -6, -16, -16, -16, -7, -14, -9, -35, -5, 12, 4, 11, 6, -2, -28, 9, -4, 18, 21, 17, 22, 16, 27, 8, 22, 11, 22, -15, 8, 15, 3, 3, 25, 13, 10, 17, 36, 6, 8, 14, -17, 19, 2, 23, -5, 7, 5, -55, -31, -4, -15, -11, 1, -18, -2, -26, -45, -28, -7, -28, -39, -23, -39, -19, -38, -38, -38, -12, -17, -23, -4, 15, -1, -22, -20, -4, -19, -8, -12, -5, -1, -9, 10, 23, 14, 49, 27, 20, 23, 29, 21, 7, 10, 15, 58, 16, 13, 9, 12, 18, 11, 33, 18, 13, 14, 0, 20, 22, 10, 8, -3, -9, -21, -10, -18, -25, -31, -40, -12, -20, -12, -38, -38, -20, -4, -37, -22, -2, -15, -2, -28, -14, -20, -25, 8, -23, -13, -10, -21, -23, -16, -15, 16, 27, 6, 27, 0, 10, 3, 25, 5, 20, 37, 35, 7, 12, 24, 23, 44, 40, 23, 29, 2, -16, -25, 28, 4, -5, 15, 9, 13, 14, 4, -12, -18, 7, 10, -27, -4, 0, -20, 3, -6, -14, 4, -6, -9, -16, -1, -8, -30, -23, -26, -24, -2, 6, -41, -14, -3, -14, -5, -26, 19, -27, 2, -13, -25, 2, -5, 6, 17, -12, 20, -5, -9, -11, -12, 22, 23, -6, -30, 25, -2, -8, -4, 2, -5, 17, -2, -10, -6, -20, -31, 2, 26, 11, -4, -14, 4, -11, -14, 7, 10, -4, -18, -3, 13, 9, -1, -2, 2, 12, 24, 22, 14, 4, 16, 4, 36, 28, 35, 46, 46, -4, 2, 11, -7, 0, 21, 36]
5198C6k4j8J6j6jK0Rk3njl7L6k2K7j5jK4l0J4k3PqJ5j1L5Ln6K4KJ2j0Ok0K6L1
5233B2k9j0J8k4K1kLP%k2K7MRj1J1l0L6j4J9k1J4k2L2k2K0j7l0K2QK4l6OmPj6
5268@J1J0k4J7m8L2j2l3K6j0L3j7J5j5J3k6J2Jj1OpJJJ2j5K2k6K0j4OMmnL5k0
5303a0j1OK9j7k3O%J7K2MO%j5rQpJ4Llj6j1oJ8j0OL4k3j9nJ3Nj5K9j7jk0MQOR
5343Ik0J1J1k1j3J2LK1j7KRl3MLmJ0oJ8Jj3jKL0k2j3MJ0j3J2k0OOj7K0J5j5L5
5380B6n4K5j0JrJ3J7j8J9l7ROoK8jk5M0k7J6ml6L7k8M7k0OQj4jMj1L0j4J7qk0
5416FlMjJ1oJ5pl3J6Kqj1J5j2RKlj3%MRnj3pK6k3L8n0K3qPKkj4J7j6j8J4J3k4
5456d4RPPkK0K9o6K4PJ5jk3L4MJ8k3MJ3l4LK8l1K4JokQk4K7R%j5J5j4j6K8j3n
$$ y = [36, 12, -6, 10, -6, -7, 13, 22, -1, -6, -7, -44, -8, -30, -3, -18, -19, 5, -25, -11, -34, -27, -35, -20, -31, 4, 7, -49, -25, -23, -11, -21, -15, -35, -9, 22, -7, -17, 1, -23, -2, -4, -1, 6, 6, -16, 11, 15, 24, 13, 24, -6, 30, 16, 35, 14, 28, 6, 38, 16, 36, 19, -11, 11, 19, 43, 7, 13, 9, 16, 0, 11, 21, -3, 14, -34, -2, -14, -47, -21, -31, 2, -15, 0, -15, -2, -28, -16, -15, -26, -20, -27, -26, -25, -13, -28, -6, -32, -12, -26, -20, -16, -20, -25, 10, -10, -21, -15, 14, -3, -26, -20, -20, -3, 19, 23, 29, 29, 14, 5, 13, 6, 20, 23, 20, 4, -7, -13, 5, -5, 1, 35, 12, -7, -12, 1, 6, -9, 20, 3, 2, -18, -14, -6, 0, 9, -11, 0, 11, -10, -23, -11, -8, 13, -4, -2, 7, -26, -22, -19, -23, -13, -19, -1, 0, -13, -14, -12, 18, -4, -17, -13, -3, -16, -4, -24, -18, -12, -29, -9, 6, -9, 26, -28, -3, -13, -12, -21, -8, 9, -9, 10, -27, -18, -12, -18, 10, 9, -16, 24, -3, 13, 9, -27, 10, -18, 29, 9, 15, 23, 9, 8, 12, 1, 31, 17, 34, 26, 6, 3, 7, 6, 17, 11, 26, 19, -14, 2, 4, -4, -15, 0, -12, -3, -1, -4, -17, -17, -13, -4, -9, -22, -29, -3, -26, 12, -38, -15, -23, -16, -14, -16, -30, -13, -29, -47, -33, -20, -44, -35, -28, -21, -23, -3, 26, -40, -16, -9, 6, 5, -18, 16, 20, 38, 15, 19, 32, -2, 1, 29, -2, 22, 23, 17, 15, 23, -1, 26, 35, 35, 20, 35, 21, 5, 33, 20, 15]
5494A5nQJ8l0nj7MMmJ1LmLk0LLpmK4j1kj6J1j1K1j2mL9m3j1L2ppk2L3qPj1K9k
5534Ej1QpNnOopK7K7k1k5K9j3rK7k1pMJ4J1k9K5k4J1J5J8j9k4J6jj6J7Kj9K9m
5571B8k4J4j7j1J6nj6M0l1J2kj1L2k3J1j0nRj2JMk2J9%pJ8kk1K8k0K0k1J4Lk1
5606a2J7k9K9qRJJ3qj0Koj7jK3Nk6K0J9k2j3PPJ2J4k1J6k6rL1j9K7oj9PJ8j4k6
5643a5J7kK1nJ0jnj5j0PK6j5j9MJ1Jj9J1K0m5K7k2L6k4J2Pj3j9lK1r%k8L7l1K1
5679a1Oj2K1l5RJK0n%rJpJ3k2J1KL0k7K2Oj1pJ3j1J1JKQj0Oj4pK0Mlk6K7nPj1
5719Hmj3J2MQk4J1qJ3MNoj2J2l2J7K0qk9L5Jmk0K1j7kRJ5l1J4nJ3%j2J8j2l0J5
5757a4QNj6J4J6KK4k3k5J9j0KqNjqJR%pRpJ4K0pl2J6J3j0mJ4j7k5K4PLjJ3jj2
$$ y = [15, 10, 18, 36, 6, 1, -16, -12, -8, -12, -1, 2, -2, 1, -19, -16, -13, -20, -24, 0, -11, -13, -29, -18, -29, -8, -20, -24, 15, -28, -39, -7, -14, -21, -43, -10, -18, -11, -22, 7, 5, -6, 2, -5, 0, -5, 1, -5, -12, 15, 42, 21, -4, 25, 12, 3, 30, 9, 2, 6, 20, 31, 2, 27, 3, 14, 29, 47, 28, 4, 20, 19, 3, 20, 22, 3, 32, 28, 4, 18, 1, -10, 6, 1, -15, 25, -6, 6, 4, -7, 25, 2, 13, 3, -2, 7, -5, -4, 0, -22, -3, -3, -10, 8, 6, -15, 13, -7, 13, -8, 6, 9, -12, 5, -24, 5, -3, 6, 7, 20, 12, 2, 4, -2, -19, -20, 3, 8, -18, 2, 21, -1, -14, -7, 0, 12, 26, 5, 21, -5, -14, 17, -2, 25, 19, 0, 7, 25, 11, -15, 2, 0, 21, 16, 26, 25, 20, 5, -5, 2, 28, 13, -6, -2, 9, 10, -9, 2, 22, -23, 4, -18, 18, -6, 6, 13, 0, -19, -22, -1, -10, -10, -38, -1, -32, -11, -5, -17, 4, -31, -22, -21, -1, -6, -6, -15, -14, -21, -8, -30, -19, -17, 13, -14, 8, 14, 3, -4, 9, -2, 9, 10, 12, 20, 10, 16, 2, -5, 15, 19, 16, -10, 17, 12, 19, 8, 4, -9, 3, 7, 15, -9, 2, -6, 7, 11, 16, 10, -2, 10, -22, -5, 15, 7, -22, 13, 14, 10, -10, 11, -6, -8, 1, 16, -15, -1, -6, 7, 7, -5, 13, 1, -29, -14, -6, -1, -17, -3, 13, 15, 39, 16, -9, 10, 0, 2, -6, -1, -2, -10, -9, 0, 0, -7, 2, -5, 9, 29, 22, -10, 6, 19, 9, 5, 19, 2, -23, 1, 8, 11, 10, 23, 22, 10]
5797A0j3OKK7Jk6k0K1rJK5j0JMj7J9rj6j7L2pJ5l4K9j2j0J2j1RlK6pk0j7MPpJ0
5835dJ3j8lJ0j4J8k1LJ1k0PK4j3Nj0K5Lj1OMoNkl7L3j6j3L5rj2%J4J2j4nPj0l
5873fJ4j8J2rPjLk4LM1k8PmK2jk9pJ7%J0l2J6mjNj%rRj3K2j7oKQL7m2J4JJ3jj5
5915eRpOqK3k6K6j6jlj1J0oJ3Nj5nJ2J3j3Nj0J7qJ6j6j0L1oj9J0oj1oMj9K3J3
5953Ik5J4lJ9l1M2k3Ql0N0Kl0j7M7k3J7%j2kk5J4nlPkj3K4k7PJL4j6oK0k3OJ2
5990A7k9JK5Onj4l2M0rj3M0l2J0J9j3k4J2J7j5J4k9KKK2j4j7LL1j9KK0l5L0k3
6024a0PoLJ2pj8L5j6RlJ0k2J3L9m2K3k4jJ4MJ3k4Pk4pOJ9Ql0J0OJ0l4M8l8lL3
6061B0mk7%K4qj5J3j0J8ljk8k2K4K2j3MJ2k8J4J7j5%J3j2K4jj6j8K4rK5k3J6P
$$ y = [10, -3, 3, 5, 32, 33, 7, -13, 8, -1, 0, 25, 15, 16, 20, 3, 22, 13, -3, -20, 12, 5, 20, -14, 15, 3, -7, 5, -6, 3, 0, 26, 19, -1, -18, -14, -7, -14, -4, 9, -9, -12, -2, -16, 2, -19, -16, -5, -25, -18, 6, -7, -2, -12, 13, 16, 5, 11, 15, 9, 14, 12, -25, 8, -8, -21, 14, 5, -7, -7, 7, 19, 5, 0, 7, -3, -6, 8, -10, 2, -7, 0, -1, 2, -22, -19, 22, -6, 1, -3, 19, 18, -11, -18, -1, -1, 9, -23, -7, -11, -12, -7, -8, -8, -17, -8, -21, 1, -16, -22, -20, -12, 25, -17, -3, -2, 11, 10, -5, 4, -3, 3, -5, 18, -8, 18, 2, 1, -2, -13, -3, -9, 4, 9, -6, -11, 1, 14, 1, 6, -4, 13, 5, 21, 5, -5, 26, 20, 1, 11, 5, -6, -12, -8, -27, -4, 9, -16, -2, -5, 14, -17, 25, 2, 10, -20, 30, 32, 2, -15, 32, 9, 26, 26, 14, 12, -13, 1, -4, -7, 0, -2, -15, 9, -18, -11, -10, 24, 8, 2, 22, -1, 5, 17, -12, -11, 14, 20, 15, 1, -31, 9, 0, -13, 27, -5, 5, 24, 11, -13, -1, 16, 1, 15, -14, -12, -10, 12, -2, -19, -16, 15, -4, -2, 18, -17, 13, -10, -3, -9, -6, 6, -1, -19, 16, 0, 9, 6, 16, -6, 7, 46, 4, 27, 3, 2, 16, 20, 33, 9, 16, -8, -15, -9, 10, 18, -12, -2, 4, 14, -20, 28, -10, -13, 20, 16, -11, -11, 13, 5, -10, 3, -7, 11, 8, 7, -21, -43, -19, 3, -10, -6, 6, -22, -8, 9, -6, -6, 7, -5, 19, 18, 2, -16, 8, -1, 24, 1, 17, 24]
6096B4k9oMJOK0j0J5m7J6J9kqK4k5jkL3m7K8k9k0K7j2J8nPrmJONk8K0J6j3r%R
6135gkJ4kj4JL5l1RJ3j3lj2J5nk7N6l7J2K6k1j7K4j3j9L3K2pj0k2QrRJPJ0j0J
6172A5npJ2Rk4ojjJ9Nm7K0K1j2k6K0j7L4j9l%j6J1LpL0j8NLMqkRj5J4l6O9j8j6
6211aJ8l4J9k2K2JK5j7j1Qj7Pj8N2l0mJ9j4mRJkj7M1k6PJ2l9J6qJJ8k5nK3j4J3
6248DoKJ6k2jJ1Jnj7J3oJOj2K7k8J8j1K7j2qkK%OPl1K8l5J6RpJ8%llqRJ7j1kO
6290A4pjnQj9K6j0J0j9LrK4kk2%j1J3K2k7J2%j3K8%lj3QjJ6j6j7nM7l1jk5K1J9
6328A4j7J0k2rJ6MnOoNopj0QJ4OJ3k7K2l2J2K2qJ4oj4mnJ2nQmMmnK0kj9K3nJ1
6369B2k6L1k7KK4j6l2K9o%Lj5J0J8j3%K6nj3Rk1Rj6K2j9k8N4l7J4J6k5J8k9J6
$$ y = [24, -5, -11, -7, -6, 0, 20, 10, 25, -22, -6, 13, 11, 3, 27, 2, 1, -1, 32, -15, 13, -16, -36, -9, -21, -3, -8, -1, -10, -14, -13, -7, -2, -30, -10, 6, -7, -16, -16, -7, -9, 5, 3, -11, -10, 25, -6, 3, 16, 3, 0, -12, 3, -2, -29, 27, -10, 2, 28, 7, -10, 14, 1, -18, 15, 37, 30, 20, -2, 6, -3, 6, 7, 14, 24, 14, 15, 10, 3, 15, 24, 0, -6, -7, -8, 11, 16, -31, -11, 10, -2, -28, -8, -25, 9, -10, -13, -13, -29, -18, -15, -22, 8, -10, -5, -2, 2, -6, -8, 1, -14, 0, -36, 33, 15, -1, 17, -17, 2, -20, 2, 3, 28, 11, 0, 8, -9, -2, -20, 32, 2, -2, 17, 3, -1, 8, 9, 7, -10, 31, 5, 12, 24, -15, 1, -7, -6, 12, -13, -18, 5, -9, 4, -2, 0, 16, -6, -7, 4, 5, 0, -17, -4, -10, -9, -3, -15, 12, -16, 2, -9, 18, 6, -2, -4, -2, -2, 4, 11, -20, 8, -27, -11, -2, -9, 9, 9, 6, 3, -5, 4, 21, 10, 8, 14, 7, 6, 1, 9, -10, 16, 6, 16, -3, 0, -9, 15, 13, -9, -9, -20, -7, 15, -12, 0, 0, -13, 15, 15, 12, -1, 7, 6, 22, 6, -11, -16, 31, 0, -1, -26, -5, 14, -3, 7, -15, -24, -8, -4, -9, -3, -9, -4, -10, -17, -27, -19, -5, 1, 14, -13, 9, -23, -11, 11, 3, 17, 11, -3, -7, -12, 0, -5, 3, -1, 3, -1, -6, 14, 12, -7, 16, 11, 22, -4, 27, 0, 2, 26, 10, -22, 7, 1, 1, 4, -11, -1, 17, 4, 4, 30, 25, 12, 21, 0, 9, -7, 15, -4, -32, 22, -15, -1, 15, -10, 8, -21, -5]
6403eRk3K2jqJ2j5J1K2qj1k7J4%NnlK3nk2M3m8J2J4j7Rj7J0rL1k5J6qRpJ2lrK1
6442A9j8MjJk2%K3kpMj6kL7o1K5J0J5j2knL7Lk5PLj1MK2k3J4j0Pk1K1jP%Jj4R
6482B0k1J9j2J4ooJj4mJ3jk1K6oqJ4j2%npJ1K0Lk5J1kj8lL3l2J4rK1J0l2NJ0o
6520eJ4k0J5J0l3M3mJ4l1NJ7jqmJ6k9K9j7plJL9m4jKK1k7JJ5Nj5QmQj2k2J3NK1
6559A5l8M0j6nNj4j0K6r%JkJ0lj1K1j1J2l0ORkNK2j1PJj4onKKJ1J1j4krLJ3LJ9
6600C2j1%j0jLNkK0l2K1pk0K8l9OJ1qKLpK5m6L3J2j2j3L0k7Oj5LJ7l9K8qLJ6k1
6638a4J0j2M7l6J6k6K5j6J0qKMJ0j3j1Oj0JpJ6LK3k8MJ6k3PjJ2jj1K0j9J0j7K5
6674A4Lk8J9kj5Lk6M0nJ8Nl2RMk6QJ6j5MM9m4Oj7pK0rK4j1Kl2L4rJ3j4J2J8k9
$$ y = [-5, 4, -19, 3, 2, -6, 6, -9, 2, 24, 16, 5, -22, -8, -8, -3, -8, -11, 12, 7, -15, 28, -20, -8, 6, -11, -2, -19, -9, -18, 13, -12, 4, -4, 5, -2, 10, 7, -2, 19, 1, 5, 4, 5, -17, -17, 6, 4, -3, 1, -15, -17, 20, -41, -16, -6, 9, -3, -5, -10, 27, 30, 5, 12, 15, 4, 8, 30, 7, 21, 11, 18, -3, 18, 17, 24, 24, 25, 11, 20, -1, 18, 6, 20, 14, 8, 9, -5, -9, 4, 3, -18, 8, 2, -6, 8, -4, -4, -9, -16, -5, 15, 18, -7, 4, 2, -16, -19, 14, -18, -4, -13, 8, 18, -14, -9, 1, -5, 9, -11, 4, 14, -19, 24, 20, 34, 3, 8, 25, 24, 16, 12, 28, -1, 28, 11, 4, 1, 2, 41, -3, -4, -2, 19, -8, -7, 8, 13, -2, 6, 2, 10, -2, -24, -11, -6, 15, -23, 17, 1, -4, 1, -13, -23, 3, -6, -6, -5, -7, 3, 0, -11, 10, -1, 11, -19, -13, -4, -6, -1, 21, 10, 17, 18, 4, -2, -7, -5, -3, 8, 19, 5, 3, -6, -3, 10, 13, 32, 21, 21, 11, 10, 13, 18, 16, 36, 4, 25, 18, -2, 26, -13, -7, 4, -4, -2, 1, -6, 19, -27, 6, 18, 6, -7, 23, -4, 2, -13, -10, 7, -32, -4, -12, -9, 7, -14, -4, -16, 31, -5, 11, -15, 10, -6, 4, -4, -2, 2, 12, -1, -12, -6, -16, -15, -22, -6, -3, 20, -8, -4, 12, -11, -4, -5, 7, 6, -5, 15, -4, 6, -11, 14, 17, -11, 8, 6, -9, -6, -32, 8, 3, 21, 26, -6, 3, 7, -19, -11, 5, -10, -6, 43, -1, 5, -12, -19, 1, -8, 16, 5, 7, -25, 9, 0, 13, -1, 11, 29, 0]
6711@Rl1QpK1KMj7nJ0OJLj8l%j6K3J7j6K3m4M7l3lMJ4Lk0J8rPJ1k6M1n0K4MkK3
6751B3k2K1j8Pj6kJ9Nj8K6j7kk1J6rK3ORl5J0Qj8MMLj1J2mj6L2l6MJ8lrJ8k4K4
6789A1k5KOj8K8j2kJ7pJ3l1RpOJ4k6LJ9l3M0Jrj9JMJ2Rk9L3Kk1k0M7l1L7k6oJ8
6827A0J9k7j1j8L3j8K3oKj3NKnJ8%onj2k1K7LnLQjk4N%RQk8J1oJ6rONRl8L0lj
6869eNPn3N2j1qK2m5N0jk2j9N1j1Oj0j2J7j2l3RL4k4J2J5j6j5K1j3QRk8K3J6j0
6904IOj4mK2mmLJ3j7j1J1j8MK0j8OKj2Nj5OJ0K%pQp%l1M3k1RLJJ2k3J4mj4NJ4
6945D%Qj5qK7k3Qrk7L6rQKOj3L0l3J2Lk1J3J0j6qoJ4Jj3J5nROj2J5Pk7JK2J4k0
6985Fk0J5PMpnj8jK5MJ5l6J9kPMj9PkRj3J2k0j5RK4j4J2j8J5m9K2K1Moj8OmKK
$$ y = [0, 9, -22, -14, -21, 0, 2, 6, -11, -16, -6, 0, 1, 4, -14, -17, -17, -33, -10, 7, -9, 14, -30, 17, -16, -19, -15, -1, 2, -18, 0, -9, -2, 9, -17, 24, -26, -2, 2, 0, 23, 1, 22, 4, 11, -5, -7, 12, 17, -1, 25, 8, 6, -15, 1, -8, 15, 21, 30, -5, 5, 13, -5, -1, 3, 6, -5, 7, 3, -13, 19, -17, -13, 5, 2, -7, 11, -13, 11, -14, -12, -6, -24, 4, -8, -10, 7, 0, 13, -18, -9, -16, -10, 4, -22, -19, 0, -33, 7, 8, -1, -20, -19, -15, -3, 6, -23, 10, 12, -9, -29, 18, -13, 24, -2, -8, 10, 29, 2, -9, -27, 6, -12, 11, 5, 7, -6, -1, 1, -4, 14, 14, 8, 3, -9, -30, -3, 0, -5, -2, 6, 5, -19, -14, -14, -5, 3, -25, -14, -20, -4, -13, -7, -2, 7, -31, -1, -4, -5, 0, 7, -46, 6, -5, -13, 9, -36, 14, 13, -9, -28, 23, 12, 18, 8, -4, 13, 1, -32, -23, 11, -13, -1, 14, -2, -17, 4, -9, -1, 8, -20, 3, 19, 9, 15, 1, -3, 19, 15, 11, 14, 27, 10, -1, 10, -8, -4, 16, -2, 4, 6, -6, -1, -16, -10, 0, 2, 2, -5, 3, -4, -4, -35, 8, -13, -4, -1, 0, 12, -11, 3, -1, -15, -10, 4, 4, 12, -3, -11, 16, -7, 1, -8, -35, 1, -8, 0, 2, 8, -5, 25, -8, 4, 7, -14, -1, 9, -7, -15, -21, -7, -6, -19, -4, -9, 0, 6, -6, 9, 16, -11, -10, 12, 26, 6, -14, 1, 8, 12, 5, 0, -18, -19, 6, 10, 25, -11, 8, 6, 13, 17, -2, 5, 3, 12, -1, 11, -9, -24, -15, 9, -5, 7, -11, 4, -45, -23, -2, 2, -4, -22, -16, -20, -18, -16]
7025a6J0Knk0pK2polJL7j6J0Nj9j4J0PJ1k2K3j8LJ5J5rj0Pj6K2KRl4OK9k1MLk
7064HJNk1mJ6k5J1JK3%Jk1K3k9J1k0ML9k0L1k1j6Qj3oOOj0j1J9JJ0j6jQjj2K2
7102Gj3j0mK6j5J7Qk9K4k0K7k3J7k9K5j9%L8j8Jj9J7Qk2KK3j2lJ3Nmk5NnL0Ql6
7139eL6l0jj3mrK8mj4L1l0PJ6k2K9k1j8J2K6k5%ORjj7plJ3J9k1%J1%l%l5L4pN
7178hMlPj6K7rpOMjj9K2pOJQj1Jj4J7j0k1J9M%K5l7L4mj8K0rJ6k7Nj8K6Lj8LJ4
7219A5pQnj0RJpK1m2J7K0l3ok5K0j9L8MNk3RJ1j2PnJ2k7mQPQlj7lK2jj4NJ9Ql4
$$ y = [-16, -6, -4, -9, -29, -36, -14, -21, -27, -30, -29, 8, -8, 2, 7, -12, -26, -16, -9, 2, -20, 3, -15, -12, 3, 18, 9, -1, 6, -10, 12, 14, 23, -11, -5, 24, 3, 7, 10, 8, 9, 14, -7, -11, 5, -20, -9, -8, 15, 15, 16, -5, 18, -11, 0, -20, -16, 23, 3, 34, 13, -3, 5, -8, -14, -8, -2, -12, -23, -4, -3, 7, -9, -10, -2, -3, -15, 7, -6, -16, -20, 6, -9, 8, 16, -13, 11, -9, 18, -5, 12, -17, 8, -11, -11, 27, 9, 10, -9, 8, 16, -6, -4, 19, 7, 4, 17, 22, 18, -7, -2, -7, 23, 31, -5, 31, 1, 0, -13, -17, -26, 2, -2, -16, 15, -15, -8, 8, -14, 15, -6, -24, -12, 14, -11, -11, -5, 4, 3, -14, -21, -24, -11, 8, -13, -13, -2, -2, -5, -5, -40, -6, -13, -8, -4, -7, 0, -16, 11, 2, -5, 1, 5, 4, -15, 7, 0, 6, 7, 15, 4, 5, -9, 8, -2, -23, -4, 0, 0, 25, -12, 22, 18, 0, 20, 11, 27, 0, 5, -13, 13, 16, -2, 1, 15, 8, 16, 11, 1, 10, 11, 4, 25, -17, 0, 20, -13, -19, -44, -24, -43, -5, -1, 4, -19, -10, 1, -11, -4, -9, 3, -24, -28, -20, -13, -5, -8, -25, -28, -6, -7, -21, -16, 3, 11, -23]
$$ [...]
8191B6
##END NTUPLES=NMR FID
##END=
