##TITLE=1H_AM A501.1
 CDCl3, 8 sc, 
 23.7.2019
##JCAMPDX= 6.0         $$ Bruker NMR JCAMP-DX V2.0
##DATA TYPE= NMR FID
##DATA CLASS= NTUPLES
##ORIGIN= UXNMR, Bruker Analytische Messtechnik GmbH
##OWNER= root
$$ XWIN-NMR		Version 3.5
$$ Tue Jul 23 14:59:34 2019 Russian Standard Time (UT+4h)  she@DPX200
##.OBSERVE FREQUENCY= 200.13155
##.OBSERVE NUCLEUS= ^1H
##.DELAY= (6, 6)
##.ACQUISITION MODE= SIMULTANEOUS
##.ACQUISITION SCHEME= undefined
##.AVERAGES= 8
##.DIGITISER RES= 18
##SPECTROMETER/DATA SYSTEM= spect
##.PULSE SEQUENCE= zg30
##.SOLVENT NAME= CDCl3
##.SHIFT REFERENCE= (INTERNAL, CDCl3, 0, 15.7039)
##AUDIT TRAIL= $$ (NUMBER, WHEN, WHO, WHERE, WHAT)
$$ ##TITLE= Audit trail, XWIN-NMR		Version 3.5
$$ ##JCAMPDX= 5.01
$$ ##ORIGIN= Bruker BioSpin GmbH
$$ ##OWNER= she
$$ F:/spectra/data/she/nmr/H-F/1/audita.txt
$$ ##AUDIT TRAIL=  $$ (NUMBER, WHEN, WHO, WHERE, WHAT)
(   1,<2019-07-23 14:58:39.84 +0400>,<she>,<DPX200>,
      <created by zg, POWCHK disabled, PULCHK disabled
       configuration hash MD5:
       00 E9 B6 7A A2 85 ED C7 34 08 36 98 17 FE 4E 26
       data hash MD5: 16K
       E1 A1 A8 FD 62 4E 31 63 0B 93 34 5D 8F 20 37 51>)
$$ ##END=
$$ 
$$ hash MD5
$$ 25 01 F3 E8 B3 CF 20 73 07 34 5B 4F C1 18 C2 6D
##$RELAX= 
##$RELAX= 
##$RELAX= 
##$RELAX= 
##$RELAX= 
##$RELAX= 
$$ Bruker specific parameters
$$ --------------------------
##$DU= <F:/spectra>
##$EXPNO= 1
##$NAME= <H-F>
##$PROCNO= 1
##$TYPE= <nmr>
##$USER= <she>
##$AMP= (0..31)
100 100 100 100 100 100 100 100 100 100 100 100 100 100 100 100 100 100 
100 100 100 100 100 100 100 100 100 100 100 100 100 100 
##$AQSEQ= 0
##$AQ_mod= 1
##$AUNM= <au_zg>
##$AUTOPOS= <>
##$BF1= 200.13
##$BF2= 200.13
##$BF3= 200.13
##$BF4= 200.13
##$BF5= 200.13
##$BF6= 200.13
##$BF7= 200.13
##$BF8= 200.13
##$BYTORDA= 1
##$CFDGTYP= 0
##$CFRGTYP= 5
##$CHEMSTR= <none>
##$CNST= (0..31)
1 1 145 1 1 1 1 1 1 1 1 1 1 1 1 1 1 1 1 1 1 1 1 1 1 1 1 1 1 1 1 1 
##$CPDPRG= <>
##$CPDPRG1= <>
##$CPDPRG2= <>
##$CPDPRG3= <>
##$CPDPRG4= <mlev>
##$CPDPRG5= <mlev>
##$CPDPRG6= <mlev>
##$CPDPRG7= <mlev>
##$CPDPRG8= <mlev>
##$CPDPRGB= <>
##$CPDPRGT= <>
##$D= (0..31)
0 1.2 0 0 0 0 0 0 0 0 0 0.03 0 0 0 0 0 0 0 0 0 0 0 0 0 0 0 0 0 0 0 0 
##$DATE= 1563879519
##$DBL= (0..7)
120 120 120 120 120 120 120 120 
##$DBP= (0..7)
150 150 150 150 150 150 150 150 
##$DBP07= 0
##$DBPNAM0= <>
##$DBPNAM1= <>
##$DBPNAM2= <>
##$DBPNAM3= <>
##$DBPNAM4= <>
##$DBPNAM5= <>
##$DBPNAM6= <>
##$DBPNAM7= <>
##$DBPOAL= (0..7)
0.5 0.5 0.5 0.5 0.5 0.5 0.5 0.5 
##$DBPOFFS= (0..7)
0 0 0 0 0 0 0 0 
##$DE= 6
##$DECBNUC= <off>
##$DECIM= 24
##$DECNUC= <off>
##$DECSTAT= 4
##$DIGMOD= 1
##$DIGTYP= 9
##$DL= (0..7)
0 120 120 120 120 120 120 120 
##$DP= (0..7)
150 150 150 150 150 150 150 150 
##$DP07= 0
##$DPNAME0= <>
##$DPNAME1= <>
##$DPNAME2= <>
##$DPNAME3= <>
##$DPNAME4= <>
##$DPNAME5= <>
##$DPNAME6= <>
##$DPNAME7= <>
##$DPOAL= (0..7)
0.5 0.5 0.5 0.5 0.5 0.5 0.5 0.5 
##$DPOFFS= (0..7)
0 0 0 0 0 0 0 0 
##$DQDMODE= 0
##$DR= 18
##$DS= 0
##$DSLIST= <SSSSSSSSSSSSSSS>
##$DSPFIRM= 0
$$ [...]
##$SUBNAM2= <"">
##$SUBNAM3= <"">
##$SUBNAM4= <"">
##$SUBNAM5= <"">
##$SUBNAM6= <"">
##$SUBNAM7= <"">
##$SUBNAM8= <"">
##$SUBNAM9= <"">
##$SW= 24.9336996594482
##$SWIBOX= (0..15)
0 0 2 0 0 0 0 0 0 0 0 0 0 0 0 0 
##$SW_h= 4990.01996007984
##$TD= 16384
##$TD0= 1
##$TE= 0
##$TE2= 300
##$TE3= 300
##$TEG= 300
##$TL= (0..7)
0 120 120 120 120 120 120 120 
##$TP= (0..7)
150 150 150 150 150 150 150 150 
##$TP07= 0
##$TPNAME0= <>
##$TPNAME1= <>
##$TPNAME2= <>
##$TPNAME3= <>
##$TPNAME4= <>
##$TPNAME5= <>
##$TPNAME6= <>
##$TPNAME7= <>
##$TPOAL= (0..7)
0.5 0.5 0.5 0.5 0.5 0.5 0.5 0.5 
##$TPOFFS= (0..7)
0 0 0 0 0 0 0 0 
##$TUNHIN= 0
##$TUNHOUT= 0
##$TUNXOUT= 0
##$USERA1= <user>
##$USERA2= <user>
##$USERA3= <user>
##$USERA4= <user>
##$USERA5= <user>
##$V9= 5
##$VALIST= <valist>
##$VCLIST= <CCCCCCCCCCCCCCC>
##$VD= 0
##$VDLIST= <DDDDDDDDDDDDDDD>
##$VPLIST= <PPPPPPPPPPPPPPP>
##$VTLIST= <TTTTTTTTTTTTTTT>
##$WBST= 1024
##$WBSW= 4
##$XGAIN= (0..3)
0 0 0 0 
##$XL= 0
##$YL= 0
##$YMAX_a= 6811
##$YMIN_a= -7383
##$ZGOPTNS= <>
##$ZL1= 120
##$ZL2= 120
##$ZL3= 120
##$ZL4= 120
##$ABSF1= 10
##$ABSF2= 0
##$ABSG= 5
##$ABSL= 3
##$ALPHA= 0
##$AQORDER= 0
##$ASSFAC= 0
##$ASSFACI= 0
##$ASSFACX= 0
##$ASSWID= 0
##$AUNMP= <proc_1d>
##$AZFE= 0.1
##$AZFW= 0.1
##$BCFW= 1
##$BC_mod= 2
##$BYTORDP= 1
##$COROFFS= 0
##$CY= 11.3945322036743
##$DATMOD= 1
##$DC= 2
##$DFILT= <>
##$DTYPP= 0
##$F1P= 18.9103706918063
##$F2P= -1.10871071338519
##$FCOR= 0.5
##$FTSIZE= 0
##$FT_mod= 4
##$GAMMA= 1
##$GB= 0.15
##$INTBC= 1
##$INTSCL= 1
##$ISEN= 128
##$LB= 0.24
##$LEV0= 0
##$LPBIN= 0
##$MAXI= 10000
##$MC2= 0
##$MEAN= 0
##$ME_mod= 0
##$MI= 1.114404
##$NCOEF= 0
##$NC_proc= 0
##$NLEV= 6
##$NOISF1= 3.799351
##$NOISF2= 2.8
##$NSP= 1
##$NTH_PI= 0
##$NZP= 0
##$OFFSET= 15.70392
##$PC= 1
##$PHC0= -8934.962
##$PHC1= 4.600957
##$PH_mod= 1
##$PKNL= yes
##$PPARMOD= 0
##$PSCAL= 0
##$PSIGN= 0
##$REVERSE= no
##$SF= 200.130013532006
##$SI= 16384
##$SIGF1= 3
##$SIGF2= 2
##$SINO= 400
##$SIOLD= 16384
##$SREGLST= <1H.CDCl3>
##$SSB= 0
##$STSI= 0
##$STSR= 0
##$SW_p= 3612.71676300578
##$SYMM= 0
##$S_DEV= 0
##$TDeff= 0
##$TDoff= 0
##$TI= <>
##$TILT= no
##$TM1= 0
##$TM2= 0
##$TOPLEV= 0
##$USERP1= <user>
##$USERP2= <user>
##$USERP3= <user>
##$USERP4= <user>
##$USERP5= <user>
##$WDW= 1
##$XDIM= 8192
##$YMAX_p= 0
##$YMIN_p= 0
$$ End of Bruker specific parameters
$$ ---------------------------------
##NTUPLES= NMR FID
##VAR_NAME=  TIME,          FID/REAL,        FID/IMAG
##SYMBOL=    X,             R,               I
##VAR_TYPE=  INDEPENDENT,   DEPENDENT,       DEPENDENT
##VAR_FORM=  AFFN,          ASDF,            ASDF
##VAR_DIM=   8192,          8192,            8192
##UNITS=     SECONDS,       ARBITRARY UNITS, ARBITRARY UNITS
##FACTOR=    0.0002004,     1,               1
##FIRST=     0,             0,               0
##LAST=      1.6414764,     0,               0
##MIN=       0,             -7383,           0
##MAX=       1.6414764,     6811,            0
$$ Real data points
##PAGE= N=1
##DATA TABLE= (X++(R..R)), XYDATA
$$ [...]
1302b41J035L43o95j131m83N69J047N97m19j042p36K40J010Q06j29r31q39j6Q14
1321b01R13J93p15r48k73O74R54L63n22q92m60M09R18N67l18q72n94K33Q22O43
1341H94j12p80p22J2P60P69L5p31p89j54O30Q16K53n98r03l61N57R00M06m42r19
1362d79n42L37R26O60k54r14p44J60Q78Q30J8q07r08j61P93R84K75o84r68m13
1382a013N39J015N79m08j043o85L07R87P48j32r15q72m6Q50R43J35p73r62k89
1401a035O24R54M28n07r74n51L90R57O09k79q82o66J28Q25P68k2p66p79m0O95
1421a23P95J76n86q04k82N63Q42L41m76q15m00L80Q03M98k90q29n73K25Q18N80
1441H43j49p73o88K3P27P48N0p29q08j69O37Q25K61n44q93m07M87R35N02m17q92
$$ y = [-241, 794, 1137, 442, -689, -1172, -603, 444, 1041, 622, -420, -1156, -916, 94, 900, 771, -160, -999, -1015, -201, 712, 905, 190, -758, -1031, -357, 597, 960, 438, -454, -914, -505, 413, 980, 662, -210, -804, -571, 251, 894, 782, 2, -720, -708, 52, 821, 856, 125, -664, -818, -188, 628, 881, 283, -620, -981, -424, 476, 882, 440, -479, -1021, -684, 242, 902, 648, -266, -1010, -850, 28, 858, 876, 69, -839, -1000, -207, 777, 1052, 368, -600, -1013, -474, 541, 1120, 712, -331, -1016, -709, 278, 1026, 894, -21, -893, -939, -89, 854, 989, 216, -746, -1035, -411, 543, 971, 464, -510, -1061, -671, 286, 895, 616, -266, -932, -804, 21, 789, 767, 1, -778, -818, -123, 672, 848, 262, -542, -824, -261, 581, 922, 446, -369, -769, -389, 414, 912, 622, -207, -780, -555, 263, 843, 694, -79, -767, -744, -17, 731, 781, 52, -756, -925, -288, 537, 798, 254, -639, -1046, -559, 376, 878, 461, -431]
1462d31n87K79R02P07j14q62p89K1Q42Q63J47p16q94k70O28R84L96n30r65m81
1482h70L96R30O21k63r15p29J24Q59P57l6p83q08j60O55Q53K39o22q91l23M83
1502d83Q30M13m01q30n16K87Q09N82k03p83n90J21P22O58J9o65o93n5O71P44J43
1523G80n54p05k47N30P86L50m44p99l66L86P83M56k75p85n72J86P79O44j45p73
1543A5p00k7O87P42J19o82q46k64N88Q40L16m96q84m84L92Q78N77k90q80o41J71
1564h69Q13P39Kp45p93j04P39Q51K47o02q21l24M96Q87M84l79q47n19K90Q25O00
1585I70j53p47o62J5P33P10L7o71p38j50N38P13K57n13p82l59M20P36L63l72p32
1606c87m54K14P12N19j79p38n64J22O75N86ro08o53p7O17P40J36n25p21k17M96
$$ y = [-431, -1018, -739, 163, 870, 756, -106, -895, -874, -32, 831, 978, 262, -632, -902, -274, 710, 1106, 576, -389, -870, -474, 456, 1077, 814, -101, -830, -706, 153, 910, 874, 91, -717, -877, -222, 631, 870, 248, -643, -966, -483, 347, 760, 359, -471, -987, -700, 109, 691, 488, -295, -885, -764, -42, 616, 635, -30, -723, -778, -107, 637, 780, 226, -479, -726, -196, 590, 940, 496, -303, -669, -283, 500, 956, 681, -104, -676, -490, 289, 933, 788, 15, -685, -712, -25, 717, 836, 154, -692, -956, -368, 472, 788, 292, -592, -1076, -684, 194, 771, 481, -399, -1040, -869, -56, 683, 685, -60, -853, -957, -218, 633, 880, 278, -543, -867, -371, 516, 1000, 621, -226, -745, -455, 370, 970, 817, 70, -592, -577, 156, 866, 903, 232, -506, -656, -118, 595, 852, 339, -443, -802, -382, 354, 717, 345, -387, -841, -627, 85, 604, 425, -313, -877, -755, -80, 506, 497, -111, -764, -841, -224, 516, 652, 127, -594, -811, -315]
1627c15P75L66l92p80m15L63Q13N16k37p62n69J11P66O77k2p33p27q0O25P58J84
1648I22n49q39l53M80Q23M09m20q28n30K46P78O05j59p91o74L0P09P00O6o16p55
1669g46j92N54P92K91m68p59l41L81P62M65k61p22n14K13P28N64r3o35n85J4O03
1690E1O55Q9n69o75j39N19O64K11m35o94l18L76P07L43l47p05m25K25O74M76j63
1711E20o96n89R4O42O03jo15o64j08N56P13K09n10p54k59M41P45M08l37p53m76
1732h31K60P70N73j41p21o02M1O81P02Q0o17p26j89N80P43K62m32p67l97L56P68
1753C93M61k80p52n33J71O80N79o0o61o57o0O11O69J08n49o65k25M57O82K89l91
1774B67o92l63L29O86M02k21o49m74J55O27N51p4o15n41J0N77N88R4n11o38j58
$$ y = [-315, 460, 826, 434, -346, -761, -398, 415, 931, 694, -68, -637, -526, 240, 917, 895, 162, -565, -645, -20, 738, 922, 373, -466, -819, -339, 484, 893, 473, -355, -885, -639, 139, 744, 585, -206, -880, -850, -141, 559, 625, 9, -746, -938, -384, 408, 699, 231, -528, -869, -488, 274, 739, 478, -244, -758, -545, 183, 747, 654, 19, -566, -552, 51, 706, 795, 226, -449, -588, -69, 595, 806, 371, -323, -641, -265, 442, 785, 438, -267, -692, -467, 207, 683, 520, -176, -765, -671, -29, 574, 573, -42, -706, -814, -258, 455, 664, 154, -600, -859, -418, 327, 735, 398, -355, -831, -571, 199, 772, 631, -90, -692, -651, 30, 732, 812, 195, -531, -720, -140, 603, 865, 433, -334, -731, -375, 393, 854, 574, -178, -711, -540, 140, 719, 659, -2, -659, -719, -108, 561, 669, 120, -545, -770, -313, 369, 658, 267, -425, -788, -459, 227, 629, 408, -241, -715, -560, 67, 618, 544, -71, -612, -602, -25, 563, 657, 146, -492, -650]
1795f50M89O68K16m10o62k92L38O83L77k73p03m51K06O66M97r8o47o04J4O09O42
1816F15O2n86o61j76N00O98K72m28p38l55L52P32M23k60o97m98J51O77N87l1o71
1837c2o26m4N97O62J36m99o85k49M60P08L00l55o85l83K58O70M68j70o66n08J09
1858e34O10N40qn57n86q2N01O35J38m69o17k11L88O25K83l19o42l52K68O26M05
1879F42k04o11m45J12N81N28n8n69n44l1N37N69J22m78o33k05M45O56K78l99o57
1900c64l40L05O52M22j91o72m99J23O54N35m0n91n93p8N57O55J52n09o58k40M35
1921b85O71L09l07o84m15K53O90M52j53o36n11N5N88N72K9n57o04r8M96O21J83
1942F69m08o35k79L37O37L47l03o13l86K00N90M35j09n85n01M8N68N12%n06n43
$$ y = [-650, -161, 507, 723, 313, -349, -641, -303, 380, 757, 484, -219, -670, -464, 202, 699, 601, -46, -650, -636, -27, 615, 677, 91, -570, -746, -246, 452, 724, 296, -442, -797, -445, 287, 710, 450, -247, -745, -594, 83, 670, 639, -32, -658, -702, -105, 557, 693, 194, -491, -740, -280, 428, 728, 373, -312, -695, -437, 233, 701, 531, -135, -643, -534, 76, 616, 608, 51, -535, -617, -116, 519, 657, 188, -429, -640, -252, 373, 656, 337, -305, -657, -389, 237, 642, 438, -173, -618, -506, 75, 603, 545, -24, -568, -599, -62, 507, 629, 151, -482, -687, -242, 414, 692, 293, -364, -704, -399, 253, 675, 484, -188, -687, -564, 90, 625, 585, -6, -599, -677, -120, 535, 687, 178, -480, -720, -285, 386, 695, 388, -296, -711, -458, 232, 684, 531, -105, -616, -561, 27, 599, 628, 71, -533, -631, -135, 486, 669, 261, -374, -653, -316, 321, 668, 365, -248, -634, -434, 156, 591, 482, -103, -604, -556, 12, 524, 524, 18, -525]
1963e25q6M59N75J81m27o03k12L50O14K87k93n97l60K22O20M28j88n77m64J01
1983d95N53N12J0n20n70q8N21N96J32m16o26k45L75O44L19l18o62l72K43O15M50
2004F58j43o11n25M6N77N69K9n43n77j37M41O26K08l92o42k87L33O40L39k44o23
2025b58l96J61N91M81r3n63n00K6N16N28Q2m55n72j37M33N79J93l53n65k61K83
2046b80N77L41k43n66l82J69N54M12r9n24m61PN19N07L1m90n45r5M31N39J81l73
2068B10n94k53L34N79L08k66n80l81J81N86M37j17n67m86O0N17N33N4m86n68j26
2089f25M37O10K13l90n94k69L07N98L56k27n79m21J46N91M63p8n37n06j1M94N49
2110E27Q6m47n74j59L84N72K33l12n90l12K43N66L70k07n53l85R4N18M51n0m90
$$ y = [-525, -611, -152, 423, 604, 177, -426, -638, -288, 326, 613, 320, -277, -637, -415, 205, 633, 445, -132, -596, -495, 58, 570, 580, 60, -510, -598, -77, 519, 651, 235, -391, -636, -261, 383, 702, 384, -278, -650, -407, 208, 658, 515, -96, -621, -575, 2, 571, 600, 57, -520, -657, -216, 410, 618, 226, -416, -703, -370, 270, 609, 365, -258, -654, -493, 98, 579, 486, -77, -577, -551, -35, 493, 575, 120, -452, -589, -156, 423, 616, 263, -302, -563, -280, 297, 638, 395, -171, -553, -384, 170, 582, 483, -41, -502, -495, 24, 531, 562, 72, -473, -568, -137, 402, 583, 210, -384, -637, -303, 276, 584, 318, -262, -643, -462, 124, 561, 444, -123, -609, -549, -32, 501, 555, 69, -499, -625, -188, 422, 635, 245, -349, -618, -311, 287, 643, 416, -163, -584, -438, 153, 616, 538, 1, -505, -516, -22, 527, 613, 166, -408, -567, -183, 389, 622, 310, -280, -592, -349, 217, 587, 380, -173, -558, -464, 54, 505, 455, -35]
2131c5n00k3M74M93Q7m14n17j68L77N54K19l28n50k59K69N44L31j84n48l90J37
2152d31N51M29q8m92m59J5M58N16P7m39n45j26L87N46K13l23n56k91K57N72L44
2173F15k10n72l89J25N27M53n2n10n08k7M66N34Q0m10n43j90L51N81K32k97n69
2194c13l12K37N51L71j63n16m34R3N15M63k7m79m75m1M26N22J22l81n23j82L48
2215a98N41K30k72n26k91K20N30L49j67n19l77J04M61M44l0m63m83k9M21M96J02
2236E43m13m89j72L17N21K20k75n38k92K32N09L34j56n07m17R8N03M53m7m65m64
2257e05m3M21N05J30l69n31j89L53N33K54k73n29k95K01N30L94j49n15m06P6M90
2278H3M49Lm50m88o3M02N07J40l78n09k05K92N12K66k39n36l11J75N04L49j18
$$ y = [-35, -535, -558, -84, 409, 496, 82, -435, -603, -226, 328, 547, 219, -331, -590, -321, 223, 554, 370, -178, -568, -431, 120, 549, 461, -31, -490, -475, -17, 499, 576, 137, -408, -534, -147, 399, 612, 289, -267, -558, -301, 271, 615, 405, -167, -556, -431, 96, 549, 497, -13, -521, -548, -82, 452, 532, 122, -421, -611, -260, 321, 553, 256, -313, -625, -388, 163, 534, 371, -145, -579, -486, 29, 492, 465, -14, -489, -530, -104, 418, 540, 159, -364, -546, -198, 343, 573, 301, -225, -516, -296, 234, 583, 416, -103, -480, -376, 85, 529, 499, 36, -447, -476, -55, 441, 543, 130, -359, -531, -214, 307, 527, 252, -286, -578, -346, 163, 497, 341, -166, -583, -485, 18, 471, 424, -41, -505, -548, -127, 378, 508, 139, -392, -581, -228, 305, 559, 286, -243, -538, -337, 193, 587, 438, -77, -483, -407, 83, 532, 535, 85, -403, -466, -64, 443, 583, 205, -304, -509, -217, 295, 561, 322, -214, -525, -350, 154, 503, 385]
2299C85m68m28M6M54M43J7m32m76o9L76M70J43l18n00k02K89N10K54k41m67l21
2320e35J91M82L63j10m80l89O7M53M27Qm11m35r3L87N03J24l58m92j99K88N08
2341B99K61k39n07l23J84M99L50j25m86m15N5M43M36L7m36m73q5L80M95J35l35
2362A50n06k06K69N28K80k43m98l06J48M90L78o7m73m20J8M59M37N0m05m48j18
2383d83L56M97J66l17m81k19K53M77K77j77m97l28J30M79L59q2m56l92MM25M02
2404C93O5l82m77j04L54M52J65k95m76k22K38M92K69k02m81k97J31M75L63p9m41
2425e9m09J5M42M28N3l92m51r3L50M71J60k80n02k24K63M84K66j89m72l25J08
2446c56M77L81p9m55m10RM08M33O4l80m70j21L30M75J70k76m84k36K12M74L00
$$ y = [385, -83, -511, -465, -11, 432, 449, 17, -459, -528, -152, 318, 461, 143, -357, -559, -270, 240, 494, 253, -214, -535, -344, 138, 501, 391, -89, -478, -411, 42, 469, 477, 66, -369, -462, -75, 428, 552, 194, -298, -497, -209, 299, 560, 321, -186, -509, -325, 174, 524, 399, -87, -502, -447, -4, 432, 469, 33, -440, -525, -145, 350, 485, 150, -356, -562, -293, 235, 515, 272, -226, -532, -384, 106, 484, 417, -56, -476, -458, 1, 438, 488, 83, -365, -483, -127, 370, 536, 219, -262, -481, -228, 249, 526, 349, -148, -476, -346, 133, 492, 410, -46, -438, -434, -9, 393, 458, 76, -401, -505, -151, 301, 466, 171, -305, -527, -289, 203, 472, 270, -211, -508, -377, 98, 461, 382, -59, -468, -453, -11, 417, 470, 78, -373, -466, -116, 355, 515, 235, -267, -491, -228, 256, 522, 333, -139, -464, -356, 121, 502, 423, -32, -442, -433, -25, 408, 472, 92, -378, -499, -169, 306, 476, 200, -284, -520, -308, 166, 466]
2467D66j77m69l19J09M35L79k7m19m15j5M03M37P1l55m35j29L11M60J98k66m60
2488b17k49K36M55K81j68m39l35R7M45L65m8m34l67k7L91L99Q4l61m43j40L09
2509a66M60J71k66m67k26J93M60K87j58m63l27J08M42L64n1m05l98k5L89M35R5
2530D52l53m46j31K92M58K07k37m63k53J97M65K96j37m41l28N8M33L77j3l94m09
2551c70m1L64M21J01l17m55j56K79M64J93k35m63k44J68M38L04j20m33l52O8M17
2572C1L58k1l61m04m4L53M11R9l26m27j42K86M39J86k00m56k56J87M33L00j23
2593C23m17l33O5M01L75j0l88l96k9L48M15R3l15m29j58K74M48K02k33m39k61
2614d64J70M41K99j13m25l38O9L83L84kl73m04m4L28M31J16l11m27j76K72M39
$$ y = [466, 289, -180, -499, -390, 45, 424, 397, -22, -437, -452, -49, 388, 459, 104, -331, -460, -149, 311, 509, 243, -217, -466, -230, 225, 506, 338, -101, -436, -339, 106, 471, 423, -11, -378, -405, -14, 385, 469, 108, -335, -475, -166, 294, 465, 199, -268, -494, -301, 159, 446, 288, -175, -502, -394, 48, 412, 361, -44, -442, -467, -78, 357, 452, 99, -347, -478, -186, 272, 479, 242, -221, -474, -277, 188, 484, 347, -94, -422, -364, 69, 446, 433, 39, -370, -411, -47, 374, 475, 158, -297, -453, -174, 290, 483, 248, -215, -459, -291, 147, 451, 331, -102, -454, -386, 31, 389, 368, 7, -397, -441, -88, 323, 422, 96, -331, -473, -187, 252, 438, 238, -218, -474, -287, 146, 446, 323, -94, -427, -362, 39, 414, 404, 16, -380, -409, -61, 354, 447, 132, -297, -455, -181, 267, 469, 236, -203, -464, -294, 147, 446, 333, -92, -430, -361, 22, 406, 404, 31, -373, -417, -89, 342, 458, 147, -280, -456, -184, 255]
2635B55K06k18m34k57J59M42L11j40l88l47M0L86L80J0l71m06m7L22M13R7k88
2656A25m07j78K42M33K17k02m24k45J30M17L00q8l99l41M3L90L52J6l46l84o3
2677d12L07M24J19k83m29j65K55M22K09j96m07k62J51L96L12j03l91l36L3L86
2697C0L52Ql36l99q4L22M05J17k75m15j82K33M22K19j82m25k77J38M10K94o6l74
2719f5l43J3L72L76J9l33l85p8L09M04J37k57m09j84K38L99K25j74l84k81J22
2740b79L83L24p5l76l48K3L48L73K6l30l70j10K96L92J34k42m22j81K16L91K24
2761C97j49m16k67J22L77L10p8l46l40JL58L61L8l14l83p2K83L89J46k46m02j80
2783d11K00M18K29j64m04k47J05L80L17p2l68l37RL39L49M9k95l86r7K61L95J35
$$ y = [255, 461, 243, -191, -448, -289, 153, 464, 324, -64, -411, -371, 15, 395, 405, 34, -372, -419, -97, 316, 413, 125, -282, -460, -218, 215, 432, 230, -194, -439, -309, 108, 408, 320, -79, -420, -377, 13, 365, 381, 35, -349, -412, -105, 319, 438, 155, -274, -439, -184, 238, 447, 251, -156, -418, -267, 129, 441, 338, -53, -389, -356, 30, 382, 390, 54, -345, -429, -107, 298, 415, 140, -275, -457, -224, 198, 417, 235, -190, -467, -329, 81, 375, 309, -65, -408, -395, -23, 353, 372, 39, -346, -424, -115, 289, 426, 169, -240, -424, -186, 213, 438, 264, -120, -401, -279, 104, 428, 353, -23, -371, -348, 0, 373, 399, 69, -301, -411, -115, 277, 411, 169, -253, -434, -218, 173, 397, 248, -168, -435, -313, 64, 374, 296, -50, -390, -389, -31, 330, 368, 54, -329, -401, -118, 271, 417, 171, -231, -411, -211, 207, 436, 272, -132, -379, -274, 106, 423, 351, -17, -354, -345, -6, 343, 392, 97, -289, -386, -125, 270, 405]
2805D05k43l96j95K00L81K35j50l79k90R0L92L09m9l54l42KL26L72M6l03l66q8
2827c97K64L79J56k21l81j97J82L99K40j54l60k74R5L52L00k7l42l40%L11L48
2848C33N1k94l51j10K42L87J44k21l83j91J63L75K43j39l72k66O3L79K97m3l42
2869c5l35k1L29L46N6k76l68j09K55L80J43j93l88j96J66L85K42j13l79k67Q5
2890b93L48L14k9l20l35k0L10L48O5k72l52j27K34L83J70k16l68k06J61L62K36
2911C93j14l56k78N9L38L15l2l16l31l0K94L29P8k65l57j28K39L80J47j98l54
2932a87k08J43L64K46j16l53k61O8L24L01k1k97l28m2L09L29Q8k61l46j14K11
2953a51L77J58j81l54k17J56L56K35q8l47k80O2L27K97Ll17l12m8K79L33Q0k40
$$ y = [405, 162, -234, -429, -229, 152, 387, 237, -142, -432, -342, 50, 359, 310, -44, -386, -384, -58, 314, 360, 57, -309, -397, -133, 246, 402, 181, -200, -397, -215, 184, 424, 270, -90, -364, -269, 83, 383, 356, 14, -326, -326, -15, 333, 384, 90, -261, -371, -129, 258, 402, 181, -202, -393, -230, 145, 388, 249, -123, -389, -326, 53, 350, 307, -35, -370, -391, -62, 284, 340, 64, -304, -413, -158, 222, 365, 172, -216, -412, -246, 139, 381, 268, -111, -378, -293, 55, 369, 340, 20, -315, -335, -25, 323, 388, 116, -236, -363, -129, 254, 424, 208, -160, -366, -205, 157, 393, 279, -77, -355, -296, 42, 357, 325, 9, -322, -352, -58, 271, 349, 84, -273, -401, -162, 218, 365, 167, -187, -395, -252, 112, 358, 242, -111, -372, -304, 20, 321, 300, 3, -325, -367, -58, 271, 359, 98, -248, -362, -151, 226, 384, 203, -151, -368, -212, 144, 379, 291, -56, -336, -274, 53, 350, 353, 36, -276, -324, -45, 288, 368, 128]
2975A28l54j48K27L64J48j69l64j95J13L57K36q8l34k86N2L09K90%k83l24o0K76
2997a05L53Q6k40l43j28K04L42J86j69l39k21J43L35K53r4l23k58K8L11L06Nk94
3019C8l02n4K59L25R7k18l41j43J88L52J76j73l37k05J07L29K55q2l23k83M7K88
3041@K94J2k86l06n7K42L44Q6k19l47j27J93L28J90j65l32k11J16L24K47o8l16
3063e8k77M3K88L06J2k70l20n2K53L10J09k14l27j39J65L41J84j44l40k04J00
3084b34L16K44n8l03k84K2K93K84K9k59l15o9K30L29J03j95l29j51J67L23J94
3105C37j37l20k17R5L18K37m2l07k60NK75K77M3k50l14o2K28L04J19j92l29j56
3127c48J72L23J90j32l25k05Q5L11K36n0k83k78pK87K98L0k53l08o0K09L15J30
$$ y = [128, -226, -374, -147, 217, 365, 196, -168, -363, -250, 107, 343, 255, -79, -365, -313, -4, 286, 286, 3, -321, -381, -105, 248, 334, 94, -249, -377, -173, 169, 355, 186, -153, -374, -231, 104, 357, 263, -60, -318, -290, 21, 327, 332, 38, -264, -318, -59, 266, 363, 145, -196, -339, -151, 201, 377, 204, -133, -338, -231, 98, 353, 271, -52, -335, -288, 0, 294, 306, 20, -286, -343, -101, 243, 329, 110, -237, -364, -171, 157, 347, 182, -150, -361, -245, 79, 326, 258, -58, -335, -292, -4, 302, 314, 44, -276, -328, -75, 235, 344, 130, -197, -336, -171, 170, 354, 210, -130, -334, -234, 82, 326, 268, -35, -319, -297, -4, 280, 309, 50, -265, -334, -104, 225, 328, 133, -196, -347, -180, 143, 337, 200, -120, -337, -242, 76, 313, 271, -36, -296, -291, -16, 261, 304, 54, -260, -322, -94, 210, 329, 137, -192, -348, -176, 147, 337, 205, -120, -325, -240, 71, 307, 257, -26, -304, -311, -24, 274, 304, 51, -257, -317, -108, 207, 337]
3149C37j93l28j58J59L19J95j16l16k08N8L14K48k9l02k63pK65K95M4k39l03r2
3171c20K14L14J19j78l18j64J54L02J91r6l19k27R5K86K43m9k72k74j2K66L00
3192B55M5k38k96r3K11K98J29j61l19j53J58K94J84r9l06k08O5K71K57l1k64k74
3214b75j1K42K93N4k14l01j06K09K83J46j70l08j67J24L11J91r6k94k34P4K87
3235C8K38j6k64k61k4K42K79N2k22k80j07J82L13J41j69k96j53J09L08J96q4k98
3257g6k22N2K77K55j5k53k82j2K47K73N3k08k97r5J86K99J39j72k92j65J12K93
3279I7J90p4k87k37M7K73K43kk53k58m2K20K83Q9k21k88j01J86K87J52j53k83
3301a32j73R9K99K06o9k90k22L9K54K60Nk55k63m6K40K75Q0j96k99j16J61K94
$$ y = [337, 144, -184, -342, -183, 136, 331, 215, -101, -309, -251, 63, 311, 282, -20, -283, -290, -25, 270, 314, 75, -228, -320, -106, 208, 327, 149, -169, -333, -179, 123, 314, 218, -101, -328, -233, 53, 296, 247, -25, -299, -311, -45, 255, 300, 62, -234, -327, -116, 182, 311, 150, -169, -322, -164, 130, 314, 215, -91, -299, -234, 37, 294, 263, -1, -275, -286, -44, 249, 303, 89, -212, -318, -109, 174, 320, 150, -158, -325, -201, 110, 301, 205, -89, -323, -249, 38, 276, 260, -4, -265, -289, -47, 232, 284, 62, -218, -325, -143, 170, 311, 142, -154, -307, -198, 110, 306, 222, -76, -298, -246, 31, 286, 271, 18, -264, -276, -29, 244, 297, 89, -208, -303, -117, 182, 321, 149, -143, -308, -196, 97, 287, 213, -74, -311, -264, 9, 252, 250, -3, -261, -303, -83, 200, 289, 68, -220, -321, -135, 152, 304, 151, -132, -305, -206, 93, 299, 230, -60, -282, -243, 11, 271, 276, 21, -242, -288, -48, 227, 307, 111, -188, -304, -143, 151]
3323A51J54j42k83j66J03K68J99o3k75k27K9K50K55Lk36k67n3K22K91P2j86k85
3345a86j20J68K81J45j35k75j79J01K79K09p3k71k16K7K45K51Pk34k63k3J91K78
3367B07Q6j89k71j21J54K79J41j09k90j69Q6K73K05o8k47k41K8K49K50J4k31k55
3389b19m8K05K55R2j79k65j28J52K75J42j09k75j81Q2K67K10n6k59k19J1K46K32
3411B31K0k15k60n8J99K72R1j85k67j20J50K64J59j17k64j86P9K65K08m1k56k27
3433b58pK46K53K3k15k57o6K06K54R6j56k77j22J29K75J42r6k53j95P8K53K22
3455B75m6k46k31RK26K44K4k08k48o6J90K61R2j57k80j03J13K71J52r8k61j81
3477b68O7K60J85l1k33k17j5K25K43K7j99k58o4J79K71Q6j30k76j25J27K52J62
$$ y = [151, 305, 163, -120, -286, -183, 85, 284, 221, -54, -281, -252, -2, 253, 256, 20, -247, -300, -78, 213, 285, 99, -186, -306, -138, 143, 288, 153, -122, -301, -200, 79, 288, 215, -56, -272, -245, 0, 251, 258, 24, -239, -262, -71, 207, 293, 104, -167, -288, -134, 145, 286, 177, -113, -282, -196, 77, 282, 214, -33, -274, -246, 3, 253, 267, 36, -219, -267, -62, 193, 285, 106, -159, -287, -135, 140, 282, 173, -102, -283, -201, 66, 276, 220, -39, -258, -247, -1, 231, 251, 36, -224, -282, -83, 189, 280, 95, -172, -292, -142, 122, 281, 164, -100, -286, -207, 58, 266, 225, -31, -258, -265, -19, 234, 257, 42, -215, -281, -75, 179, 275, 119, -158, -280, -151, 124, 266, 170, -83, -278, -200, 53, 275, 229, -17, -248, -239, -13, 231, 255, 47, -201, -267, -77, 184, 276, 119, -161, -264, -151, 120, 272, 174, -87, -268, -201, 59, 244, 213, -20, -237, -252, -27, 216, 243, 44, -214, -278, -99, 172, 258, 128, -148, -273, -146, 106, 268]
3499B68j01k51j86O2K39K12j5k45k18lK12K32N2k03k33q7J69K49J15j39k71j23
3521b65J14K61J52p4k46k01N7K57K00k7k40k09j6K06K54K4j94k42o7J62K51J11
3543B68j63k49j36J23K48J60r2k32k02Q4K08K24k6k24k18j2K13K21M3j92k38n8
3565b50J54K53J11j50k45j28R9K50J66p7k42j83M1K44K03k8k01k29j2J86K32N8
3587B52j74k53q7J74K40J17j36k54j29Q0K67J66q1k47j84M4K43J83j1k14k20k4
3609b48K21K10L9j65k28r7J52K43J16j25k53j40J09K44J57n4k52j91N3K35K09
3630B35mk22k23j1J92K21N5j81k27r0J65K41J01j17k47j37J00K30J66o0k31j94
3652b38M0K34J99j7j90k29k1J76K25N7j72k16r0J35K35J18j29k35j40J01K30J52
$$ y = [268, 167, -84, -270, -208, 31, 243, 228, -17, -235, -238, -26, 206, 258, 55, -178, -265, -96, 153, 268, 129, -142, -265, -151, 110, 262, 188, -58, -259, -202, 55, 255, 228, -12, -221, -237, -31, 223, 247, 53, -189, -256, -94, 157, 268, 105, -144, -280, -157, 91, 251, 159, -73, -275, -191, 17, 241, 215, -9, -227, -239, -26, 195, 238, 46, -192, -250, -96, 157, 268, 118, -127, -255, -156, 94, 260, 183, -59, -242, -201, 43, 246, 218, 17, -212, -224, -38, 194, 252, 78, -175, -262, -88, 152, 269, 133, -121, -250, -170, 97, 263, 182, -65, -249, -205, 38, 221, 210, -4, -224, -248, -27, 183, 222, 57, -171, -268, -116, 127, 243, 118, -135, -275, -166, 78, 235, 181, -71, -262, -209, 26, 235, 231, 9, -214, -225, -33, 188, 243, 62, -165, -255, -90, 151, 252, 135, -112, -249, -149, 81, 247, 187, -44, -238, -198, 36, 235, 218, 28, -201, -222, -46, 179, 236, 64, -152, -242, -107, 128, 246, 117, -118, -258, -157, 73, 225]
3674B25o1k19j97L2K16K10oj97k16k0J81K20O6j67k30q6J41K51J12j22k22j53
3696b42R4K22J78n9k28j85K0K31J89Mk10k09l3J77K35N6j71k28q7J40K24J28j14
3719A32k33j40P4K32J64n1k22j86K8J99K08Mk05k05l9J69K38O5j55k29r7J34K27
3742A12J12j01k36j27P0K34J60n4k08j74MK04K16jj94k08l7J67K28O7j54k28q8
3765b36J29K35J07j01k25j44P7K15J62m3k15j77J5J94K03Rj73k19o4J86K18O8
3787B21j38k36q3J10K28J20q7k27j52P8K28J60l9k05j87QJ85K14Pj78k13l9J57
3810f8K18P3j40k17r7J21K08J27r4k13j48N9K23J53k9k06j90K3J74K07J9j78k06
3833a81o1J62K29N4j28k03j16J06K31J23p6k18j56P1K08J62l2j91j94J3J88J98
$$ y = [225, 164, -55, -252, -220, -4, 206, 200, 3, -213, -233, -52, 168, 234, 67, -163, -249, -108, 143, 255, 133, -89, -242, -148, 74, 252, 193, -35, -220, -200, 31, 220, 224, 14, -195, -228, -51, 184, 240, 69, -159, -246, -106, 118, 246, 132, -101, -241, -167, 65, 229, 178, -44, -230, -202, -3, 205, 209, 4, -201, -240, -71, 167, 232, 77, -152, -249, -115, 112, 224, 123, -113, -240, -170, 64, 224, 170, -38, -212, -208, -4, 212, 211, 17, -191, -228, -61, 167, 234, 80, -148, -236, -107, 128, 235, 134, -91, -235, -158, 57, 219, 176, -39, -216, -201, -7, 196, 205, 32, -187, -251, -65, 153, 221, 83, -153, -236, -126, 102, 222, 135, -92, -244, -166, 62, 222, 183, -22, -209, -201, -16, 198, 205, 27, -186, -225, -68, 150, 223, 83, -134, -231, -110, 98, 225, 131, -82, -230, -171, 52, 205, 176, -30, -220, -197, -23, 184, 203, 25, -181, -242, -80, 149, 203, 75, -128, -244, -138, 93, 216, 140, -78, -234, -163, 45, 207, 175, -16, -210, -197, -9, 189]
3855A89Oj58j99n1J49K02P5j21k18j11J14K09J25q6j94j52N8J92J72l1j85j92
3877b07JJ72K05K5j66k05o3J60K18P3j19k14j12J01K23J17o4k19j50O5J94J63
3899A98k0j92j79qJ76K04K0j49k02o5J47K04P8j18j97j10R0K00J36p9k21j26N8
3922a55J78J67j3j93j60j8J70J90L4j46k12n7J34K10Q8j14k03j09Q5K06J28p3
3944A37j91j58M2J97J67j1j92j73oJ64J91M1j50j95o8J45J88Q0j09k00j06R1J87
3967G1J30o1j91j46L0J80J67pj79j73k5J65J87M4j50j87o4J16K06R2j03j95j23
3990b16R1J82J42m8j88j65L1J88J70j4j62j94j7J69J83M1j33j91p1J16J92R1r9
4013I8j95j09P3J91J33m6j99j41L9J65J62j0j49j87k2J50J92M7j41j92q9J30K04
$$ y = [189, 195, 37, -162, -213, -64, 138, 213, 92, -126, -237, -123, 86, 211, 125, -69, -221, -163, 29, 201, 170, -15, -207, -206, -34, 171, 196, 30, -175, -238, -78, 140, 213, 94, -120, -232, -131, 92, 209, 145, -74, -224, -159, 35, 198, 178, -14, -193, -201, -25, 179, 199, 50, -152, -217, -70, 134, 212, 94, -103, -213, -123, 77, 213, 134, -87, -213, -155, 23, 190, 177, -16, -176, -194, -24, 166, 200, 54, -158, -215, -81, 129, 217, 103, -100, -209, -124, 82, 210, 137, -54, -212, -170, 27, 194, 183, -9, -182, -188, -24, 167, 208, 58, -137, -205, -60, 128, 208, 99, -101, -207, -116, 71, 201, 140, -51, -197, -167, 13, 180, 173, -6, -179, -204, -39, 148, 192, 42, -145, -209, -93, 113, 205, 102, -93, -216, -125, 57, 199, 151, -37, -202, -171, 17, 187, 173, 11, -183, -200, -31, 152, 193, 60, -131, -202, -86, 106, 197, 98, -97, -206, -133, 58, 191, 145, -54, -195, -156, 9, 171, 161, 12, -175, -197, -47, 145, 192, 51, -141, -230, -100, 104]
4036A04R0r2j86j13P1J90J18m1j80j65M2J78J53Nj65j74k8J62J69N9j23k00p8
4059b04J21K03P9q5j88j24P9J76J50o0j88j41J5J72J63lj60j73l3J56J79N2j34
4082E2j77p5J06J88J01r0j93j15O5J87J28l7j72j60K5J77J58Mj51j68m7J47J84
4105A37N4j21k01o4J00J96R5p2j93j22O6J76J30k1j84j58K2J57J57J2j47j79k5
4128a85J33J78O2j17j88p3J01J82R2r1j62j19N2J74J29k4j76j41jJ62J62K2j71
4151Aj51l2J29J75N2j13j67q7R5J84R6p1j74j27O8J57J39j3j81j49PJ57J65Rj41
4176B8j67l8J25J81N6j15j67r0Q9J77J09p4j76j19M9J57J37k3j55j46LJ36J65
4199A42K6j49j73l5J21J68P3j01j85r5J02J72J00o5j74j00K8J63J46k4j66j39
$$ y = [104, 194, 102, -84, -197, -126, 64, 182, 141, -39, -204, -162, 16, 169, 174, 9, -165, -193, -31, 138, 197, 74, -126, -204, -83, 120, 199, 114, -74, -198, -119, 57, 207, 147, -41, -182, -167, 5, 168, 165, 5, -168, -201, -45, 134, 186, 52, -125, -200, -94, 94, 195, 105, -88, -203, -138, 49, 177, 140, -32, -192, -167, 10, 168, 172, 21, -147, -194, -47, 137, 191, 70, -131, -195, -95, 101, 196, 124, -69, -191, -125, 51, 181, 160, -24, -182, -160, -3, 154, 166, 19, -160, -185, -52, 126, 188, 71, -117, -190, -89, 93, 185, 94, -68, -187, -135, 39, 168, 144, -32, -173, -174, -12, 150, 172, 1, -150, -182, -53, 122, 174, 61, -106, -193, -98, 86, 182, 111, -63, -190, -122, 35, 174, 161, -20, -169, -162, -5, 160, 169, 28, -139, -177, -52, 129, 185, 70, -97, -187, -98, 79, 188, 114, -62, -181, -132, 25, 162, 139, -16, -162, -159, -23, 142, 168, 19, -154, -189, -68, 100, 173, 72, -113, -208, -106, 66, 166, 101, -73, -173, -145, 18, 164, 140, -26, -165]
4221a65KJ43J60J1j26j62l5J22J56P1r9j78p4Q3J77R4n9j72j26M5J71J35l4j51
4245a1j39rJ34J65L1j35j60m7R4J85O3r6j71q0O5J64J08n0j63j20L6J59J47l5
4269A35j41j44j4J49J58J2j29j60m4J12J70P1r8j68r1P3J71J10n3j63j26L5J67
4292C2J17nj39j52lJ42J39K8j13j64m8J04J67O9r4j71q2O5J68J05o0j38j31L6
4316a28J34J46j3j33j52KJ22J52K4j16j52n7J13J43P8r5j43r8P2J63R2l9j41j35
4340a61K4J63J21j2j38j43k2J41J38M6j16j55m6Q3J62P3q7j57p9N4J69R9l7j45
4364b5j30K4J41J32J2j52j50j0J23J49M1j10j45o2R5J52Q1q8j37j14O4J64R5l4
4388A16j44j35K5J50J32mj20j58j5J21J57L6j20j47o3J06J44Q2p5j64q2M6J52
$$ y = [-165, -163, -20, 140, 151, 25, -137, -172, -50, 106, 177, 78, -100, -174, -91, 86, 180, 121, -51, -177, -132, 39, 174, 140, -11, -150, -159, -25, 140, 171, 36, -124, -171, -77, 108, 171, 75, -96, -176, -111, 53, 161, 111, -52, -172, -136, 23, 170, 135, -6, -150, -164, -15, 143, 155, 26, -134, -178, -66, 104, 175, 77, -91, -182, -109, 62, 172, 119, -44, -170, -135, 32, 149, 144, 5, -147, -150, -8, 131, 159, 46, -118, -166, -62, 105, 174, 80, -91, -173, -108, 60, 165, 105, -33, -164, -128, 6, 152, 139, 6, -146, -144, -22, 130, 154, 38, -114, -171, -58, 85, 163, 68, -75, -173, -101, 62, 154, 115, -26, -161, -137, 26, 147, 135, -3, -146, -168, -27, 111, 157, 41, -114, -160, -77, 85, 158, 71, -86, -165, -111, 58, 157, 120, -25, -155, -131, 10, 142, 154, 2, -148, -158, -35, 114, 155, 45, -100, -162, -67, 85, 166, 78, -59, -173, -109, 55, 150, 116, -28, -163, -138, 12, 144, 140, 20, -138, -153, -32, 125, 161, 41, -106, -169, -63, 81, 163, 88, -76, -158, -112, 40]
4411D0J14l8j46j32K0J43J33qj24j39k3J22J50K9q7j55o4R3J54P9o9j55j03O0
4435a06J56J01m6j42j15K1J37J26Lj24j48%J13J29M6j01j54n7R0J45P4o3j54r4
4459a63N6J50J04l4j47j28L2J18J34Nj14j52k2J22J44L7r6j47o4P7J52P8o0j52
4483g0r1M4J60R6k8j38j11NJ36J21K0j18j53rR8J34O5r6j71n6Q0J53Q2o1j53r1
4509a52M0J48Q9j0j41j11MJ17J35J4j25j31l4J11J39N1r7j39n6O7J50P5p2j33
4533f1r3M5J38J06j6j34j08qJ31J16J3j14j19m7R8J45O2j01j32o0N6J38R1n5j32
4558d1j08M0J37J00kj44j23K2J12J31Qj15j22l8R9J42M2q0j38o9O8J48P7n8j44
4583e6j00N1J21J22j8j39j10nJ21J31K5j14j28l6Q9J43M4p1j42p4O3J55P4n2j35
$$ y = [40, 154, 116, -30, -162, -142, 1, 134, 126, 2, -137, -160, -38, 112, 141, 54, -101, -165, -72, 82, 161, 92, -63, -166, -106, 50, 151, 105, -37, -152, -131, 6, 132, 135, 11, -137, -137, -24, 105, 151, 50, -104, -161, -71, 74, 148, 85, -69, -163, -107, 43, 147, 113, -34, -162, -130, -12, 122, 127, 13, -139, -161, -39, 105, 142, 46, -101, -165, -88, 64, 142, 82, -70, -161, -117, 43, 139, 111, -27, -138, -133, 3, 124, 144, 26, -127, -136, -38, 96, 161, 65, -106, -162, -82, 71, 153, 92, -61, -152, -112, 36, 125, 115, -26, -137, -133, -16, 119, 133, 8, -123, -157, -46, 93, 144, 47, -92, -148, -81, 69, 144, 72, -61, -154, -109, 29, 135, 119, -15, -123, -131, 0, 116, 129, 15, -104, -151, -53, 92, 154, 53, -79, -139, -83, 55, 146, 91, -41, -149, -109, 28, 128, 126, -18, -141, -119, -7, 124, 132, 17, -105, -143, -44, 98, 140, 60, -78, -147, -79, 69, 146, 88, -56, -156, -105, 16, 138, 120, -19, -129, -134, -13, 118, 143, 29, -99, -135, -46, 97, 141, 70, -72, -146, -83, 72, 146, 94, -41]
4608d1r4K2J41J02j8j12j35NJ11J18M2j12j27m5Q5J31N5o0j40q5O8J50P2l9j34
4633d0r2K7J28J12k9j11j16oJ12J05M4j09j33l7P4J60N6o1j46p3N6J28R3l9j43
4658d0j02L8J23J15j1j15j19rR8J19L6j02j36l6Q7J27O3p3j29p0M8J41Q2n0j12
4683b7j25M5J11J16rj20j14j2J27J12K7j01j19m0Q1J36M2o0j38o3N7J17Q8l9j25
4708c3r6J6J15J16qj15j07k0J01J26K7r0j20n3Q4J24O2o8j13q0M4J27R7n4j09
4733b7r3J2J19J00Mj03j18j9R8J18L3q8j19n2P7J26Q0p8j19p3L8J22R4l0j24j00
4759a22K1J10J12Kj06j24j1R4J10M5q2j34n4P9J20P7n8j40p1M6J22R3m3j14j09
4784a37K3J23J08rr3j19k5J09J29J0p1j19n5P0J20P7o0j41n7L2J18Q8k0j12r7
$$ y = [-41, -135, -113, 28, 130, 112, 0, -135, -130, -19, 99, 141, 29, -98, -143, -58, 73, 128, 68, -72, -157, -89, 61, 133, 94, -40, -132, -105, 23, 135, 106, -5, -121, -127, -15, 90, 134, 25, -108, -145, -71, 89, 145, 84, -62, -135, -79, 49, 142, 103, -40, -142, -104, 19, 134, 123, 8, -111, -120, -22, 97, 133, 31, -105, -141, -54, 73, 136, 63, -66, -136, -88, 53, 135, 85, -27, -152, -107, 4, 120, 111, -9, -123, -135, -8, 104, 131, 30, -89, -129, -48, 88, 130, 70, -68, -131, -74, 43, 131, 92, -33, -129, -113, 2, 118, 110, -5, -112, -132, -31, 95, 122, 32, -88, -141, -57, 67, 129, 61, -52, -132, -88, 39, 136, 82, -27, -120, -108, 11, 111, 115, 12, -106, -125, -27, 91, 124, 36, -83, -135, -58, 68, 148, 70, -49, -122, -84, 38, 132, 102, -22, -122, -101, 9, 121, 123, 17, -107, -118, -24, 86, 131, 49, -85, -139, -60, 60, 137, 79, -61, -132, -86, 36, 129, 86, -28, -137, -114, 9, 117, 108, 15, -104, -129, -20, 109, 119, 48, -71, -126, -56, 64, 141, 81, -60, -117, -85, 33, 121, 101, -11, -108]
4809a08jJ11J05J1j07j22jP8J15K8o3j25m6O1J22O4m7j20q6M1J17Q3j3j11j12
4834a26J7J05R9K6j06j07k8Q7J12L5q3j10m9O6J20N9m5j18p8L2J18R4j4j19r6
4859a09mJ12J04Qq7j21j8Q6J15M8q0j30m7O1J27M9l6j27q2N0J00R4j2j14r9KJ00
4886a0J02Oq3j09k6Q8J09L8o2j20m1M3J17N4l5j13q8M2J11R4j8j12r9jJ03J09
4912I9J2r0j06l5R5J01L8o7j14n1M9J21O5l3j22q5M0J06P9j1r9r6qR5J20Nr1j11
4940i4k0N4J26M6o1j12o0M6J11O7k6j09p5J3J04R6j7r7r6oR8J04J6q8j08k8P6
4967d0J09M8o1j16o0N5J12O4l0j08q2K7J02Q9j6q1j17nR0J02K2q0j06l0P2J17
4993G7M0o0j21n7N2R7P2l6r9p7K8R4Q6j0r3r3j1Q4J05J1o8j08l0O8R6O3n4j23
$$ y = [-108, -109, 2, 107, 118, 11, -111, -112, -34, 81, 109, 46, -79, -125, -64, 58, 122, 75, -45, -131, -90, 27, 110, 97, -14, -126, -109, -4, 95, 121, 15, -92, -120, -33, 79, 114, 31, -79, -128, -62, 58, 117, 72, -46, -124, -92, 26, 120, 106, -13, -109, -113, -1, 103, 111, 24, -97, -115, -29, 86, 134, 54, -76, -123, -62, 65, 114, 78, -49, -131, -81, 19, 113, 101, -13, -112, -110, -10, 92, 98, 15, -94, -120, -32, 77, 115, 53, -67, -108, -65, 52, 106, 71, -42, -130, -88, 23, 117, 99, -13, -112, -113, -10, 99, 111, 21, -85, -120, -25, 76, 114, 47, -67, -118, -69, 52, 117, 84, -38, -123, -83, 23, 102, 91, -8, -104, -112, -17, 103, 108, 17, -94, -114, -60, 66, 112, 51, -61, -121, -75, 36, 103, 77, -32, -107, -94, 10, 106, 89, -8, -104, -110, -12, 92, 108, 20, -88, -116, -40, 69, 117, 56, -60, -120, -65, 47, 111, 81, -27, -109, -82, 20, 109, 93, 12, -105, -110, -20, 82, 104, 24, -82, -112, -40, 77, 117, 57, -64, -121, -69, 28, 100, 64, -35, -112, -84, 10, 96, 86, -7, -100, -111, -27, 78, 89, 21, -87, -117, -49, 47, 110, 56, -67]
5021f7m8L7J18O2k1j10q4K2R5R6qr7r2kP8J05K2p4j04m2O8R4O2n6j12n9L6J07
5049B6P7k5r8q2RQ9R0Or4q5j6Q7R2K8q3j00m0O1J06M9m3j01o6L8J08O4k0j03q6
5078a12K1R7Q1Rr7q8j3P2J15J6o6r6m8N6J08N2l7j12o4L7J09O8k9j04p4J3R3R8
5106A05lr4j00j2Q8R6K2p8r3l7O2R3N2m9r9o8L8J04P7l2q6q2qJ11Q0Np6j00j4
5135i8Q4R0L2p3r6m5N6J02M6m2r2m3PR7Q9l1q6r2J2Q5R2J2r1q9j7N9R3M9o9r5
5165e4m4M0J09O7o3r2p1K7J10O5l5q5p5%R1R0Kp2r1j8O6R3K8m7j08m7O9R7M7l7
5195F2j05n0J9Q4Q7j9q7p8LP6Q9J7q0r4j9P1R4L6n0j01n1N0R6N5m0r6o6K3J06
5224C2N3jr0r1KQ7Q5Ln9q2l9O7R7K2m5j02m4L8J00N6l9q3p5K8J00O2oq5q7OP3
$$ y = [-67, -115, -78, 40, 102, 81, -29, -113, -91, 4, 100, 92, -5, -97, -99, -21, 84, 106, 32, -72, -114, -46, 48, 110, 54, -58, -117, -81, 26, 103, 78, -20, -102, -93, -4, 86, 92, -2, -87, -103, -16, 76, 104, 21, -79, -119, -58, 48, 97, 54, -47, -113, -75, 33, 97, 77, -26, -112, -91, 6, 87, 96, -1, -89, -102, -30, 85, 101, 35, -61, -109, -53, 55, 107, 70, -42, -106, -69, 40, 108, 79, -25, -99, -86, 7, 105, 102, 8, -92, -104, -16, 80, 102, 24, -69, -106, -44, 49, 101, 52, -47, -115, -77, 27, 104, 72, -14, -96, -104, 7, 87, 92, 16, -84, -98, -14, 76, 108, 35, -61, -106, -50, 52, 98, 56, -36, -79, -72, 25, 114, 83, -3, -95, -83, 2, 94, 106, 15, -74, -91, -32, 61, 110, 41, -54, -98, -58, 51, 118, 55, -37, -108, -81, 29, 94, 59, -26, -101, -101, -10, 80, 82, 10, -81, -99, -33, 60, 88, 41, -67, -114, -45, 52, 99, 62, -43, -93, -74, 10, 97, 78, -9, -87, -84, -8, 81, 98, 18, -76, -95, -24, 70, 106, 56, -45, -96, -46, 50, 105, 65, -31, -97, -74, 32, 85, 84, -6, -97, -95, -8, 77, 80, 21, -61, -100, -33, 64, 86, 41, -61, -105, -67, 33, 89, 50, -33, -108, -80, 20, 82, 76, -9, -96, -90, -17]
5255a7J05Lp9q8k7O8Q7N2o4j01k9K9J00P7m9r6o6K5R8O2mr2q1J2P0P9J3o4r1k6
5285i4P3Q5L3n3q3n8N2R7M9l1j01p1K2R2P2qq4p6JO6Q1J6o7q3l3O8P5N9o0q9n0
5316a00M8Q3O9l2j03m6J1R4N9Pr5o1j7Q0R0J1p2q4l0P6P8K2m5r2l9L8Q4O8m0p4
5346a2p3RR1P7np4q8jO3P6L2o6r7k8O5Q2L2l1j02m9L3Q8O1k4q1n6QP5O9lo0p7
5378f6k1P7O9L5p6p7l1N9P7M3l8q9m3L1Q4O1k6p5p5J0Q2P3Kp9p4k3P4P5L2o0q9
5409e8k5M8Q9L8m4r0m5M7O8N6k2p3n9qQ7Q6j5o5o9j6M4R2J9n6q1l3M5Q9L7l8q7
5440c9n3L1R3M7j3p9o2J5O1P5%o4p8j3N8R3K9o2r7k6M5Q1M4l4r1m7L1Q6M6j6p2
5471a1p0QO9Q1J2q3p1j3N7P8L9n7r8k5M9P6M4l3p9n4L6P5O8l5p1o3QO9P0Qo8o9
$$ y = [-17, 88, 91, 12, -76, -103, -35, 52, 104, 40, -61, -90, -61, 39, 116, 67, -29, -95, -70, 28, 90, 86, -6, -87, -75, -5, 74, 87, 23, -68, -94, -21, 64, 97, 44, -39, -97, -45, 52, 101, 70, -31, -102, -80, 12, 84, 76, -8, -84, -83, -17, 64, 80, 13, -70, -103, -35, 40, 99, 39, -50, -100, -52, 31, 100, 68, -35, -81, -70, 24, 83, 90, -5, -66, -83, -3, 87, 98, 26, -58, -88, -12, 66, 88, 43, -49, -88, -50, 34, 102, 62, -12, -85, -76, 15, 92, 87, 13, -75, -76, -13, 63, 95, 29, -68, -96, -31, 51, 83, 52, -50, -99, -66, 22, 83, 59, -22, -78, -70, 5, 74, 71, 11, -66, -87, -10, 59, 94, 18, -59, -90, -31, 46, 89, 51, -38, -81, -50, 34, 95, 69, -6, -81, -71, 11, 84, 86, 7, -67, -90, -16, 59, 91, 31, -58, -83, -35, 54, 92, 48, -42, -87, -40, 28, 84, 62, -11, -70, -78, 9, 95, 80, 15, -54, -70, -26, 66, 85, 29, -52, -85, -40, 49, 86, 48, -39, -92, -61, 32, 79, 66, -13, -75, -60, 1, 76, 76, 12, -66, -79, -21, 72, 101, 39, -58, -84, -39, 42, 86, 52, -39, -86, -55, 31, 77, 61, -11, -81, -73, -4, 77, 89, 6, -65, -78, -21, 57, 96, 39, -59, -84, -35, 41, 85, 52, -27, -81, -45, 30, 98, 63, -8, -71, -63, 6, 76, 84, 16, -53]
5503e3j8N5Q1J5m8p7l9M5P2M5l1p7n3K7P7N6kr4n6MP0O7Mo2o5k6O4P1L3m9r3k9
5535h6M5Q2L4j0q2o1J6Q0M8lp4o3kQ7O2J3o4p0k5M9Q4K1m7o5n6N0O9M7l3p4n4
5566h2K3P5N5mo7p0LO0O6Qo3n9k6O4P3J9l3p8l6L1P8L9k2q1n1K2O8P0rp0q3LP2
5599eO5Rn6p0k0N4P6K7m1p6l7L0Q2M4k8p8n2K7P3N2j1o7n9j2P9O0K3o0r6j5N0
5630c2P6L5m2p0m0K9P5N2l1o9m7kQ1N1ko4p2MN4N8K3l9q4k8M3Q7L0m0p9l2L5O4
5662B4M8k3o2o0J6N7O3Po3o7j9P9N6K4o2p0k1M7P4K0l6p0l4K1P5M5j8o9n3PP0
5693FO0qo2o7MN2P0Om5q2pL3P7L8m9p2l1K4O1O8j4q0n5KO7O5J2q2m8j8N7P3J5
5726G0n0p0k5L9O9L9l7p9l6L5P1L2mp7n8KP2O4Mn8o9k4O5O0K5n5o3j3L6P7K4k5
$$ y = [-53, -71, -16, 65, 80, 32, -45, -84, -39, 33, 78, 47, -30, -83, -56, 21, 77, 75, -19, -75, -71, -1, 66, 70, 8, -57, -83, -19, 52, 85, 36, -57, -86, -41, 41, 75, 65, -17, -78, -62, 18, 66, 63, -11, -74, -76, 11, 73, 86, 22, -48, -73, -24, 60, 81, 34, -31, -87, -37, 32, 79, 46, -28, -82, -59, 16, 71, 67, 0, -70, -67, -7, 59, 67, 4, -55, -81, -17, 56, 75, 42, -36, -72, -41, 37, 76, 54, -27, -78, -56, 12, 82, 73, 3, -80, -77, -5, 60, 69, 13, -57, -77, -23, 53, 80, 39, -37, -74, -44, 38, 82, 54, -24, -76, -49, 24, 76, 65, -2, -61, -73, 6, 66, 89, 29, -67, -82, -32, 44, 79, 37, -33, -73, -44, 31, 83, 52, -17, -64, -66, 15, 66, 64, 0, -72, -68, -14, 44, 67, 28, -56, -84, -41, 46, 76, 36, -43, -75, -40, 24, 72, 49, -13, -73, -57, 0, 63, 70, 7, -60, -79, 0, 56, 80, 18, -52, -73, -26, 48, 68, 32, -38, -72, -51, 24, 69, 51, -18, -71, -64, 6, 66, 58, -4, -71, -67, -15, 55, 61, 16, -66, -73, -40, 37, 75, 26, -46, -77, -53, 8, 76, 62, -18, -73, -71, -4, 61, 73, -9, -57, -75, -18, 55, 70, 20, -50, -75, -36, 33, 72, 35, -44, -80, -45, 26, 58, 54, -23, -81, -79, -7, 57, 61, 3, -66, -90, -25, 35, 60, 5, -58, -71, -35, 42, 66, 41]
5758D1p0l4K2O9M8k7m8n6%P0M8mn2o8pM6P2K3n8o2k5L5P3L0k3p6m3L5N4O5k5o5
5790a2n0pO5O9qn4n9j5M2P2L1n1p5l8M5O7K5rp0m8K7N9O3j1q1l5JN5N4jm9m8k3
5823f9M8N0L7m7o1m2M2O3M7k4o9l8MP3N1k7n8m2NM9O4mm3p4pN3N4L1m6q1j1L4
5855c8O2M1k0p4l7J4O1M7pn9o3J7L7O4J3o5m8k4M1O4L0m1o5k2L5N2M3k2o5m7J8
5886e8O6M8po6n1NM9N9J1l5p0j8M4N9L3m2q0j9K9O6M4l9n8n3L0O8M6k0m7n8qO4
5918hN1J1m9n9j5M6N6J4k6n2l9J3P1N4l1p1l1QO5M9j5m5n6pM6O9J5n4n7k0M8N8
5950C9J8k5p2k5K2O9M2k2n2m9ON4N0%n6n8LN2M1K2m9n5k3L9O2K1l4n4k9K2N7M3
5982E9k9o3k9JO0N2Oo7n3j7O8M7K3l7o1k4K8O5L7m3n0l9J9P3M1k5o3m3K1M9N9
$$ y = [41, -29, -63, -41, 28, 76, 49, 1, -55, -55, 15, 63, 59, 7, -61, -68, -22, 50, 73, 15, -47, -72, -37, 36, 66, 43, -33, -76, -41, 13, 78, 53, -12, -62, -69, -4, 65, 57, 3, -56, -71, -29, 43, 74, 23, -52, -90, -45, 22, 47, 38, -32, -80, -53, 6, 69, 58, -23, -58, -57, -2, 52, 51, 2, -46, -69, -21, 29, 66, 19, -42, -84, -42, 21, 68, 44, -25, -63, -59, 14, 65, 38, -20, -62, -57, -8, 56, 52, 9, -65, -72, -19, 35, 66, 20, -61, -72, -38, 24, 65, 45, -29, -66, -52, 9, 56, 49, -10, -73, -56, -19, 45, 58, -7, -55, -79, -38, 26, 56, 15, -50, -72, -37, 15, 58, 36, -29, -76, -58, 8, 56, 49, -17, -68, -63, -14, 45, 56, 21, -49, -67, -23, 36, 69, 27, -53, -72, -43, 23, 67, 28, -30, -83, -53, 15, 61, 41, -6, -64, -72, -8, 43, 54, 5, -54, -69, -23, 33, 47, 21, -31, -70, -57, 14, 68, 37, -34, -65, -57, 8, 57, 42, -3, -59, -66, -20, 49, 64, 10, -47, -67, -19, 39, 57, 32, -40, -65, -43, 26, 68, 46, -6, -55, -49, 5, 55, 55, -1, -59, -56, -4, 37, 59, 10, -45, -68, -29, 33, 54, 20, -34, -63, -41, 16, 59, 30, -33, -62, -61, -1, 51, 57, -10, -63, -80, -12, 35, 58, 21, -40, -64, -36, 29, 66, 23, -27, -66, -47, 26, 67, 42, -21, -64, -43, 6, 65]
6013F5oo7m0j8N6N0J4k8o8j2L2N4M2m1o1m1L8N2L2j6n9l0rO0M9Jm2o8OM4M8J8
6045E5m1n6j8L5O3K6l6o2l7K8O2M4j6n1l9LL9M5Nm8n1k0O4M7J7m1n5k1L8M9L0
6076E8l5o8k4K0O3L7qo7m2J2N4N1Po5l9qL5N9J1m4n2j7L6O1J1k2n6l9L6M7L9n
6108D6o3l3LM6M5j0l6n1rM8N1J1k4n9k7K4O4K2j3o1l9K7N2L5Ln7n6JN8M2j0l0
6140@n7j3M0O7J3m5n7j5K9O0K4j6o6k2ON0M9j0o0l3J1L7O2j3l0n8pL1N9J6l3n4
6172c5k9K7N4L6j8n9l2J8M5N1j6m2n6oN0M9J6n0m8pK7O0Nl6l7l0K1P5K4l1o2k6
6204f2K1N0L3j0n4m6J5L5M2J4l7n7j3N2N5K2m2n0l4L8N1K4j4n3m2J8O5L6rn4k9
6235c5j4M5M9Rn2m4j1K5N8J3k2m7l0K8M1L9k2o6k8K4K5N5nm5n0J1L4M3kk4n8k0
$$ y = [65, 59, -8, -48, -66, -10, 40, 54, 26, -42, -54, -22, 32, 74, 33, -28, -69, -31, 21, 53, 37, -22, -52, -61, -1, 48, 49, 7, -61, -55, -11, 37, 55, 14, -42, -60, -25, 38, 64, 28, -34, -71, -43, 19, 63, 47, -4, -43, -40, -1, 44, 49, 1, -50, -70, -6, 41, 58, 17, -38, -59, -21, 28, 58, 23, -45, -69, -49, 14, 51, 43, -24, -66, -54, 0, 51, 58, -7, -46, -54, -19, 40, 51, 7, -45, -62, -26, 35, 46, 24, -32, -71, -35, 12, 51, 46, -17, -50, -47, -1, 44, 34, -2, -53, -62, -14, 37, 48, 24, -35, -62, -38, 26, 48, 35, -26, -65, -38, 14, 49, 52, -5, -61, -60, -2, 40, 30, 0, -57, -70, -30, 37, 50, 5, -52, -67, -38, 22, 46, 30, -36, -58, -52, -2, 47, 37, -23, -56, -45, -8, 54, 41, 11, -47, -54, -23, 36, 52, 19, -35, -64, -37, 17, 53, 35, -24, -56, -38, 7, 58, 42, 0, -56, -62, -12, 37, 53, 3, -45, -52, -25, 35, 40, 4, -33, -63, -42, 33, 57, 26, -36, -62, -41, 9, 42, 32, -22, -68, -53, -18, 24, 38, 1, -56, -69, -17, 38, 60, 18, -32, -66, -28, 23, 47, 33, -20, -62, -44, 21, 57, 48, -6, -35, -49, -4, 45, 54, 2, -42, -53, -28, 30, 43, 21, -26, -56, -28, 13, 52, 30, -36, -64, -40, -15, 40, 35, -10, -60, -49, -15, 28, 26, 2, -56, -76]
6267g6N9M6K0l4m2m7M8M4K9j4m1n1K0M9L4j1l9l4nL4N2Lj9n2j6K6M6K3k6n5k9
6298e8L2M2L4j8m5l2KL9M8Nn1n0oM5N0J8n0m0k4K3O1J9k6n2k1K3M6L3j6m2l9j0
6330f0N7N1rl6n4lM2N4jk9m5k5L8N4K6l8l3l8K2L9K4ml8l9J2L9M6qk7n9oL2N7
6363D1Rl5m6j9L1M3K4j8n5l1J0N8K2jm4m5QM4L1Ol7n4QK1O6Kl5m6k0M6N1Qj8m7
6397b2k4QN2L3ln7l2J2L3M2On7m3mL8N1Pj7n7k0L4M2K2j5n0k6J4N1L0j4l6m6J
6430d7M4M8k2j5n0kM2L4J3l7l9k5K4M6K2j4n2k1MN0L4Ln1l3KL4M5Jk5m4j5L6L6
6463B6J5k7n4j0L1L9L4k4n6j7MO1K2j5l6l0k0N0M9jl4m8PRN4Rk2l1m1K6M3L2l0
6496A5n2k0J8L7L6ol8l4mM0K9J7l7n2MK5N6J2k9m3k9K8N5J8k1n8j8K3M4K9mn1
$$ y = [-76, -17, 29, 49, 15, -27, -74, -26, 18, 47, 33, -8, -59, -39, 10, 44, 33, -6, -40, -45, -11, 41, 44, 25, -27, -43, -17, 29, 52, 26, -29, -58, -26, 16, 50, 32, -13, -45, -43, -4, 44, 49, -2, -52, -58, -13, 37, 55, 5, -35, -59, -36, 25, 44, 18, -34, -55, -32, 14, 47, 31, -11, -50, -60, -3, 48, 39, 3, -51, -54, -12, 42, 41, 12, -33, -58, -20, 34, 60, 22, -11, -49, -27, 12, 36, 32, -6, -45, -33, 6, 52, 44, 17, -42, -48, -16, 41, 50, 15, -31, -50, -19, 24, 48, 30, -25, -56, -46, 12, 34, 33, -11, -56, -48, -4, 27, 33, -4, -58, -50, -29, 37, 39, 4, -42, -62, -16, 35, 43, 25, -22, -46, -38, 14, 47, 44, -13, -45, -33, 0, 42, 48, -9, -52, -56, -18, 33, 40, 23, -34, -54, -20, 22, 44, 29, -21, -47, -33, 18, 48, 34, -2, -48, -47, -3, 45, 23, 8, -42, -44, -2, 32, 45, 8, -31, -56, -32, 14, 36, 22, -30, -51, -47, 3, 37, 40, -11, -44, -42, -8, 37, 38, 13, -31, -46, -10, 26, 41, 14, -40, -50, -19, 20, 54, 30, -26, -43, -39, 22, 44, 29, -7, -37, -57, -7, 42, 41, 7, -41, -34, -25, 29, 38, 16, -15, -56, -30, 13, 45, 15, -37, -57, -39, -2, 34, 28, -10, -44, -48, -8, 21, 38, 1, -51, -47, -22, 34, 46, 17, -26, -55, -27, 28, 46, 25, -33, -51, -28, 16, 45, 41, -10]
6528a0m0PL8N2%n4k1k4M6M4Kk1n0j8K0L9L0j1m6k7mN9J9Om9k6lL0L7Ok8m2j3L5
6562a7L8J4j5n9j5K9K8L4nn3k2RK9N2j2l2m3JK9K7L3l8n2kK0N8Pk8m2j7K4L1K2
6595C3k2l0k8J7K3M2ml3m0jL2L1J4k2n8k0L9N3K3l7l5k9L1L1K0ol1l7OL9M2om8
6628a1k4j4L7M0J3k7n2j3L6L0J8k5m1rJ4M1PJ1l6k7j5N6L3Mm2l1qJ6N8Rl9l6j5
6661d2K6M1J5j1n6j9J7L8K4j0l5l2J0L2L7kk8m5PK4M1Kk8k2k6J6N9J2k1l1k3N
6693b5M1K9on9j2pN0L6j0l3k7j1K1L9Ok1o1QK4L5J6pl9l8K5M8J7rm2k9QK4M5j1
6727B5k4m0PK1M7J0k4m7jML9K7k7l9k0J1N3K9k8l7j4j7N2L8j7k4l5mK3L2J0j5
6759A5l3k3K9L8J2j9k2k6rM7K6j6l0k7J0L0L4ok6l0k0L9L4Jj9k9j9J3M5L4k9k6
$$ y = [-10, -50, -43, -5, 47, 47, -7, -28, -52, -6, 38, 40, 19, -31, -49, -29, 10, 40, 29, -17, -44, -48, 11, 30, 36, -13, -39, -42, -12, 25, 31, 3, -39, -52, -17, 21, 35, 20, -39, -54, -25, 3, 37, 32, -21, -43, -34, -5, 47, 35, 3, -40, -39, -10, 17, 50, 12, -40, -42, -22, 36, 43, 15, -27, -44, -20, 11, 33, 11, -19, -47, -30, -7, 35, 31, -2, -42, -43, -11, 20, 34, 12, -46, -66, -27, 26, 49, 12, -23, -52, -21, 10, 30, 24, -7, -44, -38, 1, 43, 37, -11, -35, -49, -12, 28, 41, 14, -38, -51, -15, 15, 33, 8, -33, -42, -28, 13, 20, 31, -5, -32, -47, 9, 42, 46, 4, -27, -35, -19, 39, 48, 9, -27, -42, -16, 25, 40, 29, -27, -46, -29, 9, 33, 23, -12, -44, -34, -2, 35, 33, 5, -40, -33, -9, 32, 34, 6, -16, -42, -26, 33, 45, 24, -7, -30, -25, 16, 45, 39, -20, -32, -39, 11, 47, 37, 4, -23, -34, -13, 26, 32, 11, -50, -42, -18, 17, 33, 26, -13, -51, -26, 22, 39, 30, -12, -41, -33, -9, 36, 25, 1, -39, -32, -11, 36, 46, 22, -25, -26, -22, 17, 44, 17, -22, -42, -31, 22, 51, 23, -14, -28, -45, 7, 45, 28, 4, -31, -35, -12, 20, 30, 15, -18, -41, -12, 26, 38, 19, -3, -29, -38, 9, 35, 19, -11, -38, -28, 2, 36, 30, 4, -26, -46, -7, 27, 28, 9, -20, -39, -26, 19, 53, 24, -2]
6791bl6JM2L5j1l0l1kM0L7j8nm0rK3K9Rj4l9k3K5L9K3j4n1k3J5L7K5%k7m2MK7
6825fL1kk1l1qL0L3K2k7m1j9K8K0L7k1l5k0QK9L6j8k7k7LM3J5Ll1k8j3K4M1J6
6858D4l2l4j0K3K2J9j1l7j6J6K4K8pk8l1lK8L3Pl2l7JK0L4J6j7m9oK1K7J4Lm8
6891a8k2NM5K3qk9l3jK6N2qk7l3nK6K7Qj6k6k1J1L4J2kl2k9NM6L2j5k6l0j4K9
6925a4M7pj9k8k0K7L2J4k4k1k4K2L4KJ0l8k9oL5L8Ll9l1J0K1K6Lj8l5%J4L2K8
6958D5l8l1j7J6L1K4Jn0j6oK4M7Ll2k7j0L4K2J1k9j9k3J9L5K1j4m5j2J1L8J7j
6990B9l8k0oL4L0ml2k9jL0K8pql8j6K7L9K2k6l5j3PK7L7j5j9m2K1K5J9Pl1l0O
7024b2K1L0Nk4k8k2K0L3K6k8k5k0JL3J5Nl7j5oL4L3ok6k5j7L6L3Mj5l9oJ2L5K1
$$ y = [-2, -38, -37, 5, 40, 29, -1, -32, -34, 6, 43, 25, 20, -20, -29, -6, 23, 32, 18, -21, -44, -19, 20, 43, 29, -22, -45, -30, 7, 32, 32, 5, -37, -33, -6, 25, 23, 2, -29, -37, -7, 26, 48, 21, -20, -39, -11, 9, 46, 25, -10, -30, -22, 7, 43, 25, -2, -29, -26, 17, 32, 35, 4, -24, -37, -13, 28, 44, 12, -22, -32, -9, 13, 32, 21, -16, -32, -16, 8, 36, 29, 1, -30, -33, -5, 28, 35, 3, -34, -33, -13, 21, 37, 20, -29, -35, -14, 13, 27, 30, -18, -40, -35, 10, 33, 25, -4, -37, -38, -12, 40, 32, 5, -28, -33, -7, 20, 28, 12, -14, -35, -24, 10, 22, 20, -12, -41, -36, 10, 42, 27, 1, -29, -43, -14, 33, 26, 7, -21, -41, -14, 18, 32, 8, -13, -37, -15, 19, 21, 31, -7, -36, -42, -7, 31, 34, -5, -36, -26, -5, 21, 24, 6, -29, -29, -15, 17, 45, 7, -24, -41, -25, 6, 30, 31, -19, -35, -41, -17, 30, 33, 1, -26, -36, -2, 20, 31, 2, -17, -40, -21, 14, 35, 21, -24, -36, -25, 13, 30, 29, -9, -29, -35, -1, 29, 25, -7, -36, -37, -7, 21, 14, 6, -32, -48, -21, 18, 40, 14, -21, -34, -27, 0, 37, 22, 3, -39, -18, 7, 26, 33, 2, -28, -22, -1, 29, 34, 10, -18, -40, -20, 13, 39, 11, -14, -34, -33, 0, 15, 20, -17, -32, -38, -4, 29, 23, -3, -28, -45, -9, 24, 28, 13, -26, -32, -20, 15, 36]
7058C6j8l7k2K3M5Pnm2k2MK1L5nj8k8j5K1M9jk1k0j3JL5J7ol5rLK8J8mk5l4NL1
7094aK5jj8k0k5K4L4K0j9n4nJ0L4K7ql3l1K5K6J7j1l7kj3K8K8J0k6k9j1K0M0J
7127B5k1l5qK6K1K2j5k3k7J4K9K0ml4k1MJ4L0J0k0k4k5K6L4Okl1k3RL8J1J4m5
7160el6RL6L1j7l2k5J2K7J7Mj6m7ML9K0J8k9l2j5J8J8K2j0k6j5LL4J3Lk4k8nL2
7194bK8J5k2n1qK7L1J3j4l4rJ1K4K3j3l6j4JK2L1j0k4k7oL6L1Ol2k1LLK9J3j4
7228A0k8j4lL5K7k2j7l0J6J6K9Mk9k5oK7K1J2k0l4LJ5L7J1j9l3k3K7K5J9j0j7
7260Dk4KK2K5j0j8l2rK9L3Pk2l0j8J1M6Lj6k3j7PK3L3lk6k3LJ6K2Mj5l0pJ6L9
7295B2j1j0k4j4J6L3J3j3m4jRL4K9j9k7j1j0K5K7Kj9j8lJ0K1J2k6k6oJ4L7lpk7
$$ y = [36, 18, -19, -41, -18, 27, 34, 29, -13, -35, -31, -10, 25, 20, 2, -26, -41, -20, 29, 28, 7, -13, -26, -25, 10, 27, 21, -14, -23, -20, 8, 26, 22, -3, -37, -32, -1, 24, 23, 5, -15, -40, -16, 18, 38, 19, -35, -40, -30, 4, 31, 23, -10, -41, -16, 10, 27, 16, -21, -23, -36, -8, 20, 30, 4, -25, -36, -16, 24, 25, 4, -31, -39, -13, 8, 30, 15, -8, -35, -21, 8, 28, 24, -10, -31, -27, -13, 17, 27, 7, -17, -42, -16, 18, 24, 22, -9, -32, -23, 15, 26, 40, -5, -41, -32, 4, 35, 18, -14, -39, -27, 0, 17, 21, 5, -42, -38, 1, 21, 39, 10, -22, -37, -19, -1, 21, 11, -15, -30, -27, 7, 20, 23, -1, -29, -34, -2, 26, 41, 19, -32, -40, -13, 18, 31, 17, -17, -26, -15, 9, 32, 19, -17, -31, -30, -8, 23, 13, -11, -38, -44, -8, 23, 29, -3, -24, -21, -18, 11, 24, 10, -18, -32, -35, 0, 27, 5, -12, -42, -26, -10, 19, 23, -6, -31, -37, -10, 11, 23, 3, -31, -28, -13, 24, 35, 16, -17, -40, -13, 12, 31, 21, 4, -20, -18, 4, 29, 19, 1, -31, -40, -11, 22, 29, 7, -23, -41, -30, 16, 19, 3, -20, -37, -30, -7, 26, 23, -3, -26, -23, -7, 15, 19, 4, -26, -33, -17, 22, 11, 1, -23, -37, -21, 12, 25, 12, -32, -33, -24, 10, 39, 20, -7, -18, -28, -3, 24, 26, 7, -11, -14, -4, 17, 29, 3, -23, -29, -15, 22, 19, 12, -15]
7329a5j7J5K0K1%l8j6MJ0L9qj5l2jK7K5Lj9l1rK9J1J5lk1l2J2L3L1j4l3j8JJ6
7363a0M3ll5j8j5K1L6J0k3k2j8K3K5J6j4l0j4ML0J7ok2j9j1L3K4j0rl3J3J3K6
7395B2%k2k8MPK8J8j5l2qlK6K6j6k1k1nK8L4nj6k5oJ2K9Kj2j5j6J1K9K9k0l4q
7430b3PJ6L3nl4j4rJ3L5kj3j6k2K8PK5k0l3jJ0L4PLl8j3J2J5K2j2j3k9OK7J2J0
7465B5k5k6rJ7L0J8k1k1j3J8J1J0mj5k3LK0K6Lk3k0j1L2J6Rj9k3j5K0K4J5k6k0
7498a7plM6J3j3l1j9J3K2J8j6pk6LJ3M2jk5k4j4K5L4mk3j3j1K0J9Pjk8j0MJ2K5
7533B3nl5jmOM7mll1j6J9K3Pj3k7rmM2J4mk6k6J5J1K7lk2j6j1K1K6nkl9nK7J7
7570A4Rj2k8j2J4L2J3j0j8j8j0M2%%j1k8KJ8L1mk0l4%K0M1qj5k1k5K5K4K1j4k3
$$ y = [-15, -32, -17, 3, 24, 24, -14, -30, -26, -16, 23, 15, 0, -32, -33, -6, 19, 22, 3, -28, -37, -8, 3, 18, 15, -6, -38, -26, 7, 38, 24, -9, -27, -26, -10, 33, 30, -5, -23, -38, -17, 19, 29, 6, -16, -34, -11, 14, 30, 16, -14, -28, -24, 6, 23, 17, -5, -24, -35, -2, 22, 12, 3, -30, -17, -4, 22, 22, 0, -28, -24, -17, 11, 29, 14, -18, -26, -29, -3, 23, 7, -14, -35, -40, -12, 22, 17, 1, -24, -30, -18, 11, 13, 1, -14, -30, -19, 10, 39, 19, -15, -23, -16, 0, 33, 28, -6, -20, -29, -16, 19, 17, 4, -12, -34, -6, 1, 26, 6, -27, -28, -18, 16, 23, 26, -12, -25, -13, 2, 24, 12, -1, -30, -24, 3, 15, 25, 0, -26, -35, -18, 12, 30, 9, -12, -25, -7, 4, 14, 10, -5, -28, -25, -5, 21, 24, 1, -19, -30, 2, 18, 27, 8, -15, -30, -10, 14, 29, 3, -17, -24, -27, 19, 32, 19, -12, -31, -18, 4, 22, 6, -1, -27, -24, -11, 31, 30, 5, -19, -33, -8, 26, 22, -1, -14, -25, -5, 14, 21, 20, -8, -18, -14, -2, 23, 18, -17, -18, -22, -16, 31, 27, 24, -7, -23, -4, 19, 26, 13, -14, -23, -27, 15, 29, 25, -1, -27, -12, -1, 26, 23, 1, -15, -26, -5, 21, 16, 14, -25, -30, -3, 14, 23, 11, -17, -29, -15, 17, 30, 20, 2, -16, -26, 16, 16, 16, 5, -23, -21, -3, 28, 24, 4, -30, -30, -10, 31, 23, 8, -13, -38, -13, 11, 32, 18, -5]
7604ej9J2K6J2pk0k1kJ8K6J0k1l2LJ5J3J0kk7mLL3Nj8ql3J6K5MJ3k9k5mK0K9J0
7640B6k0k9OOK3J8j2l1j2J1J8K9k6nok0K2L6j1k8k4OJ2L0J0l3j6jOK5J2j5j2j2
7674a7J2J4J2oJl4JJ2K1kj0k0qK2J4K1j9k5j2J7J8J8j6k0j3kL2LMk0k9kL0L0o
7709B1l0j6%J9J7Qj7j9j0J2K9loj5j0rK7K1jl0j3J3J9J7qk6j4oJ9K2Nrk0j4NK2
7745@L2j7k5k3J6K2J0J0l0j2rK0K0Oj6j9JJ3J7pmk6okL2J6j7k5qJ3K7Oj4j0k2
7780c1MK0K1Pj3l2QJ2J6Rj5k0j6QK0J9j0k8oJ1K6mNl0pPJ6K2%k7rkjL5Rk4pj6
7818b3J8PJ6j8mj4RMK4Ql4j7jJ9J2Jjj3j9J4J5J1k0ok4J5J7K7j6j8k1J0K9Qnj3
7854ck0OK3NNj2j8j0ML3J3j7j8qLK0J2kk3j6PJ6J7onk5j3K8J7Lrl6KJ6K8jmk6
$$ y = [-5, -24, -12, 14, 26, 19, -1, -22, -24, -6, 20, 30, 9, -23, -20, -5, 8, 18, 16, -11, -15, -12, 21, 26, 8, 0, -33, -17, 8, 12, 25, -4, -29, -33, -13, 16, 26, 6, -23, -17, -11, 12, 30, 18, -13, -25, -14, 4, 33, 7, 2, -4, -24, -2, 34, 23, -5, -29, -23, -11, 19, 29, -4, -20, -21, -15, 10, 22, 7, -5, -17, -5, 9, 21, 15, 16, -18, -17, -5, 16, 14, 4, -16, -24, -2, 12, 33, 14, -11, -23, -6, 12, 30, 14, -6, -19, -21, 11, 14, 18, -2, -31, -33, -3, 27, 21, -9, -25, -25, -6, 11, 19, 2, -17, -27, -15, 14, 11, 5, -10, -20, -29, -2, 19, 18, -12, -25, -12, 7, 24, 16, -10, -24, -30, -11, 11, 16, 7, -13, -27, -22, 0, 32, 15, -10, -33, -17, 5, 15, 25, -5, -17, -26, -6, 14, 20, 4, -15, -14, -1, 16, 9, 5, -21, -27, -29, 3, 19, 2, -23, -31, -18, 9, 15, 1, -9, -31, -27, -7, 14, 21, 8, -24, -16, -4, 12, 21, 6, -14, -30, -22, -2, 17, 7, -21, -27, -16, 10, 6, 11, -19, -26, -19, -3, 19, 19, -8, -17, -19, -20, 15, 24, 0, -7, -23, -5, 2, 18, 0, -4, -18, -9, -5, 19, 27, -7, -24, -25, -6, 6, 7, 6, -7, -26, -12, 3, 14, -6, -12, -36, -21, -4, 23, 7, -11, -32, -22, 7, 15, 10, -3, -23, -17, 6, 11, 16, 4, -14, -24, -20, 13, 26, 9, -9, -17, -14, 6, 18, 16, -7, -23, -16, 0, 17, 11, 6, -19, -32, -4, 13, 16, 7, -29, -27, -11, 17, 16, 12, -14]
7892a4%qK3K4j6j7k3J6J0J6qj1l4J2L3J6j0nk1j0J4M0nj1qj9MJ5J6j0k6rJ0K1
7926EK1j0j6j8J1J0J3Rk2j9MnL0Kj0j4k2J5J2K2j0j3k1NJ4K7j2pj9pK1J1Oj5j3
7961a5pOK6kJj5j2J0K0J6k0j5j4J9JOJ6qk6j2J1L3mmk9mJ6K6Qj5k2j1J5PK0qm
7998A0m1K3J3jK0k7j3j3J9J3Qj0k1JKK8OKk3k3J0J1K5j2j0j9lK4J2J5k7j8j2K6
8032eJ5%nj1j7J5J1J7lk2j0lK2J7%k3j5RNK3Lj4k7jPK9%j5rj7J5J4Qj4nk2RJ1
8070hJ0Pj5j2mJ3J5Lj4j7pJ6J7Pj1qj3J1K0%jj5lj1L5Kkk4NrJ5J7nj4k6J5jJ7
8108EK0k7j5LPRJ2pk4Lj2L2QMk5j7PJ7K5pj9j5oJ6NJ4lj6j8J1LJ4Lj6omL1K%p
8148Gk5%J1K1Jnk6JOJ8mjrm%nL1jk6jJK2kkrj5LJ3jJ1j3r%mK3NQk7j1MQK0j3
$$ y = [-14, -14, -22, 1, 25, 9, -8, -31, -15, -5, 11, 3, -8, -42, -30, 3, 19, 9, 4, -17, -27, -13, 27, 22, 11, 3, -16, -12, 3, 19, 9, -17, -26, -16, 5, 26, 16, 0, -18, -7, 3, 16, 25, 3, -16, -12, -17, 13, 15, 5, -9, -31, -16, -4, 18, 8, -5, -26, -21, -7, 20, 8, 1, -18, -25, -4, 7, 13, -2, -15, -22, -16, 10, 8, 9, -6, -18, -8, 12, 28, 8, -7, -21, -2, -1, 5, 21, 13, -13, -25, -14, 19, 15, 11, -18, -22, -6, 20, 28, 13, -9, -20, -5, 2, 22, 14, 10, -31, -8, 5, 4, 24, -3, -16, -29, -10, 3, 11, 1, -20, -19, -17, 11, 17, 19, -4, -27, -17, -6, 19, 7, -3, -22, -25, -1, 11, 26, -1, -19, -31, -5, 10, 10, 5, -6, -23, -8, 3, 20, 17, -5, -15, -18, 4, 21, 21, -2, -17, -8, -3, 20, 23, 9, -18, -19, -12, 17, 17, 2, -7, -24, -9, 5, 13, -1, -6, -28, -19, -8, 2, 9, -6, -18, -22, -9, 6, 9, -5, -22, -29, -13, 4, 11, 0, -8, -21, -10, 10, 10, 9, -6, -9, -20, 15, 17, 15, -9, -4, -13, 2, 19, 14, 0, -26, -11, -12, 5, 25, -2, -17, -14, -7, 2, 14, 7, -17, -14, -26, 6, 14, 18, -7, -24, -17, 0, 25, 18, -1, -16, -22, -6, -1, 13, 10, -6, -24, -13, -10, 4, 7, -9, -15, -19, 12, 14, 14, 7, -18, -18, -7, 14, 15, 10, -16, -15, -9, 9, 5, 4, -5, -9, -9, -14, 17, 16, -10, -11, -10, 12, 10, 8, -1, -16, -13, 0, -1, 10, -3, -12, -12, -16, 7, 12, 20, -7, -18, -14, -6, 14, 1]
8191A
$$ Imaginary data points
##PAGE= N=2
##DATA TABLE= (X++(I..I)), XYDATA
0@%%%%%%%%%%%%%%%%%%%%%%%KrJ5j6J6j6J6j6J7k1K8l2L2l3L7m4M9n3O0o6P1p9
45d2Q7r8J10j21J35j52J74j98K28k69L23l97N13p19J196m400j864N919N83j943
65i35l821j059J658M329K960l22l581k499Q40L975L443N91k734l131m62L104L483
82E839R72k215k923j336J425K808J719j338l312k326P81K599J521j134k843k372
98b135q7J958J855m55k673k503k10J822J942J30k041k498o53K010K679O43j921
115b137k366n43J776K827J662j080k770j421J710L472K174p64k630k046O78L248
131A790L076Q1k866k957j66K702L166R75k200l645j757J871L565J692j703l636
147a2k579N27L064K680m33l411l394l77K588L000O42k359l410j462J723L339J734
$$ y = [0, 0, 0, 0, 0, 0, 0, 0, 0, 0, 0, 0, 0, 0, 0, 0, 0, 0, 0, 0, 0, 0, 0, 0, 2, -7, 8, -8, 8, -8, 8, -8, 9, -12, 16, -16, 16, -17, 20, -24, 25, -28, 32, -34, 37, -42, 45, -53, 57, -64, 71, -81, 93, -105, 123, -146, 177, -220, 293, -426, 770, -3630, -5494, 425, 1008, -935, -4756, -5815, -4157, 172, 3132, 2810, -771, -3270, -2430, 1545, 4988, 5579, 2845, -286, -748, 2356, 5839, 6811, 4596, 1673, 337, 1762, 4570, 6289, 4951, 1639, -687, 94, 2693, 4214, 3080, 237, -2135, -2222, -264, 1591, 1136, -1537, -4040, -4250, -2428, -486, -356, -2397, -4895, -5548, -3538, -859, -216, -2137, -4503, -5046, -3270, -443, 1219, 139, -2631, -4052, -2342, 1130, 3304, 2540, -90, -2136, -1458, 1790, 4866, 4947, 2081, -876, -1042, 1660, 4826, 5801, 3601, -44, -1801, 70, 3635, 5327, 3624, -12, -2591, -2064, 1000, 3680, 3247, -164, -3558, -3935, -1347, 1653, 2295, -64, -3474, -4936, -3213, 126, 1860]
164A860j496l103j841R56K858K402j89k559k364K26K638K593L43j855k210n00
180b241J816K654J009j507k414q17J445K227J076r69k225j442Q53K298J344j001
196B106k295j489N07J957J586m02k340k086J99K200J949j83k101k249l94J928
212a107K561P03j945k744q42J736K768J401j175k804j811J018L072K259n71k746
228b27k358J50K560K835N37k309l059q76K091L027J221j533k997j885R50K989
244A116K171p71k933k369J64K357K456L43k208k820p71J931K671R03j512k476
260a748j300J028K506J654p91k374j568O63K133J695j34j813j792J7J900J949
276B025J22j656j716k07J438J832N39j353j983o08J356J956N93j223j952r45R12
$$ y = [1860, 364, -2739, -4580, -3624, -766, 1636, 1447, -1112, -3476, -3250, -612, 1981, 2324, 469, -1741, -2241, -425, 2229, 3238, 1731, -683, -1500, -55, 2172, 3248, 2279, 54, -1388, -535, 1763, 3107, 2106, -189, -1678, -1171, 786, 2372, 1970, -370, -2456, -2257, -57, 1892, 1709, -392, -2641, -3035, -1107, 1454, 2157, 212, -2532, -3374, -1638, 1130, 2531, 1356, -1448, -3259, -2241, 831, 3090, 2519, -227, -2585, -2435, 125, 2960, 3497, 1188, -1871, -2747, -656, 2371, 3592, 2059, -938, -2823, -1873, 1116, 3287, 2516, -417, -2786, -2622, -265, 2191, 2534, 326, -2494, -3265, -1334, 1337, 2240, 728, -1748, -3048, -2020, 486, 2140, 1349, -1025, -2593, -1930, 203, 1898, 1764, -49, -1841, -1824, 76, 2025, 2147, 491, -1225, -1432, 6, 1838, 2377, 1024, -959, -1567, -211, 1745, 2338, 1115, -837, -1782, -870]
293h70K018J159r66k286j374P59K079J464m82k118j964Q8K155K171O1k085k280
310b471m33J761K480R99j479k690j286J363K746J614q17k471j950L95K536K405
326B702M7k341k424l11J990K522Q87j542k673j287J318K650J445r95k402j732
342b146M10K168J973j41k167k101j28J779J935L97j472k070p99J245K062Q31j137
359F39j913r07P84J759J143n68j770j215N58J782J219l85j538j245J96J576J542
376A657j4j597j542N4J550J611K41j355j771n19J377K005O72j320k039q94J014
393h70K052J248p68k241j633N48K201J713l01k035k019k43J825K282N39j778k426
410a906q30J415K329J224r97k400j626P07K390J831l93k105j906m7J872K194N04
$$ y = [-870, 1148, 2307, 1341, -945, -2319, -1560, 519, 1983, 1501, -617, -2581, -2493, -338, 1833, 1894, -191, -2471, -2904, -1143, 1337, 2336, 857, -1833, -3119, -1756, 990, 2604, 1787, -684, -2634, -2239, 297, 2702, 2749, 408, -2016, -2327, -337, 2185, 3072, 1530, -1143, -2430, -1112, 1538, 2983, 1988, -414, -2146, -1736, 432, 2405, 2264, 97, -2004, -2132, -353, 1582, 1979, 507, -1563, -2362, -1117, 945, 1776, 639, -1274, -2181, -1397, 362, 1505, 937, -833, -2048, -1490, 292, 1511, 1126, -412, -1657, -1461, 115, 1657, 1643, 46, -1496, -1442, 108, 1719, 1960, 605, -1166, -1685, -308, 1697, 2369, 1049, -990, -1884, -870, 1182, 2430, 1662, -579, -2212, -1664, 537, 2250, 1949, -86, -2105, -2348, -523, 1759, 2298, 520, -1906, -2736, -1321, 1008, 2232, 1235, -1165, -2791, -2084, 306, 2137, 1744, -361, -2267, -2314, -442, 1752, 2256]
427B256j658k222o54J458K160R63r69k032j241P23K083J425n41j857j385K41J598
444C48J511O7j501j657k07J394J551K11j209j536m98R63J548O22j037j667o68
461a765Q68J532P15p33j571j001N81J678J125n79j668j161L71J596J428l5j588
478b07j658o4J675J809L25j400j822o12J246K086J032j047k139j179Q70K075J442
495B432m13j967j808Q5J954J959J37j756k057n69J363K102R18j204k265j230Q93
512a426K052J309n54j949j633J19J783J777N4j670j740l01J327J766O41j061j792
529a298p71R86J793Q95o80j543r33M83J573J197k86j480j138L10J393J170n7j210
547D04j288j10J256J368J23j231j399k75J014J382M35j013j628p06R17J602O91
$$ y = [2256, 598, -1624, -2278, -820, 1340, 2303, 1334, -698, -1939, -1216, 867, 2292, 1751, -106, -1491, -1250, 348, 1859, 1926, 425, -1232, -1439, -45, 1506, 1717, 508, -1028, -1526, -563, 985, 1607, 570, -1097, -1765, -897, 635, 1350, 617, -954, -1955, -1374, 304, 1429, 850, -818, -1979, -1608, -12, 1416, 1381, -207, -1865, -1929, -254, 1555, 1880, 480, -1342, -1954, -708, 1378, 2410, 1363, -776, -1955, -1085, 990, 2432, 2019, 52, -1756, -1671, 283, 2242, 2379, 623, -1434, -2003, -640, 1462, 2380, 1176, -1089, -2319, -1426, 626, 1935, 1381, -568, -2201, -2082, -299, 1478, 1532, -138, -1878, -2179, -852, 914, 1555, 494, -1298, -2069, -1083, 710, 1605, 925, -618, -1551, -1068, 505, 1702, 1416, -64, -1202, -892, 501, 1671, 1614, 404, -884, -994, 262, 1630, 1753, 522, -877, -1152, -138, 1244, 1679, 666, -962, -1668, -751, 851, 1542]
564A542q74j665r97N32J643J230m39j775j430K55J651J547J00j488j736l85J442
581h47J998O91j210j896q36R76J979J303n41j934j448M34J945J611l8j594j742
598a149l16J458J926N72j287j945p88R30J764R82o91j838j311L95J643J248l03
615A290j558j410j01J226J439K29j264j516l67J037J386M80q35j362o45P56J463
632B48P69o11j326p01N75J372R47k76j267r77L50J441J132j49j221j115L5J249
650D75J375K19j229j485l08J138J488M69r69j646q67P48J684R38p52j783j219
667a724L35J547J338j51j641j689j70J439J664L15j264j757p20R87J851J001p98
684E63j823j078N76J727J370j28j504j488J8J543J653K90j172j512m27J039J649
$$ y = [1542, 668, -997, -1994, -1462, 181, 1411, 972, -803, -2233, -1978, -327, 1220, 1320, -168, -1904, -2289, -847, 1151, 1842, 632, -1264, -2100, -1124, 855, 2158, 1617, -317, -1765, -1331, 614, 2225, 2187, 593, -1149, -1465, -7, 1919, 2491, 1204, -741, -1529, -599, 1165, 2147, 1456, -382, -1693, -1298, 345, 1593, 1290, -268, -1678, -1779, -553, 886, 1115, -149, -1665, -2032, -995, 391, 871, 36, -1326, -1971, -1215, 248, 1017, 406, -920, -1621, -1046, 326, 1273, 997, -270, -1247, -897, 544, 1676, 1527, 306, -809, -774, 475, 1850, 2069, 840, -645, -953, 185, 1673, 2142, 1173, -473, -1340, -592, 1092, 2030, 1278, -505, -1724, -1389, 158, 1496, 1345, -296, -1985, -2155, -716, 948, 1263, -1, -1758, -2478, -1491, 360, 1361, 563, -1260, -2338, -1762, -35, 1335, 1207, -297, -1785, -1767, -224, 1429, 1719, 547, -965, -1392, -353, 1296]
701A296P80p70j570q26O86J488R24m29j329j077J73J292J130j83j282j145n1R83
719I0J117J27j046j308l47R32J196K66r17j245n16O90J255O32o91j389p28O21
737a261J342Q45m01j292j009K77J420J243r4j312j239QJ264J461L63j064j530
754i79n07J076J653P59p94j589r65N77J637J222l41j615j368J21J426J428J58
771A899j269j650n08J111J635O06r63j652q73N92J510J055m23j567j214K21J363
788a27J202j3j187j317k52J076J373L78r63j311m48P90J279O44n55j270p23N48
806h76J271Q14m05j124q09K56J136R68r3j117r99Q1J089J021O5r47j125k54R41
825a07J261L18r17j303m45P61J297O42o32j407q67N15J415R50l95j373j134J05
$$ y = [1296, 2076, 1306, -264, -1090, -404, 1084, 2008, 1579, 250, -827, -654, 638, 1768, 1585, 303, -842, -893, 90, 1207, 1334, 288, -1020, -1367, -435, 761, 1027, 110, -1135, -1651, -961, 294, 926, 235, -1154, -1882, -1261, 81, 926, 525, -767, -1776, -1499, -79, 1164, 1070, -242, -1481, -1473, -209, 1252, 1615, 551, -979, -1486, -410, 1243, 2002, 1208, -381, -1346, -769, 868, 2090, 1749, 134, -1234, -1113, 313, 1741, 1899, 630, -1020, -1528, -417, 1218, 1824, 861, -791, -1664, -1072, 438, 1493, 1070, -497, -1711, -1490, -127, 1075, 1062, -125, -1442, -1694, -618, 755, 1133, 170, -1141, -1589, -799, 480, 1124, 569, -701, -1424, -876, 395, 1209, 804, -320, -1129, -873, 263, 1231, 1138, 21, -978, -897, 192, 1213, 1278, 331, -794, -1048, -107, 1154, 1472, 555, -748, -1193, -432, 865, 1507, 875, -532, -1399, -884, 531, 1481, 1086, -287, -1421, -1316]
843a316J283J307J01j284j456k88J123J444N11q76j550q00P15J602R54n50j504
860e84j079K79J387J291J1j305j386j51J177J408L89r21j393n94P59J470P90o21
878I27j364q13M14J270R65j81j183j074P1J130J083L9r88j077k17Q36J127L37
896A302q07j184m04P01J103M55n95j120o38M43J151P04m42j189p77L19J067Q72
914I61j47j096j053L1J117J116O9j009j157k64R00J316N04q03j375o00P41J376
932F27P94m45j324r96L08J375J186j10j270j231r6J130J341L88r91j470n54Q69
950d69J428O92o47j404r17L65J346J054k54j324j154L0J111J140J80j006j263
967a092l86Q83J252M33p48j189n66N25J160P29m01j149p72L51J089Q21j64r60
$$ y = [-1316, -33, 1274, 1375, 91, -1365, -1653, -530, 914, 1425, 549, -1001, -1801, -1086, 516, 1470, 920, -584, -1663, -1384, 3, 1294, 1305, 0, -1386, -1537, -360, 1048, 1437, 516, -877, -1471, -712, 758, 1548, 927, -437, -1250, -836, 434, 1399, 1218, 35, -1039, -968, 162, 1245, 1284, 296, -781, -998, -162, 965, 1302, 495, -689, -1093, -392, 711, 1166, 571, -549, -1187, -744, 407, 1111, 669, -520, -1297, -978, 89, 961, 814, -282, -1335, -1304, -187, 929, 998, -11, -1168, -1432, -532, 784, 1288, 485, -890, -1490, -749, 627, 1421, 976, -348, -1344, -1036, 339, 1525, 1415, 145, -1086, -1182, -52, 1289, 1677, 686, -784, -1338, -469, 959, 1651, 1004, -400, -1317, -952, 394, 1448, 1194, -130, -1284, -1254, -143, 997, 1177, 171, -1092, -1478, -595, 657, 1090, 342, -847, -1413, -888, 272, 1001, 600, -549, -1321, -970, 119, 940, 776, -184]
985a84q62N7R87R82M6r10r42q0Q40R95K85p06j081l65P11J130M38o20j116n80
1005i75M88J132P37m06j219q67K95J115R25j30j104j121j01J021J197K24j002
1022B09j284m08P85J289O19o37j386q09M97J354R46l15j239j038N8J180J217J68
1040A206j063j268k48R30J292M96o84j290o39N81J309P92m17j177q34K17J097
1057C00R60k1j034j055m8R40R98J67p72j049l76O73J057M20o49j049n15M80R70
1076C97N80l90j026p05K80J013P05k38r65p86Q5R09R03L5r36r47j01Q75J012K48
1096I48p49j053l91P12J169N74n95j167o20M76J164Q24k51j128r83J37J158J073
1114A298L0j017j129k52Q79J241M42p98j303n76O22J202P13m32j217r17K20J154
$$ y = [-184, -1046, -989, -2, 980, 1026, 116, -826, -906, -66, 929, 1214, 508, -573, -938, -227, 903, 1341, 721, -395, -975, -487, 645, 1382, 976, -243, -1110, -815, 300, 1225, 1095, -9, -1130, -1231, -210, 987, 1211, 209, -1075, -1483, -698, 591, 1210, 573, -813, -1622, -1125, 229, 1175, 860, -379, -1417, -1359, -179, 1038, 1206, 143, -1125, -1373, -443, 849, 1345, 661, -629, -1268, -687, 622, 1414, 997, -180, -1014, -797, 300, 1260, 1239, 205, -850, -898, 42, 1040, 1207, 435, -614, -990, -317, 740, 1160, 511, -538, -1053, -573, 397, 977, 587, -439, -1144, -864, 149, 854, 616, -349, -1135, -1050, -141, 762, 797, -139, -1086, -1187, -312, 700, 948, 199, -854, -1245, -533, 636, 1210, 615, -552, -1172, -696, 468, 1292, 1041, -87, -1070, -933, 225, 1298, 1328, 311, -818, -1070, -191, 1050, 1492, 694, -609, -1185, -563, 639, 1352, 920, -297, -1214, -994, 160]
1132A60R87j38j082j035j30Q93J099K90q28j163m20O96J119M98n12j065o41L75
1150h97J070P70k70j005p43J73R37Q28J1q15q77o0Q24R35J70p22q76k62O47R56
1170G94L72n53j000m55N40R68M97m18r72o58K74R90P37k42j032q38R2R08Q75M9
1190I28q91j041k32Q35J068L01p30j099m89N60J138O82m38j181p57L44J101R09
1208A008r4j002r95n8R82J116K56q59j099l46P14J140N66n25j139o85M29J105
1226E14P56k53j013q57M2R46R25M3r02r65j78P29R37K82o50j000m41N40R72M51
1246H78m60r54n46L27Q96O27k14r26o78J72Q77P24p5p56p77m7P77Q96J41p17q61
1267f96j98O76R25L51n35r70m68N11J029N40l99r90o66K58R57Q08j37r72r41J1
$$ y = [160, 1147, 1009, -73, -1108, -1238, -345, 754, 1044, 216, -947, -1367, -671, 448, 946, 434, -631, -1272, -897, 173, 943, 673, -332, -1075, -902, 35, 863, 874, 59, -818, -878, -54, 881, 1051, 329, -547, -809, -162, 794, 1166, 613, -387, -842, -302, 666, 1163, 745, -227, -885, -611, 379, 1116, 874, -158, -996, -904, 4, 879, 928, 37, -1004, -1236, -401, 667, 968, 238, -861, -1350, -790, 348, 1030, 592, -589, -1346, -1002, 99, 1008, 914, -88, -1083, -1141, -159, 957, 1213, 354, -745, -1091, -377, 763, 1329, 804, -335, -1020, -591, 514, 1270, 1017, 4, -853, -811, 135, 1060, 1103, 201, -764, -942, -213, 724, 1006, 356, -644, -1085, -545, 427, 878, 418, -536, -1082, -755, 141, 768, 554, -372, -1050, -878, -1, 723, 648, -108, -885, -932, -155, 741, 882, 165, -696, -894, -218, 707, 1058, 523, -447, -915, -404, 625, 1165, 766, -224, -890, -632, 325, 1133, 996, 24, -917, -906]
1287i06Q93R41J35q04j047l56O79J103M61o31j095o05M34J052P35k51j061q54
1305a177J35R87R19K6q57r63j85P61J053L51o41j051m11N44J014N60l61r68o59
1324i23K64R68O98j39q84p53L2P64Q13J04p39q63j72O49Q37K35n77q47l67M55
1344d45Q82M36m51q81m89L48Q23N75k30q37o77J57Q53P23n7p97p75m0P36Q84J96
1365I34p03r25k78O44R67L96n14r60n54M05J009O76l11r88p50J58Q99Q48Rq64
1385I8r55j62P84R83K67o56j013m41N26J009N83m18j021o56K77R37P43j01q63
1404g9q23j5Q34Q74J24p00q82k35O08Q83L90m95r01m48M20Q74N18l19q29n73J73
1425f01Q06O43j22p76o93L7O95O92N6o46p80j76O12Q08K15n76q07l08M55Q20M53
$$ y = [-906, -13, 928, 1063, 259, -788, -1144, -465, 638, 1099, 468, -627, -1232, -798, 254, 989, 738, -323, -1177, -1042, -55, 864, 890, 33, -930, -1115, -354, 699, 1050, 409, -642, -1053, -509, 505, 1065, 704, -264, -923, -659, 309, 1007, 868, -16, -769, -737, 27, 840, 944, 205, -658, -830, -181, 656, 891, 314, -533, -900, -445, 437, 873, 422, -459, -948, -600, 223, 798, 568, -269, -946, -789, 64, 787, 730, -67, -842, -882, -146, 738, 934, 231, -694, -972, -328, 639, 1035, 521, -439, -993, -588, 421, 1097, 786, -202, -952, -794, 105, 953, 962, 98, -857, -1019, -235, 748, 1015, 359, -654, -1095, -569, 440, 1023, 605, -416, -1072, -795, 142, 885, 784, -79, -902, -917, -83, 791, 915, 215, -667, -902, -294, 589, 979, 484, -417, -865, -445, 429, 947, 628, -201, -774, -601, 205, 848, 726, -50, -743, -706, -11, 681, 737, 91, -689, -865, -253, 555, 770, 194, -613, -921, -466, 354, 807]
1446H07m07q70n14L43Q72N92k18q07o82R3Q42P93J4p74q23r3P04Q88K82o18r30
1467e06l85N30R65M97m28r35o23K66Q97P42j37r24q18NQ10Q22J23p14r24k95O12
1488d20R21L67n34r21m77L79Q74N86k38q66o64J71Q16P08l9p05p35o0O87P89K07
1509H46n92p83k21N53P58L49m11p72m11L64Q04M74k98p78n12J77P20N99j08p45
1529A3o81L0O74O78L7o65p41j94N64P90K48n66q39l50M50Q21M51l42q57n70K49
1550h00Q70O59j66p94o76J8P67Q19J44o83q54j94O34Q83L58m55q79m58L74R25
1570D92N72k77q59o30J59P85P13j4p59p85j17O71P77J69n89q15l23M26Q08L99
1590H03m08q35m80K89P44N07j89p23o07P8P07O33po48o54m9N86O99J84n21p06
$$ y = [807, 400, -470, -984, -641, 231, 823, 605, -202, -884, -791, 51, 844, 858, 84, -739, -832, -128, 760, 1042, 424, -506, -891, -361, 604, 1101, 673, -262, -885, -619, 278, 1020, 883, -41, -859, -854, -44, 778, 901, 187, -737, -1032, -420, 501, 868, 334, -587, -1064, -685, 189, 775, 537, -329, -993, -822, -6, 702, 663, -42, -777, -837, -150, 639, 846, 254, -529, -750, -197, 561, 910, 499, -273, -684, -320, 484, 958, 660, -118, -630, -453, 267, 866, 758, 13, -668, -638, 36, 714, 751, 86, -655, -849, -285, 505, 753, 187, -652, -1002, -552, 269, 720, 378, -479, -1049, -800, 70, 729, 563, -231, -907, -889, -122, 697, 841, 158, -696, -890, -256, 627, 985, 530, -349, -807, -433, 492, 1064, 787, -72, -702, -543, 242, 955, 941, 182, -603, -720, -49, 728, 897, 308, -507, -830, -404, 404, 803, 395, -440, -920, -631, 113, 620, 431, -292, -899, -821, -114, 519, 512, -136, -790, -839, -253, 446, 630, 109, -597]
1611e97k18N22P43L09l92p01l76L54P71M84k68p37n16J98P34N70o8o97o70k9O79
1632I5P16P3o32p61k27N18P79L26m85q57m46L73P99N10k96q06o11J16P75O98n5
1653F02p37p31p3O56P71K22n56q07l19N05Q48M06l56p85m67K55P89O01j36p26
1673c8o10O8O81O74N5o04o98j43N49P12K34m95p30k95L76P04L71l30p34m54K39
1694d68O98M48j71o71n51P4O12N95j0o26o42n3N62O47J44m80o99k57M77P31L16
1715F76l94p14l74L18P22N17k05p16n62J51P15O23k6o42o59q9N95P49J98n67p56
1736d40k64M43P63L78l49p84m99K59P61N51j87p22o33L5O54O69P4o30p33j56N38
1757b72P04K61m45p27l63L66P36M26k72p16m70J91O80N34p8o26n89K9O15O15O1
$$ y = [-597, -815, -293, 450, 759, 367, -334, -710, -356, 415, 899, 631, -106, -622, -424, 310, 880, 812, 115, -555, -584, 95, 811, 884, 252, -509, -736, -218, 561, 887, 402, -455, -901, -528, 271, 781, 485, -321, -932, -816, -41, 657, 602, -135, -866, -939, -283, 488, 710, 154, -653, -972, -467, 381, 787, 431, -354, -821, -566, 223, 824, 688, -38, -648, -580, 101, 775, 830, 226, -472, -615, -66, 646, 880, 385, -345, -640, -264, 440, 811, 481, -253, -707, -468, 230, 678, 507, -164, -715, -641, -29, 566, 556, -70, -712, -765, -203, 444, 588, 108, -591, -848, -371, 360, 676, 282, -432, -806, -488, 234, 751, 546, -170, -732, -581, 134, 757, 731, 89, -570, -659, -64, 685, 883, 316, -440, -704, -261, 502, 880, 531, -253, -752, -493, 268, 819, 632, -90, -723, -688, -34, 635, 709, 79, -654, -810, -272, 432, 693, 248, -479, -842, -476, 260, 686, 414, -302, -772, -581, 99, 633, 555, -71, -660, -631, -16, 599, 660]
1778F60n41o05j47M68O65K38m30o74k65L74O29L51k80o56m32K18O59M71j69o33
1798i9n21O2N89N75K6n79o47r0N30O53J74m72o76k93L90P09L92l40p19m33K38
1819e31O99N14j27o71o10N2O42O61N1o00o38j74N31O92K86m39p51l15L56P03M35
1840G66k77o71n19J64O83N52n9o64n78j8N57O27J12m95o67j99M45O55K73l80o48
1861c41l40K73O49M14k01o45m62J49O13M74m5n67n43j9N30N90P3m88n92j51M28
1882b01O02K55l76o53l15L41O44L54k50o08m46J54O37M98r1o24n47J2N82N96P2
1903F36n11o44j65M67O73K51m10o66l27L19O79M23k40o77m78J52O40N49n3o04
1923A4n91n2N42O52J20m88o62k07M11O57L04l38o62l93K75O49M25j87o20m70P4
$$ y = [660, 119, -486, -633, -165, 500, 738, 308, -366, -631, -257, 372, 723, 443, -213, -645, -427, 232, 703, 534, -99, -620, -558, 31, 606, 632, 53, -594, -684, -154, 499, 673, 201, -475, -768, -378, 331, 723, 383, -336, -769, -531, 168, 682, 555, -116, -726, -674, -32, 629, 680, 80, -558, -732, -201, 491, 777, 338, -413, -728, -372, 331, 766, 489, -182, -701, -537, 146, 698, 639, -25, -603, -621, -64, 563, 675, 180, -487, -686, -241, 414, 687, 307, -341, -681, -408, 241, 655, 454, -191, -653, -504, 109, 583, 538, -29, -572, -591, -61, 529, 602, 114, -478, -629, -201, 401, 656, 280, -373, -688, -347, 297, 651, 401, -207, -653, -499, 138, 636, 545, -79, -626, -614, -32, 564, 636, 125, -519, -684, -217, 456, 707, 297, -369, -696, -377, 302, 725, 485, -192, -670, -518, 122, 671, 618, 14, -577, -629, -87, 565, 685, 197, -465, -672, -261, 396, 700, 362, -300, -693, -418, 231, 656, 469, -151, -621, -547]
1944e47N77N28ln50n46p3M83N83J34m18o02k29L82O16K85l32n97l28K50N92M02
1965F07j59n86m50J12N86M75l7n33n24l9N05N62J28m66o01j78M11N99K52l29o35
1986c00l33K69O29M00k10o20m57J16N80N18k2n74n84m5N28N94J17m48o31k38L92
2007c19O64K94l23o45l75K60O09M46j35o02n02P3N66N34K4n18n47j23M76O07J92
2028F56m08o09k50L37O13L14k71n76l87J93N85M30j27n68m63N8N09M97J6m81n35
2049d67r5M37N43J44l89n57k14L19N76K89k91n96l29K29N69L79j38n57m47O6N44
2070A5N04j6n02n21o3M51N79J51m14n89k24L70O14K83k84n94l55K07N97M40j49
2091E00n83m73P0N29N31L1n06n69j08M41N82J83l82o02k56L08N83L41k38o10l86
$$ y = [-547, 30, 558, 555, 5, -541, -614, -131, 452, 586, 168, -434, -663, -281, 335, 620, 288, -309, -637, -387, 205, 607, 448, -138, -588, -476, 110, 585, 548, 15, -509, -548, -43, 519, 647, 181, -420, -598, -187, 412, 664, 335, -300, -633, -364, 265, 665, 455, -165, -622, -506, 74, 592, 570, -4, -588, -633, -105, 489, 606, 158, -473, -711, -319, 345, 639, 316, -329, -704, -444, 165, 611, 476, -126, -628, -555, 11, 545, 569, 51, -496, -619, -143, 464, 656, 248, -361, -611, -274, 339, 653, 382, -194, -581, -388, 197, 627, 500, -68, -531, -473, 36, 533, 549, 68, -467, -562, -125, 418, 562, 173, -384, -598, -279, 297, 586, 295, -301, -630, -401, 168, 547, 409, -148, -595, -529, 15, 519, 503, 1, -520, -583, -132, 447, 598, 184, -405, -629, -259, 355, 638, 354, -240, -595, -388, 209, 649, 500, -83, -556, -486, 43, 574, 605, 99, -470, -578, -137, 445, 628, 246, -356, -612, -304, 279, 620, 382, -228, -614]
2112f14J57N63M44j01n31m76PM85N24O5m61n36j17L79N58J99l26n64k64K93N71
2133B55L07k24n35l59J61N24M19r4n14m49N2M78M85L0m28n23j08M06N53J59l59
2154B36n47k41L10N30L03k28n79l58J82N46M07j19n24m52K3M79N06M6m55n45j15
2175e95M08N51J73l41n58k80L03N78L24k22n59l86J54N33M37n9n05m99RN00M90
2196D56Q1m10n38j47L68N77K12l35n35k70K61N38L22j71n36l93J29N07M22n6m80
2217Bm60j7M43M79Q0m15n13j37L62M96K16l16n36k66K59N28K97k12n11l53J50
2238d24M82M10o2m84m30rM60M86N2m03m93j23L52N36K09l12n39k64K71N29L31
2259E75j85n18l76J13N18M20m2m83m66j1M25N02J04m09n30j68L54N32K17k90n46
$$ y = [-614, -457, 106, 550, 449, -82, -558, -551, -66, 458, 523, 62, -474, -591, -212, 346, 545, 219, -345, -609, -316, 255, 562, 338, -197, -556, -395, 129, 548, 454, -60, -509, -457, 21, 506, 536, 108, -415, -523, -117, 436, 595, 236, -311, -552, -242, 288, 591, 363, -216, -574, -392, 154, 561, 442, -82, -534, -511, -32, 474, 520, 65, -480, -595, -187, 364, 537, 196, -362, -642, -339, 239, 563, 341, -218, -604, -450, 83, 520, 461, -44, -543, -534, -34, 456, 537, 127, -411, -558, -190, 387, 599, 264, -271, -541, -280, 258, 580, 409, -127, -520, -391, 116, 538, 482, 2, -458, -475, -32, 447, 527, 112, -401, -538, -176, 320, 536, 220, -316, -582, -323, 205, 502, 290, -221, -574, -424, 58, 468, 406, -78, -508, -517, -57, 429, 481, 78, -415, -538, -186, 350, 559, 247, -292, -556, -285, 244, 575, 390, -128, -504, -391, 127, 547, 505, 22, -444, -455, -30, 472, 576, 167, -363, -531, -177, 355, 572, 282, -264]
2280b64k88K26N15L61j84n10m03Q8M73M40j7m59m78m7M20M92J16l73n08j63L07
2301b56N31K31k57n19k74K15N06L29j48m57l92Q1M77M24j9m24m47l6L99M56J05
2322E25l43n00j64L20N05J97k62n00k84K13M94L23j44n04l82R0M63M02j4m37m57
2343d59n4M09M99R5l76n03j65L22N04K33k51n26k87K15N07L33j25m80m06Q1M84
2364E0M44rm44m61n8M05M84J25l28m94k15L10N02K41k37m94l10J71M85L49j18
2385C98m65m10O0M32M30nl99m54q8L65M78J24l22m81j80K56M85K51k31m64l09
2406e29J81M62L40j15m54l50N0M22M20J8l98m35o8L77M55J30l14m93j78K77M87
2427B85K47k35m81k88J73M57L45j11m61l81N1M21M25Km09m44r5L72M60J57l32
$$ y = [-264, -552, -326, 189, 550, 366, -144, -547, -459, 14, 454, 437, -22, -500, -547, -127, 365, 481, 108, -400, -563, -256, 275, 506, 249, -270, -544, -329, 177, 506, 358, -99, -491, -410, 67, 491, 472, 48, -399, -435, -36, 420, 525, 182, -318, -482, -162, 343, 540, 278, -222, -506, -293, 201, 524, 380, -124, -506, -416, 47, 449, 435, -2, -459, -513, -104, 395, 490, 114, -389, -554, -232, 272, 505, 254, -272, -559, -344, 163, 496, 371, -109, -515, -434, 50, 494, 485, 41, -420, -478, -73, 411, 536, 208, -286, -501, -191, 311, 552, 315, -179, -489, -318, 167, 516, 398, -67, -477, -417, 15, 445, 440, 41, -413, -501, -136, 342, 466, 144, -337, -517, -261, 224, 475, 244, -220, -529, -348, 114, 454, 339, -115, -465, -415, 7, 427, 445, 47, -388, -456, -79, 376, 506, 192, -301, -479, -202, 285, 532, 297, -184, -472, -299, 158, 503, 392, -69, -450, -399, 22, 447, 449, 40, -404, -499, -127, 333, 490, 158]
2448A58m84k06K56M92K62k08m83l20J58M64L71j01m40l72J3M18M20N2l77m47j01
2469d75L55M68J47k71m72k11K18M82K70j83m58l10J40M20L63p2m34l78mL99M20
2490D14K3l64m22r8L09M48J60k99m68k09K42M56K52j85m46l05J29M39L46q0m22
2511h0l82K4L95M11N9l59m48r1L34M50J64k84m58j99K23M66K71j77m66l01J36
2532c12M36L50m3m39l98PL87M34N0l56m42j12K92M51J83k67m74k16K10M40K79
2553D60j62m37l30Q9M32L61m6m13l81j4L68M14Q7l47m42j19K93M60J81k52m35
2574b33k20J84M39K91j52m31l19J02M35L37m6l84l88j4L58M12P5l46m28j20L10
2595a38M19J85k61m33k31K05M38K74j64m17l04O7M25L62k8m15l88j0L60M07P1
$$ y = [158, -326, -532, -276, 216, 478, 270, -213, -533, -375, 89, 460, 359, -81, -453, -440, -22, 398, 450, 73, -374, -475, -120, 348, 495, 224, -248, -459, -241, 241, 511, 328, -130, -440, -300, 120, 483, 411, -23, -401, -405, -6, 414, 437, 73, -349, -447, -138, 310, 470, 171, -297, -506, -264, 192, 444, 259, -187, -492, -363, 76, 422, 342, -80, -462, -438, -43, 368, 427, 68, -380, -471, -137, 313, 477, 193, -265, -464, -241, 225, 496, 319, -147, -448, -312, 124, 474, 431, -8, -406, -399, -12, 422, 472, 116, -326, -438, -146, 305, 488, 221, -253, -469, -259, 181, 460, 298, -139, -469, -380, 52, 413, 367, -46, -427, -441, -73, 341, 428, 81, -361, -480, -187, 273, 454, 202, -233, -453, -269, 170, 461, 309, -122, -441, -339, 96, 433, 387, 3, -385, -399, -41, 371, 446, 100, -328, -448, -138, 281, 466, 205, -228, -459, -254, 184, 458, 294, -123, -427, -360, 65, 427, 399, -16, -404, -414, -54, 353, 424]
2616D24l12m41j30K94M29K11k69m49k15J90M40K87j39m45l13R1M08L48l1l63l80
2637c65n6L48M21P7l10m35j26K70M26J85k19m24k46J71M29K88j36m11l09P1L84
2658C3L63pl83l77l0L37M00R8l02m15j33K45M40J92k29m22k35J84M14K72j16m15
2680h6l18O8L95L46l1l55l61o0L16M08R0k95m23j41K71L90K02k13m14k48J61M20
2702A22K91j28l98l10O0L77L60ll58l84n2L33M08R7k76l94j60K43M06K23k11m24
2724a78k36J68L98K83r4l87l39M5L78L57nl56l66o6L08L91J15k71m16j57K25M02
2746A99K09j90m02k46J28L98K83r6l91l07N2L51L46J6l24l70o8L21L82J16k74
2767A33l86j52K39L94K00j75l90k48J39L92K85r0l77l30L3L54L62Pl32l70o9K95
$$ y = [424, 112, -329, -459, -165, 264, 475, 206, -243, -458, -268, 172, 459, 320, -125, -438, -347, 61, 409, 378, 15, -365, -421, -73, 348, 425, 115, -320, -446, -176, 250, 435, 216, -208, -454, -283, 146, 434, 298, -113, -422, -351, 33, 396, 389, 6, -371, -401, -64, 336, 434, 132, -283, -416, -171, 269, 461, 232, -190, -425, -241, 173, 445, 329, -86, -404, -336, 59, 405, 374, 19, -342, -402, -86, 322, 412, 117, -306, -447, -176, 214, 416, 203, -211, -459, -298, 122, 413, 285, -113, -423, -363, 14, 374, 371, 13, -371, -423, -90, 318, 415, 139, -255, -415, -172, 234, 457, 246, -178, -414, -246, 152, 435, 341, -46, -385, -340, 38, 395, 390, 34, -332, -398, -90, 301, 416, 145, -271, -428, -203, 199, 408, 218, -184, -430, -302, 96, 379, 283, -108, -415, -363, -12, 334, 350, 26, -344, -412, -91, 291, 407, 133, -253, -405, -166, 228, 428, 253, -137, -385, -246, 146, 431, 341, -36, -366, -333, 21, 383, 390, 58, -312, -381, -86]
2789h6L90J18k66m12j61K17M04J96j82l83k68J28L86K91q1l66l24K2L58L41K1
2810C43l04l68r0L08L68J41k38l98j76K22L84K24j53l98k51J19L75L06q1l38l22
2831c27J1L33L44M0l21l46r4K82L70J06k25l97j55J89L81K09j72l76k51J04L60
2852F5K95p1l55l22K8L20L31L7k94l58r7K76L93J22k27l86j70J93L91K21j53l81
2874a42k44J17L63K88n5l43l11OL13L45O1l18l55q1K64L49J60k21l96j67J71L77
2896A81K27j43l76k49R5L43K85m4l30l30OL12L30M6k93l54r0K47L50J62k27l69
2918b21j80J82L59K19j32l49k63P4L49K92l8l26l09NK95L28O9k75l60r5K57L67
2940B48J38k11l48j87J56L71K17j27l36k70R3L28K86k3l30l19j2L07L25O4k79
$$ y = [-86, 304, 422, 156, -256, -417, -200, 204, 400, 218, -165, -433, -305, 81, 372, 291, -75, -399, -377, -19, 322, 343, 39, -329, -419, -111, 257, 398, 160, -238, -414, -192, 192, 416, 263, -135, -386, -267, 108, 414, 333, -5, -327, -316, 17, 361, 401, 80, -266, -360, -78, 292, 398, 173, -224, -379, -190, 191, 400, 228, -148, -399, -295, 65, 360, 289, -66, -388, -360, -40, 291, 328, 34, -324, -421, -145, 248, 370, 143, -243, -413, -220, 171, 392, 239, -142, -386, -269, 94, 382, 327, -16, -327, -321, -8, 337, 398, 80, -275, -356, -92, 257, 417, 196, -200, -367, -196, 181, 408, 265, -111, -360, -265, 78, 363, 319, -11, -341, -335, -23, 307, 353, 60, -294, -384, -137, 213, 375, 148, -221, -401, -219, 140, 359, 227, -122, -385, -311, 38, 330, 292, -34, -343, -338, -43, 285, 354, 79, -281, -376, -119, 248, 386, 175, -173, -360, -204, 167, 384, 257, -79, -349, -256, 72, 358, 335, 5, -314, -326, -19, 306, 370, 91]
2961I1l42j12K35L59J43k02l51k08J61L58K27j22l53k51N5L38K87k7l12l06j6
2982c48K81L26O6k36l62j16K35L46J62k00l48j85J56L58K23j02l38k62P6L17K74
3003C23Rl08l16k2K92L24P4k50l38j07J97L34J64j77l47k11J54L37K22j07l23
3024g6k63M9L18K85ol04l14m0K75L19Q4k47l30j25K17L45J59j76l55j81J43L35
3046A12K36j03l17k71O4L09K89lk93k95n5K60L34Q2k48l18j20K08L13J74j55l43
3068a40k00J25L26K36r4l02k74M3K97K81J0k88k98m6K55L12R3k35l15j27J81L38
3090A78J73j64l30j88J10L21K36q1l09k65M8K99K69Jk79k79n8K41L29O8k06l30
3112b16j19J81L21J60j34l37j82R2L23K25o0l12k41J8K68K97J2k55l23l5K32L18
$$ y = [91, -251, -363, -128, 231, 374, 172, -179, -387, -226, 132, 359, 237, -116, -367, -312, 26, 313, 286, -26, -332, -348, -67, 259, 325, 89, -273, -389, -154, 192, 354, 154, -194, -379, -223, 135, 358, 256, -82, -344, -268, 49, 323, 332, 24, -292, -314, -22, 302, 376, 126, -212, -319, -122, 212, 376, 199, -148, -359, -205, 132, 354, 247, -76, -339, -290, 28, 313, 307, 3, -311, -351, -76, 243, 327, 80, -250, -375, -158, 187, 346, 170, -185, -366, -223, 112, 348, 245, -72, -343, -279, 30, 319, 316, 23, -272, -327, -67, 267, 349, 101, -217, -337, -129, 184, 358, 203, -140, -340, -215, 111, 347, 253, -49, -323, -280, 17, 298, 308, 20, -278, -324, -69, 243, 336, 101, -214, -341, -160, 178, 351, 187, -143, -331, -221, 100, 336, 255, -54, -319, -271, 28, 297, 298, 19, -260, -318, -77, 252, 320, 114, -216, -335, -154, 167, 327, 193, -144, -326, -234, 89, 314, 254, -58, -299, -281, -13, 284, 296, 41, -282, -317, -85, 233]
3134B33R9k13l23j28J77L16J81j50l10k08J08L05K36o6l04k52K3K84K78J4k52
3155D8l00n8K37K92J02k04l10j37J63L13J70j27l11k08Q9L09K34n8k84k63K3K57
3177b3K89L1k67k76q5K30L06J11k09k96j42J63L17J66j21l08j98Q9L03K25m3k84
3199b2k53J1K55K90L1k52k88p1K17K98J06j89k98j58J52L22J78j20l08k20P7L01
3221E9K37n6k66k59KK47K83M4k32k86r6K19L14J05j91l04j30J42K96J93j05l02
3243h6k05P2K77K48m8k59k69kK45K95L1k30k87p9J94L01J09j55l22j49J43K94
3265A18J90j09k98k08O2K76K52m5k53k68NK34K72N3k35k78p8J86K95J34j71k99
3287a65j50J38K92J92j03k93j96O2K69K24j6k47k63j6K52K58N2k07k88q0J88K83
$$ y = [233, 332, 119, -204, -332, -155, 161, 342, 192, -118, -326, -218, 87, 323, 257, -47, -299, -276, 8, 286, 300, 48, -252, -310, -73, 219, 321, 117, -193, -330, -167, 146, 316, 189, -122, -330, -241, 68, 302, 244, -40, -303, -280, -23, 266, 297, 30, -246, -331, -101, 205, 316, 107, -189, -331, -168, 149, 315, 194, -114, -312, -223, 80, 305, 262, -22, -275, -264, -9, 281, 312, 60, -228, -299, -82, 216, 322, 133, -165, -323, -171, 151, 329, 209, -99, -319, -242, 59, 296, 240, -26, -285, -283, -36, 247, 291, 59, -227, -323, -104, 210, 315, 124, -180, -310, -168, 128, 321, 216, -86, -291, -219, 58, 306, 258, -1, -270, -272, -27, 268, 299, 69, -218, -297, -103, 198, 307, 152, -170, -319, -176, 118, 308, 199, -99, -307, -245, 31, 283, 238, -15, -283, -278, -44, 228, 281, 46, -232, -310, -124, 171, 305, 134, -165, -315, -177, 115, 307, 204, -89, -285, -223, 46, 270, 254, 7, -256, -272, -20, 238, 290, 83, -205, -285, -97, 186]
3309A86J18j55k90j64J35K81J97j03k72k22M8K73K29pk57k61k4K55K63M4j98k79
3331b03j03J95K75J35j62k82j59J19K87J83p0k94k05N4K53K49k2k49k42l1K20
3352e2K70O1k00k71r3J71K78J36j49k76j75J22K81J78o7k65k22L2K68K43j4k36
3374B0k62l7K37K59O4j91k73j15J75K83J30j38k80j68J19K63J91p5k50k37M4K51
3396A0K46k3k27k46l2K08K69O9j96k68j06J73K59J43j35k68j71J00K83J86o1k71
3418e8k13K5K50K31J3k16k65l1K06K71P0j85k61j01J48K66J41j28k67j57R2K64
3440I5J80m7k45k31J1K53K34Jk20k35n4J91K64Q8j88k66j12J58K52J52j24k66
3462a09j72Q3K63J93m6k62k08K0K31K29K9k21k47n1K11K48P1j70k62r2J36K62
$$ y = [186, 304, 149, -141, -305, -170, 111, 308, 205, -67, -289, -241, 32, 261, 254, -3, -264, -288, -33, 230, 274, 76, -203, -306, -111, 164, 299, 137, -145, -304, -185, 102, 285, 215, -79, -284, -230, 23, 272, 250, 1, -241, -272, -52, 218, 279, 79, -192, -285, -114, 164, 300, 151, -125, -300, -178, 103, 281, 214, -51, -273, -241, 27, 270, 256, 20, -242, -279, -42, 217, 281, 90, -183, -298, -123, 160, 290, 152, -128, -296, -177, 86, 277, 202, -48, -285, -241, 10, 256, 233, 6, -240, -272, -64, 205, 274, 78, -190, -296, -123, 136, 279, 144, -124, -295, -195, 88, 274, 213, -58, -271, -246, 4, 235, 248, 32, -233, -264, -58, 213, 283, 98, -163, -264, -116, 150, 291, 163, -104, -261, -169, 95, 275, 228, -17, -248, -237, 16, 250, 251, 31, -204, -258, -67, 197, 285, 97, -169, -281, -123, 129, 281, 157, -109, -281, -198, 65, 258, 212, -50, -258, -238, -7, 222, 251, 30, -217, -268, -57, 191, 262, 92, -170, -262, -126, 136]
3484A36J46j21k68j61Q2K42K05n0k36k22K1K30K28J8k12k38n0J89K39J12j64k82
3506a56j15J52K50J45j09k58j71Q8K38J96m2k45k13PK38K09L4k05k47n3J78K52
3528A73R4j64k65j17J44K48J52j02k63j66P1K37K04l3k47k04NK17K26L1j96k49
3550b04n5J77K58Q0j60k42j10J29K56J47j00k63j53O3K45K00l6k33k17nK30K24
3572B31L0k02k36p4J78K49R0j53k46j04J02K43J42r2k40j71N0K50J91l5k27k09
3594b33MK03K19L6j91k40o7J73K47J05j61k49j12J01K71J38q6k38j80O1K43J91
3616B35l0k14k15lK06K22M6j96k28n9J71K26J23j57k52j12J06K56J28p0k42j76
3638b35N9K29J82k3k20k07j1K04K20L7j90k27q8J77K27J02j33k52j17J08K41J50
$$ y = [136, 282, 161, -107, -268, -186, 56, 261, 211, -25, -247, -226, 4, 232, 250, 38, -200, -250, -61, 178, 290, 126, -156, -271, -119, 131, 276, 167, -91, -262, -174, 64, 260, 218, -27, -240, -233, 5, 214, 248, 43, -204, -257, -79, 173, 267, 103, -162, -279, -135, 113, 265, 163, -100, -266, -195, 42, 246, 213, -34, -238, -233, -16, 210, 241, 45, -204, -259, -82, 176, 256, 96, -146, -256, -127, 129, 276, 176, -87, -240, -177, 68, 268, 232, -1, -218, -223, 7, 231, 261, 59, -177, -251, -73, 176, 266, 113, -133, -237, -135, 108, 250, 158, -82, -253, -203, 47, 238, 203, -24, -233, -229, -26, 193, 229, 38, -202, -269, -96, 151, 256, 95, -154, -266, -165, 106, 244, 158, -80, -260, -199, 44, 235, 205, -9, -224, -227, -21, 201, 247, 51, -177, -236, -65, 161, 284, 127, -125, -237, -131, 125, 253, 183, -59, -235, -176, 53, 235, 212, -8, -215, -226, -22, 198, 235, 45, -182, -270, -93, 134, 236, 103, -149, -266, -158, 83, 233]
3660B33p1k34j81N5K14K04j8k22j94j5J98K16M8j77k24p7J60K23J09j22k45j19
3682b39R4K38J61q4k11j85M6K16K00j7k07k11j2J92K13L6j70k19q5J61K11J24
3704B52j31k44j08Q8K23J55p4k28j68L2K27J88j5j97k19k5J99K29L3j52k31p1
3726b37J33K40J05j16k36j31R8K34J48o9k20j71L1K32J74Lj99k13j6J70K22O5
3748B47j69k34o6J24K36J09j17k31j41R4K28J53o4k18j93M0K18J89Ok03k09k1
3770b22J78K09M4j47k23q4J32K22J20j12k14j40Q2K15J69n6k14j79K1K12J88k
3792A99j79k16nJ58K14N6j45k27p8J28K23J08j10k11j38P8K15J60n0k11j91M3
3814a79J99J78j1j66k07k9J67K13O3j59k12q9J25K17J14q3k26j33P2K10J59n6
$$ y = [233, 162, -72, -253, -198, 16, 220, 202, -20, -214, -229, -31, 185, 233, 56, -168, -245, -85, 138, 247, 125, -120, -239, -145, 93, 254, 170, -41, -226, -180, 36, 236, 219, 12, -199, -211, -19, 194, 230, 60, -159, -244, -83, 128, 252, 121, -123, -231, -143, 80, 235, 161, -67, -235, -203, 24, 212, 197, 0, -219, -244, -45, 184, 217, 65, -166, -237, -104, 136, 241, 125, -111, -242, -144, 90, 238, 169, -51, -222, -191, 41, 215, 218, 19, -194, -210, -40, 182, 247, 78, -156, -222, -98, 138, 247, 130, -101, -242, -148, 80, 233, 169, -49, -242, -202, 16, 205, 211, 8, -201, -222, -44, 165, 209, 62, -161, -245, -113, 109, 229, 117, -97, -237, -155, 60, 229, 173, -41, -220, -199, 13, 201, 199, 20, -196, -201, -43, 171, 227, 82, -145, -223, -95, 128, 236, 126, -85, -223, -145, 70, 230, 180, -31, -222, -179, 20, 198, 187, 21, -186, -215, -48, 165, 228, 69, -143, -232, -107, 110, 224, 141, -85, -218, -146, 64, 223, 167]
3836A67k04j64J1K01J83K2j89k09l5J72K16N3j34k27q9J17K29J08r9k06j41Q3
3858a35K02J57n4j85j95J9J86J98J4j76j97m8J52K14N9j41j97r7J17K19J01q3
3880A30k08j40O0K18J45l8k02j72K2J85J89J5j72j90n2J52K09N9j30k09r3J08
3902a14K14J22r0k05j43O3K01J67l4j98j74J1J69J80L7j68k07m3J44K06P7j36
3924G9j98r9J00K15J29r5j89j49O1J94J47l1j83j63jJ93J79J4j62j91n8J33K28
3947A53N9j18k07r8J06J96J20p9j94j40M9J94J56m8j63j65oJ63J94K6j59j86n3
3970b00J40K00P1j15k10r7Q4K08J27p5j93j48M7J97J61j9j87j70nJ73J74L1j48
3993D6j82o9J37K00P5r8k14r9J02J86J27p5j90j55N8J80J55pj89j59j3J57J79
$$ y = [167, -37, -201, -190, 11, 194, 216, 27, -182, -217, -45, 171, 224, 90, -137, -226, -109, 120, 228, 129, -77, -218, -135, 67, 224, 170, -15, -210, -191, -5, 193, 207, 31, -166, -214, -62, 152, 211, 70, -127, -224, -107, 112, 213, 130, -78, -218, -158, 60, 205, 167, -35, -207, -185, 0, 189, 204, 32, -158, -210, -58, 151, 210, 80, -129, -222, -114, 100, 222, 132, -73, -216, -153, 48, 215, 181, -17, -191, -180, -11, 169, 206, 38, -169, -212, -68, 138, 215, 79, -119, -218, -118, 97, 226, 131, -58, -207, -146, 48, 195, 164, -19, -182, -183, 10, 189, 203, 41, -150, -208, -75, 153, 212, 94, -113, -211, -105, 91, 211, 132, -62, -202, -153, 41, 197, 149, -14, -179, -185, -22, 172, 198, 39, -147, -200, -60, 140, 211, 96, -114, -211, -127, 81, 208, 133, -60, -208, -161, 36, 197, 178, -9, -179, -184, -11, 163, 194, 46, -136, -205, -68, 132, 207, 109, -105, -204, -102, 84, 211, 136, -54, -209, -151, 29, 184, 177, -12, -171, -184, -27, 152]
4016A52L7j49j86n5J14K11P1r9k00j14J00K01J10o0j87j51N9J76J52j4j74j62
4038a68lJ60J76L0j27j85p1J15K01P6j11j85j02Q1J90J18n6j91j41L3J92J51n
4061A78j74j80rJ54J79L0j36j79p0J26J97P3r5j86j11O9J85J20m9j83j39M7J70
4084A7J54j3j55j73lJ38J74M4j22j89n5R8K03P8q5j91j08O8J74J44n0j73j52J8
4108a59J82J47Rj68j72j2J42J81K5j18j79p5J10J80R2q0j99r1O1J79J25n6j70
4131d6j38K4J77J32Mj52j57k6J49J68L7j23j75o2J05J75J00q9j92j00O5J77J26
4154A79m2j68j48L2J56J68kj43j71j9J28J61N9j28j78p0J11J82Q6q2j77j01L9
4177a28J75J41m8j76j33J9J54J55Jj44j72k9J33J68N6j12j79o5P8J85R1p1j72
$$ y = [152, 189, 40, -146, -201, -87, 124, 195, 96, -104, -218, -118, 83, 193, 133, -54, -205, -146, 30, 182, 168, -6, -168, -171, -11, 165, 195, 68, -117, -188, -73, 128, 204, 93, -92, -194, -113, 77, 195, 139, -52, -193, -160, 32, 183, 178, 4, -176, -185, -31, 148, 178, 42, -137, -207, -81, 116, 189, 94, -92, -203, -134, 51, 171, 122, -61, -200, -153, 17, 171, 158, 3, -170, -173, -35, 139, 183, 61, -128, -183, -85, 118, 196, 111, -80, -188, -120, 54, 198, 148, -25, -177, -159, 23, 170, 179, 11, -161, -173, -31, 150, 175, 57, -122, -197, -87, 93, 185, 105, -94, -185, -124, 55, 180, 124, -46, -184, -160, 17, 149, 153, 1, -156, -182, -33, 135, 172, 49, -126, -188, -83, 92, 192, 103, -89, -189, -124, 53, 179, 137, -31, -179, -147, 9, 177, 175, 32, -139, -158, -30, 131, 190, 62, -116, -186, -75, 107, 193, 111, -66, -167, -128, 47, 188, 140, -36, -169, -150, 4, 159, 160, 16, -156, -185, -52, 116, 172, 60, -119, -184, -106, 79, 170, 99, -73]
4200g3j16N3J75J32l4j66j40J2J58J56Qj36j59l9J19J88M1j06j71p6R6J68R3p2
4224A11j68j15O0J66J30l1j59j48MJ63J42Lj28j58k4J06J71M8j06j82p6J00J58
4247F7J05o6j83j05N1J60J24k5j55j35J1J31J50K2j33j55n0J34J58N6r7j64o7
4270a66Q9J55R3o1j71j08N1J68J12j4j52j40lJ40J46L0j42j59l2J14J74M5r5j53
4294g9r0Q0J65Q7o1j62j05L7J69J29k4j51j37pJ30J69Rj37j53m1J10J70M6q2j70
4319i8q7R0J66Q9o0j55j14L8J60J26j4j56j24j6J50J38K3j14j53n1J06J72O0q8
4343H8j66r5J04J38J02n2j61j16L3J64J14Pj58j39qJ36J47K1j23j60m0J08J54
4366I8P9j07j49q3P4J51R6m8j60j07L5J41J32k5j35j39kJ26J57J0r8j62l7R8J50
$$ y = [-73, -189, -136, 39, 171, 137, -29, -169, -157, 1, 157, 165, 29, -130, -169, -50, 138, 179, 73, -98, -174, -78, 90, 183, 111, -57, -172, -112, 54, 184, 153, -6, -154, -150, 13, 155, 158, 30, -128, -152, -46, 125, 173, 67, -115, -191, -91, 67, 172, 106, -77, -182, -131, 29, 153, 128, -27, -162, -151, -20, 130, 152, 19, -136, -186, -52, 106, 162, 65, -99, -166, -77, 78, 171, 110, -61, -169, -118, 50, 162, 148, -4, -144, -147, -7, 139, 169, 27, -132, -164, -50, 124, 169, 74, -79, -169, -89, 76, 163, 102, -60, -165, -128, 41, 170, 146, -5, -142, -149, -19, 150, 159, 22, -131, -172, -62, 108, 154, 72, -98, -185, -95, 71, 160, 100, -55, -169, -131, 29, 155, 141, -15, -139, -155, -5, 133, 156, 42, -111, -162, -56, 116, 176, 88, -78, -173, -69, 69, 171, 119, -42, -158, -125, 39, 153, 160, 2, -137, -145, -9, 138, 159, 36, -124, -164, -56, 98, 177, 70, -79, -162, -88, 63, 159, 111, -49, -156, -121, 20, 152, 127, -8, -147, -149, -23, 134, 144, 46, -116, -153, -55, 95]
4391I5O7j03j30r3O8J48J21n7j48j22L5J47J23lj45j38oJ21J46L6j24j48l7Q4
4415f3J58P0q6j49q7O8J51R1n2j39j15L2J45J25j2j34j35j5J23J42L5j12j44n4
4439a57R5J49P1p7j59o6N1J52Q7k7j64r8MJ51J22Jj25j60J1J10J54J4r6j50n5
4464a62J04J40O0n6j40r0N2J43R7m0j29j20K3J29J25%j23j30k9J19J43L0j03j46
4488a03n3R7J45P1p6j40r5O0J39J04l4j35j26J9J25J32Kj22j38k1J17J36M1r4
4512E1j55n5Q8J48P2p1j53p3M1J46R5k8j23j23J4J25J32J0j30j33j2J08J47K9
4536A50j00j35o3Q9J33P1n6j45r5M9J37J05l7j26j08J0J18J23J0j21j24k5J01
4559c9J39M1j04j31o9Q6J41Q6p4j34q1L9J36R9k4j33j08JJ22J11L1j22j25k4R6
$$ y = [95, 162, 59, -71, -164, -96, 52, 173, 116, -32, -154, -119, 28, 151, 148, 3, -135, -141, -20, 126, 162, 38, -110, -147, -63, 95, 165, 79, -70, -157, -89, 62, 153, 101, -38, -153, -121, 24, 149, 137, 3, -132, -147, -24, 118, 153, 41, -103, -157, -62, 87, 158, 81, -78, -144, -93, 59, 146, 119, -45, -143, -139, 12, 134, 135, 10, -150, -139, -29, 125, 139, 43, -107, -162, -58, 82, 142, 86, -54, -144, -92, 51, 148, 108, -21, -141, -118, 11, 136, 136, 13, -117, -146, -27, 116, 146, 43, -103, -156, -59, 86, 157, 81, -59, -154, -94, 45, 149, 115, -20, -146, -127, -2, 130, 132, 10, -128, -149, -32, 104, 145, 51, -104, -159, -71, 77, 149, 78, -75, -148, -107, 39, 134, 106, -17, -140, -126, -1, 131, 141, 11, -122, -134, -26, 121, 150, 50, -85, -148, -59, 74, 145, 89, -56, -151, -102, 35, 140, 103, -23, -131, -121, -3, 120, 130, 9, -115, -140, -39, 100, 141, 37, -94, -163, -77, 64, 150, 76, -58, -139, -100, 36, 135, 111, -22, -130, -129, -7, 104, 135, 13, -112, -136, -40]
4584d0J35O8j00j50m6O9J25R2o5j37r3M7J29J00k1j29j07LJ13J28Oj12j20l2R2
4609d5J31N8q7j36p4P2J43P1m6j38j01N6J22J07k1j28j15OJ18J18K0j06j20l9
4633a34R0J39M6p1j41o6P9J29P9m9j33r4L1J32R7j8j28j15%J18J21Qr6j35k7R5
4659d3J32N0q3j28p0O6J24R1n2j35q4K9J26J06k5j22j14J2J05J15K3j09j20k8
4683a34Q5J29M9p3j24q2P1J25R3o6j18r0L3J28R6qj15j14KR9J24J5r5j17m8R0
4709d5J25N1p7j30o4O2J24Q4m3j27r9L5J19J01qj18j18jJ03J27K9j06j19k8P5
4734d8J28N2p1j24n9L8J25P7k5j13j12L4J21R4nj00j22j2J05J25J5r8j19l4P9
4759d9J16O4p0j28o6M7J36P9l0j30r6K8J04J23j0j17j24JJ13J09K2q9j20n2Q3
$$ y = [-40, 95, 163, 63, -87, -133, -64, 61, 153, 88, -49, -142, -95, 34, 134, 113, -16, -123, -120, -7, 121, 127, 15, -105, -137, -45, 86, 144, 57, -79, -153, -81, 62, 133, 87, -51, -152, -96, 26, 133, 112, -16, -131, -125, -7, 111, 131, 25, -95, -134, -44, 95, 141, 70, -71, -137, -58, 71, 150, 101, -32, -126, -95, 37, 134, 116, -12, -127, -127, -9, 112, 120, 24, -111, -138, -43, 89, 139, 56, -72, -142, -76, 48, 139, 87, -48, -132, -103, 23, 129, 104, -18, -132, -120, -15, 100, 123, 14, -106, -134, -49, 80, 129, 56, -68, -150, -79, 46, 139, 73, -45, -135, -102, 26, 122, 114, -1, -115, -113, -14, 110, 125, 30, -87, -135, -45, 80, 131, 54, -76, -140, -78, 46, 130, 87, -40, -139, -104, 15, 116, 108, -10, -128, -129, -26, 101, 130, 24, -95, -123, -48, 80, 132, 61, -63, -122, -84, 41, 118, 93, -20, -132, -98, 23, 117, 112, 12, -110, -122, -17, 108, 123, 25, -94, -128, -49, 67, 131, 61, -67, -133, -86, 50, 129, 99, -31, -127, -99, 5, 128, 118, 1, -123, -122, -9, 100, 122, 33, -87, -139, -56]
4784e6J21O3n6j37o5M8J23Q3l5j21q9K1J05J07Lj16j01j9J01J10K8q6j20m4O5
4809f7J33N1m8j38o1N4J11P9l1j13r1J5J09J12j3j03r7k5R0J25L0q9j20m2P7J10
4835E8O9n1j25o9M0J24Q2l3j22r8K9J24Q5mr7j10j9J01J06L7q5j18m4O3J17O2
4861A22n7j14p5M0J22Q7l1j10j03J8R7J10mr3j11k1R4J08L0p5j14m7P6J15N4n7
4887F1j13p9M0J21Q6l5j01r6PJ15J02nq7j17j0Q4J17L0o1j16p1Q2J03N9l8j20
4913d2p7L0J07R2k8r6r8J5Q5J04J4r6r7k8Q2J15L7p1j12n7N9J15O5l8j24o8L3
4940g9J01Q6j7j06j02J3J13R0J4j04j07rQ6J05L8o5j20n3N2J17O9l1j29o5L1J05
4966C3P4pr5j11K0R7Q2K0q8j15j6P3J10M4p6j14n7N5J07P0k9j24p1M0R6Q6j1r9
$$ y = [-56, 65, 128, 72, -65, -130, -82, 41, 124, 89, -32, -121, -100, 5, 112, 115, -1, -102, -121, -20, 90, 118, 32, -88, -132, -67, 66, 117, 69, -69, -130, -76, 35, 114, 83, -30, -121, -106, 3, 115, 102, -1, -98, -123, -33, 92, 122, 33, -87, -129, -52, 58, 127, 76, -49, -118, -78, 46, 128, 95, -27, -125, -96, 28, 113, 109, 12, -98, -117, -16, 90, 127, 42, -76, -120, -57, 60, 122, 65, -49, -124, -84, 38, 125, 94, -16, -119, -101, -4, 106, 102, 9, -102, -123, -29, 79, 109, 34, -80, -127, -51, 64, 118, 61, -52, -131, -91, 30, 116, 81, -20, -116, -109, 6, 108, 103, 16, -101, -111, -27, 90, 120, 59, -57, -128, -46, 57, 116, 78, -42, -119, -89, 18, 110, 82, -14, -112, -97, -12, 92, 106, 10, -87, -115, -33, 82, 119, 48, -64, -121, -62, 53, 118, 80, -44, -112, -79, 22, 108, 91, -15, -117, -104, 9, 99, 113, 9, -98, -107, -21, 84, 122, 57, -63, -116, -64, 53, 122, 91, -38, -103, -72, 33, 107, 100, 5, -106, -86, 11, 93, 113, 25, -90, -106, -33, 77, 121, 45, -69, -126, -71, 36, 106, 77, -47, -118, -78, 18, 104, 93, -6]
4994fr5kR5R3J8q5j01k6P3J11M8o7j10n3M4J13O9m4j04o5RJ10R0j7j04r4J1Q0
5022iJ10Kp1j05l3O2J10M8o6r6o9M9J08P0m0r9p4K6R5P8Jj09q4KP6J09Op8r3l9
5052a13P3R6N2o7j02n8M9J10O4m1q6p4J1J15P0j0q6r4oR0R3J6p3j01k6P3R9L5
5080A09n9j00o5N1J04O1m1q3q3J8R3Q3mq4j03KQ6P9L3p5j07k8O9R7M8o3j00n1
5108a13M1J06O7l8r7p3J4R3Q7%q9r4nQ6Q7K7o5r6m5Q3Q5N3n3j02o1L9R0P3j8j00
5138a8o6MJ03P0Kr9p7j6Q5R4K0o9r9l9M8J05M0l8r1o0M2Q5P9l4j01p5J6Q6R4j0
5168H1p2j03j6Q2R4K3n5r9m3N7J02N4n0j06o5M9J01N5k3r2n7PQ3Q9%q0j03j7R3
5197a1P8L4o0r4m1N3R4M5l4j00o5L6Q7P4k1r2q1J4P5Q9J2p6j00k7R5Q7K5o2j06
$$ y = [-6, -101, -103, -8, 85, 103, 18, -83, -109, -36, 75, 123, 56, -54, -107, -63, 50, 119, 75, -29, -94, -85, 25, 115, 98, -6, -100, -89, -9, 101, 103, 32, -73, -106, -44, 66, 114, 48, -48, -117, -68, 40, 110, 70, -29, -103, -77, 18, 96, 97, -12, -96, -94, -18, 91, 97, 19, -74, -113, -40, 56, 108, 41, -61, -119, -70, 40, 104, 63, -23, -97, -86, 29, 99, 89, 3, -91, -97, -7, 86, 102, 29, -72, -98, -25, 74, 109, 50, -50, -115, -64, 40, 101, 60, -23, -106, -88, 5, 88, 84, 0, -103, -101, -15, 64, 97, 22, -85, -113, -44, 53, 101, 38, -62, -113, -72, 34, 101, 63, -34, -107, -93, 0, 87, 87, -2, -96, -101, -15, 72, 99, 34, -62, -107, -24, 61, 114, 61, -41, -102, -63, 27, 100, 82, -18, -84, -80, 23, 93, 95, -4, -81, -97, -12, 82, 102, 33, -66, -105, -57, 48, 88, 50, -41, -101, -59, 26, 105, 71, -30, -105, -89, -3, 91, 81, 9, -94, -110, -28, 66, 89, 34, -65, -108, -51, 51, 105, 55, -51, -116, -67, 34, 89, 66, -26, -83, -76, 7, 96, 96, 16, -87, -104, -11, 67, 101, 41, -53, -94, -41, 53, 98, 64, -36, -101, -65, 22, 96, 75, -17, -98, -84, -9, 80, 92, 16, -84, -111, -16, 71, 96, 34, -72]
5226g2k7N1R1N3m3j12l9L0Q2P8k4q2p6LQ3R5jp3q8k7P3R5K7o0j01k7N3P6O2l5
5256F5q8p8M2Q8P0j9q4q9OJ00O7J1p5r7j3O7R0J7m4q5o0O2Q7N3m4r2o8L8Q6P3
5286H6k4p6p1jQ4Q0kp9p8k8P3R3K5o2p6l6L4R1N3l9p6o2K4Q9O4rq1p4KP2P2L2
5318A00q7p6k8O5R2K9n6r2l9M4Q4O5l8j04m9K2Q0P4j4q0p8k0R2Q1J8p9p3k5N6
5347c6Q3L4n3r1m4M8J00N1m3q2o2K0R5O0jq5p2lP2Q9J2o6r4j8N4R4L5m7r2l4L1
5378d5P6O1l5p9o5J4Q7O9j1p7p4j2P5P9On2q1l4N2R1L7m3q9m6L7Q4M8k9q3n6J5
5409h0Q1O4Mq1q3J5P3O9K1p0q2k5O0Q2M4n5p4n3M6Q2N3k9q1n6LP7P6Jp9r1OP0
5441a2P6K1o6q3k5N9Q4L2m4q6n4L8Q7N7k3q5o0J4P9N9Nq5p0NP0P5J2o6q8k0O6
$$ y = [-72, -99, -48, 43, 96, 53, -59, -98, -68, 14, 92, 68, -14, -90, -87, -4, 91, 90, 17, -71, -98, -25, 70, 97, 37, -64, -91, -38, 38, 100, 65, -23, -101, -59, 29, 99, 80, -4, -93, -87, 13, 80, 91, 16, -81, -94, -27, 63, 80, 36, -49, -109, -47, 40, 93, 49, -43, -111, -73, 13, 86, 62, -14, -85, -86, -2, 78, 76, -3, -81, -109, -36, 57, 82, 20, -56, -92, -58, 33, 86, 47, -29, -91, -67, 22, 86, 77, -4, -78, -76, -4, 68, 100, 13, -63, -91, -26, 66, 95, 39, -53, -92, -48, 36, 101, 63, -41, -90, -68, 12, 86, 72, -8, -86, -106, -14, 67, 85, 6, -67, -92, -36, 47, 81, 28, -63, -107, -59, 41, 92, 49, -33, -95, -75, 20, 80, 79, -6, -78, -81, -9, 80, 92, 26, -68, -86, -32, 62, 97, 50, -42, -76, -45, 31, 92, 57, -22, -87, -73, 14, 83, 72, -5, -79, -91, -16, 63, 69, 17, -64, -98, -46, 45, 82, 39, -50, -96, -59, 25, 73, 44, -39, -95, -80, 1, 65, 69, -12, -95, -80, -7, 62, 83, 13, -69, -94, -34, 48, 92, 37, -37, -90, -44, 38, 91, 62, -19, -75, -72, 5, 81, 82, 3, -88, -82, -12, 64, 85, 19, -64, -89, -30, 54, 86, 42, -44, -98, -60, 27, 84, 61, -24, -84, -70, 9, 68, 73, -12, -82, -77, -7, 68, 80, 14, -74, -94, -28]
5472b8P4L1m6p6l5L0O9O0k1q4n5OQ6O5jo2q4mO8P4J4o3o3k2L9P1M2m0p1n6J4R6
5504B8N8k6q6n5J6O0O5J1o8o8k4O6P8J3m1q6k8M1Q9L7m7o7n1K0R0N6j9p1o7QP1
5535CP0Kn8p6k7P7O3J8m1q9j7M4P2M9m5o6o0J8R4L5ro4n9j9P9O5Kn6p3j8O3P3
5567E0K3n5p3l0M0P7L6l6o3n3J7Q0M4Pq9n6NP5N9J3o2q4jN9O6J8l8p3l7N5N1M9
5599G4k5p3n1K2Q0N3k0p1n3ON0O4J5o3q0j1N9O5L5m6q2m1M6O3O1l3q6l8K4O7M8
5630E9Kp1o1mP1O8Po8o1k6O3P8Rl8p1l1L4O0N5k1q1n4K0P3O3np6m8j1O4P3Mn6
5663B0p1k6M5P8K9n1n7m3K9P4L2l3m1o7QQ2O5qq3o6J3O2N9K3o8o4k5M8Q4L4n2
5694C0p0m3L7P1M4j6p3m6NO9O5j0o4o5j0O9P5J0n0p1l3N7O7J1k7p5k9K0Q2M0q
$$ y = [-28, 46, 77, 31, -45, -80, -50, 19, 79, 58, -26, -81, -75, 11, 76, 75, 13, -71, -75, -7, 67, 81, 18, -45, -67, -28, 43, 85, 45, -26, -82, -68, 28, 86, 60, -26, -81, -65, -5, 60, 71, 3, -65, -89, -23, 55, 68, 27, -59, -87, -46, 43, 80, 33, -34, -85, -65, 25, 81, 62, -9, -76, -68, 3, 73, 75, 17, -59, -86, -9, 54, 72, 31, -58, -75, -31, 41, 90, 45, -21, -81, -63, 31, 66, 57, -7, -66, -85, -6, 59, 61, 5, -68, -86, -23, 50, 73, 18, -55, -85, -45, 32, 68, 32, -31, -84, -67, 13, 57, 64, -25, -81, -76, -1, 58, 71, 9, -75, -76, -17, 49, 67, 29, -44, -81, -26, 25, 74, 49, -24, -75, -53, 27, 80, 60, -11, -64, -58, -8, 56, 71, 8, -72, -83, -24, 41, 76, 30, -52, -93, -47, 16, 77, 44, -42, -80, -56, 11, 59, 61, -10, -71, -75, -4, 64, 71, 3, -58, -84, -21, 57, 66, 28, -43, -74, -40, 20, 75, 54, -27, -81, -61, 12, 75, 70, -6, -54, -65, -1, 72, 76, 20, -51, -77, -32, 46, 75, 24, -33, -76, -47, 27, 59, 26, -15, -82, -74, 8, 73, 65, -18, -84, -71, -9, 50, 73, 5, -59, -84, -36, 48, 82, 30, -40, -83, -46, 25, 69, 53, -20, -66, -61, 8, 73, 63, -1, -66, -76, -7, 68, 78, 28, -43, -76, -19, 48, 59, 32, -43, -72, -52, 30, 70, 62]
5725F2q4n9K1P5N2rp2n1jM7P5J3n0p6j4L7O9L8m3o3l3J5P7M3k7o3m1LO5M5J5o7
5757ao9ON6N3K2m7o8j9L3P5K5l2o4l3K7O7M2k3o6n2J7N1N4Qn9o9mN4N3K9m5q4
5789f3j0L6P4K7k6p1l4J6P9M9l6m4n9RO1N3po5n7jN6O2J6n8n0l0M2O1L2k0p7l7
5821g2L3O0N2j4p4m2lN8O2jn1n8j2M1P6Qm4n5l6M3O3L8l2p5k8J5P1N7k8p3m6J0
5853e7O5N0om3p2pN8O6J0n1m2l5M3M9L8k6o7l0J1P4L4oo5n8LO4N7km0p7OM3N5
5886D2K1l8o4k9L3O2L5l2n5m3K6O0O0l7n0o0QM7O1On6n5j9O4O0J3l5o7k6K8O3
5917B3L3k0n9n5J4O9N7j7m8o1%O0O4on4n1j3L4P4L1m9n6l1L4N7L1j8n9m2PO5L9
5949E3j4l8m8pM8N7Rn4m6l1N2N4K4m5m6l3J7P4K4k0n3l6JO2N3j1n3m3j0N8N5Q
$$ y = [62, -22, -81, -60, 15, 67, 58, -14, -65, -66, -19, 56, 69, 19, -57, -71, -34, 35, 73, 30, -33, -66, -51, 26, 69, 42, -21, -62, -59, 6, 51, 66, -1, -70, -64, -8, 45, 67, 20, -48, -67, -34, 41, 66, 34, -30, -63, -36, 31, 73, 50, -16, -68, -51, 0, 54, 62, 3, -66, -70, -16, 37, 66, 21, -63, -73, -37, 37, 64, 38, -33, -67, -51, 28, 77, 41, -3, -62, -53, 8, 61, 54, -11, -68, -69, -13, 49, 65, 7, -43, -73, -31, 30, 62, 42, -35, -72, -39, 21, 73, 59, -15, -57, -60, -2, 60, 59, 8, -50, -62, -21, 55, 63, 19, -36, -72, -29, 34, 72, 40, -35, -63, -48, 23, 80, 52, -21, -67, -57, 8, 58, 52, 9, -63, -70, -12, 54, 64, 13, -29, -64, -21, 28, 66, 40, -27, -57, -46, 28, 62, 56, -9, -67, -64, 0, 57, 55, 15, -62, -56, -13, 42, 63, 25, -39, -68, -35, 27, 62, 30, -25, -68, -42, 18, 78, 41, -9, -69, -61, -14, 47, 53, -3, -58, -77, -13, 47, 60, 25, -42, -68, -40, 23, 56, 36, -23, -78, -64, 5, 62, 45, -3, -64, -64, -4, 60, 54, 0, -51, -64, -30, 44, 75, 26, -30, -61, -27, 30, 61, 43, -16, -58, -51, 14, 53, 39, 1, -47, -54, -6, 51, 60, 6, -40, -71, -19, 35, 59, 14, -32, -65, -48, 26, 50, 30, -23, -59, -58, 4, 57, 46, -7, -50, -60, -2, 53, 61]
5981F1o0l6k1K8O1L3l2o9k0J5O6L7k2o2m7K0O3M0Jn3o3KN2N8Qm2n8k9M8M6L2l5
6013B2n9l8L8N9K4k3l7m5JN9M8Jo0n6J4N2M2J3m1n8j1M1N3K6m2m5m6M4N4M2l0
6044D2o4k4rO2N4k0l8n6kM8L9J6l1n7l0L2P7J5l2n3l6K9O7L1l2n8l9J6N7M9jo0
6076hn7QM3N9Pm1n4k7M6M6M3l7n4k4J0N6M9l3m6l1J8L5M7Kn2m3j7N3M4K0m1n0
$$ y = [61, 1, -35, -56, -28, 33, 66, 34, -35, -55, -40, 26, 63, 41, -21, -68, -48, 15, 55, 56, 3, -60, -58, -6, 52, 60, 18, -40, -69, -21, 25, 57, 22, -37, -75, -37, 22, 46, 23, -14, -59, -58, 1, 49, 50, -10, -66, -52, 0, 42, 55, 14, -44, -55, -14, 39, 65, 23, -22, -68, -24, 30, 72, 42, -22, -46, -55, 7, 61, 41, 3, -53, -55, -7, 32, 48, 17, -40, -70, -38, 39, 54, 22, -31, -67, -38, 29, 60, 28, -30, -69, -53, 4, 53, 52, -8, -65, -57, -14, 45, 52, 11, -43, -70, -24, 22, 65, 28, -26, -50, -40, 16, 65, 32, -14, -45, -27, 8, 55, 57, 5, -38, -55, -2, 42, 62, 21, -29]
$$ [...]
8191a1
##END NTUPLES=NMR FID
##END=
