##TITLE=1H_AM A490.2
 CDCl3, 8 sc, 
 3.7.2019
##JCAMPDX= 6.0         $$ Bruker NMR JCAMP-DX V2.0
##DATA TYPE= NMR FID
##DATA CLASS= NTUPLES
##ORIGIN= UXNMR, Bruker Analytische Messtechnik GmbH
##OWNER= root
$$ XWIN-NMR		Version 3.5
$$ Wed Jul  3 15:50:35 2019 Russian Standard Time (UT+4h)  she@DPX200
##.OBSERVE FREQUENCY= 200.13155
##.OBSERVE NUCLEUS= ^1H
##.DELAY= (6, 6)
##.ACQUISITION MODE= SIMULTANEOUS
##.ACQUISITION SCHEME= undefined
##.AVERAGES= 8
##.DIGITISER RES= 18
##SPECTROMETER/DATA SYSTEM= spect
##.PULSE SEQUENCE= zg30
##.SOLVENT NAME= CDCl3
##.SHIFT REFERENCE= (INTERNAL, CDCl3, 0, 15.7039)
##AUDIT TRAIL= $$ (NUMBER, WHEN, WHO, WHERE, WHAT)
$$ ##TITLE= Audit trail, XWIN-NMR		Version 3.5
$$ ##JCAMPDX= 5.01
$$ ##ORIGIN= Bruker BioSpin GmbH
$$ ##OWNER= she
$$ F:/spectra/data/she/nmr/H-F/1/audita.txt
$$ ##AUDIT TRAIL=  $$ (NUMBER, WHEN, WHO, WHERE, WHAT)
(   1,<2019-07-03 15:49:19.06 +0400>,<she>,<DPX200>,
      <created by zg, POWCHK disabled, PULCHK disabled
       configuration hash MD5:
       00 E9 B6 7A A2 85 ED C7 34 08 36 98 17 FE 4E 26
       data hash MD5: 16K
       C0 BE 17 F2 24 04 C9 8E CC A0 F2 4F F3 1B 44 36>)
$$ ##END=
$$ 
$$ hash MD5
$$ 5B 9A E4 6B 31 23 AB 7E 65 FB FE 32 8B 8D 04 4D
##$RELAX= 
##$RELAX= 
##$RELAX= 
##$RELAX= 
##$RELAX= 
##$RELAX= 
$$ Bruker specific parameters
$$ --------------------------
##$DU= <F:/spectra>
##$EXPNO= 1
##$NAME= <H-F>
##$PROCNO= 1
##$TYPE= <nmr>
##$USER= <she>
##$AMP= (0..31)
100 100 100 100 100 100 100 100 100 100 100 100 100 100 100 100 100 100 
100 100 100 100 100 100 100 100 100 100 100 100 100 100 
##$AQSEQ= 0
##$AQ_mod= 1
##$AUNM= <au_zg>
##$AUTOPOS= <>
##$BF1= 200.13
##$BF2= 200.13
##$BF3= 200.13
##$BF4= 200.13
##$BF5= 200.13
##$BF6= 200.13
##$BF7= 200.13
##$BF8= 200.13
##$BYTORDA= 1
##$CFDGTYP= 0
##$CFRGTYP= 5
##$CHEMSTR= <none>
##$CNST= (0..31)
1 1 145 1 1 1 1 1 1 1 1 1 1 1 1 1 1 1 1 1 1 1 1 1 1 1 1 1 1 1 1 1 
##$CPDPRG= <>
##$CPDPRG1= <>
##$CPDPRG2= <>
##$CPDPRG3= <>
##$CPDPRG4= <mlev>
##$CPDPRG5= <mlev>
##$CPDPRG6= <mlev>
##$CPDPRG7= <mlev>
##$CPDPRG8= <mlev>
##$CPDPRGB= <>
##$CPDPRGT= <>
##$D= (0..31)
0 1.2 0 0 0 0 0 0 0 0 0 0.03 0 0 0 0 0 0 0 0 0 0 0 0 0 0 0 0 0 0 0 0 
##$DATE= 1562154558
##$DBL= (0..7)
120 120 120 120 120 120 120 120 
##$DBP= (0..7)
150 150 150 150 150 150 150 150 
##$DBP07= 0
##$DBPNAM0= <>
##$DBPNAM1= <>
##$DBPNAM2= <>
##$DBPNAM3= <>
##$DBPNAM4= <>
##$DBPNAM5= <>
##$DBPNAM6= <>
##$DBPNAM7= <>
##$DBPOAL= (0..7)
0.5 0.5 0.5 0.5 0.5 0.5 0.5 0.5 
##$DBPOFFS= (0..7)
0 0 0 0 0 0 0 0 
##$DE= 6
##$DECBNUC= <off>
##$DECIM= 24
##$DECNUC= <off>
##$DECSTAT= 4
##$DIGMOD= 1
##$DIGTYP= 9
##$DL= (0..7)
0 120 120 120 120 120 120 120 
##$DP= (0..7)
150 150 150 150 150 150 150 150 
##$DP07= 0
##$DPNAME0= <>
##$DPNAME1= <>
##$DPNAME2= <>
##$DPNAME3= <>
##$DPNAME4= <>
##$DPNAME5= <>
##$DPNAME6= <>
##$DPNAME7= <>
##$DPOAL= (0..7)
0.5 0.5 0.5 0.5 0.5 0.5 0.5 0.5 
##$DPOFFS= (0..7)
0 0 0 0 0 0 0 0 
##$DQDMODE= 0
##$DR= 18
##$DS= 0
##$DSLIST= <SSSSSSSSSSSSSSS>
##$DSPFIRM= 0
$$ [...]
##$SUBNAM2= <"">
##$SUBNAM3= <"">
##$SUBNAM4= <"">
##$SUBNAM5= <"">
##$SUBNAM6= <"">
##$SUBNAM7= <"">
##$SUBNAM8= <"">
##$SUBNAM9= <"">
##$SW= 24.9336996594482
##$SWIBOX= (0..15)
0 0 2 0 0 0 0 0 0 0 0 0 0 0 0 0 
##$SW_h= 4990.01996007984
##$TD= 16384
##$TD0= 1
##$TE= 0
##$TE2= 300
##$TE3= 300
##$TEG= 300
##$TL= (0..7)
0 120 120 120 120 120 120 120 
##$TP= (0..7)
150 150 150 150 150 150 150 150 
##$TP07= 0
##$TPNAME0= <>
##$TPNAME1= <>
##$TPNAME2= <>
##$TPNAME3= <>
##$TPNAME4= <>
##$TPNAME5= <>
##$TPNAME6= <>
##$TPNAME7= <>
##$TPOAL= (0..7)
0.5 0.5 0.5 0.5 0.5 0.5 0.5 0.5 
##$TPOFFS= (0..7)
0 0 0 0 0 0 0 0 
##$TUNHIN= 0
##$TUNHOUT= 0
##$TUNXOUT= 0
##$USERA1= <user>
##$USERA2= <user>
##$USERA3= <user>
##$USERA4= <user>
##$USERA5= <user>
##$V9= 5
##$VALIST= <valist>
##$VCLIST= <CCCCCCCCCCCCCCC>
##$VD= 0
##$VDLIST= <DDDDDDDDDDDDDDD>
##$VPLIST= <PPPPPPPPPPPPPPP>
##$VTLIST= <TTTTTTTTTTTTTTT>
##$WBST= 1024
##$WBSW= 4
##$XGAIN= (0..3)
0 0 0 0 
##$XL= 0
##$YL= 0
##$YMAX_a= 75184
##$YMIN_a= -111741
##$ZGOPTNS= <>
##$ZL1= 120
##$ZL2= 120
##$ZL3= 120
##$ZL4= 120
##$ABSF1= 10
##$ABSF2= 0
##$ABSG= 5
##$ABSL= 3
##$ALPHA= 0
##$AQORDER= 0
##$ASSFAC= 0
##$ASSFACI= 0
##$ASSFACX= 0
##$ASSWID= 0
##$AUNMP= <proc_1d>
##$AZFE= 0.1
##$AZFW= 0.1
##$BCFW= 1
##$BC_mod= 2
##$BYTORDP= 1
##$COROFFS= 0
##$CY= 11.3945322036743
##$DATMOD= 1
##$DC= 2
##$DFILT= <>
##$DTYPP= 0
##$F1P= 18.9103706918063
##$F2P= -1.10871071338519
##$FCOR= 0.5
##$FTSIZE= 0
##$FT_mod= 4
##$GAMMA= 1
##$GB= 0.15
##$INTBC= 1
##$INTSCL= 1
##$ISEN= 128
##$LB= 0.24
##$LEV0= 0
##$LPBIN= 0
##$MAXI= 10000
##$MC2= 0
##$MEAN= 0
##$ME_mod= 0
##$MI= 1.114404
##$NCOEF= 0
##$NC_proc= 0
##$NLEV= 6
##$NOISF1= 3.799351
##$NOISF2= 2.8
##$NSP= 1
##$NTH_PI= 0
##$NZP= 0
##$OFFSET= 15.70392
##$PC= 1
##$PHC0= -8500.42
##$PHC1= 14.40097
##$PH_mod= 1
##$PKNL= yes
##$PPARMOD= 0
##$PSCAL= 0
##$PSIGN= 0
##$REVERSE= no
##$SF= 200.130013532006
##$SI= 16384
##$SIGF1= 3
##$SIGF2= 2
##$SINO= 400
##$SIOLD= 16384
##$SREGLST= <1H.CDCl3>
##$SSB= 0
##$STSI= 0
##$STSR= 0
##$SW_p= 3612.71676300578
##$SYMM= 0
##$S_DEV= 0
##$TDeff= 0
##$TDoff= 0
##$TI= <>
##$TILT= no
##$TM1= 0
##$TM2= 0
##$TOPLEV= 0
##$USERP1= <user>
##$USERP2= <user>
##$USERP3= <user>
##$USERP4= <user>
##$USERP5= <user>
##$WDW= 1
##$XDIM= 8192
##$YMAX_p= 0
##$YMIN_p= 0
$$ End of Bruker specific parameters
$$ ---------------------------------
##NTUPLES= NMR FID
##VAR_NAME=  TIME,          FID/REAL,        FID/IMAG
##SYMBOL=    X,             R,               I
##VAR_TYPE=  INDEPENDENT,   DEPENDENT,       DEPENDENT
##VAR_FORM=  AFFN,          ASDF,            ASDF
##VAR_DIM=   8192,          8192,            8192
##UNITS=     SECONDS,       ARBITRARY UNITS, ARBITRARY UNITS
##FACTOR=    0.0002004,     1,               1
##FIRST=     0,             0,               0
##LAST=      1.6414764,     0,               0
##MIN=       0,             -111741,         0
##MAX=       1.6414764,     75184,           0
$$ Real data points
##PAGE= N=1
##DATA TABLE= (X++(R..R)), XYDATA
0@%%%%%%%%%qJ6j6J6j6K4l2L3m1M9n7P2q1R0j06J22j43J67j88K12k42K74l06L42
33A81l85M31m79N34n95O61p33Q10q96R94j101J219j351J499j667J860k083K342
51A241k652L028l493M088m883O005p725J0724j7465O1637j5181q3761N6887L9057
65D7507j4832j9882L2471j2245n7733j4292O5046K7671n1219n2397J4313K8095
77g497M292k8R470k2228m7175j1886M6364M0302j1886l7586j7432L094J1752J9650
91b0794J4832j6558l4209l158L6009K7239n258j5768j1725j6171j161L9297M6398
104C8973q346n1632k1791L0124L0289J613l027K827j2335j8480J6075M5448J1017
117F0755m6188l9687K1009M5041J0061j5297k272l720l1627j7893M2674N1993
$$ y = [0, 0, 0, 0, 0, 0, 0, 0, 0, 0, -8, 8, -8, 8, -8, 16, -16, 17, -24, 25, -32, 40, -41, 49, -57, 65, -78, 89, -99, 113, -129, 145, -161, 181, -204, 227, -252, 282, -313, 348, -385, 425, -471, 523, -578, 641, -710, 789, -878, 982, -1101, 1241, -1411, 1617, -1876, 2212, -2671, 3334, -4391, 6333, -11132, 50505, 35324, -48437, 8450, 47507, 32675, 12793, 45264, 33019, -24714, -39006, 26040, 53711, 2492, -49905, -35592, -7497, -3205, -3233, 6237, -15991, -63166, -75052, -28688, 11614, -272, -37858, -55290, -52196, -40444, -20794, -5962, -22520, -56729, -59887, -23878, 3361, -1897, -17665, -29390, -45561, -46722, -7425, 38973, 30627, -21005, -42796, -12672, 17617, 19230, 16203, 19030, 6695, -11785, 4290, 49738, 60755, 14567, -25120, -4111, 40930, 50991, 35694, 33422, 29702, -1925, -19818, 22856, 74849]
129G4849k1637o4857j0416M5278J8083k3126p696R036k1685k8755K7496N4342
141E0912o314o0602k7971K5400K1104j064P631O284k7922l5002J4247M4408P700
154A8811l3235k2001N717J0000J1763J9721o22l8515l0819K2746M2299O964j7648
167d819o573o425k0366L147M4459K4587l8971m2905J8978M2959K506j8432K684
180H29K56k7236p008M8824M0717l0894n4655l18L7648J3653r055N345N798k4062
194a58k2953K4762M4730j780m5785k4298K2451K8567N505m259n265j8583k2547
207a9613Q451L8680J9853k5018l3777l916J7428J3628N164k753j6869k1369J619
220a8492K8189J9994j2224k7773j5973K330J5995K2896Q373k3256l3020k752K7353
$$ y = [74849, 53212, -11645, -22061, 23217, 41300, 18174, 10478, 19514, -2171, -30926, -3430, 50912, 44598, -16004, -43975, -18575, 2529, 1465, 9096, 15380, -12542, -47544, -33297, 11111, 18811, -14424, -36425, -30708, -20708, -8945, 10776, 10154, -28361, -59180, -36434, 5865, 12829, -4819, -11392, -17817, -38183, -35036, 9423, 34010, -4961, -47866, -28888, 14071, 16577, -1855, 829, 1085, -26151, -33159, 15665, 56382, 25488, -29167, -29485, 8163, 21816, 12761, 18106, 23904, -158, -23111, 1651, 46381, 44601, -1184, -25482, -3031, 25536, 31041, 26782, 21517, 2934, -19613, -11162, 27518, 47371, 22353, -11424, -15340, 2088, 15716, 20880, 18127, 1258, -20111, -18492, 9697, 29691, 17467, -10306, -26279, -23949, -7954, 14942, 23315, 59, -32961, -35713, -8360]
233h360J8259p027j1586o486j1438m617K4043K9871j2727m5516j3649L3343K7122
246A1232p633j0191K158j2101k1657J4712M5997Q735m3745k8480K4948L0391l265
259A1101r611O434o165k4294K805M2385K3739k9923l7633L233K6302J2259J619
272B2251J979j0318k2993l397K7603K3752r713k6312j1458O434J3657J5346N096
285C1927j7688k6092m124K1779J9123j081j3088j4861j2582K822K4181J8264j5390
298A3190l2747q742K0382J7177j341o271p287j5868j0698J7677L1312J941l3132
311a4407k4904J1554K4640P333n124m688q969j4835K777K8833K0041j8863l2963
324b9575l021K5714J7549k512n949n152j2517o913J9309K9263k05l0614j9618
$$ y = [-8360, 9899, 2872, -8714, -15200, -26638, -31255, -7212, 22659, 9932, -35584, -49233, -15890, 11232, 3599, -6592, -4434, -16535, -38192, -23480, 22517, 31252, -12493, -40973, -16025, 14366, 11101, 1490, 7924, 1759, -22535, -19730, 22655, 46394, 16471, -21162, -17929, 8373, 20632, 22251, 24230, 13912, -9081, -12478, 15125, 38877, 29164, 2852, -8606, -2172, 11485, 26831, 31927, 14239, -11853, -15977, 5802, 24925, 23844, 10756, -4105, -16687, -13865, 10316, 28580, 13190, -19557, -28299, -7917, 9260, 7919, 1648, -5639, -21507, -32205, -14528, 16784, 18725, -14407, -39311, -27757, -3117, 4216, -908, -5596, -14565, -29400, -26623, 2210, 22251, 3388, -29575, -32596, -6882, 10667, 8155, 2206, -2946, -15463, -22376, -3067, 26196, 25991, -4623, -24241]
337b4241J3328K3481Q944m019q882j3190p897J2157K3875Q382j7645k1748m100
350a1555J2995J7586R415q368k1412j3012J0102K0599Q232q209j3754j2721l369
363a3471J5229K2929N40k7542k1499R419K1601O387n551m895j0309j5106K579
376a9689K7616J6883j9303l0579k796K0599J3777p75m140q120j4457m605J9611
389e978K3221l624k6219j6088J0009J9297R614k871r927j2264n529R630J9899
402I170J0071j2264k2770q071J6106K2489N373j3652j5713m559O877J2896J2569
415A8522J72j6522j8409K252K2563J6481n838j8701j1329K678J2164J2377M689
428B1099r825j8149q523J2234K1631P330j5417k0865m599J3349J5086L821o879
$$ y = [-24241, -10913, 12568, 21512, 17493, 8611, -4579, -12476, -319, 23556, 31938, 14293, -7455, -11555, 1440, 19026, 28441, 20073, -1339, -14351, -4249, 16350, 24582, 16373, 2619, -10102, -13471, 1758, 24687, 25227, -2315, -23814, -14395, 7206, 13593, 8042, 3147, -7162, -22268, -19689, 7927, 24810, 5507, -25072, -27868, -7269, 6508, 5733, 1593, -6527, -20984, -25589, -5978, 17243, 13619, -12600, -28688, -18679, 618, 10232, 7361, -2566, -14830, -20359, -10729, 9170, 19241, 6977, -15793, -23864, -7758, 14731, 20104, 6452, -9261, -13820, -6943, 5953, 18522, 18694, 2172, -16237, -13985, 8578, 25059, 19221, 520, -10809, -8131, 4033, 16410, 21099, 11274, -6875, -15398, -3164, 18467, 25797, 10380, -10485, -15084, -1735, 13351, 17172, 10293]
441A0293j1842j1255r81J5158J8329j118k2684j8453O579K0130J0037n404j1165
454b376j0390n415O991J8255R816j3602k2660o035J6661J7929J404j0865j1999
467a2286o035L506J2869J3741l52j7489j7804L600K2337J6044p065j8564r286
480a6784N004J0344J0118O400o195j8743j0444J4243K4073M704j7399j5260N36
493i403Q458R060R447J89j5348j7326L762K2429J3927q960j7843r319L709J2395
507E177J1859J443j3093j5790k580J2078J4070M667r846j7438r544J0631K0518
520A2152N994j4384j6018k715N809Q846J0008K309j5471k0018K006K4073J4140
533A6731j1174j6963l973M057M020R265J0717n857k2960j0604J8449K4218O7j7812
$$ y = [10293, -1549, -12804, -13785, 1373, 19702, 18584, -4100, -22553, -15974, 4156, 14193, 8789, -2376, -12766, -18181, -11190, 7065, 16881, 3279, -19381, -25416, -8755, 9174, 10578, -287, -12286, -18321, -14815, -1946, 11795, 11443, -6046, -23850, -20250, 2087, 18131, 11066, -7498, -16784, -11780, -1436, 8682, 15082, 8887, -9856, -20300, -6057, 18016, 22720, 5321, -9939, -9403, -945, 8115, 17562, 17751, 2403, -14923, -11161, 11268, 25195, 16235, -1608, -10927, -7218, 5177, 17036, 18479, 5386, -10404, -12984, -906, 13164, 17831, 7985, -9453, -18997, -8366, 12152, 18146, 3762, -12256, -14971, -9162, -316, 9692, 12001, -3470, -23488, -21482, 2591, 16731, 5557, -11406, -15379, -11322, -7302, 1963, 12680, 6823, -16137, -26741, -8292, 15926, 15993, -1819]
547a819j1630J464N615P970J1274J737j6080j7275N233K2640J2137r952j5584
560d270n687L827Q245J1014N170j0431j8510m909J5854J7342J136j3369j3260
573g848l834P642J4082Q305q844j7185p316Q919J3048O423l047j1402j4943j451
587a7451J8278J7808n367k0664q999O872P573N095P065j703j8852j3726J4774
600i297K6263N19k2085j1296P310O051J573R989P642j5625k3707M218K8529J2680
614B2764j5802j5406P44M048J236R464J1011r037k3327m977K0979J7945n264j4375
628Cp548k239K147J1734J3193m905j9915j0129J0144J4765M043n183r095r994
642a2979j395J4568J6025l672j9679j1040O648J1490O572M002l460j5600j2743
$$ y = [-1819, -13449, -11985, -6370, 1600, 12874, 14611, -1469, -18744, -13511, 9129, 21266, 11314, -4270, -9957, -6130, 2115, 13129, 18299, 7868, -10642, -15551, 303, 17645, 18781, 5412, -7848, -11682, -4040, 10042, 18347, 9503, -7682, -14998, -6079, 6969, 13392, 10345, -1057, -16000, -17451, 827, 18635, 13268, -7396, -16395, -9523, -1950, 3145, 10210, 8507, -10345, -24071, -9297, 16966, 17485, -4600, -15896, -8586, -2535, -962, 9027, 16669, 1044, -22663, -18445, 10084, 22764, 6962, -8444, -7700, -3652, -2416, 7048, 18059, 9022, -14305, -19282, 1697, 19642, 14378, 3, -7545, -9784, -7637, 4097, 17290, 12385, -7530, -17659, -7515, 7250, 11293, 6110, -2985, -12979, -14374, 194, 16219, 12547, -7132, -18172, -11524, -34, 6538, 10540, 7080, -8520, -21263]
655b1263J0759K3523M718j7818j3580M907Q272K672N453N048j0965k0678J725
668a7227K6835J5692j5002j9956j02P817J625M508J1618k164k2651j1021J9900
681a28K1883o700k0186m644O116J872M460J2788J438k1944j7950J1840K3116M242
695A6203j1884p678l260l619M972J5547M920j7516j6037O822J6662N230m223m607
709A532q988j0679O064K3064R604j6980j8381J938J0776L270K647N703o819j8336
723a5585j825K3931J5654j4891k1501O28J1147K948L037J0338j792k2801j3763
736b4475J8400K4078l458j8993n101P283Q44j04J0220M242j7080j7640J0861K5927
750A5004N608j7001j2296K1J446K999J2593R953j1639k0473q93J8149J0085o685
$$ y = [-21263, -10504, 13019, 17737, -81, -13661, -8754, -482, 2190, 7643, 12691, 1726, -18952, -17227, 9608, 25300, 10298, -9658, -9760, -1943, -318, 4190, 15808, 13644, -9007, -20028, -128, 21755, 15055, -5131, -9775, -3659, -1787, 2673, 15461, 16899, -5045, -22995, -11155, 11961, 16203, 4319, -3359, -6619, -10238, -5266, 10281, 15201, -2315, -18352, -11530, 5132, 10362, 6139, 1532, -7456, -18135, -12071, 10993, 20597, 3617, -14764, -12826, -2050, 1220, 3867, 9570, 2751, -15585, -17410, 6521, 22175, 7284, -14217, -13589, -2442, 506, 3543, 13881, 12089, -10712, -24475, -6075, 18003, 14545, -4448, -9549, -2266, -1422, -1526, 8694, 12936, -4144, -21784, -10923, 15004, 20612, 3611, -8685, -8664, -7218, -4219, 8374, 18327, 6688, -13785, -14678, 3471, 13556, 6871]
764F871p793k968l935K059J4880J1156j2273k1707l235J5589J1012L2j008m841
778C839j3422o300J5599J8455o952k0342l872J2204N813j844L474J42j6399j3991
792b3596J5589K7208K56k3790j1811Q164N025j364Q137R156j1719k1055M169K5393
806I762P303j8740j2868O143N727n62Q343J1227r956k4475l765K2745J6072p318
820I638j1480j905n35j503Q166J2254m560j9187n524J5594J3985j893p797n056
834A97p990m255J2861J9380r70k0525j1433Q394R791N17R58L36r509j0946R132
849d062K0844J118k1422j2671Q209R703P66M191N587j0684k1190K31K4006J2686
863A7312j4635j5498L289P510q84J869Q204m024j9675n830K0850J8782p863j7973
$$ y = [6871, -922, -3890, -7825, -5766, 9114, 20270, 7997, -13710, -16945, -1356, 9656, 9688, 8680, 3839, -9583, -15883, -284, 18171, 11219, -9123, -12995, -791, 5022, 3178, 6652, 6794, -9605, -23596, -8007, 19201, 19457, -4333, -16144, -7980, -2955, -4319, 3818, 12974, 1255, -19800, -15631, 9762, 17065, -1675, -14543, -8400, -2673, -3235, 5108, 16335, 6379, -18096, -21861, 884, 16956, 9638, -1842, -3747, -4282, -5785, 2381, 14635, 10075, -9112, -14636, 958, 14943, 13050, 5253, 197, -7793, -12048, 813, 20193, 19223, -1302, -12735, -4341, 5450, 5967, 6925, 7261, -2248, -13194, -4062, 16782, 17900, -3522, -16193, -7984, 1719, 2485, 6676, 12263, 1579, -19611, -19380, 4626, 17312, 2677, -12821, -9532, -2022, -2906, -1037, 7167, 3143, -16532, -22362, -1512, 17270, 9407, -8566]
877h566l834M290M45M258J3269K528j7541j3892J0975J8588N32j1635n270M90
891e363J95O102J3353J772j7408j5058P438J6617N346l240l154o307r723L170
905f260J7374Q084j3922j5310M104J1975L004j234J155o729j4891m70K1250J4776
919B2906j3032j9781k07R191Q39O19Q310k6j7617j0084J6027J9060o484j9076
933i355m456P760K979K161R311J799j7544j5404R600K1214L730j2772p205J104
947g078L62J501R645N312j0806j5307L238J7502Q241o531q479n222l222M244J3885
962G285R055r843j6447j727J1528P558Kj830m391r086r76J4343J2597p346j7346
977f624m646R260P316K483L234k556j3778r267J1764J8642r10j6571p627O693
$$ y = [-8566, -12400, -8110, -7665, -3407, 9862, 12390, -5151, -19043, -8068, 10520, 11052, -583, -5853, -5363, -5168, 934, 14287, 16059, -1349, -16407, -8969, 7648, 12994, 9754, 6600, 293, -9430, -6260, 11114, 19198, 5276, -10034, -5930, 6045, 9049, 7815, 8970, 2241, -12650, -13120, 8130, 22906, 9874, -9907, -10114, -923, -84, 535, 8845, 8819, -8798, -18882, -2855, 16205, 9721, -9355, -13811, -6051, -3072, -911, 8400, 10199, -7345, -22749, -13149, 8065, 11795, -977, -8182, -7078, -6716, -5215, 4430, 9742, -1064, -16371, -13133, 4369, 12610, 6079, -2400, -7622, -10844, -6600, 7285, 16340, 6497, -9950, -11677, -149, 7409, 7411, 5581, 1190, -7896, -8872, 5471, 18068, 10722, -6624, -11270, -2010, 5306, 7789, 11023, 8467, -5311, -14578, -2814, 15828, 14918, -1653, -9280, -2587]
991b587N602j36L731L111j0877j4449N260K0886P161j4112j3006J319M525J777
1005a795O407O809p322j7263j929J6513J1196p165j1355k171J324J758P785P920
1019A0712n451j6136n893J1573J2193P44o113n672n876r43J0373J1846l566j5026
1033g235o533Q226R096K313n20l279r557o390R429J6716J696j4537r625L731O696
1048B27L529M017J536r248j2234M710J7181O930j1356j2113Q62N925L667M380
1062H013L980o240j3963l321J3984J2924l828j2365n353J659L997N660N414l074
1076G487j3068p369Q375J3639K076q654q821k399J815O915P991k25j1184r910
1090a3332L011J0679O439k397o813p487k716P140J1968K668j0886j1002J003Q612
$$ y = [-2587, 3015, 2879, 6610, 9721, -1156, -15605, -10345, 10541, 17702, 3590, -9416, -8097, -3572, -1795, 4612, 11421, 4099, -13164, -15093, 1420, 12616, 5451, -5904, -8075, -6751, -4993, 2792, 10712, 5261, -10875, -16768, -5195, 6998, 7742, 1629, -4043, -9919, -10862, -489, 11357, 7791, -7235, -13768, -5542, 3554, 5867, 5347, 2068, -7489, -13879, -4450, 12266, 13962, -575, -10200, -6469, 227, 3756, 7773, 9309, 61, -12173, -7463, 9718, 16648, 5292, -6821, -5959, -34, 3633, 8013, 11993, 5753, -8210, -11531, 2453, 15377, 11549, -816, -6169, -4510, -513, 5147, 10561, 7487, -5581, -12950, -4575, 9064, 11140, 2486, -6335, -8734, -6919, -4, 7987, 7762, -3422, -13332, -10321, 358, 6797, 4400, -2413, -9900, -12616, -5476, 6492, 9160, -1726, -12728, -11725, -3113]
1104c113O550K002j973p695q463K444J3967R024p688j2174k552O310N776L826
1118F241K368n019j1590l225J2693J3156k635j2741o125L289N346M395M592k011
1132H734j0441q121O207J3529M354q350r593k780L612O755O428m61r779r483J432
1147g957J0445P974k401q958o989q21O673Q743J561p431r441j937O189Q036L706
1162G392m431r447o546M751J1438N987n920j0298m422M236P491N587K35p268r203
1177a0418p50R935J0143r42r441p237M15O252P193L522m043r578n493N618J1573
1192F749N177o827j0152k984N396P258M356j648o977p312j0Q859R256o16j0047
1207D78q041P84Q283P148O33n894q195l458N294R856M390o040j0575m185O025
$$ y = [-3113, 3437, 5439, 3466, -4229, -12692, -10248, 3719, 12743, 5055, -7119, -9671, -3361, 2415, 6241, 8609, 3590, -8000, -11225, 1468, 14624, 11989, -752, -6877, -3588, 1758, 6153, 10745, 8734, -1707, -9828, -3621, 9908, 14262, 5912, -3681, -6461, -2849, 3906, 10334, 9873, 94, -9389, -7957, 2488, 10462, 8061, -897, -7886, -8707, -2034, 6709, 8270, 839, -8602, -10539, -4350, 3686, 7392, 2961, -6486, -13032, -8281, 3157, 9144, 3224, -7074, -11496, -7260, 231, 5818, 6053, -1215, -10418, -11168, -1233, 8910, 7968, -1473, -8710, -8295, -2043, 5150, 8672, 4629, -4949, -10442, -4824, 6749, 11926, 5099, -5053, -8037, -2641, 4617, 8973, 7325, 348, -6964, -6974, 1885, 11141, 10525, 478, -7563, -6779, 1504, 8652, 9285, 3391, -4804, -8262, -2968, 6888, 11278, 5238, -5337, -9522, -3497]
1222c497Q870L458l767p526n236R51P446P853o92r192q440O43R282Q001j251p980
1238a077p318n11O221P839K445n499r072l944N522R701L978m845q892m667L550
1253f569Q264N891j937q163p120J155Q416Q240l82q560q292P62Q804P121m78o203
1269I49n873k197L457Q418N816m322j1398n245O946J0512K674n001o342l941P8
1284e469O541Q940O15j0699r435L112J0320M766k573m701m781l316K866R776N348
1299A1310p050j1502k429P625P874J640l677o599o242K079R710O887m277r962
1313d613m322K956O043N508J199o154r467j488Q957Q850n16p165n778j830L152
1328d668P657O140m031j1431n140P831J0404Q98n693m824k547k54N182Q863J595
$$ y = [-3497, 5373, 8831, 5064, -2462, -7698, -6747, 699, 8552, 7860, -1332, -9772, -9129, 153, 8154, 6903, -1077, -8395, -8906, -2685, 5154, 7599, 2100, -6972, -10916, -5394, 4307, 8285, 3440, -5452, -10119, -6569, 1695, 7586, 5649, -2514, -9634, -8479, -63, 8177, 7795, -765, -9057, -8295, 509, 7630, 7152, 949, -4924, -7121, -3664, 4754, 10570, 6248, -5150, -10395, -3449, 7063, 9737, 4736, -1606, -5547, -5469, 1072, 10012, 10627, -72, -9507, -6395, 3925, 8691, 6118, 1417, -3364, -6680, -3814, 5962, 11310, 4260, -7242, -9671, -2046, 5828, 7468, 3791, -2808, -9050, -6971, 2739, 9626, 5349, -4613, -8935, -5979, 64, 5572, 6771, 617, -8850, -10338, -1381, 7469, 6953, -212, -5990, -7820, -4668, 2989, 9129, 5098, -6333, -11473, -3642, 6762, 7660, 1967, -2857, -5404, -5658, -476, 8387, 9982]
1343I982j0182j0082K516J0791N810l188n165m159k825K739R176O091p113j2392
1357h001j774R230P717p15m064m076m345j031P409R402j589j1358o638M663Q157
1372B987K918j017l914p166l242P441J1217K1j0207p544K154N545L966L572n52
1387F179q818q077M793J2180L521p368o432o49Q91K898P741L574r621j2450K875
1402h763J3367N619o079n721r57k219l82P876Q338n587j3767k622J0710P472k550
1417D735m620k265l902k188P820J1117k039j4133p144O924Q841J624j847k000
1431I23n107m706M614J0769K074r089q194K214O713M185J488j278p226p564L802
1446f382J2301N847p140r035j074L577L187M061L041n570r860q05J1837P907n410
$$ y = [9982, -200, -10282, -7766, 3025, 8835, 5647, 482, -3677, -6502, -3763, 5413, 11504, 4391, -8001, -9775, -545, 7172, 6457, 2393, -1683, -6028, -7059, 350, 9752, 8163, -3195, -9833, -5170, 2987, 5905, 4888, 974, -6192, -9434, -1993, 9224, 9245, -962, -8506, -6352, -807, 3159, 6731, 6179, -2639, -10716, -5923, 6257, 9778, 2410, -4022, -4671, -3780, -882, 6859, 10433, 812, -11638, -8763, 4604, 10223, 4144, -1577, -2534, -4753, -5135, 2741, 11079, 5492, -8275, -10897, -187, 7285, 4735, 115, -2150, -6052, -8240, -420, 10697, 8658, -5475, -12619, -5695, 3146, 4770, 2923, 923, -4184, -8890, -4276, 6493, 8567, -522, -8716, -6502, 211, 4396, 5884, 4606, -2620, -10184, -6382, 5919, 11766, 4626, -4409, -5483, -1906, 1281, 5342, 8383, 2813, -7047, -7852, 3985, 11892, 6482]
1461F482q330k149Q83R54N775P776k983j4318o077J0327J0810k474p672r46k68
1476b210k966L139R594J014j3023r424P621J1781J011n661k371k720n791K205
1490g801J2530O042j0410j1562K510R612K420k345k75k591o750M21J2002P751
1504A1554p792j1484j021O546L783K705L242l621j0438k980J0821R580m129r296
1518b530j721L439J748K890N577k377j2033o015R903J1905p14q102l939l29j808
1533d106K531Q950L275j1243j0034N383J2187J279p733l736K49k267N52R591O497
1548A1375q838j3696j96J1379N394l049k203r79n029k724Q279R511m818j3047
1562h641k537R467O378j046r22k123o987m689Q172J2576o40j1163n163L919L555
$$ y = [6482, -1848, -3997, -3114, -2160, 3615, 11391, 8408, -5910, -11987, -1660, 9150, 6676, -996, -1942, -2210, -5176, -2037, 7557, 8571, -4452, -13876, -6255, 5526, 6537, 876, -1495, -4215, -10006, -7801, 4729, 10771, 361, -11201, -8691, 921, 3341, 996, 721, -1870, -8620, -8199, 3803, 11554, 3762, -7722, -8743, -2197, 1586, 4291, 7533, 3912, -6526, -9506, 1315, 10895, 6766, -2530, -4251, -812, 936, 3826, 9403, 7026, -5007, -11022, -1119, 10786, 10072, 1970, -1969, -2298, -4106, -1575, 7375, 10650, -593, -10627, -5244, 6943, 8222, 489, -3247, -2998, -5265, -4713, 4878, 11375, 2537, -11159, -11355, 24, 5418, 2369, 166, -813, -5842, -8566, -287, 9224, 4406, -8641, -11178, -1711, 4667, 3621, 2699, 576, -6411, -11100, -2928, 9648, 9008, -2155, -7318, -3399, 156]
1577A56P12L560J035q102p155O749J2929M65j1023n450K484K179J784O711L960
1592A0994r089j2219K680J2893M152o782m390R14r63j217O716O861o730j3559
1606i739n69J2918P148m475n474q69l336k950O568J0541j842j2632n192Q134O945
1621E176j616k845q06l935l998N926J1390L77j2309q051M299P675J983Q01L0n628
1637a531p422K299J1324L830q300p323K173M306J826K628K007o133j0567J003
1651i880J3440P021o308q205m67J324k57M095O885k551j1773l445J1020Q492m297
1666E094p481n55K56j454M536R760k25j3147q307P787J0385m9m630q91j293m244
1682d458J979R574L187j0224r155M266R253K321k254j852l889o291J139J1240
$$ y = [156, 868, 4428, 5463, -2639, -9794, -3045, 9884, 10349, -674, -6124, -3640, -1461, 323, 7034, 10994, 1905, -10314, -7634, 5259, 9411, 2629, -1761, -847, -1810, -3027, 3689, 10550, 3820, -9739, -10308, 2610, 9758, 5283, -191, -1060, -4396, -7346, -778, 9763, 7921, -4711, -9903, -1769, 5176, 3560, 715, -91, -4026, -8024, -2098, 9292, 9669, -2640, -10691, -6392, 1283, 3266, 4067, 4097, -1531, -8953, -6654, 4670, 8500, 200, -7123, -4950, -644, 1182, 3810, 5817, -316, -10883, -9880, 3560, 10581, 4273, -3932, -4399, -3075, -3332, 763, 7648, 5097, -6676, -10121, 899, 9391, 5094, -2387, -2942, -2686, -4140, 396, 10156, 9931, -3216, -11523, -3736, 6649, 6600, 1970, 1079, -214, -4458, -2479, 7095, 10282, 58, -9097, -4831, 4422, 6743, 4489, 2637, -1252, -7543, -6404, 4836]
1696D836O668p658j0332R9N729K524L71J447l173p981j160J0071P732n530r415
1711e772j708L223J863L457N190k384j0708n171Q619J0057j596p803k411J795
1725c349K08K556O168O82r843p829O327J1273J607n932l532j096k009J465Q441
1740E137N354p513j0602J449J0033L841l862l076j217l150L07P973O597n246j1037
1755e012k139O908N267K92p42k770n859k682P235Q636k431r837m144M512M497
1770A731J596J093j854p748m858O298J0332N49q278n033J253J571J975N002J763
1785E392p819q163L968J0565K904o820m932J8M06J591O406M163o445j0233L67
1800h632R512N625k880m233j567k174j13O686O259l183j0082l330P089O892J83
$$ y = [4836, 11504, 3846, -6486, -6387, -658, 1866, 2237, 3684, 511, -7470, -8630, 1441, 9173, 3643, -5772, -7480, -4257, -2394, 1063, 6253, 3869, -6839, -12010, -3391, 6666, 5070, -2733, -5144, -3349, -3141, -585, 5583, 6265, -3578, -11407, -5080, 6193, 7800, 1868, -1664, -2760, -4769, -3304, 5137, 10491, 2978, -7624, -6175, 3858, 7699, 3837, 761, -456, -3606, -3299, 4674, 11271, 6025, -5012, -7151, -243, 5024, 5316, 4574, 1804, -4055, -6737, 498, 9134, 6703, -3134, -7278, -2766, 1731, 3327, 4420, 2566, -5182, -10040, -3742, 6590, 7139, -1139, -6172, -4919, -3348, -1373, 3629, 5392, -2427, -10590, -6622, 3943, 6847, 27, -4905, -4887, -4481, -2890, 3516, 7679, 1234, -8999, -8632, 880, 6505, 3625, -608, -2175, -4349, -4462, 2224, 8483, 5300, -4782, -8112, -1023, 5869, 6052]
1815F052k790l054l932j203N564P586k65q359n559L032N422K718Q3k307n220l773
1831f005M436Q425J881o911o570j33M107L816K666o44n976o362J697Q689M621
1846G737m483o436j747J163K744M180K317m485q398j496P897P008j880o249k935
1861e063l33J156M582M957j728q715m568N817P421J185m047l427k191q63L988
1876a829P323J085p833o866K470P117L661j162k785l945k653L036P611K963n426
1891B767o850l94M590M292K195j504n009n355J709P763M727l425o478k947J489
1906b430L947M385J274m933o970p79O343N902q97n083m137j290J899N146L730
1921F107k777p487l859L712O996K224l289n251k967R70M479M758r9n798n817O82
$$ y = [6052, 3262, 208, -3724, -4927, 637, 8223, 7958, -401, -5960, -2928, 2494, 5212, 5295, 2988, -2232, -6005, -1569, 6856, 8737, 1826, -4744, -4877, -770, 3046, 5712, 5068, -908, -7270, -5573, 3116, 7737, 3254, -3182, -4929, -3766, -1022, 3158, 5475, 990, -7408, -8904, -1007, 6001, 4121, -2128, -5063, -5396, -4240, 342, 5299, 3571, -5144, -9712, -3895, 3526, 4711, 664, -2763, -4954, -5817, -1829, 5494, 6579, -1254, -8120, -5650, 1467, 5128, 3966, 1181, -2764, -5417, -2381, 5230, 8193, 2767, -4083, -4477, 113, 4405, 6600, 5096, 87, -5268, -3559, 4204, 8931, 5506, -972, -3919, -2430, 1517, 5902, 7176, 2243, -4727, -5506, 837, 6739, 5842, 759, -3378, -4668, -2769, 2377, 6107, 3330, -4157, -8016, -4304, 2692, 4916, 1627, -3624, -6591, -5621, -1142, 3616, 3517, -2281, -8098, -7416]
1937g416O301N044o87m972m102j059L788N364K876l338o579k863M456O612K198
1952E623k931n212k614J781N563M331r98n786m379J503N427M345j54m547m947
1967b995r71N049N915P61m895n467r22L420M855K335k589o243l637L032O356K864
1983F868l271n329k824N22M354M801j29n966n686Q26N291M544m78m314m957j075
1999f823L850N417J655m003n323k029L202N496K969k530o168l179K809N871L080
2014D294j550m172m165PN206O058j26o125m821J184N052L692N11k509m797k765
2030e026L259O742K662m437n945j192K911M057L010m95n641m892J334O571M176
2045G094k342n329l452M64L764M662J125m379o228r59M823M987P29l324m565k665
$$ y = [-7416, -1115, 3929, 3242, -1730, -5832, -6891, -3103, 2261, 5137, 1799, -4780, -7643, -3187, 3425, 5623, 2692, -2520, -5134, -3353, 2210, 6541, 5543, -243, -4622, -3119, 2308, 6653, 6499, 1952, -2995, -3966, 1083, 6998, 7759, 2864, -2603, -3525, -105, 4750, 7085, 4496, -1747, -5384, -2352, 4004, 6868, 3597, -1732, -4556, -4034, 320, 5121, 4992, -974, -6660, -5834, -543, 4001, 3523, -791, -5748, -6823, -2973, 2444, 4099, 96, -5227, -7256, -4054, 1442, 4411, 1881, -4287, -7466, -4657, 1214, 4294, 2744, -1428, -5593, -5586, -380, 5678, 5552, -573, -5394, -4210, 842, 4534, 5045, 2536, -2261, -5026, -1767, 4975, 7637, 3200, -2745, -3937, -1026, 3031, 6041, 5546, -95, -4987, -3653, 2918, 7094, 4752, -577, -4029, -3565, 199, 4861, 5986, 1607, -4621, -5580, -757, 4230, 4959, 1635, -2930, -5595]
2061e595K145N990L297k744o674l100L559M895K404j699l943l871j46M918N509
2076D945k37n729n120P75N006L763L11k609m432k938K767O881L280m697o852j146
2092f032M447M121J413j014l264m806o0O060N822j873o560l116K110L262L016
2107C526J322k309o176k467N269O972L2n511l976k0J881L474L885r10o368m948
2123f324L527O729J902l185l258k160j004L051O188J547o866o924K194O292K781
2138D490j570j774k815l339R16O972L896m893p203n14M625L388K74j48k937n181
2154e813r33O843O616k686p449l245L148L472J956J365j522n510l242M399P283
2169D682N67n739l823O35K220K689L190O5n827n304K903P933K616l784m527j314
$$ y = [-5595, -3450, 2540, 5837, 3093, -3581, -6681, -3122, 1773, 4177, 2478, -1465, -5336, -5482, -564, 4945, 4708, -1021, -6141, -5366, -360, 3403, 3714, 1105, -3327, -6265, -3498, 3383, 6663, 1966, -4886, -6032, -1585, 2536, 3949, 2935, -329, -5135, -5195, 865, 6687, 4814, -1746, -4862, -2752, 510, 3526, 4848, 2539, -3637, -6104, -835, 6137, 6169, 658, -3318, -3338, -1457, 2017, 5902, 4992, -1376, -6324, -2797, 3932, 5834, 2649, -609, -2769, -3773, -722, 5466, 7013, 147, -6777, -4583, 1709, 4490, 2920, 1146, -1669, -5008, -4092, 2880, 6776, 1883, -5320, -5834, -1209, 2179, 2453, 2305, -632, -5813, -6746, 97, 6713, 4027, -3422, -6667, -3519, -47, 1909, 3274, 1752, -3758, -7000, -2601, 4682, 5249, -490, -4313, -3678, -1458, 1231, 4421, 4486, -1341, -6645, -3742, 4191, 6807, 3023, -1504, -2818]
2185b818M35K210M584K254m774o871M61O800M213k428l224k179j780L93N464N377
2201H117l285q702k606N995M714q32j859j239l186k098M586O900j399q332m175
2216g401M457M513N66j6l33m550m935L229Q607K105p102n234J908L649R05J493
2232A861R12m017n927J548Q613L641m924n551q1J440J261L610L461l354p718j004
2248f229P218N167k678m401q93K8N7L883M847k209q443l005N982N842l54k589
2264B223j602k477k542L160P391O21p967n235M210N449M86j883q66k486m017K239
2280c296P719L430o894p112J214M832J405M36J141k285n854q35P449N527m735
2295B142p006l21L928K035J092K190k083o895k863O455P315j779n765j640J155
$$ y = [-2818, -2383, -173, 4411, 6665, 1891, -4980, -4519, 2281, 6494, 4066, 842, -1337, -3117, -2724, 2740, 8117, 4832, -3870, -6476, -481, 4233, 3401, 1542, 303, -2883, -4981, -395, 6505, 5106, -3226, -7401, -2944, 1569, 2135, 2119, 1786, -2764, -7699, -4470, 4137, 6242, -860, -6094, -4186, -537, 368, 1861, 2773, -1244, -7171, -5623, 2990, 6631, 1707, -3844, -3925, -2485, -1224, 2386, 5847, 2493, -5225, -6229, 989, 6156, 3478, -923, -1816, -1788, -1731, 2152, 6999, 4790, -3653, -6658, -676, 5166, 4812, 2223, 621, -1856, -4398, -1238, 6153, 6774, -1193, -6428, -2218, 3231, 3717, 1834, 968, -1518, -5535, -3296, 4423, 7853, 959, -6153, -4939, -107, 1298, 1734, 2875, 590, -5264, -6099, 1350, 6877, 2142, -4864, -5185, -1257, 778, 1870, 4060, 1977, -4918, -7781, -1326, 5989, 4210, -1555, -3195, -2040]
2310b040L37J366M331J02o888m534N027P649j55n239k381j79r04J919O446K372
2326G229p106o846K673O590J434k801m81o60l492m4P086M263n900q174J007O532
2342A310K809j233n9j409n119j899O377O897l119p659j182M439J824m08J142l50
2358B361n504l322N512P986q08p930l492K204J949J189L141J117n539n785K745
2373d176P444J462n374k891Q93L55P93M337K231n608p191J293P911L708l420l051
2389a284n42j688l72M987N042l424p869n01O615L545k048j888m53k766k034N152
2405D72P413j526q593l680M668M128l48J16L40l507m159L304P398P06p456m314
2421e038L217L676M19Q45J107m385o276J634Q133L421n035n246M19J776N86K230
$$ y = [-2040, -1703, -337, 3994, 4096, -2792, -7326, -2299, 5350, 5195, -44, -2425, -2604, -3508, -1589, 4857, 7229, 123, -6723, -4050, 2540, 3974, 1173, 692, 32, -3460, -3504, 3582, 7845, 1945, -6229, -5222, 1310, 4119, 2886, 2827, 1418, -3701, -5600, 777, 7674, 4555, -3104, -4286, 153, 1977, 1569, 2711, 2361, -3143, -6465, -953, 7033, 6225, -1705, -5197, -2993, -1044, 145, 3286, 4403, -1136, -6921, -4176, 3268, 4730, -644, -3535, -2642, -2287, -1494, 2843, 5074, -534, -7725, -6432, 1479, 5187, 1767, -1284, -1826, -3514, -3886, 1101, 6143, 2719, -5150, -5651, 964, 4509, 2461, 573, 120, -2646, -4680, 472, 7885, 6359, -2234, -5914, -1246, 2882, 2534, 2650, 2990, -517, -4676, -1372, 6026, 6732, -724, -5038, -1821, 1855, 2274, 3119, 4226, -159, -6435, -4801, 3332, 6753, 1718, -3528, -3109, -1333, -747, 1483]
2437A483K227k878o986P6P402M171l649m696n73M9M9L540N102k061p702k850N693
2454a603N291j344k851p77r38j549L257N878m12p539m156M332N715M70j441p25
2470A608k601l381J406P323K889o037n635J695M527J357r27R9k113m373M67P227
2486C531L994m783o280o23L493J529J017K032j846n985k016N843N690k153n601
2501b158j575J524J160K027L186j119o654l814N241O512m48m194j839J2j020J811
2517a348M974J357o165n144L069O085J115k648j834j319k088J496O303K756n596
2532A013o519J180N123J969o84m06j561l504o16N743M608l432o589j153L746K869
2548A787P56K56j852m604j850M823O041j191n340k864J802K141J409J752m26m838
$$ y = [1483, 3710, 832, -6154, -6078, 1324, 5495, 1846, -2850, -3423, -3374, -3325, 215, 5317, 3256, -4446, -7296, -1603, 3688, 2344, -507, -1284, -2222, -3771, -514, 5364, 4952, -2587, -6743, -2411, 3304, 3774, 2333, 1608, -993, -4374, -2968, 4355, 7244, 1207, -4428, -2733, 1794, 3151, 2224, 2323, 210, -4163, -3696, 3531, 7525, 2742, -3538, -4161, -668, 861, 1878, 3910, 2064, -3921, -5937, -94, 5596, 3443, -2158, -3733, -2209, -1049, 978, 4164, 3045, -3609, -7423, -2182, 4330, 3882, -312, -2151, -2139, -3159, -1348, 3626, 4983, -1182, -6326, -3257, 2828, 3943, 1295, -539, -1858, -3946, -2450, 3853, 6609, 1013, -5506, -4326, 797, 2766, 2082, 1676, 115, -3389, -4005, 1738, 6346, 2914, -3675, -4828, -1082, 1787, 2543, 2799, 947, -3657, -5507, -684, 5357, 4166, -1174, -4038, -2236, -95, 1314, 3066, 2640, -2198]
2564b198l446L420O071J604m508l761l63J314K355L374R24m665n362J392O149
2579B300K480k305l220p54q44J131L897K724l426o305o88N146L859r59j971j979
2595i14k311k90M323M864k412o139k643L899L726L44q93j324l316k196L632N777
2611D127M87n771l879J672L035J691J114n67l842l454K256O070J813l985l884
2626c117k72J818K343K379L89l489m625Q19N356L361j558l742k254N0K050L705
2642C213J961l017n395q68M077M101q3k600k740j461Q13L596L186j267m921l137
2658d542K190M238J636j118k802k701n98K765M726M76m763m073M82L785K687K61
2674B649k088k704k538J657M524K974k915m630j562K411L325J694n66k677l636
$$ y = [-2198, -5644, -2224, 3847, 5451, 943, -2818, -3181, -1867, 488, 3862, 4786, 121, -5241, -3849, 2300, 4780, 2475, -745, -1499, -2343, -1212, 2685, 5409, 1983, -4322, -5010, 136, 3995, 3036, 1065, -914, -3225, -3515, 808, 5672, 3260, -2879, -5522, -1623, 2103, 2447, 1554, 230, -3086, -5282, -1650, 4127, 4614, -1157, -5036, -3364, -329, 1362, 2476, 1909, -1933, -5387, -3131, 2939, 4752, 767, -3117, -3389, -1571, 772, 3151, 3540, 51, -4574, -3755, 1601, 4962, 3404, -338, -2592, -2542, -492, 3213, 5174, 2157, -3238, -4106, -29, 4072, 3989, 1389, -1351, -2812, -1999, 1597, 4783, 3516, -1405, -4542, -2352, 1886, 3522, 2404, -398, -3099, -3697, -932, 3794, 4270, -493, -4566, -4084, -299, 2388, 2649, 561, -2143, -4681, -3024, 1500, 4474, 1559, -3071, -4633, -2222, 1103, 2797, 2231, -446, -4082]
2689d082qM494M081j090m497k310O21K705K665J389k450m143j478L356M087Q86
2705D226k854l108j446J332L560L033j399m480l088K082M318J780j224l031k550
2720b849m63L014L823L71l688l787j39L413K847Q60k319l546j548J933M315J966
2736D203k452m131j886K122L414K242j099l563k698O44L570K936r2l317l504k09
2752c820L388L656L13k987l424q76K654L388J410j985m084j527K150L959J585
2767C800j782l415k101Q16L599K909q15l775l047M89L536L124j56l137l220n85
2783c760L188L570O08k447l896q98K419L437J556j630l675k043J382L804K530
2798D145j314l888k368Q99L614K531m71k793l338j52L044L832L04l369l336j73
$$ y = [-4082, -4090, 404, 4485, 3395, -1102, -3412, -2791, -86, 2579, 3968, 1518, -2625, -4103, -747, 3340, 4226, 1372, -1736, -3182, -1850, 1710, 4743, 3344, -1136, -4224, -2142, 2176, 3956, 2732, -299, -2849, -3312, -298, 3525, 3896, 208, -3579, -3718, -305, 2542, 3402, 1083, -2463, -4011, -2078, 2237, 4203, 1751, -2380, -4266, -2144, 1270, 3512, 2413, -1150, -3848, -3204, 366, 3302, 3210, -107, -3611, -3820, -432, 3224, 3537, 550, -2874, -3750, -1096, 2292, 3702, 1717, -2367, -3894, -1744, 2215, 3800, 2018, -1397, -3498, -2682, 917, 3826, 3011, -764, -3811, -3322, 214, 3338, 3182, 45, -3175, -3760, -572, 2998, 3606, 1159, -2737, -3635, -1216, 2221, 3777, 2147, -1528, -3571, -2189, 1615, 4145, 2831, -1057, -3425, -2526, 1088, 3619, 3148, 355, -2983, -3135, -91, 3741, 4045, 676, -2660, -2833]
2814b833K375K851J432j717l607k572J891M438K248k689l760j559J532K560K272
2829B862l1l263l592J75M029L472j054l448k317J9J979L029J482k105m448j576
2845d787L396L856O70k463k751j407N93L742L235j215m422k634J830L657J715
2860C015m77k238k356j277K713M425P73m034l697L07K996K639N53j332k975k630
2876c595J610M703K106k791m081j011J888K088J799M42l048l927k75M383L932
2891D223j166m131k126M01J661K649J818j698m628j914L401M204L65k952k266
2906b159m20K56K317L166K54m654l580J834M613K014j847k135j694r10J959M146
2922C160J350l679m543O80L558K068j32j114j868k757O00M582L334k755m958p77
$$ y = [-2833, -458, 2393, 3825, 2108, -1499, -4071, -2180, 2258, 4506, 1817, -1943, -3502, -1970, 590, 2862, 2831, -432, -4024, -3849, 180, 3652, 2598, -850, -3167, -3148, -1169, 1860, 3342, 1237, -3211, -4787, -1391, 2465, 3135, 672, -2079, -3486, -2893, 849, 4084, 2869, -1553, -4187, -2357, 1300, 3015, 2538, 300, -2056, -3333, -620, 3805, 4578, 544, -3153, -2846, 150, 2789, 3342, 2010, -965, -3595, -1985, 2718, 4824, 2033, -2048, -3059, -1171, 917, 2716, 3158, 110, -3817, -4092, 291, 4223, 3057, -1074, -3200, -2799, -1138, 1511, 3329, 1631, -2997, -4911, -1510, 2694, 3059, 107, -2159, -2579, -2323, -6, 3160, 3414, -1240, -4820, -2986, 1627, 3641, 1794, -341, -2035, -2945, -986, 3160, 4510, 831, -3712, -3032, 526, 2594, 2462, 1348, -520, -3277, -2677, 1905, 5239, 2484, -2474, -3251]
2938c251K357K057R31K49j776l368j190M245M248j250m825j996J700J610J536
2953A277J621o94m140l049L037N147M74l403k696K37O57J643K660O15l912m190
2969d716J805N274J799k550k493p99l65P68L499K197k848n267k51M683K595j076
2985B255j770j137k049k00M184L646k073n726j526L293K974K28m17r86l037j993
3001d334L304M814n0n165k558J896K366R00P34k55l466l065K433N789J193m143
3017C93l263N31J664P55K089J267k820m602N62N296K855k925l271k89O24P01K651
3034B218K482k365n606j041M784L635j353k649n07r63p18K403L912r34n507k285
3050d494L152M146j66j847j073k143j401K426M943M77n132l644J887L143O69j15
$$ y = [-3251, -894, 1163, 2094, 2343, 567, -2801, -3991, 254, 4502, 3252, -1573, -3569, -1869, -259, 1277, 2898, 2204, -1936, -4985, -1948, 3199, 3673, 270, -2426, -2189, -1532, 111, 2771, 3386, -526, -4716, -2911, 2363, 4162, 1612, -881, -1680, -2045, -1277, 2222, 4419, 1571, -3696, -3947, 736, 3331, 2255, 485, -652, -2701, -2901, 1283, 4929, 2856, -2870, -4396, -1103, 1871, 2099, 1682, 696, -2341, -4334, -1030, 3784, 3734, -1431, -3989, -2093, 273, 1173, 1907, 1652, -1814, -4879, -2446, 3343, 4536, 393, -2870, -2339, -675, 80, 2169, 3436, 616, -3986, -3424, 1872, 4727, 1802, -1469, -1758, -1134, -433, 2218, 4700, 2335, -3271, -4312, 472, 4107, 2754, 105, -402, -1365, -2083, 320, 4232, 3298, -2209, -4494, -1342, 2804, 2638, 791, -282, -2425, -3826, -1400, 3543, 4020, -1112, -4756, -2869, 274, 943, 828]
3066H28L31k134l257J239N349K178m316m219P45L094P72R07J206k123m555k65
3082d220N244L667k506m211m8J555L68J383K273j261m706j887M367M854j129l989
3098b46j271J16j06K011L209K53m817l682K773M770p8k629j020m29j064J059M092
3115B941J499m668m853J778M272J474j178n83j357k884J92M812L012l376m976
3130c895M81L505J463m84K54q52l884q41M554M598j848n005j307K115J139Q35
3146H28J761k53m123k606L523N244q37m506j448J283R28N89K649Q05m364m269
3162d796K029N381J223k827k001j30n52M38L263J906l424m810P99M957J965k104
3178A317j552r76j261l39L601L547k198m953j267L721K483p52l90p72k451j322
$$ y = [828, 1159, -975, -4232, -2993, 2356, 4534, 218, -4001, -3256, -162, 610, 1517, 2723, 600, -3955, -4220, 1024, 4691, 2185, -2026, -2074, -519, -151, 1232, 3505, 2244, -2462, -4349, 18, 4872, 3743, -246, -1517, -1401, -1507, 504, 3713, 3966, -851, -4533, -1760, 3010, 2932, 303, -717, -1146, -2210, -1151, 2941, 4440, -228, -5081, -3303, 969, 2443, 1265, 682, -675, -3559, -3367, 1445, 4457, 1081, -3895, -3414, 91, 1554, 1070, 1324, 472, -3412, -4253, 301, 4899, 3051, -1954, -3261, -1146, -7, 828, 2589, 2336, -1787, -4393, -870, 4374, 3537, -969, -2417, -1134, -206, 383, 3032, 3837, -527, -4796, -2767, 2614, 3837, 1010, -991, -1121, -1673, -1235, 2028, 3934, 510, -4300, -3501, 1456, 3421, 1317, -235, -1211, -2472, -2811, 790, 4337, 2139, -2814, -4081, -360, 2123, 1371, 981, 209, -2242, -3564]
3194c564L605M214r53n307k041K741K442N19L60n6l242k888K191N448O12m026
3210E5k756J182J502N88J270P77k943l928J293N456K072l699k939QO26N66K326
3227A456K072k162m830l84M322K852j637k461o01l60j76K684L178j468n170j851
3243d536L629L593o38j291q60j445j384K255M113k14m411k419J978L140O72o46
3259A536n68k186k317J966M675J419l944l543O94K364R38P72L25j989l246J27
3275b977M365K605k464l689l07J157J263J506J336j668m043j299L902L704r00
3290B491l421j004N58L52J469K254l96m080k470K680M101L32k394j487p12m79
3306b206J623L299J219m071l684J537L780J129j274j088j034j592P20L906J843
$$ y = [-3564, 41, 4255, 3302, -2005, -4046, -1305, 1137, 1656, 2016, 1960, -1282, -4170, -1979, 3469, 4081, 55, -2701, -1519, -17, 571, 1841, 2618, -325, -4253, -2960, 2496, 4568, 869, -2070, -2062, -1436, -870, 1456, 3528, 1366, -3464, -3848, 474, 3326, 1689, -772, -1373, -1733, -1909, 775, 3953, 2485, -2685, -4536, -907, 2686, 2048, 757, -103, -1548, -2932, -677, 3436, 3222, -1189, -3608, -1630, 1510, 2182, 1536, 968, -1218, -3535, -1569, 3106, 4525, 581, -2962, -2268, 96, 1034, 1806, 2131, 142, -3104, -2977, 1388, 3993, 1529, -2160, -2467, -1310, -47, 1459, 2795, 1127, -2916, -4215, -313, 3391, 2491, -930, -1934, -1376, -1024, 445, 2699, 2303, -1777, -4247, -1567, 2534, 2866, 472, -1015, -1727, -2206, -583, 2716, 3935, -136, -3820, -2283, 1497, 2626, 1352, 264, -770, -2362, -1642, 2264, 4107]
3321D107k996m178J40K978J745j61o8j474k842m98M261K930j975m062q23K018
3337h98J302O32R46j186l320j312L531L566n72l344j705L96R67J586K048m45l462
3354a270k706K350L773Q76k380j959o11N03J668K526M56l210l077N99L533J857
3370B928r64j619j667p93J052K982J911k383l782p59K682K714j77j160j752j464
3386b251m1K662K876j099l581j935J654K248P54J47j470k163j306K185L910n5
3402B535l042k477N06J992J555P24m48k667k239J429L821J741k407k604k97Q07
3418a071J362K105L33k182l237J15L618K435j124k302j157o50J546K338J402j907
3434A624l212q70K189K661M82j482k005j460k6K764K418q33l379j905J009K597
$$ y = [4107, 1111, -3067, -2927, 51, 1796, 1635, 1567, 93, -2749, -3247, 1014, 3944, 1969, -2093, -2916, -898, 404, 1036, 1982, 796, -2524, -3836, -305, 3261, 2689, -655, -2360, -1964, -997, 589, 2637, 2192, -1270, -3976, -1626, 2147, 3023, 643, -1316, -1927, -1424, 244, 2770, 3226, 16, -3061, -2462, 1071, 2928, 1964, 345, -1322, -2115, -1063, 1919, 3830, 1447, -2335, -3094, -412, 2302, 2125, 965, -787, -2251, -2292, 370, 3246, 2147, -1434, -3369, -1715, 533, 1287, 1434, -36, -2199, -3505, -1320, 2590, 2535, -507, -2984, -2478, -486, 1069, 1793, 1345, -1322, -3561, -2132, 1689, 3430, 1023, -1581, -1878, -1071, 291, 2396, 2729, 547, -2690, -2575, 1043, 3478, 2354, 52, -1105, -1755, -209, 2129, 3531, 1624, -1588, -2458, -269, 2392, 2874, 1392, -613, -2073, -2099, 665, 3083, 2250, -1129, -3034, -2025, 572]
3450E72J356k92j745k245n62K116K789K99k545k355k15J772K083P09j000k544
3466a807j562J247L191J535j378k969j236J318K176J622j16k308k217J11K754
3481C61K246j82k357j911J34J414K306J009j510k876j144K114K707O90j735k057
3497g91j077Q07K416J591p79k561k101O87K654J681o03j901k171k52J850K398
3513A848O78k356k649m85K156K343O29j548k322j229J274K652J128j021k333j404
3529b639O97K199J838l26k400k075L42K262K304J51k063k078o24K095K633L30
3545B646j953k359n61J317K314J212j149k467j434J105K559J374q72k286j659
3560b213L58K176K061j88k383k357K21K493J971k00j604j949p41J540K225J156
$$ y = [572, 1928, 1636, -109, -2354, -2916, -800, 1989, 2288, -257, -2612, -2827, -1055, 1028, 1737, 737, -1807, -3369, -2122, 1069, 2604, 1226, -1743, -2979, -1661, 515, 2137, 2021, -287, -2504, -2393, 361, 2607, 2425, 68, -1843, -1709, -295, 2011, 3020, 1510, -1366, -2510, -396, 2311, 3001, 1266, -791, -1868, -1061, 1355, 2946, 2167, -394, -2495, -1808, 846, 2527, 1924, 23, -2148, -2400, -550, 1848, 2526, 170, -2479, -2964, -808, 1535, 2164, 616, -1706, -2935, -1661, 991, 2119, 1098, -1235, -2639, -1942, 257, 2095, 1769, -631, -2706, -2364, -102, 2202, 2353, 290, -1788, -2412, -317, 2316, 2646, 693, -1666, -2227, -910, 1404, 2616, 1467, -1000, -2434, -1329, 1230, 2604, 1732, -554, -2213, -1855, 321, 2382, 2194, -189, -2546, -2325, 168, 2139, 1939, 335, -1614, -2355, -815, 1410, 2566]
3576B566j632k642r46J242K585J074p66k256j755N94K682J995n99k715j802P52
3592a623K059J673j14j563k174p88K085K574O65k169k414k07J190K164J172q01
3608A729k736j574J294K648J088j211k326j242Q02J716J636J87k175k371P3K326
3624a36K261n75j673j808l27J011K192J554j638l090p98K050K436N19j277j731
3640a030r65J19K211K113k42k861j935J031K457J242l31r08k046j096J670L251
3656B680O48k795k232O4J767J544N74n10j878k277Q78L122J669j549k625q37O30
3673a127J414J399M82j688l003l18K979K343r73k224j159r3O61J589J828r82l271
3690b143j377K175K785J22j429j341q16n6J532K596j50k917k384J507K818J107
$$ y = [2566, 934, -1708, -2654, -1412, 1173, 2247, 1481, -775, -2530, -1936, 746, 2741, 2142, -573, -2375, -1623, 436, 2109, 1995, 432, -1742, -2530, -445, 2129, 2794, 625, -1789, -1996, -806, 1358, 2530, 1729, -1007, -2581, -1287, 1361, 2449, 1238, -1088, -2330, -1528, 188, 1824, 2011, -164, -2535, -2462, -136, 2125, 1550, -123, -1931, -2258, -1247, 945, 2499, 861, -2229, -3027, -977, 1459, 1978, 701, -1030, -1995, -1876, 335, 2448, 2206, -655, -2590, -1559, 898, 2140, 1809, 901, -1145, -2241, -571, 2680, 3328, 533, -1699, -1635, 132, 1676, 2250, 1740, -138, -2415, -1537, 1585, 3254, 1705, -920, -1757, -1127, 287, 1686, 2168, 480, -2523, -2841, 138, 2481, 1508, -716, -1875, -1968, -1307, 282, 2110, 1128, -2143, -3520, -1345, 1440, 1562, 133, -1208, -2024, -2080, -548, 2048, 1898, -1019, -3403, -1896, 922, 2029]
3706B029j035j039j214p87J054K764J021k056k967Q2K492J424O5m83j256k055
3722a961M88K835K223j412l527n75J409J293R94N34j305k565j017K708K499k48
3738B373k670j387O78O04J254J307m09l051k028J928L421K39k129j710k0J84R40
3755d76K277M22k692k864J068L008J322j493j149n77q11M46K859J589k283l476
3771b830R2K550J555k27n55p89j584k26K477K563j264l215r75J817J551M84r8
3788A326p04k119j492K661L459m11l159j755J058J055J030P91k32j903k112J252
3804a255L476O14k256k065J35P02R44J450J019k368k975o3L631J817j641j831
3820f66l89o8L06J606J904j460l659n24K788K441n65j519o26j135n31J927K860
$$ y = [2029, 994, -45, -1259, -2046, -992, 1772, 2793, 737, -2230, -2148, 344, 1768, 1833, 1350, 94, -1961, -1473, 1362, 3585, 2173, -1354, -1929, -520, 773, 1767, 2301, 996, -1569, -2586, 122, 2621, 2373, -297, -1684, -1006, -402, 852, 2159, 1750, -1301, -3329, -1401, 2020, 2259, 130, -1580, -1600, -1416, -476, 1801, 2223, -469, -3333, -2265, 743, 2065, 572, -577, -1154, -1965, -1519, 1340, 2929, 646, -2830, -2738, -188, 1367, 1140, 585, -204, -1788, -2014, 463, 3026, 1762, -1453, -2428, -611, 940, 1424, 1326, 622, -1497, -2989, -328, 3131, 2720, -439, -2194, -1136, -81, 949, 1740, 1508, -395, -2507, -1255, 2221, 2835, 579, -1486, -1351, -649, 295, 1745, 2764, 396, -2579, -2642, 989, 2806, 1165, -666, -1055, -1123, -817, 789, 2693, 1233, -2426, -2950, -162, 2279, 1714, 195, -431, -1566, -2097, -170, 2690]
3837B690o30l571j638K005K203m0p82j85j367j191J477L255M48l326k198J183
3853a667J903N52L13J37j847k119N79L798J398k473k324K97J321M50Q16R46j575
3870E05k972J03L346K335j647k212m98L75j2J441K063j025l424j093K929K314
3886B528n68j938q56k22r1J467K298j39l488k061J612K699L19q95q87p78j121
3903b121J008K952P34k873k601Q31K488P27l76n20r68j916L14L067J975j939k656
3920a874m10J886R53L44J94n20k557p96L063K844j176k988o48Q01J007P22J332
3937B177k13k919j894K264L185j48k496q01L12Q9M50K151M36l129k492J630L297
3954A899M94j712j048n19p66O56K337J600k590l012M64K662J131j054m37p79j491
$$ y = [2690, 2060, -1511, -3149, -1144, 1059, 1019, 237, 52, -1315, -2506, -1029, 2226, 2674, -652, -2850, -1667, 236, 788, 1101, 1238, -609, -2728, -2149, 1649, 3047, 574, -1750, -1453, -132, 318, 1134, 2080, 505, -2467, -2364, 982, 3317, 1670, -542, -1040, -665, -677, 764, 2827, 1802, -1622, -2715, 214, 2528, 1960, 22, -834, -1056, -1147, 320, 2618, 2479, -1009, -3070, -1458, 1241, 1560, 665, -222, -1000, -2121, -1113, 1839, 2573, -300, -2901, -2070, 418, 1145, 769, 249, -719, -2635, -2321, 746, 2721, 782, -1874, -2284, -398, 555, 899, 1093, 573, -1984, -2780, 283, 3127, 1951, -1037, -1685, -884, 123, 845, 2177, 1964, -955, -2849, -585, 2600, 2452, -44, -845, -533, -444, 6, 2157, 2593, -536, -3028, -1398, 1899, 2393, 681, -367, -886, -1652, -996, 1341, 2941, 351, -2661, -2197, 465, 1596, 542, 105, -674, -2165]
3971b165K8K917K024j710l185n94J900J498J06J37o44k008q26K341K625n87k874
3988a017j009J033J153P43N69k00k230j791J945L124N45k430j961M23P47O91J316
4005A651K34j950k335O98L089J124j564j763k58Q5M49J710J291j683k889l44K591
4022A36J873q50j381n91n14j30J603K174p78l237j232K402J923j49p28q15j035
4039a329r72J612L058k6k779j876J230J628N94qj95j562j694J269L001P02k357
4056B96k066M97J214M86Q42P53j814k306K45K928J666j649k118k23M23N97J471
4073A242Q01j268k642p81K601K080m68j761q03l31NJ438J982n36k751j466J648
4090a010K250P8p08j124p79l93J308K210N15k771j864P90J982J111n42m54j305
$$ y = [-2165, -2137, 780, 2804, 1094, -2091, -2685, -785, 713, 819, 956, 312, -1696, -2522, -181, 2444, 1857, -1017, -2026, -993, 160, 903, 1472, 1272, -958, -2749, -804, 2320, 2865, 435, -1526, -1103, -356, 335, 1651, 1885, -65, -2400, -1702, 1387, 2511, 947, -816, -1074, -989, -540, 1170, 2461, 778, -2111, -2455, 136, 2009, 1159, -222, -813, -1327, -1457, 146, 2320, 1542, -1695, -2927, -525, 1398, 1249, 521, -294, -1329, -2301, -689, 2369, 2343, -436, -2312, -1082, 546, 1140, 1132, 937, -625, -2319, -1050, 1951, 2653, 296, -1770, -1273, -59, 427, 1269, 2022, 208, -2098, -1853, 1075, 2741, 1092, -1026, -1249, -826, -229, 1242, 2043, 775, -1867, -2648, -47, 2033, 1565, -196, -999, -1330, -1325, 113, 2095, 1559, -1192, -2658, -1010, 1240, 1318, 610, -514, -1293, -1686, -378, 1832, 2347, -424, -2288, -1498, 484, 1595, 1053, 599, -706]
4107g06r90O50K196J650j863k480j91J799Q35K87O1j278j800J31K360J910j143
4124A428k219r10Q74Q66Q34N95p35k170j076J956K634j34k255j133N5P46R07J498
4142A761l76k327j749J509K543N80j407j396j09k07Q86J787O47k048k369O50K059
4159D34J178l57j000j111p41Q94K055J138j570k343k36J309J266M60m06q85j729
4176a644P7J992J663l84k253j257O65J347J048M23j229j887o55J621K102R3j754
4193c2j431R8P29J281P95n93j605j434Q74K379Q52j177j698o12M18R69J821J28
4211A762j599j978J25J851J691m02j345j095k33N23J637J358j478j949o87J357
4227d62J653N38p30j431r93L89J444J596m88j856j264N27J435J042N1j422j322
$$ y = [-706, -1696, -1046, 1150, 2800, 937, -1543, -1734, 65, 900, 1187, 1248, -30, -1830, -1699, 661, 2571, 1428, -791, -1701, -827, 39, 873, 1468, 733, -1437, -2513, -557, 2077, 1943, -312, -1445, -1390, -644, 263, 1761, 1385, -942, -2691, -1182, 1361, 1941, 534, -862, -971, -1178, -292, 1495, 2142, 94, -2275, -1625, 434, 1612, 1255, 255, -856, -1597, -703, 1352, 2490, 920, -1423, -1659, -350, 916, 1376, 970, 85, -1644, -1567, 425, 2088, 1704, -549, -1806, -1141, 206, 1254, 1677, 448, -1439, -2094, -473, 1629, 1722, -32, -1463, -1365, -636, 645, 1440, 847, -758, -2192, -1318, 1061, 1913, 736, -962, -1574, -1156, -187, 1634, 1762, 163, -1815, -1690, 161, 1852, 1450, 105, -990, -1223, -700, 937, 2295, 817, -1132, -1819, -462, 1191, 1729, 999, -432, -1425, -1036, 408, 2004, 1516, -340, -1604, -1077, 358, 1400, 1451, 29, -1293]
4244a293l85J206J981M23j709j702l26J159J586O61o78j942j051P85J981J100
4260A796r92j618q38N45J376R12K27j556j270Q1J267J877j63j564j316k36J145
4277c27J556M35r41j791m14P94J651Q01r32j602p94N48J480J204l05j633j275
4294a545K52J577J130l0j339j618l9J329J526L93j266j785k48J020J571O97q74
4311G51j752o42Q66J320J039m59j481j357L50J832J219l52j466j331R7J426J369
4328A429K86j521j360m44J494J627J58j112j608n34P14J679R91q64j495j128O34
4345a054J735R78m68j691j091L73J326J368J3j679j481J22J560J118J28r95j227
4362i65q20J090J428R65r08k008o32J189J502O27m28j412j246L72J571J504m18
$$ y = [-1293, -1678, -472, 1509, 1932, 223, -1479, -1805, -646, 940, 1601, 923, -1019, -2070, -1285, 696, 1796, 804, -814, -1652, -1107, 269, 1181, 1408, -148, -1418, -1337, -70, 1807, 1644, 80, -1236, -1472, -327, 1229, 1664, 723, -1068, -1482, -688, 963, 1764, 832, -770, -1564, -1016, 464, 1668, 1363, -270, -1545, -1293, 284, 1414, 1384, 45, -1573, -1612, -283, 1243, 1636, 370, -1415, -1663, -643, 928, 1625, 751, -1001, -1643, -777, 543, 1582, 1123, -358, -1715, -1365, 467, 1686, 1334, -132, -1463, -1366, 60, 1429, 1715, 194, -1166, -1610, -116, 1511, 1669, 557, -1051, -1585, -871, 808, 1799, 935, -560, -1688, -1054, 681, 1659, 1191, -500, -1591, -1218, 108, 1476, 1489, -190, -1671, -1549, 11, 1129, 1257, 262, -965, -1785, -695, 733, 1698, 790, -1218, -1850, -661, 841, 1468, 1040, -372, -1618, -1246, 325, 1829, 1411]
4379A411j878j063K51J494R24L46j074j395o94J493J714K55j349j612J2O21J315
4396G71P54o00j660r69N35K094O50o56j498o11O5Q37J313M20j378j898o4K009
4414A14J153k06r11j075n19M55J723J195j177j973n36R94J497M74m33r34j027
4431a186k45J541J735j58k208j244O93J413Q76M3o47j349r37J228J914M99j661
4448C07j411l4R32Q51O81K26j603j703N94K003J168j112j654n55K71J013R57M12
4466A343j018k140J9J790J264m00j056q38k11K37J140J539p89k202j147J613J886
4483A030L20j094p29p17l11J307J867J06k185j426Q32J692M47ko77j033q83P39
4501g17K116Q25j802j758Q2J324O57L82j46q91j499K19J998J158r27j717k53L35
$$ y = [1411, -467, -1530, -1279, 215, 1139, 1485, 411, -984, -1678, -185, 1529, 1784, 435, -1177, -1165, -544, 771, 1525, 925, -735, -1704, -1169, 925, 1575, 919, -579, -1190, -1125, -288, 1025, 1445, 67, -1831, -1895, 114, 1267, 1061, 150, -925, -1444, -989, 734, 1929, 752, -1221, -1757, -763, 734, 1208, 775, -159, -1186, -1431, 110, 1845, 1687, -521, -1765, -1072, 341, 1217, 1260, 613, -736, -1673, -445, 1469, 1968, 307, -1104, -1138, -206, 645, 1326, 1552, -51, -1754, -1160, 843, 2011, 899, -755, -1310, -1039, -26, 931, 1343, 325, -1815, -1796, -6, 1258, 858, -198, -1036, -1247, -1010, 130, 1669, 880, -1322, -2469, -856, 1030, 1350, 256, -473, -1190, -1501, -194, 1673, 1779, -406, -1832, -1000, 692, 1139, 1137, 460, -573, -1456, -717, 1399, 2224, 422, -1336, -1254, 70, 727, 1109, 963, 72, -1427, -1208, 790, 1948, 1021, -696, -949, -614]
4519f14P42R30M33r53k075k68J675J837m26j696q21N5N34O82J197r6k310q88J365
4538f97J761K96j297r28j30l23R89J761J83j827j891P49J918Q11n55p47n51o67
4556a145L12J956J052j522k186P0J720R83m43Mp29j131m02K037J739j080k173
4573i38n49J180R09L8J78l98j377r52J645K246l71k042r44N93M44N40R10R5j789
4592e82j606J023K433L18j466r26j2J66M40J248N49j705k000O68K163Q47r37n06
4610A15n92o37K89J622J057j180j933m08J733J114j95m53o63q94M6J143J710n70
4628A304k158r90J347J141J16J25l34j315r26R24K383J25k042j363O04J049N96
4645E86J92J17j297j575O40K259R14j627j330k7Q81m1Q29Q26j163j836j00K190
$$ y = [-614, 128, 1058, 1491, 538, -1537, -1805, -130, 1707, 1281, -415, -1236, -1181, -647, 35, 1232, 1136, -1174, -2062, -697, 1064, 1360, 63, -865, -995, -1318, -329, 1432, 1615, -212, -2103, -1354, 564, 1375, 820, 73, -478, -1145, -833, 1123, 2175, 653, -1533, -1463, 257, 1240, 797, 801, 72, -1059, -1461, 576, 2315, 1235, -938, -1487, -307, 602, 640, 818, 420, -957, -1909, -264, 1982, 1611, -431, -1375, -782, -338, 202, 1112, 1207, -582, -2188, -1165, 1268, 1586, 120, -806, -818, -652, -212, 1036, 1585, -120, -2120, -1452, 711, 1558, 621, 115, -477, -1114, -825, 797, 1854, 674, -1259, -1667, 66, 1180, 985, 532, -131, -1025, -979, 164, 1874, 1304, -854, -1844, -497, 644, 760, 885, 551, -764, -1690, -766, 1617, 1742, -300, -1663, -1059, -10, 586, 778, 895, -402, -1977, -1337, 922, 1836, 209, -1121, -1148, -267, -308, 521, 1347, 184, -1652, -1752, 438]
4663D38J551j199j245j34q3K83R50J339p72k098q49J886J363m88r11k59k15o42
4681a085J029J718j32k138j277J244J960j80o40j15r47p57O76K145K16j866j341
4698a490N54J191N03k29K77j049j379K96K276Q30j336j830p2Q70O87O23M90o82
4716E30k057l43J861J872r86j394n14P03K7O63Q75k12k229q21J760J839r2j321
4734A61p70J36m83Q74J516L2j680j572R39J949R9r41n05j70n00K49J873P11j591
4753C27j894K26J809O30k87l97m92r86j42J848J277j139j949j82J351M83R2K94
4771H69m13j382r71J969J717n00j866o45O39O66L49N54r1j631j110J266J980o1
4789A339j413q85J93J64P02Q36N49j575j776Q18J857O05r03r19k99l03K25J577
$$ y = [438, 1989, 790, -455, -589, -672, -389, 561, 1900, 1128, -970, -1819, 67, 1430, 942, 31, -228, -443, -1085, -56, 1662, 1530, -608, -1885, -641, 1319, 1139, 499, 384, -563, -1320, -644, 1501, 1717, -149, -1490, -936, 255, 758, 529, 806, -243, -1622, -1326, 950, 1780, 444, -1386, -1458, -588, 99, 722, 1212, 530, -1527, -1870, -9, 1863, 877, -517, -1031, -328, -301, 362, 1237, 1025, -1204, -2025, -265, 1574, 1482, 161, -609, -473, -956, -82, 1434, 1466, -214, -1786, -847, 1102, 1201, 260, -245, -415, -915, -666, 1207, 1918, 327, -1567, -1341, 468, 1098, 811, 414, -78, -1064, -1206, 642, 1919, 780, -1169, -1351, 0, 483, 575, 869, 456, -926, -1897, 72, 1789, 1289, -577, -1222, -583, 83, 432, 986, 895, -736, -1846, -580, 1400, 1339, -74, -959, -766, -602, 100, 936, 1485, -90, -1866, -1048, 809, 1414, 511, -408, -707, -1010, -785, 792]
4807G92Q61j299j735k45J785J047m49o03n08n90j75J510J179m83k089o58J107
4824e53J321N4l06m25r55m54J141J940j97j883q65M33J285L20M6j28j016j246
4842a488O78J834N38j197j310J75O65L89P46J91j243j676L44J936R32q88j209
4859e83k41k0K89J151O85q89j582n97J800J210m81o98n75m74P3J125J207m17j772
4878g89r26J060J623j11l82m62q44k49Q99J566K3j485j315O56J018N79J75m87
4896E49r47o91L51J945O48j312j386QQ04O34K39J92r38j383L56J545J046q90j123
4915c53q20O13L68Q52N11q32j328n94J434J543l92j186p72Q5L77P25Q80l92j463
4934g44r41R35J320M74n72o07r39p9J042J234L40j570j293J18J473O98j95m64
$$ y = [792, 1653, 354, -1381, -1626, 159, 1206, 757, 154, -354, -944, -1119, 391, 1570, 1087, -1002, -1660, -553, 768, 822, 516, 91, -864, -1318, -177, 1763, 1566, -317, -1182, -749, 536, 856, 902, 774, -242, -1488, -810, 1024, 1562, 365, -945, -770, -105, 284, 1030, 1221, -22, -1698, -1354, 582, 1514, 626, -583, -824, -844, -555, 596, 1281, 392, -1190, -1787, 13, 1223, 742, 44, -531, -1005, -932, 193, 1400, 983, -789, -1715, -655, 968, 857, 475, 13, -831, -1080, -181, 1385, 1408, -77, -1392, -736, 282, 861, 1036, 549, -398, -1089, -738, 1207, 1855, 543, -843, -835, -31, 603, 842, 1034, 96, -1287, -931, 614, 1660, 770, -353, -1173, -560, -192, 660, 1171, 339, -989, -1583, -149, 1394, 1002, -184, -956, -871, -494, 231, 1111, 719, -744, -1685, -750, 570, 1044, 472, -135, -1074, -1153, -111, 1123, 1463, -107, -1400, -1282, 191, 889, 694, 230]
4952B30p02n79L31J466P73r21j475j43O70Q04N92k13q16j152j5J547J193p61j300
4971d71m94K04Q21O03K68o79j227l05Q54J539m2q85p64k33L97Q16P45n06j086
4990d45j020Q35J288O84n62j297m17Q3J007Q19J49q39j424N21O60J137r9r60r15
5009g95j13M84J253N25q74j188k97O47Q79M27k51j009p76M09J005Q28l63j351
5027e60m66l3J010P61J73p32j125k14O31J350P4o69j335j63P16J173L52m79j061
5046e97o44N63J097P60k63j053o65p8J218P38k4q48j298K04Q79J206n5q99p77
5065e36l82R78P99L52m17j309m11P20R33L91m59j007o13K16J020O51j60q80r55
5084a069K03J032P55J6r63j022j63R29J026M5m84j034n91N41J302M17o03j112
$$ y = [230, -472, -1051, -720, 746, 1519, 598, -877, -1020, -350, 454, 1046, 833, 17, -1135, -1150, 397, 1590, 829, -471, -965, -761, 60, 663, 931, 252, -975, -1280, -426, 1113, 1071, 186, -578, -811, -414, 402, 1147, 641, -445, -1465, -630, 658, 1342, 780, -517, -934, -851, 156, 975, 1124, 285, -1139, -618, 42, 1179, 1080, 120, -795, -908, -424, 829, 1354, 480, -708, -1005, -358, 521, 948, 697, -312, -1088, -679, 326, 1154, 791, -560, -1026, -1059, -49, 712, 885, 153, -972, -1186, -555, 795, 869, 200, -1135, -1298, -582, 591, 943, 464, -597, -1241, -678, 419, 1179, 916, -137, -802, -880, 338, 1076, 1052, 204, -1094, -890, -11, 1195, 1140, 241, -536, -918, 60, 859, 1211, 794, -515, -926, -206, 727, 1118, 659, -348, -961, -745, 275, 926, 766, -114, -1069, -866, 166, 921, 937, -26, -1048, -1211, -282, 744, 789, 305, -729, -1320, -779, 523, 940, 337, -775]
5102g75l99L46R82Q72m95j105o15L15J078P79j32q72r78J32R56Q01J36p50r57
5121f81m30J056P48L76n78r86m69M53R55R32o07j065p44L60J432L78m35q93p22
5140i20n1Q03J146P8q62j154R2P12Q20L30o46r50n62P23J020N07n74j298m83Q17
5160d52P49N42j85q28p71k3J004J161l05j240n14oR43N12L90o95j103l61R87J008
5180H13K78q67q69j60M05N29Q50k62r66r58L12J388M89l34j000n09L21O63P22
5199H45K02j046j142J28J065Q00j54p55m16m07K58J227O26n60j617j7P10R03K26
5218H76k38o03q93p1J235J061n32j304m23L33O71O86k15l4r46q66R33J380J33
5237A183j024q35j79L90P47M80j37q08j079N80J169R17j004r57k31J23O04O99
$$ y = [-775, -1174, -828, 154, 1026, 531, -574, -1189, -874, 204, 983, 851, -21, -999, -867, 89, 890, 1026, 276, -681, -1111, -55, 693, 1069, 491, -495, -964, -511, 444, 1376, 769, -296, -1040, -680, 752, 1130, 695, -198, -920, -971, -168, 978, 1056, 194, -960, -868, -156, 664, 994, 348, -602, -1164, -441, 579, 1086, 512, -786, -1269, -452, 297, 839, 654, -174, -945, -968, 36, 1197, 892, -348, -862, -868, 75, 587, 977, 282, -821, -1182, -195, 813, 1091, 224, -645, -805, -400, 129, 979, 717, -249, -1207, -895, 493, 982, 648, -352, -861, -540, 123, 845, 1047, 1, -1141, -1013, 52, 852, 698, -57, -473, -880, -622, 605, 1231, 671, -946, -963, -253, 650, 876, 638, 35, -858, -929, 306, 1367, 835, -469, -892, -559, 112, 798, 583, 549, -397, -1263, -330, 1050, 1183, 159, -676, -855, -465, 282, 762, 625, -183, -1262, -682, 487, 1404, 400, -557, -788, -665, -61, 638]
5255F38P4n14j331m3J165Q63p4q30n25k59J84J017R01n24j500m50R26Q27K76o07
5275B14k53o20j6N96J201K42j507r97Q21P65M52k39k62o50o03N19J283L87j233
5294A00q87J8Q67K43K85jo63r90J89J372P89r34r40o6K48J83O11N34p70j256k27
5315a295J457R56m27r29l00q6k9R59P01m01j518n64R99J060L9l73l31n31j34O59
5335h8R58J69j364p50L42J273L04m32r3n83n79M64J202M87q93j383N7Q34N44N
5355D74K22p20p57j70J350R85p95j166m35P21N74J35M87m37j249l59J135J096
5373A091k66j082n31K56L45K47N29J96j370q73Q85J457P0p30n68n5j9L1R85N68
5393A166j243j087L67J430K89m54m46l63k60K8J179P60q44j537NJ097O32j25k54
$$ y = [638, 712, 198, -1133, -1176, -11, 852, 778, -52, -577, -836, -652, 365, 1266, 742, -758, -1208, -282, 545, 821, 214, -39, -659, -675, -79, 1122, 1364, -143, -1140, -319, 446, 898, 659, 397, -253, -856, -337, 946, 1333, 100, -787, -769, 98, 341, 626, 625, -38, -1028, -839, 533, 1322, 388, -552, -618, -370, -187, 424, 958, 188, -1068, -1295, 162, 1118, 691, -238, -538, -624, -653, 306, 1007, 606, -912, -1476, -477, 583, 622, 249, -82, -613, -747, -88, 870, 1039, -325, -1075, -733, 540, 844, 412, 319, -264, -843, -379, 823, 1310, 417, -966, -909, -75, 469, 474, 696, -24, -781, -951, 399, 1384, 589, -577, -1012, -291, 283, 418, 905, 468, -781, -1140, -5, 1091, 825, -257, -788, -532, -187, 60, 589, 785, -585, -1458, -573, 884, 954, 224, -344, -399, -418, -387, 598, 1166, -77, -1164, -797, 633, 922, 468, 22, -341, -601, -573, 606, 1366, 522, -1015, -1010, 87, 719, 594, 340]
5412C40l27o83j91J159R98o49j152m43O92P85j46N6j76r19n76R07J394j03j238
5431b72o44L72M89K61K27L01j028j219O79J584N05q99q34j35K10K77P69L42q14
5450A71j147L5J543N12o97n64n6l88L11P10P95n36j689j44J331P78l56m68k41
5469a00m15m72R34J330l79j387n84Q13P66Lk57k12m74o39P30J253J86j421r02
5488a227O05P78R5K2L6m99j040M62J470N42j207o48m4O06j10O21K75p47q76j20
5508a006J278R13o07j005j7L0K85L32Q21n70j367k32J075R51J5q47l90M0j70P23
5528B52P56p3j508m83M86J124O6l40l44k66o17N82J151N31j199j282K05J129K47
5547D17k9k63l12o89N1J225R25j088q95r5M13P75L6O1m42r76j65J223R33m87j133
$$ y = [340, 13, -670, -861, 298, 1296, 647, -505, -948, -256, 529, 383, 439, 263, -656, -1232, -325, 1069, 966, -272, -916, -544, -55, 206, 433, 734, -294, -1513, -834, 750, 1255, 356, -478, -613, -403, -126, 643, 985, 171, -976, -941, 602, 1114, 417, -147, -203, -591, -280, 430, 1225, 689, -1000, -1144, 187, 965, 609, 141, -100, -515, -987, -53, 1277, 898, -489, -1073, -260, 506, 509, 252, 40, -434, -1073, -343, 910, 1096, -325, -1227, -622, 156, 251, 273, 309, -190, -1230, -768, 702, 1244, 37, -611, -655, -49, -159, 462, 737, -10, -886, -1006, 272, 1185, 578, -427, -444, -414, -129, 203, 1024, 454, -913, -1145, -70, 881, 896, 49, -341, -301, -471, 252, 1008, 935, -573, -1056, -570, 554, 620, 280, -64, -330, -947, -365, 786, 1317, 118, -1164, -959, 170, 417, 388, 125, -187, -876, -825, 400, 1325, 237, -658, -753, -340, 435, 471, 532, 90, -886, -1051, 172, 1105, 618, -515]
5568e15l79L04N29K78N33j39j229n70Q51J239n2p20n39k27J78N51O50J44j248
5587c61o91L50J387J18m91n71l5j24R7R85K27p27j350K64J110N10m48j33m52m48
5607g83m5J202P39m59j261l68P47O55J04n6m09n81k43P97R42k62r25o60M52N97
5627A83L72O8k36p82o19O50J229J14p61o40l23N33M56K52L12r15q77K44J008O80
5647I48o27n13m19l3M15P94J39n84j064j39J073O62j24n75m40k49K79P54Q85q20
5667C62j080l07Q06Q75qj49n00n52l64P47R62K80j263o72K32P65N56J10o24o07
5687d31l73M79J056K29p73q63J3M94N42M70j15r21n89K04J102M71p15n76m03J57
5707e42M80N07L43o46r68j45Q76R08j43q60k57k39K29N98P64n67q12n14P35P96
$$ y = [-515, -894, -590, -61, 217, 750, 611, -618, -1188, -337, 902, 850, 130, -409, -636, -458, 93, 743, 887, -361, -1052, -702, 685, 803, 312, -259, -294, -418, -321, 664, 891, 164, -1186, -922, 188, 698, 250, 117, -335, -783, -828, 374, 1113, 654, -607, -975, -228, 427, 531, 475, 66, -515, -758, 39, 981, 719, -206, -866, -414, 183, 555, 623, 387, -395, -1014, -364, 865, 979, 218, -422, -745, -212, 244, 496, 808, -107, -984, -740, 268, 948, 321, -192, -611, -644, -229, 565, 704, 120, -944, -1083, -10, 652, 528, -47, -487, -736, -457, 297, 1182, 362, -718, -1025, -219, 656, 648, 499, -1, -553, -917, -170, 792, 1072, -191, -863, -631, 134, 690, 800, 176, -431, -804, -325, 731, 960, 187, -676, -663, -169, 373, 843, 728, -193, -782, -578, 524, 995, 280, -296, -699, -542, -62, 445, 788, 142, -826, -971, -95, 813, 670, -190, -447, -686, -457, 141, 905, 338, -474, -988, -253, 543]
5727E43P6l43n90m03L01M50O11J39q47o96L1R88N56l41k0r17k70M04R98L16p50
5748B36q01j37O08N51J90m34l87o20J85R08P16n42p59l40J79N29M45R8m13r18
5768g06q2Q55O35q1n14q50K30L15O84K43l10p62n33M67J138O8m72l73o16R1O80
5789A07P16Jp43j103L35Q16M42p0o91m33j55N55P19J84m62p77k33M20P21K47j41
5810D55p02n59J16P66Q28l91p76p08N14M67P25lm43r41o6N90P52Q4p24m02j68
5831e86M11P26L78n56o59l81L36P02N72l00q25k88J06N62O40k36o73o17J79N57
5851D8O14J62q64k86l39M06O74L63m96q50l1K56Q11Q0k44p53l55K52Q80L12m44
5872A96m20p39L83M75O59j12l88r78J8N70O70M06o14o33m44N84O59N21n20p13
$$ y = [543, 619, 276, -314, -717, -416, 34, 645, 784, -63, -759, -728, 260, 816, 475, 455, -462, -732, -328, 670, 986, 236, -565, -702, -94, 457, 647, 213, -174, -794, -609, 299, 1015, 473, -286, -626, -447, 82, 527, 625, 212, -706, -788, 67, 702, 621, 107, -743, -513, -198, 486, 729, 419, -343, -876, -409, 729, 797, 325, -48, -664, -573, 107, 823, 824, 81, -1022, -687, 129, 571, 501, -190, -623, -778, -223, 496, 680, 218, -559, -792, -372, 349, 596, 455, -247, -806, -690, 76, 904, 513, -263, -971, -457, 10, 735, 732, 289, -652, -718, -128, 624, 708, -16, -418, -586, -175, 551, 929, 373, -286, -667, -331, 371, 943, 643, -182, -470, -364, 198, 838, 602, -71, -688, -509, 48, 662, 824, -40, -326, -665, -259, 415, 778, 282, -568, -599, -343, 468, 548, 304, -449, -804, -552, 328, 640, 196, -224, -963, -580, -105, 554, 442, 54, -924, -906, -336, 334, 740, 126, -507, -951, -367, 292, 813, 293, -420]
5892d20l01M38O17M92k55o39n48Q4Q95M29l9p21m17m4O21N17K5m24o64l24R11
5913B33P11j29o56n46j58J97N78M51l56n99n83M31Q65J00km37o78k51Q17O64P7
5934G29j112o21K25P30M21J94o07m64k02M79L59N48m62q66O4J74N26L49j4o62
5954b12n12J13P48R51p14m37p26K76N18N62J06l87p24m16Q75Q01r7n47o82Q0J85
5975b39N66M77k30n69p39M36P34M26o15l62l11j6L74O96n6l40r25J11O07N80k00
5996D05l36m27j52O3O84N16n43r49L0N56N45K3k35k01n16l28R09O48k76p35l27
6017f46L58L12L79K24l51q04k41N46R56Jp96m43K98J2M63K75nq96l84K67Q94K50
6039F69l68n16l99L72J53P46p6o09o97J32P42L47j07k47m65k44K08P40M09l41
$$ y = [-420, -721, -283, 334, 826, 571, -68, -616, -532, 363, 792, 753, 32, -385, -429, 192, 709, 734, 310, -354, -678, 233, 944, 815, 159, -387, -545, -348, 230, 681, 325, -274, -857, -426, 439, 539, 537, 100, -578, -829, -12, 652, 729, -383, -1004, -779, -49, 372, 566, -41, -505, -707, -228, 131, 679, 217, -649, -585, -411, 115, 464, 450, -212, -724, -611, 137, 1088, 374, -63, -789, -513, 5, 567, 673, 286, -438, -854, 21, 822, 725, 178, -504, -424, -239, 327, 804, 574, 5, -734, -298, 436, 862, 247, -115, -426, -442, -68, 628, 572, 232, -693, -582, 25, 605, 405, 69, -358, -510, -447, 237, 753, 210, -739, -709, -153, 392, 415, 180, -21, -537, -865, 44, 692, 416, -319, -646, -288, 24, 403, 627, 276, -528, -769, -223, 733, 734, -62, -505, -207, -195, 268, 543, 538, -358, -742, -475, 419, 669, 301, -215, -614, -242, -89, 657, 581, -28, -725, -593, 149, 496, 389, 142, -323, -567, -359, 381, 790, 449]
6059D49j158l1M83O58J97l10k91l51p5N00P62j86q16m04K90M00M74q0m52k69l17
6080e27L25R15J94r05o59K11L50K30M12k31n11o55J22J030M02m94o93k1M4M17
6100d4L91L74q89n36k20R20O89m71l53j45j29K46L73O40m65j016l76Q34Q18j38
6120E03l17j85l21k45P54P65k45r59o29N41Q40J41j83m34j54l77M85P47L61j144
6140e6p15K33O54K31J93q6o14m33N2J081J45m65p68M1L22J68M17M2l77r56k25
6161a116J079Q22n82m69k86K36O4M79K04k20o42n24P89P99j9n15m33j06j39N29
6181e0P68O7q85o21K10Q20L49m16j31l64p4R0R10K26p45q71R3Q56J47m5Pm08n80
6204f47K19O58O29m25r93q8M93M42o3J09j51p42k44R51O34j65r97k51N05J08j12
$$ y = [449, -709, -740, -257, 401, 598, 288, -3, -354, -429, 71, 833, 647, -169, -573, -283, 117, 591, 511, 59, -210, -527, -202, 713, 907, 2, -657, -446, -96, 134, 546, 315, -196, -851, -729, 301, 703, 209, -484, -505, -461, -44, 347, 721, -168, -704, -924, -4, 685, 214, -139, -284, -413, -167, 206, 846, 381, -635, -1011, -177, 641, 503, 186, 1, -320, -565, 189, 954, 709, -250, -879, -338, 502, 643, 460, 26, -128, -505, -20, 727, 1088, -56, -771, -538, 116, 347, 540, 454, -160, -593, -541, 540, 685, 220, -548, -507, -185, -17, 400, 442, 65, -891, -1116, -37, 785, 203, -266, -552, -316, -252, 227, 431, 211, -431, -955, -166, 633, 614, 99, -334, -440, -579, -50, 718, 785, -100, -721, -511, 309, 658, 242, 111, -253, -327, -237, 673, 899, 154, -717, -624, 232, 379, 334, 341, -67, -647, -428, 230, 859, 434, -559, -647, -154, 288, 225, 334, 183, -559, -803, 148, 782, 617, -380, -631, -126, -18, -130]
6225a30N01N6q98o38P38J156j72o13l37L7O9K30M04J38p13n76R2R65K67k70l82
6246g6r2l25K68N64N26p59p88J01P20M60l38j8l77l44l6P31P62n30r77j70O48
6267e0M03k84l7J27m21m00L94R19Pq36l65N8N21J94J62o3n50o14L46J159K8n62
6289A36l95K5N4L87K75J13o27n83R4R15K44k50n77p4K0J29N05K43l66p23l17R30
6311A58M75j50m64k84k20q4M64Q64j14j172l07N48O29q1Kk43k32l25K59J018l9
6332G02p99n75P2Q01M7J27rn60l92J95P47L20m32q11Q1M46K27K75Jl49o82K48
6354c20O23O03m77p06j01J98L3L18L32j45p78k14P55M00L7n97k64j78J76M97M11
6375F03n9q68n44N43O16J8j39l69k1l73L27P91K13p88o77J41P80L53k86k17m04
$$ y = [-130, 371, 427, -471, -1109, -371, 785, 613, 0, -337, -300, -231, -1, 403, 541, -172, -748, -656, 309, 576, 306, -76, -168, -493, -225, 339, 865, 106, -682, -581, 139, 599, 261, 243, -134, -478, -514, 217, 979, 449, -528, -698, -50, 353, 69, 32, 159, -262, -662, -268, 651, 658, -178, -543, -485, 36, 230, 392, 329, -221, -835, -489, 670, 698, 136, -259, -234, -180, 207, 482, 595, -32, -615, -521, 394, 638, 388, -189, -263, -243, -114, 391, 634, 268, -455, -772, 158, 633, 483, 19, -265, -485, -569, -105, 759, 645, -527, -834, -286, 343, 262, 264, 21, -211, -536, -277, 741, 702, -97, -672, -600, 201, 248, 375, 366, -194, -586, -391, 356, 676, 244, -567, -486, -40, 187, 462, 463, 114, -568, -320, 303, 906, 429, -277, -378, -180, -147, 171, 503, 358, -420, -634, 121, 521, 558, -39, -303, -481, -305, 192, 603, 544, -324, -868, -325, 291, 309, 170, -199, -220, -593, -266, 525, 738, -50, -727, -586, 194, 547, 261, 44, -360]
6396c60k93K58O47N57n74p14Q5M88K26M8j02k83n42r1O57Q65l95p16l2L5K81K12
6418B57K92l39o74k14N64P47j22m11n85J2K55M68J82j0p26o04N37Q30m2K3p03
6439b63j73j54N37N09J42n61n73q3P26K70Q6m05m16k04J75Q72J24l75o23p4L69
6460i4O83j84j75l42n18K10N62M83n2o48l69J54L18L47m3j7m25l73J73O74K86
6481F50m98o39N2L85K76L33k02n17n46K01P22L37m23m47J5O4J19N73j2n95l30
6502d82k0O45L08r9m76m18m3M31M02M13k82o30l83L15O49J79k87l23l64n6P69
6523B48M26j7o41m58J49M93J57J41m10m96j16N33M43J98m64p05J59J86M51K93
6543E70l34n60k51L47M07L38l20l15l19m6N40K54O9m73n25K25L47N66j39l42k75
$$ y = [-360, -653, -395, 252, 809, 235, -479, -394, 94, 320, 368, 266, -17, -559, -650, 7, 872, 477, -239, -271, -236, 45, 257, 549, 210, -464, -678, -114, 633, 511, 100, -485, -473, -218, 250, 432, 422, -304, -908, -371, 459, 417, 440, -263, -436, -590, -53, 456, 598, 37, -536, -619, 107, 377, 463, 58, -358, -562, -387, 485, 609, 234, -389, -463, -94, 589, 405, 230, -112, -630, -420, 142, 625, 573, -75, -444, -290, 28, 375, 332, 315, -110, -483, -310, 364, 650, 152, -487, -435, -50, 226, 559, 357, -160, -706, -505, 217, 554, 131, -316, -301, -237, -118, 455, 443, -152, -482, -502, 143, 451, 352, -124, -542, -585, -154, 248, 661, 379, -251, -634, -319, 330, 509, 222, -101, -465, -521, 248, 674, 657, 16, -442, -293, 200, 357, 498, 88, -408, -524, 9, 452, 650, 186, -519, -360, -174, 277, 570, 236, -324, -575, -228, 179, 517, 197, -118, -437, -483, 57, 311, 380, -93, -618, -393, -46, 520, 381, 39, -236]
6564b36l26O02L85J01k34p99Q8M8N56K63k16l28k69M8M90N48m18k87n59O0O64
6585A81L09Ko43j17j39M24M17J81n32l14l25K66P54J44k95n25l11J59N79K22k03
6606B34n31j68KN17L94j20l60k70j81L09N78P7k73o66O1J84N48J97m39n42J34
6627c15LO60R1k5m36l75L2M56L35j41m59k88M2N80L64j04m99l30J11L01L21%j27
6650A97o27q3K27N34K47m91l60j06K63L95K65k69m05l14K7N57L59j57l12l88J4
6671d27L65K22L42m37m17j56M23O33j02l95l85j09L80N61l8j21m43k41J11N91
6691C57N5r0l63k88q4N01N08r9l54n80K47M04J61j06j72n22j8L10M37N9q5p18
6713d40PK68L10N8q9l19m25L70L19M69j36n47l23N7L96M44r0k68m05j63L12O38
$$ y = [-236, -562, 40, 425, 526, 292, -507, -419, -371, 185, 448, 232, -96, -365, -317, 173, 721, 303, 16, -543, -483, 181, 490, 492, -151, -268, -407, 17, 434, 615, 83, -231, -556, -290, 464, 608, 313, -212, -523, -364, 215, 437, 234, -297, -465, -463, 54, 448, 328, -32, -302, -483, -174, 404, 481, 208, -458, -397, -213, 335, 532, 93, -449, -315, -312, 348, 439, 414, -22, -397, -365, 91, 426, 285, -174, -462, -420, 160, 524, 420, -79, -409, -298, 3, 324, 324, 197, -430, -513, -286, 248, 495, 4, -356, -462, -199, 196, 461, 192, -213, -527, -500, 57, 416, 259, -53, -441, -427, -62, 160, 502, 65, -352, -508, -85, 548, 446, 51, -334, -443, -63, 498, 460, 339, -104, -345, -234, 357, 412, 322, -41, -329, -413, 88, 596, 497, 143, -437, -190, 214, 375, 269, 97, -425, -443, -133, 304, 363, 278, -440, -433, -165, 145, 203, 114, -205, -630, -260, 59, 528, 392, -155, -478, -421, -25, 419, 329, 61, -344, -507, -195, 443]
6735D43J17o23k70j55M39L70J37j60m82l23K36O40K0j29n32l1J96J61J86L19o56
6756i7k41j48L55N82j03l68j79n8J24K60N39o85l47j66M13O73k76j12j05k96k02
6777d37L34P38j63n92m65J10P42j02J71j68l47m77N42L90K49n55m09K72O6K66
6797A65L09k46m10r7j24N94M75l35n58l24K12L81M63o5m79j31k07L71M90j34l27
6818B3m88J53J00L41M69k73n76m03O48M72p2l97l01j9M3K70L32L02q22l94K87
6839c05L22L15k98J0l00j09J01N24N11m94o08K3J40N63Q2m87o4n14L4O99M30j90
6861C85n57l40M88L31KNj81n83l1L97Q08j96n01k69k9L8L62j8J99n84m5K04M98
6884C83J23n59k22q5J16K67N09l14l27n00LQ69L39m07m75L7j39L02K54N00m97
$$ y = [443, 560, -63, -333, -488, -49, 321, 458, 298, -184, -507, -271, 369, 389, 260, -272, -303, -107, 54, 240, 559, -97, -338, -486, -131, 451, 348, -20, -199, -257, -133, 127, 666, -19, -366, -532, -119, 554, 278, 166, 61, -235, -437, -103, 635, 472, -120, -585, -475, 267, 165, 336, 168, -179, -656, -114, 276, 525, -30, -439, -167, -101, 165, 474, 228, -182, -279, -403, 191, 666, 331, -227, -551, -339, 42, 505, 440, -39, -170, -377, -6, 484, 350, 23, -465, -312, -212, 129, 598, 325, -251, -654, -6, 466, 394, -3, -304, -323, -280, -10, 322, 624, -198, -592, -305, 17, 332, 34, 44, -256, -365, -264, 260, 771, 277, -331, -308, -168, 395, 477, -10, -74, -588, -554, 145, 575, 385, -172, -512, -24, 307, 309, 314, 133, -450, -481, -84, 724, 528, 27, -242, -271, -233, 129, 111, 310, -274, -319, -115, 383, 506, -53, -275, -360, -244, 23, 532, 218, -109, -609, -606, 263, 602, 195, -280, -243, -382, -80, 174, 674, 177]
6905A77o85J6N22L67j1j76m54k7k5N42L63j01q69k81N27J26K96l5j88k94m34N15
6927a29N82M4o06m99M02L23M2R4j13l76j64J45O82R4m16m68j25K53J38N21R5m73
6949D6q57L8J059K46m31m58JJ33J75K42J76k83m84j11N95L71l28k30k2j51K31
6970d2J72N98l09o75k17K00O73J29k50j76j73k16K24M30J51m93n64L24L65J21
6990B72R3k16k59l93J44N00N32o35m32j34K92L69J58P6j88q95J89N71N27l66n34
7011c29L0Q0J70J73K64j78p23n1M16P15k07m48j06J77P4P1M20m5n07n42L33N11
7033B98K22l70k13J31l65K59K81L24n64m72N1M66L67J91m73k40l91P0O06K13k23
7054A68o72K28J24L39J9P6k84m10o9M54O15l70o90j1K43L49k7J15K3n04k31L14
$$ y = [177, -508, -492, 30, 397, 386, 210, -244, -271, -296, 246, 609, 508, -361, -642, -115, 11, 307, 272, 84, -210, -644, -129, 453, 497, -109, -608, -206, 117, 159, 253, 140, -236, -400, -255, 427, 521, 105, -363, -488, -235, -97, 424, 519, 46, -811, -773, 286, 532, 101, -357, -356, -223, -48, 194, 370, 87, -397, -508, 87, 458, 130, -100, -122, -273, -42, 130, 728, 419, -256, -473, -273, 400, 529, 279, 103, -70, -286, -62, 368, 519, 26, -538, -214, 151, 272, 365, 149, -110, -503, -359, 141, 673, 38, -394, -528, -236, 133, 291, 367, 179, -716, -527, 44, 571, 205, -329, -299, -219, -49, 124, 388, 210, -513, -564, -148, 567, 360, -88, -194, -17, 57, 128, 548, 503, -4, -546, -213, 298, 520, 150, -63, 68, -297, -38, 243, 567, 3, -469, -418, 48, 415, 606, 133, -107, -498, -428, 178, 391, 168, -504, -276, -152, 187, 206, 282, -2, -412, -481, -27, 588, 218, -472, -483, -240, 109, 82, 197, 220, -284, -515, -201]
7076b01N71Q6m26l53j1L05J18M25l20m46k12J18O77J78m81j83o6J7J09O12J7l97
7098A37n54j85P66J97p5l26o6k52M3M71M14j90q16j66M05N46j96j03J4m12j65
7119e13N02O08k09m83l43K32K99J64J85j22n17l35J78R67j57l17m58n6K84N4N35
7140D98k02m59l33L60O29j22k23k71k21J89R5M60o4k95n17J4P04K97k53l80j96
7161b90K2R3M10K56l19n30j01K06M08P1j70k48j24J8J81O25j62n29k23j17P33
7182B10n7M6j50l73k0J79O25K03o13l77j00N06L21l3j83p6m64J94N40K53m66l41
7204a76j3J23J86L64j79r8l96r0M09J68J90l73m79R5L14R6L44j97m74l79M22M21
7226B78O3k29l30j97J62K56Q8K90m84m71K79M30K26o5m70k62P5K32M92P3l18m50
$$ y = [-201, 370, 456, 30, -323, -334, -29, 89, 514, 194, -252, -464, -346, 331, 509, 28, -155, -221, -204, -95, 517, 534, 137, -417, -602, 164, 361, 286, -40, -106, -358, -315, 156, 570, 380, -436, -602, -197, 349, 153, 50, 64, -348, -513, -11, 597, 388, -95, -438, -206, 93, 257, 442, 320, -197, -532, -354, 613, 456, 139, -319, -375, -91, -37, 498, 296, -163, -496, -136, 493, 371, 148, -123, -344, -155, -60, 400, 336, 41, -476, -462, 242, 539, 286, -94, -290, -268, -175, 235, 491, 172, -358, -459, -253, 155, 226, 56, -192, -316, -298, -117, 508, 346, -183, -406, -523, 210, 153, 199, 49, -324, -344, -165, 460, 663, 50, -327, -427, 79, 400, 367, 184, 108, -356, -162, 378, 631, 165, -176, -189, -66, 120, 484, 305, 207, -189, -279, 130, 298, 488, 115, -364, -269, 45, 141, 485, 288, -186, -565, -143, 278, 341, 112, -218, -415, -253, 3, 91, 381, -103, -574, -295, 135, 361, 296, -174, -436, -361, -129, 363, 436, 118, -332]
7248c32K00K19J23J31j63k33m98J47M67M92l31m93n9J20K78K62J22l83l91j5M58
7269A21L44J09q15o8K43k0J63L46l51l50k73N50J54N0mk52l49m3M05L57Q8p00
7291b95j57Q9L69L40k70k59k59K9M68L21J53l09o23J8J89L07K71k30l69j92J11
7312b98N43J89j84m16k41L02J48L15j8m37j40p8L06N81j05m96m03L7M66J00L8
7333B09J09n34k59L04M86J76l74l32k02K67L99K02j15m73k33J83L18L39k59k70
7353e9j84j83L29M70k1k80l92P2J54J92K63k08m45j60K21K27N44l11n33LK47R1
7375C7L44j96k37m17L70Q0K92o0j79l19j67L39L39K8k32l92l7K06N48j9l5m86
7397a93m63M98L93J43k09k00j17k53L25M00n8l36l71P6L99N47q1m03l70o1L15
$$ y = [-332, -132, 87, 210, 341, 178, -55, -553, -406, 61, 553, 222, -271, -330, -210, 68, 330, 452, 69, -322, -337, 121, 465, 574, -241, -309, -66, -86, 77, 423, 72, -278, -551, -1, 153, 203, 199, -53, -402, -445, -40, 317, 405, -295, -452, -363, 6, 346, 76, -183, -442, -413, 55, 376, 529, 220, -403, -385, -196, 111, 382, 152, -217, -409, -298, 245, 434, 250, -166, -407, -105, 43, 358, 340, -97, -237, -315, -9, 572, 467, -29, -432, -395, 71, 171, 209, 318, -216, -475, -171, 315, 491, 117, -215, -417, -150, 249, 451, 336, -137, -370, -187, 131, 470, 211, -59, -243, -426, -97, 373, 352, 72, -320, -248, -94, 98, 361, 153, -292, -452, -231, -4, 540, 229, -304, -301, -54, 37, 381, 185, -52, -469, -99, -19, 273, 213, 34, -285, -452, -113, 226, 254, 22, -370, -407, -201, 347, 328, 293, -193, -656, -158, 235, 378, 169, -31, -148, -401, -76, 324, 266, -70, -441, -365, 34, 581, 500, 97, -273, -334, -19]
7418a9L94K0l25l44j81L12L72K96k40l15k97J49L63K93k65l02k55J86K57K09Q8
7439C96l09l95M3P5M89j4k26l35k8K31K31P6k09k12l57L52J86L41k89m69j05L74
7461a54J49M92j22m68l91L35m9N33K60n79l41K36K07m5M03m46j98l73N57M09J00
7482E15m88k29j14K21K22L18j38m86o4P9L02L13k25j94j99j02K00L61L22p32l19
7503d37J23K97K37P4j57j97k17k2N80J79j73n82q2K47J28J25Q8k28l41j75M66
7524f7J94L87o15l06J41K15L76P1q7l50k11Q8N10K04o05N7l73N0M01J69J77m09
7546A7m31J25M83K85j78m66n1j26J89M11J93k93n48P3L32K26J2q3k93k10o4O72
7568B75J17n0n73p3K86J50K39j77j93j38M9J77K16K78n13n76L59L12K8J90j80
$$ y = [-19, 375, 395, 70, -274, -455, -143, 229, 525, 285, -30, -327, -178, 185, 478, 213, -89, -344, -158, 99, 308, 396, 87, -308, -265, -190, 299, 285, 59, -276, -304, -73, 158, 234, 25, -187, -544, -192, -6, 335, 46, -423, -528, -154, -5, 487, 365, -103, -494, -159, -208, 325, 585, 6, -335, -99, 108, 63, 466, 20, -178, -551, 6, 415, 515, 27, -202, -316, -95, 127, 445, 307, -179, -243, -164, 138, 451, 226, 32, -167, -269, -69, 292, 614, -118, -437, -314, -17, 220, 294, 137, -60, -277, -299, 281, 460, 287, -295, -377, -130, -2, 123, 211, -17, -358, -533, -67, 127, 514, -101, -407, -266, -51, 325, 396, 309, -41, -252, -164, 346, 550, -55, 2, -371, -321, 80, 249, 426, 17, -414, -289, 194, 479, 301, -165, -216, -342, -153, 258, 451, 158, -390, -317, 15, 241, 253, 170, -123, -333, -397, 275, 392, 342, -231, -304, -18, 132, 371, 194, 1, -137, -88, 89, 305, 583, 70, -506, -147, 165, 193, 383, 203]
7589B03l49l72L89L53L54m28k55q3jL40R0N3l63l63J97L71K58k39l22j62j3K66
7611g6M18l1k15n08M3K46M17j19j60k81NR7O3M83pm45m87K15P15j03m4l71j02
7634b47p0J86N37L3m46m37K51M53o4J60j43k57l62L44L03M07m31n97j3M15J58
7655A80R4j59j49k25r2M56L27l95k88k8K79J50Q5K78n45m23j97N49M38n8k75j76
7677a74Q8K0m1M95j04n85o0l9P65J7l31k36k0k5K22K26K85m12l75p3O68P8j55
7700B34Ln42p1J70J12N00m90l40p1M62K39J64l31m9k93K5L27L03K2n78r6NK96
7723AO1J80j47m92q2L11N68J32o78k06O6J92J01K64j37k33n44N13L92R3k45l41
7745b31J11l2j0M31L5l12m11O4N70J59j66l45P5j27J86K93J92k88m82q4M13K82
$$ y = [203, -146, -518, -129, 224, 578, 150, -105, -188, -189, 151, 241, 294, -69, -432, -235, 136, 394, 155, -167, -329, -342, -76, 342, 311, 96, -412, -369, -123, 294, 175, 15, -266, -261, -164, -101, 382, 375, -70, -557, -342, 373, 270, 226, -145, -247, -317, -131, 406, 439, -7, -444, -193, 260, 196, 356, 213, -44, -406, -62, 241, 648, 217, -380, -393, 22, 180, 274, 115, -34, -259, -351, 105, 432, 37, -251, -279, 0, 150, 235, 513, -32, -455, -652, -103, 335, 277, 2, -174, -86, -66, -107, 388, 284, -301, -361, -400, 365, 382, 51, -185, -205, -230, -8, 218, 503, 91, -284, -357, 311, 389, 234, 237, -305, -376, -206, -94, 406, -84, -424, -495, -33, 206, 370, 39, -10, -303, -278, 49, 352, 374, -204, -300, -295, 1, 62, 242, 95, -397, -479, -168, 400, 532, -146, -352, -286, -94, 7, 271, 134, -99, -643, -130, 262, 355, 110, -231, -120, -152, -162, 269, 304, -8, -419, -355, 215, 374, 208, -137, -62, -189, -3, 290, 482, 194, -288, -372, 41, 323]
7767C23j89Rk72k3j88M37L73j58l45m79K98L40P0p4k4q6m53K83N66k9m74n19N52
7790f2M0J44l4Q6k72m16J82O39J28j96l79j86J66J60J83K11k14o06kM04K98k04
7812G0r8l13J42m8M35L17j79p83L3L06M58J2l08k36j9j17M54K47j08l00o03M95
7834a43M56q9k60J25l38j37J93N13m7m22l42J56M67q7R8L5k28k65m3N55M58n38
7856A17j72j88L21k1K32k0j98l36k65N26L89r7k91k14R7K12J31J81Rq07N9K11
7878a24N76j34m19n3M2l4K95K03r8l74l26K13N28k41J21l00N5j15LL84J58k47
7900A13m66j49N06J70N9Ml61n1M7J14N46k21p60O5L46J08K07o9q3l61q0L41K82
7923C07j00k52j55j28K54K67K27m4m21k82l7Q37m0j93l95k1j26K87L04J62o27
$$ y = [323, 134, 143, -129, -152, -340, 97, 470, 312, -33, -512, -214, 126, 196, 122, 98, 12, -441, -158, 408, 379, -95, -614, -62, -22, 122, 88, 174, -98, -514, -332, 307, 435, 239, -140, -326, -160, 0, 183, 394, 180, -426, -428, -24, 274, 70, -28, -341, -199, -247, 188, 505, 326, -457, -424, -118, 340, 352, 44, -192, -211, -328, 126, 373, 265, -35, -638, -143, 313, 224, -36, 89, -249, -386, -193, 320, 273, -149, -491, -335, 132, 45, 143, 178, -50, -315, -358, 197, 655, 117, -55, -243, 78, 57, 289, 269, 71, -265, -530, -4, 385, 288, -3, -217, -120, 92, 223, 404, 413, -394, -335, -124, 452, 318, -101, -154, -112, -146, 149, 352, 254, -120, -446, -233, 295, 54, 175, -125, -70, -185, -182, 202, 360, 113, -353, -502, 4, 174, 233, 237, -124, -175, -128, -14, 532, 311, -449, -384, -38, 70, 277, 208, 125, -236, -316, 25, 307, 207, -45, -200, -328, -74, 193, 420, 376, -45, -327, -364, 473, 433, 240, -155, -176, -302, -15, 289, 451, -176]
7944a76k52RN59K24k14j17l9l10J2N05j4k7m04o7J72N04p4m2k19l39m7N21M13
7967E78m86k57j67L40J39K65j37m17M0l30M76K27Ml08j02R6J32J68n8M8m73p8
7989c00J09M30K47k81o09M34j80J60L53j72j58k03p2L66J54j04k10p2M6K4L52
8010C14N9m12k45lL09L16o2k06l26L8P5K62M46m45k38k05J30M03J20rl57o9p7
8033a82N3N87j14m74r4p5L74J70K44m50j47j90J49N99L9l95k97O5j32L25L36L2
8055D23m07k58j1L57J00j19j73j95J15J46K70qO1m69l23M95M50l44p2j88k02J80
8077a72M65K16k71k64m94M38J87R8R7l55k00k02M41M19k34j03j99j72M69L24j38
8098C50m52q3N2J66M27J35l84l42k06L41R8J38N6l97l13J53M39K54j86l45l60
$$ y = [-176, -428, -419, 140, 364, 150, 33, -6, -316, -304, 201, 187, 160, -244, -311, -139, 365, 291, 249, 30, -309, -356, 165, 578, 92, -165, -332, 8, 147, 412, 275, -142, -102, -432, 44, 271, 275, -33, -135, -39, 93, 261, 203, 251, -222, -300, -191, 239, 486, 205, -404, 30, -150, 10, 363, 191, 33, -170, -242, 124, 278, 174, -36, -108, -62, -38, 314, 373, -39, -284, -287, 22, 338, 276, 70, -256, -218, -143, 119, 565, 120, -118, -323, -193, 210, 330, 321, -36, -105, -182, -129, 458, 344, -130, -224, -299, 75, 245, 489, 39, -108, -298, -149, 450, 489, 94, -203, -138, -270, 55, 391, 423, 16, -242, -253, 104, 204, 85, -88, -283, -168, -22, 248, 240, 301, -168, -491, 4, 454, 110, 38, -150, -352, -172, 293, 509, 238, -26, -520, -82, 105, 203, 300, -55, -255, -457, -16, 403, 169, 66, -133, -305, 164, 488, 350, -102, -185, -133, 33, 460, 595, 211, -131, -337, 4, 102, 240, 296, -101, -414, -261, 178, 432, 246, -99, -459]
8119d59J81K91N0J94k80k00l10N30K88Q8k19l14q5J84J2L57l06p4l74J32M52J20
8141B58k20j24j60j34L77L81p4m60%k67L44L27j46Q8n07j23K41N56Q6n21m2k26
8163c46L62J02J60r5m73m4k2L25M83j38k44m76K7L41L03K0j50l40LL03J41p7q4
8186H1l24m1L19O6K11
$$ y = [-459, -278, 13, 63, 257, -23, -223, -533, -3, 285, 373, 154, -160, -245, -61, -49, 308, 2, -72, -446, -314, 138, 258, 38, -86, -246, -380, -3, 378, 304, -156, -156, -423, -79, 248, 102, 190, -317, -440, -199, 357, 443, -78, -120, -346, 16, 118, 278, 183, -290, -334, -356, -31, 452, 314, 70, -406, -379, -38, 265, 285, 135, -205, -202, 101, 242, 165, 81, -243, -284, 35, 101, 312]
8191C12
$$ Imaginary data points
##PAGE= N=2
##DATA TABLE= (X++(I..I)), XYDATA
0@%%%%%%%%%%%Kj0J6j6J6j6K0k8L2l7M5n0N8o8P6q8J01j13J28j44J61j81K02k25
35a19K53k83L13l47L83m22M68n17N74o39P08p85Q75r78J096j237J406j613J873
54A009k213K679l355M431o423J1319m4394p4794P7497N4598k6483l5600K1163
67b0566m519m4708p43O5706J9344n9666m3606L5361M4416Q75j3917J51j5290k7012
81f4174J1358N5464L1551k8764m1918l354K3708K1693J3732L565j8962k3511J0800
94h812M0789J9558k0472k4622n094K479J2111L3750K5497k7911n4437q544M3418
107B7710L0367j2414j8595l601p814j0176J5978L1496p004n1524k8523L4814M5551
120D6265m586l4665j3560n57j6376m711M0298L4604l7106o4351K923N6035J6345
$$ y = [0, 0, 0, 0, 0, 0, 0, 0, 0, 0, 0, 0, 2, -8, 8, -8, 8, -8, 12, -16, 16, -21, 24, -26, 32, -36, 40, -48, 53, -60, 68, -76, 85, -96, 106, -119, 134, -149, 164, -183, 200, -222, 246, -271, 303, -336, 372, -413, 462, -516, 580, -657, 749, -864, 1009, -1204, 1475, -1880, 2551, -3872, 7447, -36947, -111741, -34244, 20354, -6129, -41729, -20566, -25085, -69793, -70536, -4830, 14514, -45152, -88758, -53397, -8981, -8106, -22023, -21872, -37162, -64174, -52816, 2648, 34199, 5435, -36483, -39837, -16129, 5564, 19296, 22861, 3899, -19612, -8812, 31977, 51535, 31063, 6441, 1347, 3826, 15937, 49687, 75184, 47273, -7164, -15708, 27710, 58077, 45663, 27068, 23467, 15653, 5477, 21455, 52951, 45947, -5577, -34100, 714, 46265, 41679, 7014, -6546, -7103, -23479, -28190, 12108, 46712, 9606, -54745, -51822, 4213, 20558]
133B0558l4998j6643J2235p771j5903K8325M1991k0524o2738j2976M5921L0080
145G557q923p305R2k1079j9758K5305M3525j970m0445j6065K1036K0593O995N209
159A4767r290l1581j3863L5795M2306n145l2040j0700M165m242R836L6042J0358
172D6408m4393l5297L0860M6516o342l1971l288P224j3360R78M1290K3277m4645
185A7257n2270J4271M9436J0728k2308p095K995j6851j3272K6679L4603j6260
197B7913m9600j3117L5574K9806p794j9898j0423j0895q489J7171L3390M893l6283
210g752l1230Q965K8112J1197o230j0922j4243j0226J1839K7765R248k3313k7757
223c4547k866J7868K0448J2666n484k7052k2460J1602L4386J3881j7161j7058
$$ y = [20558, -14440, -31083, -18848, -26619, -42522, -14197, 27794, 7270, -55468, -68444, -22523, 7557, -1366, -8671, -8579, -29658, -49416, -24111, 19414, 17444, -23001, -39066, -18030, 2563, 9558, 14767, 5477, -26104, -39967, -4172, 38134, 32989, 949, -9751, -5586, -9828, 8, 36050, 46408, 2015, -33282, -2422, 44094, 37752, 5781, 2493, 9717, -3643, -2665, 38625, 61902, 17257, -35013, -20742, 28694, 39422, 17114, 10019, 13014, -3837, -17109, 9570, 44173, 27913, -21687, -34804, 770, 30576, 22782, 2884, -7539, -18434, -26923, -9752, 23638, 28531, -7752, -38982, -30017, -1905, 9292, 3062, -7860, -22103, -32329, -20490, 7275, 16523, -6790, -34547, -37413, -19545, 903, 13569, 8085, -18967, -41427, -29825, 4561, 18442, 1281, -15777]
235a5777j678J642M708K0784J7902k0925l9573N51M3921K4759j8953k1242J958
248a923j310q962J8120L6311l886m7818k0201L6346L2854j2177k1074J817l02
261G795j4108P692L5751R119l9969l4147J6240L4606P375j2241r013j0015j4186
274a5101M924K7449J3894k1612k9133l027J7496J5025M891p175k0562j8369P298
287b4002K7053J3468j3110j9800j0075M3J1869K0786P467k2547k8271L586K9177
300d356J5642r963j3690n619n155J378K0740K2941r301l4950j4283K5061K8724
313A7169N42j4919q180l246l566R798K4577Q716k5853k8276R218L2313J3496j3699
327A8090j4078m041l249J390J9421J8953j1952l3356j1133K3741K4285q12j6199
$$ y = [-15777, -17455, -15813, -11105, 9679, 27581, 6656, -32917, -32366, 11555, 36314, 17361, -3881, -1923, -3233, -12195, 5925, 42236, 38350, -9468, -29669, 6677, 39531, 27354, 6280, 8097, 7795, -6313, 1379, 37130, 46249, 6280, -27867, -11627, 22979, 30354, 18113, 9100, -915, -15101, -10177, 17272, 31166, 9554, -19579, -22606, -5110, 9915, 14806, 7631, -12931, -31300, -24002, 3051, 16519, 3409, -16391, -26466, -26423, -14554, 6232, 13699, -8848, -37119, -33533, -4356, 11286, 1323, -12367, -17986, -23141, -21763, -1023, 21918, 12617, -22333, -36616, -11555, 17169, 17711, 2792, -5388, -8634, -12200, -2402, 22175, 30891, 5038, -23238, -14020, 18293, 31789, 18090, 4012, -29, -3278, -1888, 17533, 36486, 24534, -8822, -19955, 3786, 28071, 27259, 11060]
340A1060j2331o728J242J5108J7489l688k4550j7898O631J9596J2742k728j6183
353b38j8878l228J7915J8881j235j6875j4133l630O861J6574J3834r351k8287
366b1790j2532J9812K4607p9j4506q344m326m210R930K3768O630k5633k5854R074
380b3453K8583J1146r870j0996n973n115M426K0485J5077j3147k7126o756K0276
393b443K0848J669j2308j2160n893L564J4075J4807m68j8728j8383K622K2536
406I738J7571n874k0612j3093M510J3630J1098L022q696j7521j0332J1220K2485
419A7146Q252j6354k0703m222J1776J3957N893n263j4013j3454Q26J7726J6641
432A8208l390k1540j6456N199J9359J1865m963j3322j0578k670P253J5701J0551
$$ y = [11060, -1271, -7999, -6757, 8351, 25840, 22152, -2398, -20296, -13665, 5931, 18673, 15945, -238, -19116, -22344, -4429, 14452, 13217, -3658, -17791, -21421, -14560, 2014, 15848, 6497, -21790, -34322, -14510, 10097, 10018, -4488, -12832, -17158, -21368, -11438, 12330, 18960, -6673, -32527, -23453, 5130, 16276, 6406, -4590, -10563, -15678, -11252, 9233, 24310, 11163, -15963, -22719, -2443, 18405, 20074, 7766, -4394, -10287, -6723, 7352, 22159, 21691, 2963, -15420, -12798, 9738, 27309, 21435, 823, -12270, -7760, 5870, 16968, 19990, 11294, -6227, -16559, -5339, 17146, 25398, 9044, -11659, -15881, -4105, 9852, 15745, 10482, -3531, -16985, -16159, 1567, 18208, 14818, -6722, -23178, -17979, 1380, 13245, 8282, -5040, -15618, -18288, -11035, 4666, 15217]
445A5217j0163k3615r485J6434K2088L036j4000j2969m017M261J1491J3820J153
458A3251j8123j8302M731K2586J4399p183j6619q532K878J0221J2170N877q220
471I134j7986r094J2795K3033P367j6221j9505j897J3240J2572L604k925j0344
484C773j4348j522J8616J9434n679k3188j2124Q671J4055O298j48o852j4877r583
498a7474J1586K1633N053j7759j8944j219J2316J2706M744p104j5243j0202N962
511a3945J6241R662m459j4593j2853K64J6537J7169k629j9612j2843N273J3679
524b109Q251K809m917j4931j1594J0698K4859O942j8198j7773K749J2241O910
537E937L980K626r734j7943j150K3459J9474r728k3156p833J0089J0909N481K951
$$ y = [15217, 5054, -18561, -28046, -11612, 10476, 13512, -488, -13457, -17474, -13213, -1722, 12098, 13251, -4872, -23174, -18443, 4143, 18542, 11359, -5260, -13792, -10914, -693, 11477, 17354, 9134, -8852, -17946, -5151, 17882, 25249, 9028, -10477, -12374, 866, 13438, 17042, 14117, 3773, -10575, -12097, 6519, 25953, 20274, -2914, -15038, -6367, 7688, 13986, 13838, 6986, -7891, -17474, -5888, 15745, 20798, 3039, -15905, -17124, -4808, 7898, 12642, 5538, -9705, -19907, -13945, 2296, 11958, 7499, -7094, -19947, -19683, -3146, 14023, 11394, -8218, -21061, -15788, -2109, 6142, 8951, 4034, -10897, -22491, -11793, 13066, 20008, 1810, -15963, -13214, -973, 5937, 9917, 12543, 2809, -15134, -16284, 7175, 26649, 16921, -6235, -14068, -3979, 6930, 12411, 15362]
551A5362n158j5871j0134J2255K2216M021j8027j6555J227J0769Q999M195k970
564A0329j3201j3623L291J9284J2508q170j8170r170N007J2345J0812j56j3905
577b819j4466M80J5181J2023j075r747j1236o583O970J9220J0591j3039k1665
590a6165k861J5161J0790Q32p66n575j3992n150J9178K1504p266k6256p380J5389
604b557J1036q07J720J167j5059j5917J1933K8241M935k3548j6450P290J0847
617B831K515L290L282j1359j8526L379K4170J2311j4144j8567l054O588O650R100
631H466N088j0494j8286l172J6564J4395k703j1234q406l004N918J4082R272j0639
645E847j9935m432J4760J3933J440m458p549j1166m043J5469K0034l141k2180
$$ y = [15362, 10204, -5667, -15801, -3546, 18670, 22691, 4664, -11891, -10664, 105, 9104, 13299, 10329, -2872, -16495, -13204, 6080, 18588, 10418, -7752, -16922, -11915, 430, 11242, 11086, -2819, -17285, -16805, -1624, 10399, 9324, -423, -11659, -18242, -11272, 7948, 18539, 5500, -16165, -19026, -3865, 6925, 7757, 6991, 1416, -12576, -17726, 1452, 22956, 15690, -10566, -17946, -2557, 8479, 7672, 9392, 10559, -4500, -20417, -8484, 19757, 24692, 1144, -15306, -8016, 2831, 5346, 8636, 11918, 559, -17967, -14588, 9582, 21893, 7749, -10818, -13872, -7284, -634, 8466, 13554, 3060, -15226, -18398, -1834, 12561, 9858, -1376, -9782, -12786, -6868, 7214, 16486, 5847, -14088, -18520, -3760, 10173, 11613, 7155, -394, -11560, -15603, -134, 19900, 16759, -5421]
658e421j0594J1393J2743M07j508l84j0379j2722Q483K5795P436k2861k0297O159
672a1750J5180K992m72M061n418j8445m165K2932J7656j4372k3065j30J3750N285
686D039L07M937l830j9438r897J9009K2995l042j9288q202L464K887N979J0707
700A0627p30j8287j0930J3337J8121n7j1565o664l606k055J0397J8160J766k1919
714c405j6377R566J6389K632l608Jo360j2483L976K3069Q646k0995k0320P549
728a1720J7927L503l262K480m844j8280n220K2823K0647j0928k3430k458J3217
741D55M024j973M131Q74j4911j0678J5960K3431k766k3596j1348Q006Q879L766
755D254O512K561j4379j6669N689K1092O522j2813j0586O81K920M084J0018L893
$$ y = [-5421, -16015, -4622, 8121, 8528, 7020, 6636, -3743, -16465, -7982, 17813, 25249, 2388, -17909, -11750, 3430, 6422, 5950, 10011, 4593, -13852, -18017, 4915, 22571, 8199, -14866, -14996, -1246, 4039, 4346, 9283, 5453, -13985, -23882, -4873, 18122, 15080, -4208, -12410, -8946, -6059, -80, 10627, 9897, -8390, -19320, -5983, 12138, 12081, 516, -6148, -9754, -11809, -1412, 16748, 18514, -3405, -19782, -10216, 6173, 8805, 5197, 5198, -1162, -13645, -9669, 13400, 22046, 1051, -19269, -11720, 6207, 9710, 6448, 8928, 4084, -14196, -19416, 3407, 24054, 13126, -10304, -12762, 455, 4479, 2506, 6637, 7511, -7400, -18078, -2118, 21313, 18547, -5049, -16397, -8391, 488, 4254, 10766, 13327, -1052, -17721, -12032, 9060, 15582, 2769, -7817, -7136, -4216, -132, 9886, 13779]
769A3779j5638j8497M978K1064R160p670p803m989p125L92J6611J2978j2096k0639
783a5495J023J7094O052o507k330r08j0669n557J8371K2246q701k7695p851J6321
797d606J0457k626J897M548j1442j5807R507K4509J921k3005j1405J2552J1162
810G662j205J770M142j1381j8828M225K6126J1824j5563j5827R39N493J530N547
824F454O824p821j6865o2J8609J0988r751j2924l675j95K071J2670J2218q636
838I905k2285o921J4986J2371l086m994j521o378n397J0914J6352n353k2732q063
852b2202J6034J2978k119l105N64r557j3673P255K4695P170j9847j5811Q159J3073
866C614o14k213L798m359j3745O34K2394J3329j5379k0394P25J2055M667J993
$$ y = [13779, -1859, -20356, -15378, 5686, 14846, 7176, -627, -5616, -12741, -12349, 4262, 17240, 5144, -15495, -14472, 2622, 8674, 2167, -163, -1071, -11740, -17297, 1074, 23320, 14619, -13076, -20927, -4606, 5851, 3225, 5122, 9670, -1772, -17579, -8072, 16437, 18358, -4647, -16052, -3500, 7662, 6457, 8227, 12369, 988, -17840, -13615, 12511, 24335, 8772, -7055, -6116, -623, 907, 6454, 13278, 5457, -11408, -11470, 7139, 18127, 8376, -4548, -8223, -8418, -6347, 6323, 18541, 9905, -12380, -19301, -4315, 8056, 4970, -24, -1545, -7923, -13320, -2406, 13946, 8593, -14139, -22202, -6168, 6810, 4691, 1586, 2150, -7407, -21080, -13825, 10870, 18040, -1807, -17618, -9459, 3614, 3000, 787, 4585, 226, -13519, -12885, 9509, 22838, 7459, -12935, -12210, -155, 4512, 6505]
880F505O464k259j6833q158J5415J7456n300j6000l748O024M100M294O377m257
894A0080j7460q796J3795J7944n3j1182o343l514l288O296J4545K473j7513j3062
908a6078R297J4611J23p437k606m387p803M674J9975P607j9247j9280N638J5512
922E99K620l482L072j793j3794m525J8334J5332j1668k0653M12J4670N638j239
936C523K452j869j4746q596J5573K0582k438j7864p265O729N045J634N170J326
950I256j1425j0756Q561J7975K906j2986j0391J1L524O738R880K228j3946j4505
964a2930M368J5284N821n796n848l772l662L004J2706O659j2369j6799J022J4530
978B218P735k739l572m608r419k638J4241J4988o946j9185m708J2033Q041k593
$$ y = [6505, 12969, 10710, -6123, -14281, 1134, 18590, 13290, -2710, -6458, -434, 3666, 7960, 14337, 10080, -7380, -16176, -2381, 15563, 15510, 4328, -2015, -5529, -8817, -2521, 12024, 14497, -3016, -16078, -6781, 7830, 7953, 516, -2090, -6477, -14280, -9606, 10369, 17976, -1271, -20551, -14913, 599, 3219, -263, 2809, 1016, -12778, -17303, 1031, 16363, 4695, -15958, -15546, -876, 4762, 3523, 5975, 4106, -10640, -19236, -3663, 16919, 14481, -3383, -10648, -3919, 1126, 2760, 7930, 9256, -2169, -12925, -4364, 13611, 16517, 3531, -6860, -6849, -3325, 3413, 13293, 15521, 1575, -12930, -8562, 6722, 12543, 6747, 899, -2873, -6535, -3531, 9175, 15834, 3465, -13334, -12312, 2218, 9953, 7214, 3642, -966, -10385, -13023, 1218, 16206, 9260, -9925, -14633, -2600, 5441, 2848]
992B848j370J27q564q422R553J9129J049j9487j1796P474J0180K011J975J453
1006F160q828j2819L791J8429P173j2587j2202J632P285L516M150K646q074j3401
1020a3129N17J5571J0532n077j0621m545k14L890R654O747p645j4933j749J2731
1034A729R634k429n919m394n184m13J1347J2212m501j7086o860R420R831R04j394
1049F897k594q068o698Q042J5877J441j6018j1238N892J0048K992p20j028p245
1063b420r661K129J5589Q561r851j4136j883P497O025K260P49o175j0324k033
1077a3673J2140J1845l305j2729o871L298O597O393L147m582j0862n145Q149J1870
1091F272K208o913q021l109L109Q954Q456k767j2823p481O648J1616M175l425
$$ y = [2848, 1478, 1605, -6959, -15381, -5828, 13301, 14350, -5137, -16933, -9459, 721, 2732, 4707, 6160, -2668, -15487, -11696, 6733, 13906, 1319, -10883, -9251, -1966, 1550, 5700, 8346, 272, -13129, -12612, 2959, 13491, 8414, -2207, -6752, -6966, -3076, 6578, 13325, 5680, -9253, -11002, 1729, 11363, 8934, 3015, -1379, -6563, -6976, 4371, 16583, 12082, -5004, -11864, -2444, 7387, 8291, 6897, 4303, -3765, -10463, -2421, 13456, 14897, -1121, -12359, -6467, 3581, 6573, 5853, 4825, -2420, -12081, -9952, 5637, 14198, 4347, -9789, -11672, -4175, 1850, 4110, 4859, -1316, -11640, -13673, -1533, 10312, 7007, -5722, -12593, -9295, -2698, 3695, 6842, 2260, -8602, -13747, -5598, 6272, 8480, 1567, -6454, -9563, -6454, 2500, 10956, 8189, -4634, -12115, -5467, 6149, 10324, 6899]
1105F899n692o083k637O522J2750L306j2078j1541K292J0122N432m18k732o298
1119a56p543J968J3573Q584q412j4564k770Q282O877J571r40m960q769l147R725
1134f81J1999j617j2348q487K696P441N890J789m920r617n083O272J1505L890
1148H729p308r618l307M587Q464N325k651r437o410L161R431O145j506p323p771
1163i489q22Q861J0238Q64r807r156R98Q489O997J210m382p561n067L960J1147
1178F480O328n924j1079m308N564Q479L928j658o856p547o68Q860R947n60j0830
1193A56q641J973Q620O326m85n240p031l685M325R428N180n600j1137m714N818
1208d707R879L901m568q164n458J816P934P564o79r343q595J052R436P593j088
$$ y = [6899, 1207, -4876, -7513, -991, 11759, 15065, 2987, -8554, -6262, 3860, 9292, 8874, 6142, -156, -7699, -5731, 7842, 16426, 8014, -6550, -9320, -1038, 5839, 7410, 6470, 1510, -7259, -10406, -681, 11318, 9701, -2647, -11134, -8438, -997, 4893, 6682, 1762, -7855, -12938, -6666, 4839, 8729, 1421, -8197, -11504, -6917, 1547, 6872, 4221, -5216, -11626, -8465, 966, 7111, 5605, -1718, -9489, -10311, -1450, 8788, 9652, -155, -9311, -8313, 176, 7173, 8383, 4001, -3560, -8627, -4667, 6480, 12808, 6884, -4195, -8503, -2939, 5540, 9468, 7810, 954, -6593, -7261, 1599, 11546, 10986, 156, -8485, -6512, 2108, 8434, 7949, 2709, -4322, -8007, -3682, 5746, 10926, 5326, -5811, -10525, -4707, 5172, 9073, 4505, -3659, -9117, -7301, 633, 8197, 7518, -1825, -10420, -9368, 68, 7661, 6573]
1223F573p726o669j039N420P581L727m980r537m719N905J0396M296o093r393l778
1238a0036M421Q378N052k025p995o974J360Q754P730n52q435p650N33O869P893
1253G323J807o115q273l153N684R328L950n201r471m814N594R814M113n127p965
1268b506l732K123O301O082P94p553r559o06J0251R284k390q911n944L72L968
1283b026O416M907m320j0825n835P874J0758J509p245o127j904J381M922P030
1297F515R35r760r422K579J0820O233l263o592n353j378N641R045K648p894r643
1312h889k62P669O442J651l069p122n861L179J0512O243n168r592l464L267O109
1327A645N406J602p087r955l71J0897Q717l296r040m080J380L339N282M599k663
$$ y = [6573, -1153, -7822, -8861, -3441, 4140, 7867, 2887, -6650, -11369, -5464, 4932, 9228, 3135, -6258, -10036, -5615, 2763, 7815, 5790, -2205, -9179, -7819, 935, 8665, 8113, -322, -7972, -7439, -570, 7323, 9130, 3015, -5258, -8411, -2727, 6601, 10551, 5350, -4121, -8935, -3341, 6473, 10586, 5459, -2506, -6238, -4115, 2186, 8268, 9062, 1509, -8050, -8656, 1595, 10879, 8489, -422, -6366, -5994, -2026, 4390, 9297, 4977, -5848, -11683, -3809, 6949, 8458, 1213, -4914, -6818, -5437, -515, 6515, 7450, -2310, -11732, -9153, 1667, 7900, 4637, -1955, -7308, -8686, -3045, 6000, 8648, 754, -8889, -9151, -1482, 4960, 6611, 3542, -3580, -9441, -6262, 4250, 10493, 5325, -4267, -7731, -4464, 1645, 7051, 8653, 1566, -8389, -8760, 2137, 10854, 7558, -1482, -5562, -4182, -843, 4439, 9038, 6375]
1342F375j0797o499P178J1743J892p500o831j131J427M626O855J330r711r842
1356a0885K566J2055O010n441p071k869o8K339P338N309n382j1662k896R028Q581
1371F952l49n324m903l359J180Q326P583l590j2341m668O972P745K175j245l671
1386A483p359l630Q023J1129m24j0868n883L080M277L086L693p84j0003q083P121
$$ y = [6375, -4422, -10921, -3743, 8000, 9892, 2392, -4439, -5570, -4143, 483, 7338, 8668, -1043, -10885, -8319, 3736, 9746, 4305, -2766, -5635, -5703, -3364, 3974, 9283, 3901, -7761, -10657, -1629, 6952, 6603, 1279, -3624, -6983, -5803, 2523, 10106, 6516, -5825, -10493, -3521, 4224, 6399, 5154, 1483, -5876, -9506, -1483, 9646, 9222, -1646, -7529, -4449, -172, 2914, 6607, 5823, -4180, -12263, -5142]
$$ [...]
8191b9
##END NTUPLES=NMR FID
##END=
