##TITLE=1H_AM A490.1
 CDCl3, 8 sc, 
 2.7.2019
##JCAMPDX= 6.0         $$ Bruker NMR JCAMP-DX V2.0
##DATA TYPE= NMR FID
##DATA CLASS= NTUPLES
##ORIGIN= UXNMR, Bruker Analytische Messtechnik GmbH
##OWNER= root
$$ XWIN-NMR		Version 3.5
$$ Tue Jul  2 15:36:01 2019 Russian Standard Time (UT+4h)  she@DPX200
##.OBSERVE FREQUENCY= 200.13155
##.OBSERVE NUCLEUS= ^1H
##.DELAY= (6, 6)
##.ACQUISITION MODE= SIMULTANEOUS
##.ACQUISITION SCHEME= undefined
##.AVERAGES= 8
##.DIGITISER RES= 18
##SPECTROMETER/DATA SYSTEM= spect
##.PULSE SEQUENCE= zg30
##.SOLVENT NAME= D2O
##.SHIFT REFERENCE= (INTERNAL, D2O, 0, 15.7039)
##AUDIT TRAIL= $$ (NUMBER, WHEN, WHO, WHERE, WHAT)
$$ ##TITLE= Audit trail, XWIN-NMR		Version 3.5
$$ ##JCAMPDX= 5.01
$$ ##ORIGIN= Bruker BioSpin GmbH
$$ ##OWNER= she
$$ F:/spectra/data/she/nmr/H-F/1/audita.txt
$$ ##AUDIT TRAIL=  $$ (NUMBER, WHEN, WHO, WHERE, WHAT)
(   1,<2019-07-02 15:34:52.09 +0400>,<she>,<DPX200>,
      <created by zg, POWCHK disabled, PULCHK disabled
       configuration hash MD5:
       00 E9 B6 7A A2 85 ED C7 34 08 36 98 17 FE 4E 26
       data hash MD5: 16K
       85 B6 A2 C3 2E A5 F7 3F 18 A5 4A 9C 78 B1 1E DD>)
$$ ##END=
$$ 
$$ hash MD5
$$ 6E 2D 0B 50 22 78 C0 F6 89 B5 71 2C C2 2D C6 51
##$RELAX= 
##$RELAX= 
##$RELAX= 
##$RELAX= 
##$RELAX= 
##$RELAX= 
$$ Bruker specific parameters
$$ --------------------------
##$DU= <F:/spectra>
##$EXPNO= 1
##$NAME= <H-F>
##$PROCNO= 1
##$TYPE= <nmr>
##$USER= <she>
##$AMP= (0..31)
100 100 100 100 100 100 100 100 100 100 100 100 100 100 100 100 100 100 
100 100 100 100 100 100 100 100 100 100 100 100 100 100 
##$AQSEQ= 0
##$AQ_mod= 1
##$AUNM= <au_zg>
##$AUTOPOS= <>
##$BF1= 200.13
##$BF2= 200.13
##$BF3= 200.13
##$BF4= 200.13
##$BF5= 200.13
##$BF6= 200.13
##$BF7= 200.13
##$BF8= 200.13
##$BYTORDA= 1
##$CFDGTYP= 0
##$CFRGTYP= 5
##$CHEMSTR= <none>
##$CNST= (0..31)
1 1 145 1 1 1 1 1 1 1 1 1 1 1 1 1 1 1 1 1 1 1 1 1 1 1 1 1 1 1 1 1 
##$CPDPRG= <>
##$CPDPRG1= <>
##$CPDPRG2= <>
##$CPDPRG3= <>
##$CPDPRG4= <mlev>
##$CPDPRG5= <mlev>
##$CPDPRG6= <mlev>
##$CPDPRG7= <mlev>
##$CPDPRG8= <mlev>
##$CPDPRGB= <>
##$CPDPRGT= <>
##$D= (0..31)
0 1.2 0 0 0 0 0 0 0 0 0 0.03 0 0 0 0 0 0 0 0 0 0 0 0 0 0 0 0 0 0 0 0 
##$DATE= 1562067291
##$DBL= (0..7)
120 120 120 120 120 120 120 120 
##$DBP= (0..7)
150 150 150 150 150 150 150 150 
##$DBP07= 0
##$DBPNAM0= <>
##$DBPNAM1= <>
##$DBPNAM2= <>
##$DBPNAM3= <>
##$DBPNAM4= <>
##$DBPNAM5= <>
##$DBPNAM6= <>
##$DBPNAM7= <>
##$DBPOAL= (0..7)
0.5 0.5 0.5 0.5 0.5 0.5 0.5 0.5 
##$DBPOFFS= (0..7)
0 0 0 0 0 0 0 0 
##$DE= 6
##$DECBNUC= <off>
##$DECIM= 24
##$DECNUC= <off>
##$DECSTAT= 4
##$DIGMOD= 1
##$DIGTYP= 9
##$DL= (0..7)
0 120 120 120 120 120 120 120 
##$DP= (0..7)
150 150 150 150 150 150 150 150 
##$DP07= 0
##$DPNAME0= <>
##$DPNAME1= <>
##$DPNAME2= <>
##$DPNAME3= <>
##$DPNAME4= <>
##$DPNAME5= <>
##$DPNAME6= <>
##$DPNAME7= <>
##$DPOAL= (0..7)
0.5 0.5 0.5 0.5 0.5 0.5 0.5 0.5 
##$DPOFFS= (0..7)
0 0 0 0 0 0 0 0 
##$DQDMODE= 0
##$DR= 18
##$DS= 0
##$DSLIST= <SSSSSSSSSSSSSSS>
##$DSPFIRM= 0
$$ [...]
##$SUBNAM2= <"">
##$SUBNAM3= <"">
##$SUBNAM4= <"">
##$SUBNAM5= <"">
##$SUBNAM6= <"">
##$SUBNAM7= <"">
##$SUBNAM8= <"">
##$SUBNAM9= <"">
##$SW= 24.9336996594482
##$SWIBOX= (0..15)
0 0 2 0 0 0 0 0 0 0 0 0 0 0 0 0 
##$SW_h= 4990.01996007984
##$TD= 16384
##$TD0= 1
##$TE= 0
##$TE2= 300
##$TE3= 300
##$TEG= 300
##$TL= (0..7)
0 120 120 120 120 120 120 120 
##$TP= (0..7)
150 150 150 150 150 150 150 150 
##$TP07= 0
##$TPNAME0= <>
##$TPNAME1= <>
##$TPNAME2= <>
##$TPNAME3= <>
##$TPNAME4= <>
##$TPNAME5= <>
##$TPNAME6= <>
##$TPNAME7= <>
##$TPOAL= (0..7)
0.5 0.5 0.5 0.5 0.5 0.5 0.5 0.5 
##$TPOFFS= (0..7)
0 0 0 0 0 0 0 0 
##$TUNHIN= 0
##$TUNHOUT= 0
##$TUNXOUT= 0
##$USERA1= <user>
##$USERA2= <user>
##$USERA3= <user>
##$USERA4= <user>
##$USERA5= <user>
##$V9= 5
##$VALIST= <valist>
##$VCLIST= <CCCCCCCCCCCCCCC>
##$VD= 0
##$VDLIST= <DDDDDDDDDDDDDDD>
##$VPLIST= <PPPPPPPPPPPPPPP>
##$VTLIST= <TTTTTTTTTTTTTTT>
##$WBST= 1024
##$WBSW= 4
##$XGAIN= (0..3)
0 0 0 0 
##$XL= 0
##$YL= 0
##$YMAX_a= 17323
##$YMIN_a= -18097
##$ZGOPTNS= <>
##$ZL1= 120
##$ZL2= 120
##$ZL3= 120
##$ZL4= 120
##$ABSF1= 10
##$ABSF2= 0
##$ABSG= 5
##$ABSL= 3
##$ALPHA= 0
##$AQORDER= 0
##$ASSFAC= 0
##$ASSFACI= 0
##$ASSFACX= 0
##$ASSWID= 0
##$AUNMP= <proc_1d>
##$AZFE= 0.1
##$AZFW= 0.1
##$BCFW= 1
##$BC_mod= 2
##$BYTORDP= 1
##$COROFFS= 0
##$CY= 11.3945322036743
##$DATMOD= 1
##$DC= 2
##$DFILT= <>
##$DTYPP= 0
##$F1P= 18.9103706918063
##$F2P= -1.10871071338519
##$FCOR= 0.5
##$FTSIZE= 0
##$FT_mod= 4
##$GAMMA= 1
##$GB= 0.15
##$INTBC= 1
##$INTSCL= 1
##$ISEN= 128
##$LB= 0.24
##$LEV0= 0
##$LPBIN= 0
##$MAXI= 10000
##$MC2= 0
##$MEAN= 0
##$ME_mod= 0
##$MI= 1.114404
##$NCOEF= 0
##$NC_proc= 0
##$NLEV= 6
##$NOISF1= 3.799351
##$NOISF2= 2.8
##$NSP= 1
##$NTH_PI= 0
##$NZP= 0
##$OFFSET= 15.70392
##$PC= 1
##$PHC0= -8652.115
##$PHC1= 2.600971
##$PH_mod= 1
##$PKNL= yes
##$PPARMOD= 0
##$PSCAL= 0
##$PSIGN= 0
##$REVERSE= no
##$SF= 200.130013532006
##$SI= 16384
##$SIGF1= 3
##$SIGF2= 2
##$SINO= 400
##$SIOLD= 16384
##$SREGLST= <1H.CDCl3>
##$SSB= 0
##$STSI= 0
##$STSR= 0
##$SW_p= 3612.71676300578
##$SYMM= 0
##$S_DEV= 0
##$TDeff= 0
##$TDoff= 0
##$TI= <>
##$TILT= no
##$TM1= 0
##$TM2= 0
##$TOPLEV= 0
##$USERP1= <user>
##$USERP2= <user>
##$USERP3= <user>
##$USERP4= <user>
##$USERP5= <user>
##$WDW= 1
##$XDIM= 8192
##$YMAX_p= 0
##$YMIN_p= 0
$$ End of Bruker specific parameters
$$ ---------------------------------
##NTUPLES= NMR FID
##VAR_NAME=  TIME,          FID/REAL,        FID/IMAG
##SYMBOL=    X,             R,               I
##VAR_TYPE=  INDEPENDENT,   DEPENDENT,       DEPENDENT
##VAR_FORM=  AFFN,          ASDF,            ASDF
##VAR_DIM=   8192,          8192,            8192
##UNITS=     SECONDS,       ARBITRARY UNITS, ARBITRARY UNITS
##FACTOR=    0.0002004,     1,               1
##FIRST=     0,             0,               0
##LAST=      1.6414764,     0,               0
##MIN=       0,             -18097,          0
##MAX=       1.6414764,     17323,           0
$$ Real data points
##PAGE= N=1
##DATA TABLE= (X++(R..R)), XYDATA
0@%%%%%%%%%%%%%%%Lj1J6j6J6j6J6k4L2l2L4m2M8n2O0o7P5q8R9j09J22j36J52
38H0j70J88k05K26k50K78l09L43l78M18m69N27n92O68p62Q81j036J241j530J977
58A126k769M595j7271l778K0690q137r180K407R251o299o044O935J0360o024q223
73a2361N474J1474j863p344J326N869l091l436P809J0404m227j1102m02R370L157
88A1057m126p98L648l23k675J827L746k237n229j75L538Q75J4K229j009p453m836
105a927M983O640j975n755m68J824k061k276K511O54n859l573N709N617m197o467
121f620J257K565m855l403P939P843o870j1497K692J0664k63q690J68P300n76
136b346n977L374Q322l298j0999O99J1263K711o791o8O911j997r390J560J2223
$$ plain form
0 0 0 0 0 0 0 0 0 0 0 0 0 0 0 0 0 3 -8 8 -8 8 -8 8 -16 16 -16 18 -24 24 -28 32 -35 40 -48 51 -58 64 -72 80
38 80 -90 98 -107 119 -131 147 -162 181 -197 221 -248 279 -313 355 -407 474 -562 679 -851 1126
58 1126 -1643 2952 -14319 -18097 2593 -5544 -14724 -12317 -3066 -9365 -15409 -8474 1886 -4138 -12361
73 -12361 -6887 4587 2724 -4620 -3294 2575 -516 -3952 3857 14261 10034 -1068 -1470 7900 11057
88 11057 6931 6133 9781 9458 6783 8610 12356 10119 4890 4715 8253 9128 9142 11371 10362 2909 -1927
105 -1927 3056 9696 7721 1966 1498 3322 1261 -1015 1496 2150 -3709 -7282 -1573 4044 -153 -6620
121 -6620 -5363 -2798 -7653 -11056 -3117 4726 -2144 -13641 -10949 -285 -548 -9238 -9070 -1770 -2346
136 -2346 -8323 -4949 3373 75 -10924 -10225 1038 3749 -3042 -3110 3801 1804 -7586 -6026 6197
151F197K528j0702m179R049N894n761m529L820J821m449p0P624K662o786m928
166a809L283K930k027Q0M183m75o370j505O143K963m910m527J746K851K15O65
182C436Q72l210m924P38M965J002k874l6J576k855l975K971N937k010p514p59
198f660O834K750m363k468J740j110l442K724O995l13p962k489N878K571m664
213c979r21N552P83p135j525Q635M404p695o941M817P162j407l562K391J995m660
229b086l127N833N810l481n702K147M715j437l044K877L297m105m862M066P384
244H285q65o777k039L405J721q25R89J120k544l088J656L157n97k528k19O09j549
261h9k41L222J252m398m261J650L915M98j673o61j352k433O37M065R46m481k729
$$ plain form
151 6197 8725 -1977 -6156 2893 8787 3026 -1503 2317 4138 -311 -381 7243 9905 3119 -1809
166 -1809 1474 4404 2377 2457 6640 6165 -205 -1710 4433 7396 2486 -2041 -295 2556 2771 3436
182 3436 4308 1098 -3826 -3088 1877 2879 5 -31 1545 -1310 -5285 -2314 3623 1613 -5901 -6660
198 -6660 174 2924 -1439 -3907 -2167 -3277 -6719 -3995 3000 2687 -5275 -7764 -1886 685 -3979
213 -3979 -4900 652 1435 -5700 -7225 1410 5814 -1881 -8822 -4005 3157 1750 -1812 579 2574 -2086
229 -2086 -5213 620 6430 2949 -2753 -606 4109 2672 -372 2505 5802 1697 -3165 901 8285
244 8285 7420 643 -1396 2009 3730 2905 3894 5014 2470 -618 1038 4195 3598 1070 851 1460 -89
261 -89 -330 2892 4144 -254 -4515 -2865 1050 1548 -125 -786 -2138 -4571 -3934 131 1077 -3404 -6133
278f133L006K379k316j242K872O68m911k369N617N373l371n773P00M017K60j486
294b709J901J731l324k799L880N197j907n013P17M087j9k427K087L819k260n699
310b738P62O750K530m335l451J815K102m73M3J540p53l326l95L512J948k157k320
327A054L18K76q60N89K420q7l781k597J930L279K31k359k111p36Q22J953R39j631
345c51k393l20J100M64M8R30P1k527k198J935L618K23l043j586R52R51O91J382
363e3L41k907k324K428M143j78l399o22K117J18j532J429L311q05m446j084M223
380G60L295j762k783j30J060J28R48J741m96l078j306K716K586p41k072j62N34
397A238o78k35K010J557j878l399l45L271K419j290k833j169Q51J472O67j27r16
$$ plain form
278 -6133 -3127 -748 -3064 -4306 -1434 -766 -5677 -8046 -2429 2944 -427 -6200 -5500 -1483 -1223 -2709
294 -2709 -808 923 -2401 -5200 -1320 3877 1970 -3043 -2326 1761 1742 -685 1402 5221 2961 -2738
310 -2738 -1976 4774 7304 2969 -482 1333 3435 2962 3005 4545 3792 466 71 3583 5531 3374 1054
327 1054 1372 1648 788 1377 3797 3710 -71 -2668 -738 2541 2772 413 -1698 -2434 -1612 341 1280 -351
345 -351 -2744 -3064 -1964 -1500 -1452 -522 -451 -2978 -5176 -3241 377 600 -2443 -4029 -3077 -2126 -1435 -53
363 -53 288 -2619 -4943 -2515 1628 1450 -1949 -2571 -454 -336 -1868 -439 2872 2067 -2379 -3463 760
380 760 4055 2293 -490 -620 440 568 1516 3257 2761 -317 -1623 1093 3679 2938 866 704 1238
397 1238 560 325 2335 3892 2014 -1385 -1730 1541 3960 2670 -163 -1332 -481 991 1658 1531 615
414F15j449p13Q38J573N67j092j544p52M12J105J061J82j615k180l25K488K352
431A523p38l040j617J534K215K95j040m61j31p00q8J525J732n09k447j154J415
448a686K229Q00p84j411j116L08K077J984m91k543j221J528K122L30r27m83q8
465F28m51j07J375J742l44k633j642J594K813P34k017k129j10J312R94L98l24
482A833j306j504N7J874J212j054j743l33K92l04M64J689J69l019k552K097L815
499A687n0l459j741J492J271k72K10Q36j008k156J44K623J325j378j256K02rj78
517a717J479K161q38l422r16L181K864r57k289n06R34N22N92R51l2j387j000P44
535C64J254O82O7o39j643q23J719K569j28k710j831Q85J730N09q7o13j538j129
$$ plain form
414 615 -834 -1547 -709 864 1431 339 -1205 -1957 -1545 -440 621 803 -812 -2992 -3317 -829 1523
431 1523 785 -2255 -3872 -2338 -123 172 -868 -1329 -1460 -2160 -2248 -723 1009 500 -1947 -3101 -1686
448 -1686 543 1343 559 -852 -1968 -1660 417 2401 1910 -633 -1854 -326 1796 2126 1199 716 628
465 628 177 70 1445 3187 2843 210 -1432 162 2975 3709 1692 -437 -547 765 1759 2157 1833
482 1833 527 -977 -920 954 2166 1112 -631 -964 -672 -976 -512 1177 1346 -1673 -4225 -2128 1687
499 1687 1637 -1822 -3563 -2071 -800 -1072 -862 -26 -1034 -3190 -3046 -423 902 -476 -1732 -1530 -1539 -1717
517 -1717 -238 1923 1085 -2337 -3253 -72 2792 1835 -454 -960 -26 496 1088 2039 2007 620 -380 364
535 364 1618 2300 2367 1728 85 -738 981 3550 3422 712 -1119 -234 1496 2005 1918 1305 -233 -1362
553a362J184J965j12j817p98N85k70m97J429J637j814l727J36L962J934k751k356
570b672P16J041m50L18J809l70k992q28K980J995j707j594J053L70j714K50L618
587A823J295m020l243K667L949n01k606m2J087p53n50K027J467k272k434J199
603i07K471j62j075O76Lk320r13L068K786j942l585nK482O65q24J18k37j478m62
622a641K259J674j480k082L07Q33n78L09K356N19l407k351K605L303r10k609m9
639i42J393l47k18J884N52k803k234K358L140q41k139P38Q89k144j547L115L203
656D057k429m467Q93M081L49k871o46J472p82j514J920K991j646m168j54L192
672B78M78j974O15K084j744l355J207M380k6m433j418L248J753j319n28Q45j260
$$ plain form
553 -1362 -178 1787 1675 -142 -940 -355 -625 -1122 307 1944 130 -3597 -3461 501 2435 -316 -2672
570 -2672 -1956 -915 -1365 -1047 762 392 -2600 -3428 -448 1547 -160 -1754 -701 -331 -2045 -1795 1823
587 1823 3118 -902 -4145 -1478 2471 1970 -636 -678 409 -344 -894 1133 2600 328 -2106 -907
603 -907 1564 1402 327 1003 1006 -1314 -2227 841 3627 1685 -1900 -1905 577 1242 418 536 299 -1179 -1641
622 -1641 618 2292 812 -1270 -963 -130 -708 -399 1957 2476 -931 -3282 -677 2626 1716 -893 -942
639 -942 451 104 -114 1770 2322 -481 -2715 -357 2783 1942 -197 541 1430 -714 -2261 854 4057
656 4057 1628 -2839 -1946 2135 2484 -387 -1033 439 -343 -1857 63 3054 1408 -2760 -2914 278
672 278 756 -1218 -603 1481 -263 -3618 -2411 1969 1943 -2490 -3908 -660 1093 -226 -754 91 -1169
689a169k368J204L694N20k905r38J629p7j571J174K721j114l483L38M034J145
705B834l043j758J234O36n69J527K152j498l608J01L197O64k182J63K055q71k694
722a660J077L843n23m622j114L898K368j909j220R87o89k581Q42M082N74l830
738d77j306K861J130k624o88K689L30l601m88M539K150m013l696J691K668o01
754E64o48J819K26l249j444L144K091k639k205K042J800j865r99K531P36l816
770a912k426L384L880j195k979O1Q39j234l44K501J067k709j701K623K161j964
786E2k067J300J023j932m44L705K175l546l798J554L094j90j180J268O61k413
802g38j077L048J877l080k645K332L023j344j746J824J168l477k776L444M398
$$ plain form
689 -1169 -3537 -2333 1361 1881 -1024 -1962 -333 -410 -1981 -807 1914 800 -2683 -2345 1689 2834
705 2834 -209 -1967 -733 -97 -666 861 3013 1515 -2093 -1992 1205 1869 -313 -150 1905 1034 -1660
722 -1660 -583 3260 2737 -1885 -2999 899 3267 1358 138 1125 436 -2145 -1303 2779 3353 -477
738 -477 -1783 1078 2208 -416 -1104 1585 1915 -1686 -2174 2365 4515 502 -3194 -1503 1165 564
754 564 -84 1735 1961 -1288 -2732 412 2503 -136 -2341 -299 1501 -364 -1363 1168 1904 -1912
770 -1912 -4338 -954 2926 1731 -1248 -1187 -348 -1582 -1926 575 1642 -1067 -2768 -145 2016 52
786 52 -2015 -715 308 -1624 -2068 1637 3812 266 -3532 -1978 1116 926 -254 1014 1675 -738
802 -738 -1815 1233 3110 30 -2615 -283 2740 1396 -350 1474 2642 -835 -3611 -167 4231
817D231j388l903oK343o56j666J481J471k218k293K540L413j781l920J63K529
833C40p60j752K297K910k340m526M37M001O47k662n19J741j24j423J249J805j967
850f46l153J172L782M81k364j09J526j442k329J678L929k43l524o93K758Q91j581
867A33k96J033r10j395K193L156j209l836m05K589L24j553J052K562j367l692
883a621J77L766O04l191j194K208Q68j326L61J501j764l438P18M241Q92l280j129
900a607K045n8k713K49L441M45l820j322L343K033k356k026J036M88j188Q43K968
917A801q6l784j552L004J727j777r26K044O07k459o97K969J398k881k175J950
933h37K397k89q06N68o95k209L38L240J425k605j830J696J280j503o90J873O28
$$ plain form
817 4231 2843 -1060 -1066 1277 621 -1045 436 1907 -311 -2604 -64 3349 1568 -2352 -2189 340
833 340 -420 -2172 125 3035 695 -3831 -3394 607 1254 -1408 -1927 -186 -310 -1733 -484 1321 -646
850 -646 -3799 -2627 1155 1636 -728 -837 689 -753 -3082 -1404 2525 2282 -1242 -1935 823 1714 133
867 133 -163 870 -40 -1435 758 3914 2705 -1131 -1536 1053 1377 -176 876 3438 2071 -1621
883 -1621 -1444 2322 2926 -265 -1459 749 1617 291 652 2153 389 -3049 -2331 1910 2802 -478 -1607
900 -1607 438 380 -2333 -2084 1357 1802 -2018 -3340 3 2036 -320 -2346 -1310 -822 -2010 -1167 1801
917 1801 1715 -2069 -3621 -617 1110 -667 -1593 451 1058 -1401 -2098 871 2269 -612 -2787 -837
933 -837 1560 1271 465 1033 338 -1871 -1533 1707 3132 527 -1303 393 1673 170 -520 1353 1981
950A981k541j047K781K132j869k465K21J093l23M90J912k58l112j337K700K014
966B372j835j947J385J228j502r62K207J315k754k552J715K999k37j810K0K56
982a02j413m45K509J597k456k427J599K547q31k176P15J379j268j621J980K670
998B257j218l200k14K053N89m80N12L76j684j251J987K208j285k526M38K104J9
1015F85j066P01J096j400k083J119K696L24j759p25M81j18K1J362P65j880j887
1032a668J475K438j91k144k81J088l23r77J305J835j051k633k28K000P47p51l22
1049C19R0r65p29J561J849j245k867O4K272O72j355l84R42p22j582M06K296O51
1067A273k180j283Q96R49p1J13M00j043j437Q36K535L72k309j151J271J016n34
$$ plain form
950 1981 -560 -1607 1174 3306 1437 -1028 -807 286 -37 453 2365 2107 -1005 -2342 358 2372
966 2372 537 -1410 -25 1203 -299 -1261 946 2261 -493 -3045 -1330 1669 1432 -378 -358 -102
982 -102 -1515 -1960 549 2146 -310 -2737 -1138 1409 578 -1598 -883 496 -772 -2393 -413 2257
998 2257 1039 -2161 -2375 -322 267 -213 299 675 -1009 -2260 -273 1935 650 -1876 -1438 666 685
1015 685 -381 320 1416 16 -2067 -948 1748 2072 313 -412 69 -49 -28 1334 2099 219 -1668
1032 -1668 -193 2245 2054 -90 -371 717 394 -583 722 2557 1506 -1127 -1355 645 1392 641 319
1049 319 409 -556 -1285 276 2125 880 -1987 -1923 349 1021 -334 -718 224 -498 -2080 -1674 622 1273
1067 1273 -907 -2190 -1294 -345 -416 -303 97 -946 -2383 -1547 988 1360 -949 -2100 -829 187 -347
1084c47r5J200j03j790m67J754J432o45j231j67K64K37R36R88q96j962j56K025
1102I77J210r83r90K25J46n85K46J405J69j528j115P61J105J60l00l96r08o88
1120a089R88J801j13k067j183J068J274l33n48K81j69j058k57J350J012q34j343
1137a220j69N01N45M57M12q30j521p3J896J243j100j401J21Q13J79r7M88K72r37
1156d21q30N64J395M05o95q60l18K92R04J007k44j452r57R64J391L09r36o38p0
1175a90J99K20O11L10m52r16m31N81R96M59n51j098p15N98J347N53r69j263j43
1194h54P85O79R4l64m66m65p4N32O94P0o04q04l88N79J030N87q42j447m17J091
1214e84J318M9j135p73R0N55N65Q8j05m54n83j20N58J011J64p62j165o4R98J098
$$ plain form
1084 -347 -442 758 655 -1135 -1602 152 1584 939 -292 -459 -195 42 978 1966 1070 -892 -1048 977
1102 977 2187 1204 214 439 585 0 246 1651 1820 292 -823 -62 1043 1203 903 507 -401 -1089
1120 -1089 -101 1700 1587 -480 -1663 -595 679 346 -202 79 -90 -1148 -1405 -55 957 123 -1220
1137 -1220 -1389 -888 -343 114 526 -304 -1825 -1898 -2 1241 141 -1260 -1139 -326 -147 -244 244 516 -421
1156 -421 -1251 -687 708 1113 418 -442 -760 -468 436 1443 1199 -253 -1210 -246 1145 1454 518 -120 -190
1175 -190 9 229 840 1150 698 -218 -649 -68 928 1387 836 -262 -977 -379 968 1521 552 -711 -854
1194 -854 -69 610 704 340 -126 -591 -665 -133 561 631 27 -777 -1165 -586 444 1031 189 -1258 -1675 -584
1214 -584 734 783 -352 -1125 -1035 -480 85 173 68 -386 -969 -1089 -531 480 644 -118 -1283 -1347 -349 749
1234G49R2r49j077M4J042R81k5r23o46J51P62K75R6P2j58p80l92P89J353J02j362
1255A96j080M53J169O69l18o89p01j69Q73R72r6j097o01M04L95K4J72M14n80j302
1275h92k02J499J101p23j494n28O90O59M14oq03j045P5J241O47o65o42M1J8l65
1295i80M46J139L1j541r22Q80J432K17p46o39l50M1R92R63l48j384m93J061Q90
1314F89k95k66L90k65j169P3J712R28j179j464O7R67O12L8j0o92j017K25J604
1333I48O76j294j168M64Q10l25j61Q61J92j468j117J101J836j97j533n55L95K83
1351b52K99Q19j59j488q54J264J589m61j317K1O37m55m83J117J292j023j931K69
1369a116J657O57q24n16q2l15L5J351R20j462j665M95J636Q0q79K74O02j031j209
$$ plain form
1234 749 841 -108 -1185 -1141 -99 882 857 -66 -712 -561 201 476 572 644 486 -294 -686 103 1456 1558 196
1255 196 -884 -431 738 1407 1089 400 -301 -470 403 1375 1279 182 -419 -15 380 404 576 990 410 -892
1275 -892 -1094 405 1506 783 -711 -1239 -549 110 524 518 -285 -1330 -1255 -14 633 -32 -674 -633 -615 -980
1295 -980 -534 605 636 -905 -1827 -947 485 702 -44 -683 -1033 -992 0 963 615 -769 -1262 -201 689
1314 689 394 128 518 253 -916 -843 869 1797 618 -846 -779 188 800 838 828 136 -881 -656 948
1333 948 1624 330 -838 -374 436 111 -50 811 1003 -465 -1582 -481 1355 1158 -375 -930 -535 -252
1351 -252 47 866 707 -781 -1635 -371 1218 757 -560 -539 98 -357 -840 277 1569 546 -1385 -1116
1369 -1116 541 1198 374 -142 -224 -539 -504 847 1767 305 -1360 -865 771 851 -28 246 848 -183 -1392
1388a392J031J877l55j913l78J046N25k84L10K8j395r71J536J905p13j988K4J220
1406A13j55q36O82J309r21j842L20K175L99j453q01N95K02k40J130R65j316k010
1424a684N21K274L18j465l52J066j95j129L81J725n5k116o17J721J224p25p05
1441A87M7m31q98R57J972l03k290p06J633Q00j236m29J093Mj588o7J963O76j842
1460d58j451Q31J004j16K5Q31p04k002J44K306P50j915r57J435Q14j164l10J464
1478E27K23k003p37K098J652j005j382L30K19p69N30J903J29k335p91K110J294
1495A993j499j272J087Q09j168l88J911Q86k078j872J115J726k97n99N39j53j515
1512g75l08K040R54k083j649J558J651o85j329N51O38j548r37J722J962r76j969
$$ plain form
1388 -1392 -361 1516 1161 -752 -1130 -84 441 157 467 495 -900 -1871 -335 1570 857 -1131 -1107 113
1406 113 -42 -878 -196 1113 192 -1650 -1330 845 1244 -209 -1010 -415 -213 -453 677 1642 326 -1684
1424 -1684 -1163 1111 1429 -36 -388 678 483 -646 -265 1460 1405 -711 -1328 393 1617 892 187
1441 187 234 -197 -1095 -138 1834 1531 -759 -1465 168 968 -268 -697 396 400 -1188 -1255 708 1384 -458
1460 -458 -1909 -1078 -74 -190 -165 666 -38 -2040 -1896 410 1160 -755 -1712 -277 537 -627 -937 527
1478 527 750 -1253 -1990 108 1760 755 -627 -297 -78 -847 -317 1586 1715 -620 -1411 699 1993
1495 1993 494 -778 309 1118 -50 -438 1473 2359 281 -1591 -476 1250 953 354 893 740 -775
1512 -775 -1083 957 1911 -172 -1821 -263 1388 703 -626 -75 563 -985 -1922 -200 1762 786 -1183
1529a183rR29k41k39J036M42j708r17J893J629j389j939M37J482j63q35J199J012
1547A436j466j998Q79K085j2j290K04O74p46n71J451J055j790j866J394K518m66
1564A491j899K8J092r06j168J401K053p47k231n4J642Q3j082L94P66j045r69J474
1582C23J938j198k720Q5K200M17j301L42J257r13k006M48K179J82j725m46J281
1599C43J64p77M43Q29j234j836R33K742J61k230p95J270P9j160M02J823k49j907
1617i99l10J739N92j445n65Q51j59p65J029J747q71k647l22K314R07j241n79J206
1635D82P9j507q4J751M77j859p08J556R56q54k89P44o38j714O13K663N24k216
1653b4j268J424J047j171n22J331L57j558n06J816R50j619j307P96P07n91L28
$$ plain form
1529 -1183 -1192 -263 -504 -743 293 735 -973 -1890 3 1632 243 -1696 -1259 223 60 -775 424 1436
1547 1436 -30 -2028 -1149 936 924 -366 -162 512 -234 -805 646 1701 -89 -1955 -561 1957 1491
1564 1491 -408 -380 712 -194 -1362 39 2092 1345 -886 -940 702 785 -297 97 863 -182 -1151 323
1582 323 2261 1063 -1657 -1572 628 1045 -256 86 1343 430 -1576 -1128 1051 1233 -492 -938 343
1599 343 507 -270 173 1002 -232 -2068 -1135 1607 1768 -462 -1257 13 92 -1068 -666 1157 908 -999
1617 -999 -1309 430 1022 -423 -988 -137 -296 -1061 -32 1715 844 -1803 -2125 189 1096 -145 -724 482
1635 482 561 -946 -1030 721 1198 -661 -1369 187 1143 289 0 744 106 -1608 -995 1668 2192 -24
1653 -24 -1292 132 1179 8 -514 817 1174 -384 -890 926 1876 257 -1050 -254 453 -138 190
1670A90J298l50k288p45K072J481j434j469J003R05r32o53J153N20j630j059J466
1687d72J402n79j040K85k3r78L6K017P43k046j392J416J592q32j286O57Q08p75
1705d67n38J458R51j284j491N33J328j57k46Q22R5j663o77J895J481j398j694
1722a052O86J590k18j021M88O38j181r76J167J652m80j424n0M96m47k95J238P45
1740A556j592j523J174J945n07j903r4J094o5o14P11Q81r34j660L27J455K12p99
1758c36P2M65q29p12J203J413j046k015L19J923M51j120k86N50l83p92P15J452
1776A044k03j463k53Q51K24m02M45N74q92j197R22J943k74j898n63J191O94n64
1794A79J85N59m75j276K70J395K99q46m13M30n2m60O74R97q20j702N1J955O32
$$ plain form
1670 190 1488 1138 -1150 -1895 177 1658 224 -1245 -242 663 -269 -922 231 751 -879 -1938 -472
1687 -472 930 351 -689 -404 -427 -1405 -1369 648 1391 -655 -2047 -631 961 129 -1157 -500 308 -467
1705 -467 -1005 453 1404 120 -1371 -838 490 333 87 909 1004 -659 -1336 559 2040 642 -1052
1722 -1052 -366 1224 1006 -15 473 1111 -70 -1046 121 1773 1293 -131 -181 315 -132 -427 811 1556
1740 1556 -36 -1559 -385 1560 1053 -850 -944 150 85 -529 182 1063 129 -1531 -1204 251 463 -336
1758 -336 -264 201 -628 -1340 -137 1276 230 -1785 -1466 457 908 -212 -498 52 -331 -1123 -408 1044
1776 1044 841 -622 -875 -24 200 -202 243 817 -75 -1272 -350 1593 1319 -579 -1142 49 743 179
1794 179 364 923 448 -828 -558 837 1136 290 -123 307 255 -205 469 1466 646 -1056 -1005 950 1582
1813A582j195q74M11K99n07K34R08j08j260l87J019N36n28k30J70l54p79N72J439
1832I48Kj719r16J114J040l21n99J25ln99J5J037L65j028o46M70M88j15J20M91
1852B69m29j148J1J582Q45j069j142L30Q14J07r4L55k6p93k36Q74P68l94n21N7
1872A60N1k34M02R83oj435p38J103J172k86q89p3J44j24J19N85O4p78p05L83O35
1893E33l5k35N7k94p89R6J070N85r85j199J13R73M19l57l91j43l21k0N53M84l04
1914a90o80q7K69J29K32M41j74p83n58Q52J172j08r23n26M19N96K71N7j13l97
1934a01k18L02O89J47k65l31j28o5K75P34L20p42r65Q0J064N96m12o97k86P1L38
1955D06L51Q3l77n60j22K88K33J13mm28n83j94P69O77k50r83n52L02P69K77k59
$$ plain form
1813 1582 387 -487 -76 223 -284 -50 858 750 -510 -897 122 658 130 -100 70 -284 -1063 -491 948
1832 948 950 -769 -1685 -571 469 148 -451 -326 -329 -928 -913 124 489 -539 -1185 -715 -227 -342 -222 269
1852 269 -160 -1308 -1297 285 1130 61 -1081 -751 63 170 76 431 405 -388 -624 250 1018 624 103 160
1872 160 211 -23 379 1362 1356 -79 -817 286 1458 1172 283 210 354 230 349 934 998 220 -485 -102 533
1893 533 498 263 320 26 -763 -667 403 988 3 -1196 -1083 -110 309 -48 -439 -582 -903 -923 -370 114 -190
1914 -190 -870 -957 -688 -559 -327 114 -60 -843 -1401 -549 623 515 -408 -934 -515 81 352 409 296 -101
1934 -101 -319 -17 672 819 554 223 95 30 305 1039 1359 617 -348 -268 796 1392 980 283 -3 68 406
1955 406 757 840 463 -97 -219 69 302 415 411 -17 -600 -794 -25 652 402 -581 -1133 -831 -62 215 -44
1976d4o26l30J25M72L75%m33k27j99J84M34M45q3o30m72L04P73M93k78p82l14
1997h13M37P48L55m15m78m8J84K53K08K68k17m58m04M28P37K04m15m62l42J49
2017h1P26N56m53r87j79O72M97j14k83j65k09j95J49O00J59n11o14j4L80M44J76
2038E54l07p38l46M38R22J53q39o86K54M66J22J7m6j10m84j32N31N45q4n09m24
2059g03MK40O34K92l70r95j57Q90P50l49o92o7K24O7P8M33J52o00n94J67P47K87
2081D38k24l04k76k81L96R03L02j008q93M82J025Q9n03k4P7k82l54O85P58l10
2101F96r33j17N22K90J2J95j52r28k03R50R87n75j219j09Q23J46k79J42L50n48
2121E0q12M39Q88P9q03l01J41r6J52O70K53r93j091O50J256J19r78l05M64k3l33
$$ plain form
1976 -44 -670 -1000 -875 -403 -28 -28 -461 -688 -887 -703 -269 176 93 -537 -1009 -705 68 561 283 -499 -813
1997 -813 -376 372 727 312 -166 -214 -30 223 431 699 482 24 -380 48 785 989 574 112 -230 -81
2017 -81 645 1201 748 -239 -418 254 751 637 354 189 -20 -215 -66 534 693 182 -432 -446 -66 378 554
2038 554 247 -491 -837 -399 523 676 -163 -849 -595 -129 -7 10 -36 -146 -630 -762 -231 314 230 -279 -703
2059 -703 -699 -459 175 467 97 -898 -1055 -165 585 236 -456 -523 -299 -232 -154 279 431 -169 -763 -596 151 438
2081 438 214 -90 -366 -647 -251 652 954 -54 -947 -465 560 649 146 122 199 -83 -437 248 1006 696
2101 696 -237 -354 168 458 470 665 513 -415 -618 332 1319 744 -475 -584 239 385 106 248 598 50
2121 50 -762 -323 565 644 -159 -460 -319 -415 -263 407 660 -333 -1424 -774 482 601 -377 -682 -218 -241 -574
2142e74M10O74l84r10L4Q23K91l15j14N4n04k61R13J076n30j391j78J185M50n34
2162B15k37M58j98o40K87J059l2r39n01O15M05k01K28L32o23j183M16J523J94
2181A178j294o51P86M71m92j53N56j38j039k9J048M56p15o20K53O6l99N01J055
2200H40l81j562l30J443P47r37o97N32M06n30k2R86R0j159n49Q61P94l21k46L10
2220B75j83r61K07J479M59j481q34J017J045n95o18M49J94q71j08J192N93r02
2238C57r57M32M74k71l1Q60r9j297m85J368J062j080j276M11R79j95m85O32K45
2257F44j088p43R53J072m13p71K64K12o32k42J158N54j365j050J013J534m10j276
2275e86n6O35l55l27R48P95q82j162K97J040k43n19L96L84p99o84J213J168j023
$$ plain form
2142 -574 -164 510 126 -784 -750 73 364 49 -65 -11 -515 -776 137 1213 683 -708 -886 299 749 215
2162 215 -22 436 238 -402 -115 944 912 -27 -528 87 492 291 519 851 228 -955 -539 984 1178
2181 1178 -116 -767 19 490 -2 -155 401 263 -776 -805 243 699 -16 -636 -383 -317 -716 -215 840
2200 840 459 -1103 -1433 10 757 -180 -877 -345 61 -469 -491 495 585 -574 -1123 -262 532 211 -35 275
2220 275 92 -869 -662 817 1276 -205 -1039 -22 1023 428 -190 259 453 -418 -526 666 1259 357
2238 357 -600 -168 306 35 4 864 765 -532 -1017 351 1413 333 -943 -532 447 252 -233 399 644
2257 644 -444 -1187 -234 838 425 -346 -82 130 -502 -744 414 968 -397 -1447 -434 1100 690 -586
2275 -586 -642 -7 -362 -689 259 1054 172 -990 -693 347 104 -415 -19 365 -434 -1118 95 1263 240
2294B40j613M02J465J04o99J19M02o17r07P67J211l31j111J48Q41k18n26N16O09
2313H02q28j156R06J720k19j606l37R18J89o19M47R40n86j186K86J183k6r62j1
2332a45O99k46p39P58J109p99j782J53J690M43r88m49O06k50p37K35J209k77j326
2351h36nJ112J99r07k9O00m55j031N32J710K9j714p31J101O29n87k13O84k1r70
2371i03R4J236J63j125m63R11L70m73J40R14l17j583j41J691Q26r73q88N89N75
2390F43o11j13Q11J19j228k20J228O36r05o23N52L8r00L01J392L17j610r66J061
2409g8J025p05p26M68L14o43j87J007K42j263p74R06Q46m71k99O27J0j243m10
2428a354J410R83j027j200O33J036l09o27M70K09q03k66J078Q95q14r58L40N62
$$ plain form
2294 240 -1373 -971 494 598 -101 18 420 -197 -1104 -337 874 543 -568 -420 421 203 -323 193 802
2313 802 -26 -1182 -276 1444 1225 -381 -718 200 389 -230 217 1157 571 -615 -329 854 828 -134 -145
2332 -145 554 308 -431 327 1436 637 -1145 -992 698 1141 153 -296 310 60 -677 -442 767 490 -836
2351 -836 -841 271 470 -437 -466 134 -321 -1352 -820 890 919 -795 -1526 -425 204 -383 -596 88 67 -903
2371 -903 -809 427 590 -535 -998 -87 283 -190 -50 864 547 -1036 -1177 514 1340 367 -521 68 643
2390 643 32 -81 730 849 -379 -599 629 1265 360 -263 289 327 -573 -272 1120 1437 -173 -1139 -78
2409 -78 947 242 -484 -16 298 -345 -532 475 717 -546 -1320 -414 432 -39 -338 289 299 -944 -1354
2428 -1354 56 1039 12 -1188 -555 481 172 -455 15 224 -579 -845 233 1128 314 -644 -304 258
2446B58m47j48R63N00j180r91J022J208n10j155M1Q07o5k93M86L73r43q71O82
2465b63J061k32p84K43M03p61n12Q92R63q27j303L89J250J25r15j31K84l64l13
2484g95Q32P74n95j149K59Q63n8o48M95O05o77r62P59J277l16j391k39J110K96
2503D40l37O7L65o38p53N03J193k30q64oO04j39o24N05Q05n86j203K67J351L57
2523A077j001n67L54J30k69M49N90l97r87j9R61K12p78k3N38k10o42L81J054p9
2543G74j362m26R88P39m05l01J54j86n81M12R31q0r54k44P21L18m70o7N58k86
2563B33r04P9J205N30r90r28L53N60p0m3L23k12q10M9R25K14o77m45L76K37m40
2584d35J14O95K0j141m19Q94Q39l30o88kK05k04K27N41Lq61l37P80N62m04l00
$$ plain form
2446 258 -189 -337 626 1126 -54 -1045 -23 1185 675 -480 -439 368 303 10 496 869 -74 -945 -263
2465 -263 798 566 -218 25 428 -333 -845 47 1010 183 -1120 -731 519 644 -271 -402 -118 -482 -795
2484 -795 37 811 216 -933 -674 189 131 -517 -22 583 -94 -1056 -297 980 664 -727 -966 144 440
2503 440 103 170 535 -103 -856 -353 840 610 -254 -260 344 205 -419 86 891 305 -898 -631 720 1077
2523 1077 76 -491 -137 -7 -276 173 763 366 -621 -640 321 533 -245 -268 270 60 -582 -201 853 774
2543 774 -588 -1014 -26 713 308 7 161 -25 -606 -194 737 657 -297 -541 180 498 28 -39 519 233
2563 233 -671 -592 613 1143 153 -775 -422 138 68 25 348 136 -674 -625 300 514 -163 -608 -232 5 -435
2584 -435 -321 374 394 -747 -1166 -272 567 237 -451 -453 -248 -452 -225 316 319 -542 -879 -99 463 59 -241
2605b41K62Mn39K7R97M68q01q22K61P57J67k89K2j59l39J09P02L06o84n55L43
2626dM23j76j35M02k6o83m04O93P81k55p69l14L59K67M5J79k22n26k85N90N66
2647E06k41n41o4K22j67j3M79L26o09p64L07P11K86m22l67rj6K44L79K05o07n26
2669f81L37N41J47l25J9M3k81k92N31O62j92q46k57N54M14O7j73l16l04r9O32
2690A81M65l06n95j29L94J3o5K63K9m03l41J35O44K35m87m79m6K87L82K60k22
2711B15n07k83L60N15P1k90k39J3r1J02K70L20k10o01j81M84M88Q1l25m96j30
2732d34L07M95Q3k67m44j08L51K44J3q4k27r1j14J36L82J76l41n36m5M39M28M3
2754D06n00l40j3L20M92j17k51l40K2J89K37J54r5j96k48o1L59M33J1m27m32j9
$$ plain form
2605 -241 21 25 -514 -487 510 978 177 -645 -384 373 540 251 273 114 -225 -116 586 892 208 -347 -4
2626 -4 419 243 108 510 484 -199 -603 90 871 616 -153 -467 -108 159 204 383 161 -365 -650 -60 506
2647 506 265 -276 -340 -118 -285 -298 181 507 -102 -866 -559 152 438 16 -351 -360 -376 -132 247 452 -155 -681
2669 -681 -344 197 344 19 38 81 -200 -492 39 701 509 -337 -594 -40 374 441 268 -48 -352 -451 181
2690 181 646 340 -255 -384 10 23 -42 221 250 -153 -494 -359 285 520 33 -446 -492 -205 177 437 215
2711 215 -292 -575 -215 300 371 81 -158 -145 -236 -134 136 456 246 -355 -536 -52 436 517 192 -304 -434
2732 -434 -127 368 451 184 -260 -368 -17 227 240 156 -71 -162 -276 -140 242 418 77 -459 -504 -65 363 406
2754 406 -94 -434 -447 -127 365 248 -3 -343 -321 -132 105 259 164 -32 -280 -341 18 451 462 35 -397 -416
2776d16N83M70j46m94l07J72L39K48k7j75l52m5R4L49J24o6l34k39r8M07M37p1
2798D53n25n29J72O78J83k84l46j50L9Q2L57M3k32m12K0K06J58J71j5k38m89J0
2820f48O54M76l26p83m9L67L33R1m4j75k88q3M47L93j60k97n9L2K9J46M49N1o96
2843a40m06L84Q20J2n06l52J51P2J23K84J9m20l61J77M33Lj10m1j51k61o3N49
2865B16M75m15q60j8O64L85l22j99n8j27r1L49L84k42n94k6L22J61r0J45J39m80
2887b82n43M42Q64Mp73l63L54L56N0j0O9l21l34K93O10O5m94k74K53mj63L36N38
2910F73m02q93pR13L97m57n47J29J06n2K86L28k35p09p5O74K59l31j94K26j35
2931d6n17L09Q77P4r94m57N86O63k60l16J26rl70K58O21Q9o83l60L33L74k16L
$$ plain form
2776 -416 167 637 491 -3 -310 -138 201 449 422 247 -105 -150 -56 293 417 351 17 -222 -320 87 524 453
2798 453 -72 -601 -429 249 432 148 -198 -348 -309 -227 130 173 -59 -471 -451 -245 -87 84 69 -169 -658 -648
2820 -648 6 482 156 -627 -676 -309 24 115 71 -104 -392 -475 -28 365 205 -92 -151 -119 -90 56 505 556 -140
2843 -140 -546 -162 658 670 164 -188 -37 35 158 442 461 41 -320 -143 290 293 183 142 -9 -270 -333 216
2865 216 691 276 -584 -602 62 447 125 -74 -132 -259 -350 -1 383 141 -453 -479 -157 4 -86 59 198 -282
2887 -282 -825 -383 481 485 -288 -651 -297 59 109 99 168 -153 -487 -194 416 481 -13 -287 -34 -38 -201 135 673
2910 673 271 -622 -629 284 681 224 -323 -194 -88 -140 146 474 239 -470 -545 129 388 57 -137 89 -46
2931 -46 -563 -254 623 697 -297 -754 -168 495 235 -81 45 36 -334 -76 545 634 -49 -409 -76 298 82 85
2953H5M72j99q04q6R03N92p30o96J94N01N2j65K18j11o84j05P51N06n23m87K54
2974f2Q1l31m9P15K06r37n71P26Q03l07p07K5J85j55N9O49R8p73n10N34O65k47
2996I7m02L02J88o16k79R07O23p01r81L76Q60P6k91n7J0m19j76P52N58n40p26
3017d39K92N31k09l81M55L59o39o82O95R63l14j066o4N00J0m9L14K49o58o27M97
3038b63P33k22o60J30M82k81m41N54O29o07r53L10R41K74o74k44J90p7k74M76
3058B3O29m70p65K37Q10o9o23J96M00l54n52N47R38j93j152k50P02M59l16n7L17
3079D57l97n63M22P57j54r38l9P41R2n01J10N34m03r11J46J042L88q78m74L01
3099b68J92k04J45N38l54p32P0R81K42r04k65M92J53n60J90R22N7j182m31Q33
$$ plain form
2953 85 557 358 -446 -532 371 963 233 -463 -269 232 284 119 337 226 -458 -563 188 694 171 -316 -62
2974 -62 19 -312 -361 354 560 -377 -948 -222 581 274 -433 -408 -223 -378 -319 330 428 -345 -855 -321 344 97
2996 97 -305 -3 185 -431 -710 197 820 119 -862 -486 374 450 159 102 112 -307 -483 269 827 287 -439
3017 -439 -147 384 175 -206 249 608 -31 -713 -18 945 631 -435 -499 1 11 -38 276 525 -133 -760 -263
3038 -263 470 248 -412 -282 200 -81 -522 32 661 54 -899 -589 352 626 -48 -292 -102 -179 -453 23
3058 23 652 182 -583 -346 464 395 -228 -32 368 14 -538 9 947 754 -398 -648 54 513 197 140 457
3079 457 60 -503 -81 676 522 -416 -455 286 378 -123 -13 521 118 -793 -647 395 783 -95 -569 -268
3099 -268 -76 -280 -135 403 49 -683 -613 368 610 -294 -559 -67 86 -474 -284 638 695 -487 -918 -85
3119h5O14l94l24K83K3m44K31O73q5q68k77Q58M93m78l05M06m0p83LR12M99p54
3141A58p30M02N49k52k03L12j76n75O5R09L37q94o62N95L76l59j24N80K99r66
3161c59m49P11P36l91p23K11L86j20j30N19Lq20l62P98O97m36o03K99L01m73l16
3182e21P66N10o20q47M46Q11j73n31Q3J38l98k8O76L93p65q02M80P31k31m49L13
3203a8M15n98n47O94O51l82q30J2P34R4k85J98J64p03l81P16P74l63q83K57O07
3224C26j76m81L87N18m91p55M62Q59p9o46j86K71l6k2M39L43o15p51L95Q31j13
3245D80o16J5M43k45m28L42O34k44r17j16Q15L06l60j31P7k48l63N60N67l55p19
3266e03o7P20J22m53q3M03j15o56J74R06J24p70l76L50K95m3J49K18l05o43K43
$$ plain form
3119 -85 529 135 -189 94 117 -327 -96 577 492 -376 -653 205 698 220 -85 321 281 -502 -499 413 912 158
3141 158 -572 -170 379 127 -76 236 60 -515 -450 459 796 -98 -760 -165 211 -148 -272 308 607 -359
3161 -359 -808 -97 639 248 -475 -264 122 2 -128 391 394 -426 -788 10 707 271 -332 -33 268 -205 -521
3182 -521 245 755 135 -712 -266 545 372 -159 -76 62 -336 -364 312 705 -60 -862 -382 349 118 -331 -18
3203 -18 397 -201 -748 -54 597 215 -615 -603 131 225 -60 138 302 -401 -782 -66 708 345 -538 -281 326
3224 326 150 -331 56 574 83 -672 -210 649 570 -76 -262 9 -27 -49 390 733 118 -633 -238 593 480
3245 480 -136 -121 322 77 -351 -9 625 381 -536 -652 163 469 109 -22 55 -193 -556 4 571 216 -503
3266 -503 -570 150 272 -181 -264 139 24 -632 -458 448 572 -198 -574 -224 71 28 177 395 90 -553 -310
3287c10Q87k8p43k43N47K32l97l9N85j43p65j85Q29M49m14l74Q2mk10L12M95j77
3309C86q67j10P94K93n12m09L32J16m00R0N36J96o39n55M99M33q8j85O1j29l42
3330e00J65O89J43p54l62M62N14k24k44K47O7m20j65N29N12l53n25R2K18R7M9
3351B37K27k29n23q9O70M59n53m77J38L10j05j14L60J49n40l97L23M88J8m30j27
3372b05j2p9J27N07K8o57m18L79O70j66m07k4K18j81k06M07M03k32n69q7M92K00
3394A88q7qp3k84j06O50L59l80o23O9N45J29k42O8J12l48k18L09M79q5m59r0l2
3417a27K37J44J79Jn32m09M52N70j54m48j98J83J02j17J79J75k24m67R3K70K07
3438A16o6k29j36j15J64K80L15m43n09J15M89K02j20j83k9p7J0J60K91ml50j90
$$ plain form
3287 -310 577 549 -194 -437 110 342 -55 -94 491 348 -417 -602 227 676 262 -112 -30 -34 -244 68 563 386
3309 386 -481 -591 203 496 -16 -425 -93 23 -377 -287 249 445 -194 -749 -250 183 95 -90 -29 -158 -500
3330 -500 -335 354 497 -257 -619 -157 357 133 -111 136 203 -217 -382 147 659 306 -219 -127 91 188 237
3351 237 464 235 -288 -377 293 752 199 -278 -140 170 65 -49 311 460 -80 -477 -154 334 352 -78 -205
3372 -205 -217 -296 -169 338 366 -291 -709 -330 340 174 -233 -257 -39 -220 -426 -19 384 152 -417 -504 -12 188
3394 188 101 93 20 -264 -370 280 639 259 -364 -295 250 379 137 205 317 -31 -249 60 539 454 -5 -95 -127
3417 -127 110 254 433 434 -98 -507 -55 515 361 -87 -285 -102 0 -117 62 237 13 -454 -361 -91 116
3438 116 50 -179 -315 -430 -266 14 329 -114 -623 -508 -19 183 63 -120 -149 -226 -216 -56 235 231 -119 -309
3460c09Q0L00J19N8j16l58r2L60M13Rm79k69J90L56K0p1o8r4k19L5L02K65j65
3483B67l63q1jK61K52Ll05m44R8M60K67l02k73r9J26R6N5J44m1k81j10P5L17P8
3507A99m0l13j65qM49L30k89l25k76K90L47J20j61k26j05O7N9J59R0j20j92n2
3529a62m6L23K37k25k92k12K21L80J06j87l22j33J86K60J33j65k10j12J0J67J64
3550A21J45j34l11k10K77L66R6l18l04m9K66K27K26l21k77o9K73K32j6j24p4n4
3572c2n0O4K42J97k82k95j10K94L89q7k71k19n7J85L49P7l66k53O6K55m8O2l8
3595G2j01j90j24K66L83j44l41k31J06J97K29Jk32l13p9M31K69J4m28q2J43QP
3618a39K22J14k56l91J03M11K73j62l23o5P0J45K23J88l74l85J43M36J27k61j01
$$ plain form
3460 -309 -229 71 190 248 132 -226 -318 42 455 464 -15 -284 -94 262 282 211 143 49 -170 -135 167 432 267
3483 267 -96 -177 -178 83 335 338 33 -411 -313 147 414 112 -161 -260 -134 -38 17 161 120 -161 -271 -196 121 199
3507 199 159 -154 -319 -327 122 452 163 -162 -438 -148 199 319 158 -68 -173 -106 -47 112 202 82 -110 -162
3529 -162 -208 115 352 127 -165 -377 -156 224 330 143 -179 -312 -126 134 267 102 -108 -220 -210 -43 121
3550 121 266 132 -179 -389 -112 254 350 32 -272 -321 -55 172 398 77 -200 -269 4 236 220 96 22 -32
3572 -32 -82 -18 224 421 139 -156 -266 28 417 330 59 -160 -217 -32 317 394 28 -225 -159 96 48 110 72
3595 72 -29 -219 -343 -77 306 162 -179 -410 -304 -107 122 123 -109 -422 -501 -70 199 213 -215 -297 -154 -146 -139
3618 -139 83 197 -59 -450 -347 64 337 175 -148 -213 -143 2 225 413 39 -346 -203 233 360 99 -2
3639bQ8j36q6J90L95r8m48k05K70L26M2k14r1k37l1L30L65j30n81q0K56K68j25
3662F6p1J50j30l87N9M64L02m70l94J67K03J08kJ15k85l87J95M60J83l89l86K38
3684a91J45j00L1L46n6m83k55N31L87j64k63o0m9k1K57K73J0n86k40N58K87j85
3706A72k58J37M4k53j08N45K44m84m33K43M24k1j10mj46k83J05N49K44n30m35
3727c58K83L80j40k49J94K17m12k87M38M61k92m88k5K71O1M0J65j3m71k65M82
3748hM91k70n29J57J94q9j80L05K07l37m92K37O12j1l95o1Rk04O6M95K19n10n79
3771f73M08O10n7m60KK91j27k43K11N17k45n73n1N15J05j10K9N4l46k69N18N20
3793F26k85o14O6M33J51l89Q3K12j80n28K07P01M9n39k62K17J05p8J52K69l41
$$ plain form
3639 -2 86 -50 -136 54 449 351 -97 -302 -32 294 336 122 31 -206 -237 93 458 328 -253 -333 -77 191 66
3662 66 -5 145 15 -372 -313 151 453 -17 -411 -244 -41 67 65 180 -105 -492 -297 163 346 -43 -429 -191
3684 -191 -46 -146 -115 231 175 -308 -563 -32 355 191 -72 -132 -181 -202 55 328 338 -248 -488 70 357 172
3706 172 -86 51 95 -158 -266 279 523 39 -394 -151 273 252 142 138 -8 -291 -186 363 607 77 -358
3727 -358 -75 305 165 -84 110 327 -85 -372 66 527 235 -253 -278 -7 54 94 259 246 -225 -490 -8
3748 -8 483 213 -316 -159 35 -54 -234 71 278 -59 -551 -314 298 287 -108 -169 -160 -364 -298 197 416 -94 -673
3771 -673 -265 345 288 -172 -170 121 -6 -249 -38 479 234 -339 -390 125 230 120 149 203 -143 -412 106 626
3793 626 341 -273 -207 226 377 -12 71 283 103 -425 -218 483 532 -7 -269 -52 53 -25 127 396 55
3814E5n90J65P44Mo41j65L49O4k40Q6M75j83o76j1N67K51k74k31J84o5l07K86
3836a53N87k93o38o8P26K07l76j53K55p0l19M8O59J26n41l59L27K74j24m0K59
3857C34k10m14J98P47k5o96l19M35K94j59j45L08O0o08j85O25K55k95l84J56J47
3878A19k04M7M17j57p17o6O68M34m50m94J84L02l33j45N22K54n86l79L69M25j24
3899H6l60J53R5l05J03N59J48o99m43M68M97p5m38K62J63l20k92M79M24l90m72
3920c57K05L41p6j00J48M1m89j66O58M80m61o63K54L98q3k11K01K29m44l05L35
3941f5M78k06m24K6J95j12p4M25J68n12n49M27O73j79n83J29K78n5k87L10K34
3962B97k09m35K2N64K2k12r0J22k33k62N62M33l65o08K5N54Q1l76N6J34q1l33
$$ plain form
3814 55 -535 -370 374 378 -263 -428 -79 -15 -255 -169 306 123 -553 -564 3 254 -20 -251 -67 -132 -439 -153
3836 -153 434 141 -497 -565 161 368 -8 -161 94 24 -295 -247 412 538 -3 -362 -35 239 115 75 334
3857 334 124 -290 -92 655 630 -66 -385 50 344 185 40 348 408 -200 -385 240 495 200 -184 -28 119
3878 119 -85 -38 379 222 -495 -561 107 541 91 -403 -219 83 -250 -395 127 381 -205 -584 -215 210 86
3899 86 -274 -121 -26 -331 -228 331 479 -220 -663 -195 302 227 -211 51 214 -106 -398 81 505 115 -357
3920 -357 -152 189 113 13 161 202 -287 -453 205 685 224 -439 -185 213 130 -81 120 349 -95 -400 -65
3941 -65 413 207 -217 -191 4 -108 -182 243 411 -101 -650 -223 450 271 -312 -183 95 40 -247 63 297
3962 297 88 -347 -325 239 261 49 -41 81 -152 -414 148 581 216 -392 -367 187 268 -108 -52 82 1 -332
3984c32K48N07q0n63j10L33J63k16K16J21k87n26L32N89J6o88j41M97R9k11k9
4005f2L02j38m75Q6M93K47m22k80K57k4k00K77L89j94o30MO51J40m06l61L34R6
4027H4k10N6M89j27n14j22L85K63k18j13J16j18l35J70N83L2o75k98M75L75k79
4048A9q6J06q8k94O3M71J91l79l91K37J71q4N9K41j27m89nO28L34n53l56J88K51
4071A07l1n6J83O0m33j52L80K48j26l22J95l8j06q4M95J12n39l97L51N68j66l72
4093a23J2J90j96l0L16J89m30l25K32K56m3o7P0j6l22r4N53K51l90m44N8N10M9
4116B06k47P5K9k53q0L32K36j55l06k9K50m5K3K25M4n37j71L87M26j15m50o7K18
4139dK8pJ39J16k82k81K06K88M1k50O6p7j43QK95K37l22n01N4M89J59l25q6L4
$$ plain form
3984 -332 -84 423 343 -220 -330 3 166 -50 166 287 0 -526 -194 395 411 -277 -418 79 178 -33 -62
4005 -62 240 102 -373 -287 206 453 31 -249 8 -16 -216 61 450 256 -374 -370 281 421 15 -346 -12 84
4027 84 -126 -70 419 292 -222 -344 41 304 86 -27 89 -29 -364 -194 389 421 -254 -552 -77 298 19
4048 19 -67 39 -49 -343 -280 191 382 3 -388 -151 20 -64 -5 236 109 -380 -385 243 577 24 -332 -144 107
4071 107 76 20 203 263 -170 -322 58 306 180 -142 53 15 -91 -175 320 432 -107 -504 -153 415 249 -123
4093 -123 -111 79 -117 -147 169 358 -72 -397 -165 91 48 -19 51 35 -287 -381 172 423 33 -411 -353 157 206
4116 206 -41 34 63 -190 -270 62 298 143 -163 -192 58 13 36 261 305 -232 -403 -16 410 295 -155 -222 -4
4139 -4 24 17 156 272 -10 -291 -85 203 244 -6 60 -17 -160 -152 143 380 58 -443 -389 100 259 -66 -152 -118
4163a18k4k8J66K17j46l27n4L04Q8j24L2P0k02j46K56L98o9n02j32L03K15l4r4
4186D9Nj31p3J10L29m1k23j50N1M4M7J66J37l37k86M4M74J38k96j93LJ21M5Q0
4210A13L4j55k02J3K52J14j73Jo4q7r9K47K23k2m17k19L35L10l5k50p8J7L5J78
4234G1N3N0k70j18N6K08K6N4J1j54k19Q7L85M2k73k36Q1K15P4R3j50r3j38R5J79
4259A29O2q4j20o1l5N4J57J42j29k98j21L34K18l9k67j88J6L08P8m6j05j55p2
4282b22J10J54R2j10p8r0r2J71K35P8j99k78k3K95J20nj58j81N7J93J09pk13K8
4306a4r6P9J41Q3L5j56k33M2J46K04l6k50j82R5J88J38p4j50j42R3R7N7K8o9j23
4331i9p7j9K30R3n3j78j41J5K14K19j12k47j25J44K79Q7k12n4o3KM9J01J67q5
$$ plain form
4163 -118 -142 -170 -4 213 67 -260 -314 -10 78 -46 -14 56 -146 -292 -36 362 293 -209 -341 -38 177 143 49
4186 49 54 -77 -150 -40 289 248 25 -125 -74 -30 17 183 320 -17 -303 -259 215 353 57 -136 -133 -12 33 113
4210 113 147 -8 -210 -197 55 169 -4 -3 -67 -154 -253 -6 217 195 -222 -441 -106 204 169 -81 -159 -142 -107 71
4234 71 124 174 -96 -214 -158 50 76 130 141 -13 -232 -145 240 282 9 -227 -146 69 143 236 86 -7 -145 -50 129
4259 129 191 107 -13 -74 -109 -55 102 244 115 -183 -304 30 248 209 -58 -246 -230 78 156 110 5 -150 -222
4282 -222 -112 42 134 24 -54 -144 -236 -65 170 248 49 -229 -252 43 163 158 0 -181 -124 69 178 171 -42 -14
4306 -14 -110 -31 110 193 228 72 -161 -119 27 231 195 -55 -237 -142 46 184 110 -40 -182 -89 8 65 93 24 -99
4331 -99 -176 -195 35 128 75 -103 -244 -229 -15 204 92 -155 -280 -136 143 230 18 -36 -99 -97 -48 53 220 135
4355A35k70rR2J89P2m5j86j28M6K90J81j31l77j00K54K11Jn8p4n2p3l0K16J17
4379B71k73j27k3J25J89pn4k51k11J74L55M6k62k10R0J12LL7Q2p3k30l7K60J65
4403A51j34n1r2n5M6J58K43k29k92o2K99K97j47k39mL1oR3J52P7k88j55J09K42
4427A44N8q3J6k27j35J40M16N8m48k16J78K40m3p4J05p0k42K3J56K83j85k94N8
4450a42J07OQ1J06o2m39m1M12L16k94k78J15J59Rj16J57K6j23k93K26K42l0j48
4473dn8J4o1P0L29N9m42k84K80L90j24k17mL0k4l2J88J51k45k46J08K07M7j11
4497B1J05p4l03J1L29K48k03m46K6L87L4j91O2P5j44k18K28L55j38k77m3J61j2
4520gnJ75J25l15l75K70M73n9l90o3J98M8q5J12P2o0l43M2L21P2k02r5J76j87
$$ plain form
4355 135 -135 -144 -52 137 209 164 -22 -150 -104 186 367 236 -141 -241 13 224 225 167 93 41 -32 -62 154 271
4379 271 -2 -129 -152 -27 162 155 101 -150 -361 -187 168 214 -48 -258 -168 -56 -53 -16 66 -7 -237 -274 -14 151
4403 151 17 -34 -126 -181 -135 23 266 37 -255 -317 -18 279 132 -107 -111 -80 -86 7 159 236 -52 -207 -98 144
4427 144 202 119 135 -92 -227 -87 329 387 -61 -277 -99 141 98 24 129 59 -183 -160 -4 279 94 -200 -142
4450 -142 -35 -29 52 158 96 -343 -384 28 344 50 -228 -113 46 55 -61 96 122 -1 -294 -68 174 144 -4
4473 -4 -62 -48 -109 -39 290 349 -93 -377 -97 293 169 -48 -52 -22 -46 -78 110 261 16 -230 -122 85 132 21
4497 21 126 52 -251 -240 89 337 134 -312 -286 101 135 -56 6 81 -63 -281 -53 302 164 -113 -156 5 -7
4520 -7 -12 163 288 -27 -402 -132 341 282 -108 -171 27 75 -10 102 174 114 -229 -187 134 206 4 -91 85 -102
4544a02j11K24L06k36m17k1M62K28l54j46R7J3j34R4M06k02l74K6K74M9r4N3N1
4567I2j27l31J89N14p1m80j49L90J81j41p7J14r8k13M9L86R8l12j39J73O2j53
4589d3J13K14j21m59K7M77K26l82l10J71J37m6k4K39J2m85o4L37K06j84j97K13
4611E7l9k76J13M20J14o31k09L40M57k13l12J40O6j92p0M33K1k15l23L02K20k37
4633c4j8J67J6l50o8M77K99m15m20J99L15o8j91K52J3l15r4K68K80k60k35P8K87
4656A83j89q5L22K4l77l63M31M16j67l91O2J39lj75K40J93l58k14K50K74j66j50
4678a04M6J50k44j08M25J93k82m77J98M49l7k03m3J74j48j30K64J54k10k94M0
4699a87L13M7j51J27J03l38k47K29N17j54m58p2K84Q2j91Q9J74k20k56J81L21
$$ plain form
4544 -102 -213 11 317 81 -336 -357 105 333 -21 -167 -70 -57 -191 -97 309 107 -267 -241 33 82 -12 41 92
4567 92 -35 -366 -177 337 266 -214 -363 27 208 67 -10 104 6 -207 -158 228 326 14 -125 48 110 -43
4589 -43 70 284 163 -296 -269 208 434 52 -258 -87 50 4 -20 219 231 -254 -318 19 225 41 -156 57
4611 57 18 -258 -145 275 389 -242 -451 -111 346 133 -179 -39 27 -165 -235 198 219 4 -319 -17 203 -34
4633 -34 -52 115 131 -219 -287 190 489 74 -346 -147 168 100 -91 161 174 -141 -235 33 313 53 -182 -104 183
4656 183 -6 -91 231 255 -122 -485 -54 362 195 -196 -134 5 2 -173 67 260 -98 -312 -62 212 46 -104
4678 -104 -58 92 -152 -260 165 358 76 -401 -203 246 209 6 -37 137 -11 -141 123 277 67 -227 -187
4699 -187 126 173 22 149 252 -86 -333 -104 413 259 -199 -271 13 95 -96 -7 167 -53 -309 -128 193
4720A93n2k77r2K31m9j48K10K61k61m73J91M35O7l25j64K46L8j55J48J83j02l89
4742b84L9M14J04k86rK15j85k15J64M18j11l97q4L21J42j30j30J05j04j46J05
4763e4M43j39l31j26L22L9k37J1K23k7m09K6M78P5l44k91J79K24o8m9J80j45k98
4786c18L0L35J58l09r1J56L9j80K6L23l1l42j88L27L64j64k71M3O1J2J8K91k6
4809B63l73j21K45K44j47j54J29N5k49p5M23J14l18l56J88K82L6j53J0Oj92l2
4831a75L28K10l77j83J54J40j57kJ37P6l22k22L59L28j90l27rK47j8oP9m4k08
4854a82j09K13K59j22k48Q4R9q1l7K62R0j98l45J88L67Rk24j32J46p4J7J69J03
4877B54k23k72J45K35j9j00k1R1j54j47K40K80j23m04K1K02J21n5o6l6k3j21J46
$$ plain form
4720 193 141 -136 -228 3 -46 -194 16 277 16 -457 -266 169 236 -89 -253 -7 31 -124 24 207 105 -284
4742 -284 -245 169 273 -13 -22 193 8 -207 -43 375 264 -133 -217 104 246 116 -14 91 -13 -159 -54
4763 -54 389 250 -81 -207 115 154 -83 -72 151 124 -285 -259 219 294 -50 -341 -162 62 -6 -55 125 -20 -318
4786 -318 -288 47 205 -104 -195 -39 0 -180 -154 169 138 -204 -392 -65 299 135 -136 -93 -32 -20 -2 289 263
4809 263 -110 -231 14 258 111 -43 86 141 -108 -183 240 354 36 -320 -132 150 186 33 43 49 -143 -175
4831 -175 153 363 -14 -197 -43 97 -60 -62 75 151 -171 -393 -34 294 104 -223 -232 15 -3 -9 70 26 -182
4854 -182 -291 -78 181 59 -189 -105 -6 -87 -124 138 228 30 -315 -127 240 249 25 -107 39 -35 -18 151 254
4877 254 31 -241 -96 139 120 20 -1 90 -64 -211 29 309 186 -218 -197 5 126 71 5 -31 -54 -175 -29
4900b9K56j10k77m4K68J2j03N3J17j84k70J41L83K5k69p4rJ62n5J70j0j48k72
4923b67J86K30J1k14j1J12q7l9O9K72j49k97QJ57J95n8j52m2pJ9N1R9l5k54J6
4948a87J82N4j44R9L1p5k56J84K38N7j97k28J46J75JN5j09n5j39J03K06M4j81
4971Dr6O3J06m8L2R5k2k01o5K01K32p3k81lk3K02K6J30j13k78n9K49J45j31j20
4996b8Qj9L2j5J76mk27r8Q5J46L0Mj76p2l2R6J93nk15j14R1J74j4m1J8p5o8J6
5024a34J27J42q2j90n9J14J04J19k5j97pk1K35Jm8j04o8O7P8K7O8k8j34o2K1J69
5050A13J25j86j42n6N6J97J7J1j68r2O8J83j8n4j21K4n7O9J00O7j31n0r0O6J33
5075F4L9j08j14n3J86P5pk8j97L5L9R4J17j05r3o5P5Q2L7O4j04j16q2J29J33N0
$$ plain form
4900 -29 227 117 -160 -204 64 76 -27 26 143 -41 -311 -170 213 238 -31 -105 -114 48 -7 163 153 5 -267
4923 -267 -81 149 160 -54 -65 47 -40 -79 -10 262 113 -184 -176 -19 176 118 -34 -76 -83 -64 -13 86 51 -203 -187
4948 -187 -5 49 -95 4 35 -40 -296 -112 126 183 -14 -242 -96 79 80 135 26 -29 -168 -65 141 185 4
4971 4 -92 -29 77 29 61 156 134 -67 -132 69 301 228 -53 -56 -79 123 149 279 166 -112 -171 78 223 92 -28
4996 -28 -20 -39 -7 -22 154 150 -77 -175 -90 56 86 90 -86 -158 -190 -94 99 94 -121 -235 -144 30 16 -25 -7 -82 -150 -134
5024 -134 -7 135 53 -137 -196 -82 22 141 116 -81 -88 -109 126 127 79 -25 -93 -26 52 79 147 119 -15 -77 -56 113
5050 113 238 52 -90 -146 -90 107 124 135 -33 -125 -57 126 108 54 -67 -43 -100 -31 69 136 5 -45 -135 -69 64
5075 64 103 -5 -119 -172 14 89 82 54 -143 -108 -69 25 142 37 -56 -121 -46 36 73 137 33 -83 -165 -36 97 147
5101A47j38j10o2J41J65m4j08q0j06J24P6oR3j30Pl7K8J09R9j59j68l8J61K51
5125B15j17j19j31J18nJ32P4j52j51P0P4O1J7o2O6j18n0O4K38n0j40k03J47J21
5149I9L7j14j3jp1P9J11R8k54J1N1n9O9O2M3j64k28R9K18J40j75j83K0N6P9Pk
5176A5J7k61N1J25J39j09m4K7l6r2J40J67o4j52j83K38K12p8j11j50J45PK0P6
5200I9M7j51j11Q2J56Kk8J0r3p8j1K39J50k51j83K9K11qk2o5J7r8n4J87J16j49
5226D3j63K7N5QJ6N1L4j12k50K53J79k7k38n3Q7O1K2M0L2j54j60J59K27n5j59
5251g7kM5oj52K55J61j91k50R8K66M1j19j47J30L1j41J71J35j79j89J8K11J9j39
5275a1P4J05k07r1J29K60q7k84p6J52J62k1o8N7j78p5J13K52j07j78r1J91j5n8
$$ plain form
5101 147 9 -101 -163 -22 143 99 -9 -89 -195 -71 5 -1 92 -38 -31 -68 -40 69 168 9 -159 -197 -36 215
5125 215 98 -21 -152 -34 -39 93 167 15 -136 -66 8 69 86 24 90 -28 -78 -14 224 174 34 -169 -22 99
5149 99 136 22 9 8 -63 16 127 225 -29 -18 33 -26 43 105 148 -16 -244 -145 73 213 38 -145 -125 -69 10 17 15
5176 15 32 -229 -178 -53 86 -23 -67 -40 -76 -168 -28 139 75 -77 -260 -22 190 112 1 -149 -4 3 23 99
5200 99 146 -5 -116 -34 122 124 96 106 13 -65 -76 163 313 62 -121 -92 119 111 89 24 41 -57 -111 76 192 43
5226 43 -120 -93 -38 -30 -14 37 71 -41 -291 -38 141 114 -124 -177 -90 -29 -7 33 65 -89 -249 -90 137 82 -77
5251 -77 -79 -34 -40 -192 63 224 33 -217 -119 147 188 69 -78 52 83 -58 113 248 69 -120 -102 109 128 -11
5275 -11 63 168 -39 -130 -1 259 172 -112 -188 -36 126 105 37 94 -84 -159 -46 206 99 -79 -170 21 6 -52
5299e2R7J95k64j92P0K31R9j58j80R8R2q1J38L3j19k41J12K06P1j89n6J93j08
5322ej55J59J70k5k46j31K61J97p2k57J06K3j66J32J51l4k27q0K03J20j17j06
5344i9J99p2k44L2K78J48k97j42Q4J00O1m2P7q4j31pJ91J19k12j06J56J04j11
5367Bo1J85L3k34j64K50K40j83j13K4L9k2MJ97l4k12j39K03K11j37j64J16O1j12
5391a0o9K20J00k92j71J18K34j0j63mR3k02M8J96J36k55j69Q8J76O7k39J50M4
5414H6j67j67J79L05j25k98J7K07k1q1Q4N6k12l1K23J98j33k20k4K00n2j27K00
5437I7J13j59k96J43J99J01k27j9N9k6m9J47L6j30k37J43K96o7k17M5J50j30j19
5460a47Q4L22j33m14J11K02J24p0j67J65r2j32J08K61j12k91nK25L2r5M5J24j49
$$ plain form
5299 -52 45 240 -24 -216 -146 85 184 26 -154 -56 36 -45 93 126 7 -234 -122 84 155 -34 -90 103 -5
5322 -5 -160 -1 169 144 -102 -233 28 225 153 -104 2 25 -141 -9 142 108 -119 -199 4 124 7 -99
5344 -99 100 28 -216 -184 94 242 -55 -197 -113 -13 48 6 83 -1 -132 -139 52 171 -41 -147 9 113 2
5367 2 -59 126 159 -75 -239 11 251 68 -45 -21 18 -4 0 197 163 -49 -188 15 226 89 -75 41 102 -10
5391 -10 -79 141 241 -51 -222 -104 130 120 -43 -47 46 -156 -108 88 224 -31 -200 -112 64 131 -108 42 86
5414 86 -81 -248 -69 236 111 -187 -170 37 16 -65 19 75 -137 -168 55 253 120 -100 -124 76 24 -103 97
5437 97 210 51 -245 -102 97 198 -29 -48 11 -15 -64 83 119 -11 -248 -105 191 124 -93 -48 102 -28 -147
5460 -147 -63 259 126 -288 -177 25 149 79 -88 77 -15 -147 -39 222 110 -181 -186 39 71 -24 21 145 -4
5483dk40Q4L80m5k02j08J74Ok3L4J25j60k76J19K98J16l56r4J42Q1j47P5Q7R3
5507A59k43q1J90J82k09p8N8o9LQ6J72m8l21l2L34K4j40j03P8J15j56n3K39J26
5531B33k53k31J98P7R3r7L0m0k29J21K64J02k94j69J76J55j66pJ26O9k62n8K53
5554I1Q6p7k58O4J10l3J5J05Q1l64K5J21K27j89j87J37R2r0QN8J18j80k23J32
5578a31J78jj14oK1k9K8J21Q3j99j82J74J37M0j86R3L8j18KP4K37j29k21k3J92
5603G9J01j13Mk2j14m0K30J14j31k78M0K19m8q8j3J55j33j19J22J82m6k07K6N5
5627b5M6n4O8J31k05j43P3K58j1k40l7J66J0j50N6J83q1k74Q4J76J21j03r7qN4
5652bj22J89O9o4k11k3K55J19j57j03M1Mq7O8J63k1j71o0M8Q8l2J40n1j79m6J06
$$ plain form
5483 -4 -244 -160 220 175 -27 -135 39 45 22 56 181 21 -255 -136 162 278 -78 -172 -30 51 -96 -21 66 159
5507 159 -84 -165 25 207 -2 -80 -22 -91 -88 -2 170 122 -199 -231 103 127 -13 -116 -38 77 -79 -132 107 233
5531 233 -20 -251 -53 24 117 20 50 10 -219 -98 166 268 -26 -195 -19 136 -30 -37 89 158 -104 -162 91
5554 91 177 100 -158 -94 16 -17 -2 103 184 -180 -155 -34 193 4 -183 -46 46 -44 -36 22 140 -40 -263 -131
5578 -131 47 46 -68 -74 -53 -82 -54 67 150 -49 -231 -57 80 120 -66 27 65 -53 -51 23 260 131 -90 -113 79
5603 79 180 67 71 49 -65 -105 125 239 108 -170 -130 89 41 -47 -60 95 -38 -157 -35 147 101 -106 -80 -25
5627 -25 21 -33 35 166 -39 -182 -109 149 138 -102 -139 27 37 -113 -57 126 45 -229 -145 31 152 49 -48 -56 -2
5652 -2 -124 65 134 70 -141 -164 91 210 53 -50 -9 -5 -92 -24 139 118 -53 -113 -65 23 -9 131 80 -99 -145 -39
5678c9K23J4k45q8J10J42j47J04k4m1j24l8J69M1J0j57O2K8k0K3J39j48j28OJ84
5703E6J01j76q6O1M5Ol8J10J1j50n1J03P0O1l9j05m3QN2J51j5j68j16J26Q3o3
5729fM4r9Q9j36QJ71Mn0j32r8J70O0J0pp6j27N0J70R0j41r3K5Q7Jn2O0N2j65k
5758i3J16J02l0p4l1lJ8R8OJ2j18q4J28J10j04p5L6qK3L8P6m7k8j25J0P9J05p1
5786F6j8p8j9j3J41M4r1j89K2J20K0J5m5l6l2K1M6K5K7j03n4JJ11N4O1l7j24n3
5814a18K3J95k5j08j53P9K7K34n1j03J3j01Q5QJ04l0l2j04O1K0Q8%o8j41N2J78
5840A33j8k7o5r3N2P3O9n7m9j4j11J27J8Q8o5p9j30K2J58P4n5p2n9JJ20P7q5j41
5868a08n8O9M7Q1KPo6l0pJ28P9j52r0oM9J21Pl6mj25Q3P4K2p4l8p9R7n7J38P2
$$ plain form
5678 -39 184 198 -47 -135 -25 117 -30 74 50 9 -115 -153 16 57 67 -90 -28 0 -20 3 142 -6 -134 -128 56
5703 56 157 -19 -105 -44 1 7 -31 79 90 -60 -111 -8 62 123 84 -21 -64 -56 -4 147 132 -36 -152 -26 57 -6
5729 -6 38 -61 28 -108 -100 71 75 25 -107 -205 -35 25 35 28 -48 -175 -125 45 135 -6 -99 -74 13 14 -38 22 74 -91 -93
5758 -93 23 125 95 21 -10 -13 5 103 109 121 3 -81 47 157 53 -22 14 6 29 67 143 96 68 -57 -47 32 137 66
5786 66 48 -30 -49 -62 79 123 32 -157 -135 -15 5 20 -25 -61 -93 -72 -26 -1 26 -77 -131 -130 -19 35 96 59 -65 -118
5814 -118 -95 100 75 -33 -186 -107 -80 154 103 0 13 -88 -3 5 109 79 47 -57 4 24 112 112 44 -97 -45 133
5840 133 115 88 23 -70 -18 55 124 67 18 4 -107 20 38 126 61 -18 -148 -126 32 106 51 -21 -80 -79 41 118 33 -108
5868 -108 -166 -97 -50 31 33 40 -26 -56 -63 65 144 -8 -98 -104 -55 66 73 37 33 -92 -9 65 87 13 -25 -104 -7 -64 74 146
5898A46q9q9r2J12J33mm5j11n1O6Q1N4Nj64l8Q9M7qL0k7n7j3j8R1O5j55q8P6L9
5927a5J04%p9n1q7J57R2j03K5j06J2N9K9l3J2L8j35n6J13J11lj45%L5JO0M9r7
5955a3j41m9K07N8N2j85l1P6k0L2N9J3q3j55M9J72P6j01k3l3RN5J10L8k01q9J21
5982CO3J3j09J7K2n6j3M7J74q8j58rJ11Q6n7Mk6j07K7N4K07j39j02kM2J6ko1Q2
6011C9k4r7K2J11kK4j89nJ23l1O5l1p6j51J32J30L4j15k8L1k2n3J33N7J6j38q9
6038a34J01P0n4l3Lk8N6L4J95n0k12r4K02Pjr0J01k9l1J0J25N1j67j44P4J22r5
6065a1M5L7m9r4O9P5Q8j37j05R2L6J4j24J36m0j54KJ54R5j61rn5M3m7J00J00q4
6092A6j08j54K90J30j33j41N4Q5q0j4J05N3j16j86J44R9m3n2Q1o9J7J5J99l7j80
$$ plain form
5898 146 57 -32 -124 -12 121 117 72 -39 -90 -24 57 111 116 -48 -86 3 50 42 72 45 -12 -25 -43 48 113 -42 -130 -54 -15
5927 -15 89 89 10 -41 -128 29 121 18 43 -63 -51 8 37 4 16 54 -81 -137 -24 87 84 -61 -61 -26 -25 35 84 -13
5955 -13 -154 -203 4 62 114 -71 -102 -26 -46 -14 45 58 -25 -180 -131 41 117 16 -7 -40 -31 24 134 172 -29 -118 3
5982 3 66 79 -30 -13 9 -47 -60 -13 161 73 -85 -94 17 103 46 50 24 -83 -56 -2 205 66 -36 -38 4 20 18 -43 39
6011 39 15 -82 -60 51 49 73 -116 -121 2 -29 36 5 -71 -222 -90 40 74 -41 -69 -38 -60 -113 20 77 93 -45 -134
6038 -134 -33 37 -17 -50 -47 -75 -19 15 210 160 -52 -146 56 63 62 -28 73 44 13 23 148 199 32 -112 -38 84 -11
6065 -11 34 71 22 -72 -3 72 160 23 -82 10 46 60 -64 72 32 -122 -120 34 129 -32 -41 -96 -53 -100 0 100 16
6092 16 -92 -246 44 174 41 -100 -46 39 -41 -55 50 103 -13 -199 -55 44 1 -51 30 -39 -22 -7 192 155 -25
6117b5j09J06J25p9l4J9M2p8j8R2J03j30j40K1J26J3ML7n4j08o9J53J55j50j44
6142a42N0J98q4L7k6K8j37j07J72J53q6j32J00j1j0rJ67M6l01r4J89J33Lj48l4
6167d5J10o7r2J29L3r5j28L9K11j5j12Q0K7j41pJ41J26j95j58N7K07K7j73k2R6
6192C3j37n7J06R4K2j04l0R2l1M8oJ15k05r4R0J92l5k02kR9R1j37P5Q1j09n2q7
6219a50K17J03j31j33P9J5L7J8M0Mk41m8L18M2j61p4J44r4p4N8Q8J6j86k8J22
6244a9J11j11Lm8Mn7J07J40j1j90j19J93J12j47j5J14m9p1r8J66R4j14j15K5J13
6269A8Ml9J45r7j25j0K67Rj32j42K4J74l3p8J23k4j82k6J80L7m9n6j7L3j20Q0
6295c6J08N6j92r0J09K12j49n7p7J53q8l1J27R9j89l5K7P8RK7n7J7j36QJ86L2
$$ plain form
6117 -25 -134 -28 97 18 -16 3 45 -33 -51 41 144 14 -126 -105 21 34 38 75 21 -87 -156 -3 152 2 -142
6142 -142 -92 106 22 59 33 61 -76 -183 -11 142 56 -76 24 13 3 -6 161 207 -94 -188 1 134 137 -11 -45
6167 -45 65 -2 -94 35 68 -27 -155 -116 95 80 -32 48 75 -66 -73 68 194 -1 -159 -102 105 132 -41 -63 33
6192 33 -104 -161 -55 39 61 -43 -73 19 -12 36 30 145 -60 -154 -64 128 93 -109 -111 -12 79 -58 17 98 -11 -63 -150
6219 -150 67 170 39 -94 -15 0 37 55 95 99 -142 -190 128 170 9 -65 79 -15 -89 -31 57 73 -113 -141 -19
6244 -19 92 -19 -16 -64 -60 -117 -10 130 119 -71 -190 3 115 -32 -47 67 18 -53 -151 15 109 -5 -120 -95 18
6269 18 22 -17 128 31 -94 -104 163 172 40 -102 -78 96 63 -15 108 84 -98 -124 56 93 44 -12 -29 4 -116 -36
6295 -36 72 128 -64 -154 -45 167 18 -39 -116 37 -51 -82 45 144 -45 -80 -53 25 34 61 4 21 -115 -107 79 111
6321A11q9j53lJ43L7k5nj5k9p6J13R3l0j17m7R3M2l8J01p6j52J3P6J58oj38j24
6348a43J50o0N1K8L8q7n7P6J28j9j20L8kq1m5R4J16n2k18P7K05pj87%P2n2J5M8
6376FO5lj50N7N7N5q0O5n1j9j28J12R2J2j22q4J67j0Nm7jKq1L0J36l7p4k7M1P
6406em5Q7Lj25o9N6J88J3j76l6O3M4k3J4N3j1j32m8J11R1m6k5j6O2j06N9J21K1
6434A23k73qJ97N7o6r4K4L3o5O3N4K2j9j33P8J2L3Ll1k9j25J06J12Q7j50j48P8
6461e9N3L4L0l5l2l4LP3L6j9o4j2kJ6J9M9L7j38j25J44R3q1k5M6o7N6L6N0m0p0
6491b8j2M2J02l9k8K6o4nl5J54K3m1k10J04M1R8o6q4n9P3M9N4qj9j22kO9K2n4
6520a9N1l0k8p2O2R4k4r5l4M7P9Jk3l2K7l6K7M3l6l9jl3P5L0j9Om3q0LK11l5m
$$ plain form
6321 111 22 -131 -134 9 46 21 16 1 -28 -104 9 102 72 -45 -92 1 43 5 106 30 -122 -109 -33 125 119 -19 -143
6348 -143 7 -53 -2 26 64 -23 -80 -4 124 105 -15 23 21 -60 -105 -11 105 53 -165 -88 117 110 -77 -77 -5 -57 -42 6
6376 6 71 68 -82 -25 32 87 7 72 21 2 -126 -14 78 90 -32 -116 51 41 46 -1 -2 0 -81 -51 85 48 -26 -53 -12 -5
6406 -5 -50 37 40 -85 -154 -98 90 103 -73 -109 -46 -2 -25 -11 42 31 -101 -149 -38 53 7 -18 -34 28 -78 -19 102 123
6434 123 -150 -158 39 96 30 -64 -40 -7 -72 -9 45 67 48 -85 -7 5 38 41 10 -19 -144 -38 74 161 11 -137 -59
6461 -59 -6 28 58 23 -9 -43 -40 33 69 50 -14 -26 -28 -12 7 56 93 -45 -170 -26 67 -14 -39 7 -60 -4 32 82 42 -28
6491 -28 -40 2 104 65 37 63 -1 -6 -41 113 136 95 -115 -11 30 128 62 -22 -81 -8 41 95 87 68 -54 -56 13 35 -19
6520 -19 32 2 -26 -98 -36 58 34 -61 -95 -48 31 32 9 -23 4 -32 -5 38 2 -37 -38 -71 4 34 15 21 -22 -102 -99 112 77 73
6552G3j52R3pO2l2O2o1r2O3lO0j7l4o8J5k7J01k1M7j70L9K1J55j00K1j71L3M6
6580f4L9L7q0K4jl1OQ4NKj00m9J21K1P2r2n9m2P3J06m7r4M2k7L3M4K3k9jj1l0
6611b5P7J2L1j27p3Q7J5J08k1k4q8L3L4K1Mo6ko0P4K8lrL0p3j7K2P0l3Mj04OK7
6643d2K4N1l4j13Q5lK6l6QPn8K5Q1N3m3r5K9m1Q5P6k5o2j01R1M5J10j22n1j8N3
6673EJ2M1J8J1j05M6j5L1Q7o2r1J7P7j13R8l5o9l1O2P9l2J5l4op5P5J5O6j20j4
6703d7N1L5l9J3Kn7m8N7P1J9n6q4k0J01J6K2L1j19L5l0K1O5%n0k4K3k4N0P4l6
6733E2r9k7N8O7P7j32k6J5jM3kj7k2p2M0P4j4kpJ2l2J7J3M2m5j29OJ71m1K6j31
6764h6R3p8Q8J9K4K4r7M0m3N0qL9Nq5p0R3N2N3j31n4KJ29j9o3M4Rm9k4K4J55o7
$$ plain form
6552 73 -79 14 7 69 37 99 38 -54 9 6 66 49 15 -53 -38 -65 36 15 62 -108 -69 -48 107 7 28 -143 -110 -64
6580 -64 -25 12 -68 -44 -45 -76 -70 14 19 21 -79 -128 -7 14 86 -6 -65 -107 -34 72 25 -69 -27 -54 -21 23 46 17 16 5 -25
6611 -25 52 64 95 -32 -105 -18 -3 105 84 60 -28 5 39 60 64 -2 -4 -64 10 38 35 26 56 -17 -34 -12 58 25 29 -75 -69 -42
6643 -42 -18 33 -1 -114 -29 -32 -6 -42 -34 -27 -85 -60 21 74 31 -64 -35 -76 9 85 60 -2 -103 -12 33 143 21 -30 -48 5
6673 5 17 58 76 87 -18 28 13 44 131 69 -22 -5 72 -41 57 22 -47 -78 -16 63 31 46 12 6 -69 6 21 87 -33 -47
6703 -47 4 39 0 13 15 -42 -90 -33 38 57 1 -83 -103 -2 14 36 67 -52 -17 -47 -26 39 39 -11 -35 -12 -36 14 88 52
6733 52 -47 -74 -16 51 128 -4 -30 -15 -16 27 25 8 -14 -86 -46 28 14 12 5 17 -15 2 15 57 12 -117 -111 60 19 45 -86
6764 -86 7 -71 17 36 60 84 -13 27 -16 34 26 65 70 -15 -85 8 60 113 -18 -72 -70 59 40 -23 21 30 -19 -43 -19 136 69
6795F9q3j4k8K5J16J7l4o3j34J00J07j18k5O3j2NO2O6r2l9r3J10j1r%J2j3p1O3
6824b4J07o1p6n9J33K0n0j6K2J2j5n8J06N9r6o8O1N7q8M0n0J10j44P9J24Qj41
6851hj26N3Q4L8qK2m7op0J44kj5q2k2P7r3pJ98j20q1qnJ44n4o2K4O5r0L6R4l8
6882C5l2p0RP8rJ8j04J26r8J4J12J0l4j75N5J87r1%J1j4Nr8J11Ll8j02J1J18J5
6911E3J7m3J2j02m0Q8J48j06p9J1M2K6om6M8n0q0N5J81p1j24K1L0k8J9K8P7j27
6939d6q4R2J15Lj15k3Q0j8k1M9K0n1q5J6O5M4r9M9R0j26j6N3J28%j95L0N3L3K6
6968F7o3j1K8q1JJ93q6j16J5N3Q6j43L5J8K9j13L5J53k1p1j3J9Qk8N1kJ5q4nJ28
6998I7o4m9NnK3n5P8K9m6j6j65J97M2rq8K0n8K9J8M1J5j17JL6Q2l7pl3L2r5N1
$$ plain form
6795 69 -14 -28 -56 -31 85 102 68 5 -129 -29 78 -40 -65 -2 -14 -9 53 119 27 -12 -105 5 -6 -15 -15 -3 -16 -87 -24
6824 -24 83 22 -54 -113 20 40 -10 -26 -4 8 -7 -65 41 100 4 -64 -3 54 -34 6 -44 66 -78 1 125 133 -8
6851 -8 -134 -81 3 41 33 55 8 2 -68 76 74 59 -23 -45 32 -61 -68 130 10 -71 -79 -84 60 6 -56 -32 33 -57 -21 73 35
6882 35 3 -67 -58 20 11 29 -75 51 -47 -33 79 89 55 -120 -65 122 31 31 42 28 33 -65 46 49 11 -91 -80 38 53
6911 53 70 27 39 -63 -103 -15 133 27 -52 -41 1 27 21 -25 23 -27 -107 -52 129 58 -66 -45 -15 -43 -24 4 81 -46
6939 -46 -130 -38 77 80 -35 -58 22 4 -17 32 52 1 -84 -68 -3 41 -58 -9 81 -45 -61 -8 120 120 -75 -45 8 41 67
6968 67 4 -7 21 -60 -59 134 48 -68 -53 0 86 -57 -22 -4 25 -88 -53 100 79 8 -5 14 22 -6 45 43 58 -26 -31 97
6998 97 33 -16 -11 -16 7 -48 30 59 13 -3 -168 29 71 62 -26 -6 -64 -35 -17 24 39 -78 -77 -41 41 4 -3 -36 -4 -99 -48
7029d8P4N1j22q1Q7K7J3l5MK1j04M7J10L3j71JM6L5l3N9O4j6r1o2R0R8m0j16M5
7058a4J2PJ2Q0j01l7m1R8N8n4J5q7J19p3m5R5j7r8j00J76Q7k5j47R4r2L3p4J75
7086E6n4m7o5mJ51Op5O1M1j36o1J65O5q4q6j7N6O3m2j4N3p7J8N7J41m4j75k2Q2
7115A2Q2n5LL2l1q1l1J41k0p9K4J5J9J8JO5l8j42L5R4J4j05m3Q7J6n4oQ9jr0r1
7146a20J39k4L5j7j16Q2j5Q4M6j08jk7M4L2l9m7N2nq1J5J72o8j4r5J3O6K8j4J
7175A8ml3j2P4mmn1K0qM9nJ0j2r8N7l7J11j08m0M6M1k3J0N7n6j11k7J58K1j9l8
7206a8O2p7Km5J38Pj02p8M1O2K7J%m2L5p2J05L4p7n8M0K6k2l4J2R7j02l7J63O
7236I4q3k5OpO6%j7m1n3K3R1L2l2j10N4m3l4P6j9L6l4k6k8J19J8k7j24Q0k1K4
$$ plain form
7029 -48 26 77 -45 -126 -39 -12 1 -34 -30 -9 -113 -66 44 77 -94 -93 -47 -12 -45 14 78 62 -29 -91 -1 97 57 -59 -14
7058 -14 -2 5 17 97 -4 -41 -82 16 74 20 35 -52 67 -6 -51 44 27 -71 -171 5 92 67 -80 14 -78 -45 -119 56
7086 56 2 -45 -110 -114 37 43 -32 29 70 -66 -127 38 103 19 -67 -84 -28 35 -7 -21 32 -45 -27 30 171 127 -48 -70 12
7115 12 94 39 42 74 43 -38 -69 72 52 -27 -3 12 31 49 50 115 77 -65 -30 64 78 -27 -70 17 33 -21 -27 62 61 -29 -120
7146 -120 19 -5 30 13 -103 -21 -36 48 94 -14 -15 -42 2 34 -5 -52 0 -5 -86 -71 101 33 19 -76 -63 3 31 17 18
7175 18 14 -19 -31 43 39 35 -16 4 -4 45 40 50 38 -60 -3 -40 71 -37 -77 -31 10 -13 -3 54 -2 -113 -140 18 39 20 -18
7206 -18 44 -33 -31 -76 62 69 -33 -111 -70 -8 19 20 20 -22 13 -59 46 80 3 -55 -15 11 -11 -45 -33 64 -38 -75 88 94
7236 94 11 -14 -8 -15 51 51 34 -7 -60 -37 54 86 54 -56 -2 -45 -79 -3 -22 14 -20 -46 -74 45 63 36 -88 -8 -29 -5
7266eJ5j5o2K8rO8j8Jj0J8qJ2j5J07p8qo1P7kJq2K2nm1J43Lk0j38P9j2P5J3q6
7299a3PJ1m3P8L5k3j4r0P9j6K4K1l1j25O5L5M2l6qjO7m3m6K8Kk2p0O2L4K1m2l8
7331e0j0J6J3L5l5Q6j08rM6K0j8M2l4j8qN5J6mq7mN3O6L5q5K6j12J7Q6L4Mo7L8
7363C9j5n1J2P7k6m7rQq9J02L1m5Nn4J62n5M0j26o0N0O9qO9m4p3M8m8nP9n6Pk4
7395c7K8k2R8l0j30MO7O7k9j6K5n6K7M7m9N9l4m3rL6pQ6r8J1q1J37p4O5j0o4Q
7426b4O3mlpo6J0L4L2j8m9OJ0n2N1mK8J5l0j06J25J7Jl5l3L2M0p1Q2o8J7l1M0
7458Bl3M8k1J2k9lO4l7O7r2j5l1J07R9j43L0k3M4j2m6O5o5J0l5Lj3M1QL0p8l6
7489h2J29J1q1K9Jp2J8M7k0M9m5l6L4M0j4o9J2ML2N4k5K2p7QJ6L6M4o3k5K1K7
$$ plain form
7266 -5 10 -5 -67 -39 -48 20 2 3 -7 11 3 15 0 107 29 21 -40 37 35 36 -46 -24 -29 -70 73 76 56 -82 -3 -15 60 73 -13
7299 -13 -6 5 -38 40 75 52 38 -52 27 11 35 56 25 -100 -35 0 42 6 -2 -3 64 21 -25 3 5 -17 -87 -25 9 30 -12 -50
7331 -50 -60 -44 -31 4 -31 55 -53 -62 -16 4 -14 28 -6 -24 -32 23 39 35 -52 -56 -3 63 98 13 39 -73 -56 30 64 68 1 39
7363 39 24 -27 -15 62 36 -11 -20 -12 -101 1 32 -13 -8 -62 100 45 85 -41 -101 -51 18 10 79 35 -38 10 -38 -43 36 -20 -13 -37
7395 -37 -9 -31 67 37 -93 -89 -22 45 16 0 25 -31 -4 43 -6 53 19 -24 -33 3 -4 82 -16 -5 -86 51 -23 42 32 -32 -24
7426 -24 39 35 32 25 -41 -31 3 35 17 -32 -26 -16 -68 -17 -21 7 22 -8 -114 11 28 29 -6 -39 -7 33 -38 44 -24 -7 -38 2
7458 2 -31 17 -4 8 -21 -24 40 3 70 -22 -37 -68 39 138 -5 25 2 46 34 -12 53 -12 -2 -37 -34 -47 -6 2 32 -46 -82
7489 -82 47 58 -23 6 7 -65 -47 0 -20 29 -16 -52 -18 22 8 -61 -49 -45 -13 41 16 38 -39 -31 -15 21 65 2 -23 -2 25
7520B5Mj7L6L9j17L4kO6j22P2K2o2j2L2J05m8r5JJ9O4m6j5m5P1o7J15j7j5m8k0
7550d3j3P0J3l8M4k9j13P4J25k9p5n2P0N5k3l1J0k0m9j8J42m9j8j1J6j4KqML3
7580B5r3M1RM6PJ9j9p3K7oJ04p3q7OP4M7k2n6K8k6o3N0J03m6Mj10P6M2K1m8J0
7611A7Rm4m7J53q6J2q6M7M6K2m1ML1n2k6P1L0Jq6j4N6k2%L9n2qp3J11O4j8o7k4
7643c3M9m0p7J02J0K8r1j4O0K5Pk0rk6J4M4K9o4k6J6R3Nj25J4M4K3p9O6Q5j05
7673En3pO9l1R9q5m0L8J6r0J70k5j24K3nR7p0l8J8J3J4n0J04L6j53oL2N2k3K6
7703A2K5K1p3o6J51q0j5O4r0P3m9KK7k5j6pK1Q4q5N2k7l0k0N5P8j02%jM7J8n3
7734iO4N0o7n5J6R9o6j2Lm0P1m5J0n9%N7p9J23M5j71L1NQ6q4K7K3J1o1k6N3L8
$$ plain form
7520 25 29 12 48 87 -30 4 2 68 -54 18 40 -22 -34 -2 103 55 -40 -39 -20 44 -2 -17 -62 9 -58 57 40 25 -23 -43
7550 -43 -56 14 27 -11 33 4 -109 -35 90 61 -14 -66 4 59 36 5 15 -5 -54 -72 70 21 3 -8 8 -6 -4 -12 -8 25
7580 25 -68 -27 -18 28 35 54 35 -38 -11 -17 87 14 -73 -67 7 54 32 -24 4 -22 -85 -35 68 22 26 -84 -8 34 55 7 17
7611 17 26 -18 -65 88 2 14 -72 -25 21 43 2 6 37 -15 -41 30 60 61 -25 -39 17 -5 -5 34 -18 -26 -99 12 76 58 -9 -33
7643 -33 16 -24 -101 1 11 39 -52 -66 -6 19 26 6 -3 -29 -15 29 58 -6 -32 -16 77 82 -43 -29 15 38 -41 25 110 5
7673 5 -48 -55 14 -17 82 -3 -43 -5 11 -79 91 66 -58 -35 -40 57 -13 -51 -33 -20 -6 -56 48 84 -69 -75 -43 9 -14 12
7703 12 37 58 -15 -81 70 -10 -25 39 -51 22 -27 -25 2 -23 -39 -46 -25 59 -26 26 -1 -31 -51 4 82 -20 -20 -21 26 44 -9
7734 -9 55 105 38 -17 -1 98 32 20 23 -17 54 9 19 -40 -40 17 -62 61 106 -65 -34 -29 57 -27 0 23 34 -27 -53 0 38
7765C8J7j48J20m2PrR1n1q4N1NQ4o0o5L2M1m8LO3L9j16L8K1K6l4n5P7m5j2NN2
7796D1pK7q8L0O5m5l9Ol9N1j0J4R4q2q4L3P7k5l4ORk8k2Q8j2j9j8lk0Q2o7PmJ0
7830fj06Q7J06Oo0j38P3N2%nL3k9n1M2N4l3n7lL6K9p8L3R6j6o3j3L7K2r5M1j5
7861b1ml4L8Q4n8r1J59m9M7o3n8M0oK7o3J64r1o5J3M3j0m4N3Pr8nQ5M1j0qr3Q8
7893A8J8J6l0o0L8l2k3J06k5j9K1k0K6k9O2l2k5p6J2N1K3o1N8j0l0J5k5L0L2M
7923C3o5jO4pj9N8l9j7j8Q4j6l2o7J00k3%k4l6J1N1q8R0M5n8l8q8J12j8m2N0L8
7954D0n0nlR8m7o3N5O7r4jK8K8or2L4rJ05n4l5K8l0O0o1P2o1%OjK0k5Pj9j5N1
7988B8rL9p5K2q0Q8Jk1L8l5L8j17Q4k4nj9oN8MM5n3M6q7J5L7kJ1M8j13k2O6KL5
$$ plain form
7765 38 55 -93 27 -15 -8 -17 74 23 -61 -10 -5 79 19 -46 -14 27 -21 -18 45 84 -32 6 27 53 19 -36 41 -4 -16 -11 41
7796 41 34 61 -27 3 68 23 -16 -10 -49 2 -8 6 100 18 -66 -33 44 19 -15 -9 0 -28 -50 38 26 7 -11 -14 -34 48 -19 -12 -16 -6
7830 -6 -112 -25 81 87 27 -111 -38 14 14 9 42 13 -38 4 58 25 -32 -35 1 30 -48 -15 81 65 2 -11 26 48 -47 -6 -21
7861 -21 -25 -59 -21 63 5 -86 73 24 71 8 -50 -10 -16 11 -52 112 21 -44 -31 12 2 -42 11 18 -80 -85 0 41 31 23 -70 18
7893 18 36 52 22 -38 0 -32 -55 51 26 7 28 8 34 5 67 35 10 -66 -54 -3 20 -41 17 7 -23 -8 -33 -3 29 33
7923 33 -32 -33 31 24 5 63 24 7 -11 73 57 25 -42 58 35 35 11 -25 -14 37 -51 39 84 26 -12 -100 12 -6 -48 2 40
7954 40 -10 -15 -18 80 33 -30 25 92 -2 -3 25 53 47 -45 -11 -20 85 31 -4 24 -6 54 -7 65 4 4 10 9 29 4 11 -8 -23 28
7988 28 19 58 -17 5 -75 13 14 -7 31 -4 34 -83 1 -23 -28 -47 -53 5 9 54 1 47 -40 -25 12 10 21 69 -44 -66 0 2 37
8021C7J4k8k4N3lj5j3J6J3m5l5M3l5Q5q0qR7n6l4K2p8L8P9l9M0Mj30K4J17J8r3
8052a6l1M7K9m1M6J5m7rK4qL0l5L8j4p0lN4J04p6p5lM0L3k4K0n6j9K0N0O2q2l3
8084c0N4j2K5k1N4r9P5j27Q8M2k0on9M0j3O9l4L9o8M2m4mN8J4n0o9J5K4R7o5K5
8115D0k9o4L6J04q6L0l5L2Nk6k1rk0J2J7jK4J9K9l6m6J8K1J8j7k7j4K5oJ9n8O
8147d0j5Q1KJKnj0k5j4M2K0k8l1j6OO3K6j20M0L0L1n2J7L1p1l5N6j2Q8o2J1K8
8179C9n1M8n8lm5O1Loj5N3n7N0
$$ plain form
8021 37 51 23 -1 52 49 34 21 37 50 5 -30 13 -22 63 -17 -25 72 16 -18 4 -74 -36 43 4 44 48 -82 -58 59 77 -16
8052 -16 -47 0 29 -12 34 49 2 -7 17 9 39 4 42 28 -42 -45 9 113 37 -38 -41 -1 32 8 28 -28 -47 -27 23 85 3 -30
8084 -30 24 12 37 16 70 -29 46 -81 7 49 29 23 -36 4 -9 60 26 65 -3 39 -5 -9 49 63 13 -56 -41 -17 80 15 40
8115 40 11 -53 -17 87 1 31 -4 28 33 7 -14 -23 -43 -31 -14 -15 9 28 57 21 -25 -7 14 32 15 -12 -26 -1 -7 12 -46 -40
8147 -40 -55 26 28 29 31 26 16 -9 -23 19 39 11 -20 -36 -30 33 59 -61 -21 9 40 -12 5 36 -35 -70 -14 -26 62 0 11 39
8179 39 -12 36 -22 -25 -70 -9 -6 -12 -27 26 -31 19
8191A9
$$ Imaginary data points
##PAGE= N=2
##DATA TABLE= (X++(I..I)), XYDATA
0@%%%%%%%%%%%%%%%%%%%%%%%%%%%%%kOqRj1J2j2J2j2J2j3J7k1K2k4K9l3L5l7M2
49B3m9N5o4P5q8J07j34J75k47L91p86L229J4636q336j3252M359R894l934o365
68c11P255Q919o294q843N972J0372l771r798J104O492j801l947N699O247p222
83A0073j1879J186J0319J916o995k754K865l84l745L40K420l076n258P41M329
98I8M16k273m59j860n600k097O647O115l652o757P5L548p45j832K309J321l882
115h628j527O370N032m941o332K745M895k155j619P230N853p605r704N254J1878
130F746p18r117M84Q367K07o068K208O978l442r575K531J1863J670q982j839O248
146G561j281q052K178J1162L12j1918l679R736M954p684n845M116L078l951p07
$$ plain form
0 0 0 0 0 0 0 0 0 0 0 0 0 0 0 0 0 0 0 0 0 0 0 0 0 0 0 0 0 0 0 -2 4 -4 5 -6 6 -6 6 -6 6 -7 10 -11 11 -13 16 -17 18 -19 23
49 23 -26 29 -35 40 -48 59 -75 100 -147 244 -542 2687 17323 8987 -4265 94 9988 6054 -311
68 -311 6944 15863 9569 726 6698 17070 13299 3501 4605 11097 9296 5349 11048 17295 10073
83 10073 -1806 -620 9699 11615 4620 1866 4731 4347 602 942 3362 286 -4972 -4231 98
98 98 514 -1759 -2218 -4078 -9678 -11775 -5128 987 -2665 -9422 -9347 -5799 -6544 -8376 -6067 -4746 -8628
115 -8628 -10155 -3785 1247 -3694 -10026 -7281 -2386 -4541 -6160 1070 6923 -682 -10386 -5132 6746
130 6746 6028 -3089 -2605 5762 5969 -99 2109 9087 5645 -3930 -1399 10464 12134 3152 1313 7561
146 7561 6280 -1772 406 11568 11880 -38 -3717 6019 10973 3289 -2556 1560 4638 687 -20
161b0N817O98q090m541M724M171k432j584K684j009n701p31O208K148n926m118
177g702L283L930n57j327k65k497l136K350N548M36l922r34J878j411k431L345
193c412N088k500o797J003P646K084n660k842K895J106j890K578N645j662p767
208d485j027P218L100m775j377N036Q80o085p24Q129K990q372n693O726P647k714
224F474n476J450K296l382k284N730M547m889o110K581N275j848l985J932K802
239E113l714m224M337O064l014p862j162N188K049k058o68L98k386k467K138L067
255G99j252l296p4J313o40l17K326K68m187k826L259M569m29l000q84n3n82J348
273c658L647K92m407j790L972L108k232j753K614J067l700r50N925M097m516n683
$$ plain form
161 -20 5797 6495 -1595 -6136 -1412 2759 327 -1257 1427 418 -5283 -6014 194 2342 -3584 -7702
177 -7702 -4419 -489 -1046 -2373 -2638 -5135 -8271 -5921 -373 63 -3859 -4793 -2915 -4326 -6757 -3412
193 -3412 1676 -824 -7621 -6618 1028 3112 -2548 -5390 -2495 -1389 -3279 -701 4944 3282 -4485
208 -4485 -5512 1706 4806 31 -1346 3690 4570 -1515 -2239 5890 8880 508 -5185 1541 9188 6474
224 6474 998 2448 4744 1362 -922 4808 9355 4466 -1644 937 6212 4364 379 2311 5113
239 5113 1399 -2825 1512 7576 4562 -3300 -4462 726 2775 717 49 447 -1939 -4406 -2268 799
255 799 -453 -3749 -3823 -2510 -3150 -3467 -1141 -873 -5060 -7886 -4627 -58 -487 -3487 -4371 -4424 -5006 -3658
273 -3658 -11 281 -4126 -5916 -1944 1164 -1068 -2821 -207 860 -2840 -3790 2135 6232 1716 -3967
289c967K067N548L10k382Q07J417k621j914M022M152k957n251J174M690r9l002
305A994Q53K647k538m801J716O336Q36o063l432K821K855j153j184O50r69k683
321b115J27L525J097l300k587Q79J283n17L09J464p41l502j386L144L228r85l072
338c149j402P61J811J635J09k008j760O33K124Q06l93K47j20j721r37K759L243
355B638q36l483r81K227J696L18K88l89k255j176L153L429j251l870l31K692N71
372B440j442P33K300j425m089J1M652K169l079l336N84J929L40J5N98j030k696
389a326m76L116K044j911k652jJ165j99k23J256O73k243k744Q54L567J381k467
406a86k955k19J965J599L3j019j135p99K09J219J443j74j506j232J93J223J196
$$ plain form
289 -3967 -1900 3648 3958 1576 2383 3800 1179 -735 3287 7439 4482 -769 405 5095 4996 1994
305 1994 2847 5494 2956 -1845 -129 6207 7043 980 -2452 369 3224 2071 887 1537 568 -2115
321 -2115 -1988 1537 2634 -666 -3253 -2374 -1091 -1608 -1299 165 -576 -4078 -5464 -2320 908 -77 -3149
338 -3149 -4551 -3790 -1979 -344 -235 -2243 -4003 -3370 -1246 -440 -833 -586 -706 -2427 -3364 -605 2638
355 2638 1802 -1681 -2662 -435 1261 1579 1867 1478 -777 -1953 1200 4629 3378 -492 -823 1869 2440
372 2440 998 1731 4031 2606 -1483 -1472 3180 5349 2270 -1066 -482 1447 1787 1802 2400 1370 -1326
389 -1326 -1802 1314 3358 1447 -1205 -1206 -41 -240 -463 793 1466 -777 -3521 -2667 900 2281 -186
406 -186 -3141 -3360 -1395 204 237 -782 -1917 -2716 -2507 -1288 155 -19 -1525 -2757 -2564 -1341 -145
423a45M49n59j602j211J014K615J542j635l004m77K749K193m74j649n06L94J37
440a69L48J339R76j094k275k22K233J992k88j632j261j77J180J821R10j549k494
457c62l89K093J887m83j828o29L10k7O9J000Q06j191k508p11K130K405m98k810
475g36j827Q40J844P09m68j110j128o86O97J982N70j690j730K43J082K96J69R47
493Dl71k499j263K931L309r50l822r70K559J896o35m36N18p51j441Q37K799P23
511B438k010j458P59Q91R2R45J082j371k817J56L575J940k117k784RJ687O86N5
529A758J33o37j388n86J301J202j14q41r98r93K5J783J718j126l079j006J910
546i38J940q9j093q96q96j54J440J646o55k027m26J181M08k76R15R18j876k623
$$ plain form
423 -145 304 -255 -1857 -3068 -2054 561 2103 468 -2536 -3013 -264 1929 1455 -194 -700 -306 -169
440 -169 179 1518 2494 1400 -875 -1097 1136 3128 2840 1208 -53 -230 950 2771 3681 2132 -362
457 -362 -751 1342 3229 2746 918 289 599 572 641 1641 2447 1256 -1252 -1963 167 2572 2074 -736
475 -736 -2563 -1723 121 830 362 -748 -1876 -2562 -1865 117 687 -1003 -2733 -2490 -1408 -1112 -943 4
493 4 -367 -2866 -4129 -1198 2111 1161 -2661 -3631 -1072 824 189 -247 271 -480 -1921 -1084 1715 2438
511 2438 428 -1030 -271 620 712 1657 2739 1368 -1449 -1293 2282 4222 2105 -679 -670 1017 1703 1758
529 1758 1891 1254 -134 -720 581 1783 1669 828 -170 -1163 -1138 645 2363 1237 -1842 -2848 -938
546 -938 1002 913 -180 -1076 -1972 -2126 -686 960 305 -1722 -2148 -967 -559 -835 80 998 -878 -3501
564c501J232M192J010l470k302J621J973l65k25J186m94k430q5L181J581k319
580G85k086J332J077j234J46K729K22m105k300L544L847j573l557O0J738l28p15
597d18J455R06k496k020J792K636o82j851R7K99j498k12K898J951k805l419Q42
614b525L224N97j621m85J83p55K4K158J134k051k094R73J605j95J6J463j07l139
632a595j289L172L126j653l173L06K091m9o21R36L06k574j331K819K952j709k814
649a100M06J454j389j060K876K300l052m125J649M441j40l736o96K087rj270J541
666A77K113k086l795P36L852N63k560L4J758j222k596J550L993o33m588n82L978
683F92J853k213j333Q94n12j478J583L264k58l501r03K183N43j443Q37K057j206
$$ plain form
564 -3501 -2269 1923 2933 -537 -2839 -1218 755 390 165 1351 857 -1573 -1658 1523 3104 785
580 785 -1301 31 1108 -126 20 2749 2971 -1134 -3434 110 3957 2384 -1173 -1113 625 297 -418
597 -418 1037 1943 -553 -2573 -781 1855 1173 -678 -581 -282 -1780 -1992 906 2857 52 -3367 -2525
614 -2525 699 1296 -325 -810 -627 -1382 -1358 800 1934 -117 -2211 -1238 367 172 188 1651 1544 -1595
632 -1595 -2884 288 3414 1761 -1412 -1106 985 936 315 1251 1557 -1017 -2348 471 3423 1714 -1100
649 -1100 -694 760 -629 -1689 1187 3487 435 -3690 -2041 2400 2260 -1476 -2172 -85 -94 -1364 177
666 177 2290 204 -3591 -2855 997 1560 -1000 -966 792 -430 -3026 -1476 2517 1884 -2704 -3286 692
683 692 2545 332 -1001 -107 -619 -2097 -514 2750 2492 -1009 -1912 271 814 -629 208 2265 1059
700A059l150Q48L914L45l731j602K156J437o34N84J146j889l035Q29L589M72k605
717b67m16K019n66k440J099L188r96m244k24M596J892k928k101J152J13j688J258
734e53L425j23m187j176L338J338k740q90K602M65l075j70M066J243m632l166
750d235K965L439q57j603J052R1k769p40L371J911l007k204K286K032j784j352
766a404J876O81l233j401L984L340k342l715L06J821l85m16K008O83k689j388
782b274K709J966k370k159J630J588j438n01K950J121l963l196K593L713m60k170
798b61N22O84j793q64K703J451l038k392K860K928j801k568J316J236k714j814
814c545L724L778k507m489M75L051k68j818R09J612j804j848K471K862k329l835
$$ plain form
700 1059 -2091 -1243 2671 3016 -715 -2317 -161 1276 642 1226 2372 483 -2552 -1723 1866 2338 -267
717 -267 -683 1336 770 -1670 -571 2617 1621 -2623 -2847 1749 3641 713 -1388 -236 -123 -1811 -553
734 -553 2872 2749 -1438 -2614 724 2062 -678 -1568 1034 1499 -1576 -1746 2320 3563 -1069 -4235
750 -4235 -1270 2169 1312 -291 761 852 -1917 -2657 714 2625 -382 -2586 -300 1732 -52 -1404
766 -1404 472 1153 -2080 -3481 503 3843 1501 -2214 -1908 -87 -472 -888 1120 1803 -886 -2274
782 -2274 435 2401 31 -2128 -498 1090 -348 -849 2101 3222 -741 -3937 -1344 2369 1909 -261
798 -261 261 945 -848 -1712 991 2442 -596 -2988 -128 2800 999 -1569 -253 983 -1731 -3545
814 -3545 179 3957 1450 -3039 -2564 487 219 -1599 -690 922 -882 -2730 -259 2603 274 -3561
830c561Q76L435j49j795J458K221k630l837J465M628M49l361o58K261K01j520
846e17P53J585j783k269J882L807l52l252m15J752o82j701J887L256j022l916
862i87l54L114Q44k251o19J169k56j058J605K111j910l863K42L353O13k081L14
879a4J837j491l318O99L759K69l594j008K801J044j750l93J101j229k398J528
895b157M058P7l863j315K520O88k228L07L244j9l572q07L646J780k895k138J707
912i67J510q41M59K078o33l641p06L604J987k195j370J824P83k330n28K856R72
929B862k955j859K498K535r76j881J92j33j320P02K972N27l075j754J991J394
945A720j536q90J562N74k218p47K655J521k575k503R95J931j20k29J026o83k703
$$ plain form
830 -3561 -2685 750 601 -1194 264 2485 -145 -3982 -2517 2111 2560 -801 -1459 802 1003 -517
846 -517 236 1821 38 -2231 -349 3458 3106 -146 -561 1191 509 -1192 695 3951 2929 -987
862 -987 -1341 1773 2617 366 -253 916 660 -398 1207 3318 1408 -2455 -2213 1140 1753 -328 -14
879 -14 1823 332 -2986 -2287 1472 1741 -1853 -2861 -60 984 -766 -1159 -58 -1287 -3685 -2157
895 -2157 1901 1978 -1885 -3200 -680 8 -2220 -1913 1331 1312 -2260 -3067 579 2359 -536 -2674 -967
912 -967 543 -298 161 2239 1606 -2035 -2741 863 2850 655 -715 1109 1892 -438 -966 1890 2862
929 2862 -93 -1952 546 3081 2105 224 416 283 -1037 -335 2637 3164 89 -1665 326 1720
945 1720 184 -706 856 1430 -788 -1535 1120 2641 66 -2437 -1442 489 369 140 1166 483 -2220
962b220n75L087J743k344j908J503J567j416j017J778R38k507j922K499K926r35
978A197k503j98R72n50j59K120R76k587k112K123K620j234k290P50J639q19j292
995a347J750K133j807l036M98K789O94j113k10K89j175p46K061J736j587k455
1011a526Q13K406K0j666K76R26j127j538J440K460l00k430p94J073M86j90P42
1028A071L00j811j330J716K286r17k576j52J581L8q82P79J257j325k382L05K446
1045D04O59j451o73K89l18l97J477J196j625k333O68K727N17j953o19J126k02
1062e08j157P94K150J5k330r89J624J334l89l96K20o52q82J177K213k77k572p35
1080a360J768J314o06n89P29j93j380k31K008R96j235j569J27R03K55M03J92j077
$$ plain form
962 -2220 -2795 292 2035 -309 -2217 -714 853 -563 -1580 198 1136 -1371 -3293 -794 2132 1197
978 1197 -1306 -1504 -532 -1082 -1241 879 1855 -732 -2844 -721 1899 665 -1625 -875 764 -55 -1347
995 -1347 403 2536 729 -2307 -1809 980 1674 561 351 640 -535 -1281 780 2516 929 -1526
1011 -1526 -713 1693 1713 47 323 1249 122 -1416 24 2484 2184 -246 -1040 33 519 329 1071
1028 1071 1371 -440 -1770 -54 2232 1315 -1261 -1413 168 206 -676 103 1360 35 -2347 -2042 404
1045 404 1063 -388 -1061 -772 -1090 -1487 -10 1186 -439 -2772 -2104 623 1140 -813 -1432 -306 -508
1062 -508 -1665 -871 1279 1294 -1036 -2025 -401 933 544 148 368 -284 -1166 11 2224 1947 -625 -1360
1080 -1360 408 1722 1116 527 1256 1063 -317 -548 1460 2456 1221 -348 -221 682 937 1340 1532 455
1098D55j654L42K213P19j619j292L80N79k49N8Q47j70j571p23J101J283l59q08
1116d68m39m68o5J136J272n39k204o60J765J250n99q92K17J26o56J47J271O60
1134H54j160j273M24J144M71Oo7p97j043O33J932O68j556j465O24J311K25m72
1152D59J81P0p73n15R43J221r4j164q36J41P83P55L11p19j420k67J235J248k59
1171A300j333o62L89M45K54K76m5o07q96J17P96Q25o3r61r53r0J035J116o4j424
1191e45r29L89J092N77l73o53m03q9K47O73M14k79p51n44J63Q24Q73o7j113j013
1211a507K32J426R55n52j237n59N64R36L05k06m46l34k67L49P06N26j80r78o58
1230i25L66J226P67n31j094o87N79J198N67m99j059m73N95P67K48l32k72l22m44
$$ plain form
1098 455 -1199 -857 1356 2075 456 -836 -456 123 -126 -68 779 609 -962 -1685 -584 699 340 -468
1116 -468 -907 -1375 -1440 -304 968 429 -1775 -2435 -670 580 -19 -911 -694 -568 -1224 -1077 194 854
1134 854 -306 -1579 -1155 -11 460 466 399 -398 -1441 -808 1124 1792 236 -1229 -605 706 931 459
1152 459 640 710 -63 -578 365 1586 1492 328 -508 -367 416 1171 1482 763 -657 -924 311 1559 1300
1171 1300 -33 -695 -306 139 393 669 624 17 -879 -762 34 859 796 -165 -1118 -1208 -173 943 879 -545
1191 -545 -1474 -1085 7 584 211 -442 -845 -934 -687 -14 400 121 -630 -1174 -1011 -187 686 619 -494 -1507
1211 -1507 -1275 151 1106 554 -683 -1242 -678 258 563 357 -89 -423 -690 -341 365 891 711 -267 -925
1230 -925 -559 667 1434 903 -191 -878 -299 899 1466 967 -92 -565 30 797 1045 713 441 119 -325
1249c25K6R75Q82n82j460n80R17J258P3p81r05l50L47Q47P40o02j261l59Q06N89
1269B55j47j93Q8n13p96K41J503P04j236j435N6J130Q28j25m11p28n01M97J227
1288D44M12j026o85L08L62K4K83O95k28j353n43J328J406l02j102o47J98M68P92
1307H34N24p21j365n8J322O47m90n96K04j49p17K97J434M13j501j437O64J273
1325E78L68m94l93n43n04N94J395J26j540j052R02J101l50m46M74J15j249o43
1343a561J436J684p71j815k62J060O00j5K20l22j110l43J446J357q58j554J98
1360f10R06j02m11Q15Q38j242j542N87J908L02j290q02M07P2J65Q61L92j568j350
1379a664R55J823j86j295k5O17p06p94J072J568p29j988j98J634O41o04k73k7
$$ plain form
1249 -325 -299 676 1558 976 -484 -1064 -147 1111 1184 403 -502 -852 -505 342 1082 480 -781 -1140 -334 255
1269 255 108 -85 3 -510 -1306 -1065 438 1142 -94 -1529 -1473 -343 485 360 -51 -779 -1280 -783 444
1288 444 856 -170 -855 -547 -185 -161 122 817 589 -764 -1307 21 1427 1125 23 -624 -426 42 834
1307 834 1358 637 -728 -786 536 1183 693 97 301 152 -565 -268 1166 1579 78 -1359 -695 578
1325 578 946 452 59 -484 -988 -394 1001 1127 -413 -1465 -563 538 188 -258 216 331 -918 -1561
1343 -1561 -125 1559 788 -1027 -1289 -229 371 356 576 254 -856 -1199 247 1604 746 -808 -610
1360 -610 296 194 -217 598 1436 194 -1348 -761 1147 1449 159 -643 -236 -164 1 862 1254 -314 -1664
1379 -1664 -709 1114 928 -367 -392 225 -481 -1275 -203 1365 636 -1352 -1550 84 725 121 -152 -179
1397a79q23l81J613J456j157k044J97J739J2r13N02R91q31j591O36K140J00j940
1415d73o64J025P06l02N41M19j333j635J122K224K3j911n21J344j06r43J86J495
1433A197l57j971k85K048Q21j216j074J99R5l64Q87J356o74k265l07J985P78j277
1451d24o40R64K61j267Q9J803L36k107j105J459J445l27m75L89o58j241N04K321
1469A327M39k123q59J531J026j178n23J266J94j689m21K250J234j668j668N55
1485c07R19m90K98J329l89k192n26K341J044j805j428J205J076j074n67J466M32
1502A332k077j455J642J878n44j335K73J11j064j1J836N51k046j283J770J721
1518A299j082j572O04Q44j004n84J709J573j389k119L86J485Q0m90P14L40j481
$$ plain form
1397 -179 -1002 -1383 230 1686 529 -1515 -1318 421 433 -480 22 1013 182 -1409 -773 1367 1467 -473
1415 -473 -1137 -112 594 292 833 1252 -81 -1716 -594 1630 1653 -258 -779 565 459 -484 -298 1197
1433 1197 840 -1131 -1416 632 1453 237 -837 -638 -543 -907 -20 1336 662 -1603 -1910 75 853 -424
1451 -424 -1064 -100 161 -1106 -1017 786 1122 -985 -2090 -631 814 487 12 401 -257 -1498 -994 1327
1469 1327 1766 -357 -1216 315 1341 163 -360 906 1100 -589 -1010 1240 2474 806 -862 -307
1485 -307 612 122 420 1749 1360 -832 -1358 983 2027 222 -1206 -1 1075 1 -566 900 1332
1502 1332 -745 -2200 -558 1320 776 -559 -286 -175 -1239 -1250 586 1137 -909 -2192 -422 1299
1518 1299 217 -1355 -751 93 -911 -1495 214 1787 398 -1721 -1335 150 230 -260 454 794 -687
1535f87o23J855J423j687j997R68J974l10j033N91Q59j435j640J357K216l30j741
1552b40n8R82m77o02J090P06j658j375J647K325j009k254l8J402l55j003J227
1569C10J630j210k316L30J924J00j338Q7R18o48q67J349J481j562k545P67K582
1586I92K79j649r6J078p32j688Q06K205q2k047k97J526K89j045Q4Q01r26j267
1604a769J297K383m16k643p02J790N23j074K35J478l33j949k5J892M66j560o43
1621a050J066L78n89O27J115j062k303K63K617Q99j798q33J186K15j316L2J705
1638A152J34j766n72J732R46j248p51N92j58j097P49K263r3k657j074J906J175
1655A233j235p53J205L43j440m49J691O17j832j145J207J108n84j94Q81n14j980
$$ plain form
1535 -687 -1310 545 1968 281 -1716 -748 1226 916 -117 474 1333 -102 -1742 -385 1831 1501 -240
1552 -240 -298 684 207 -395 695 1401 -257 -1632 15 2340 1331 -923 -961 441 86 -917 310
1569 310 1940 730 -1586 -1256 668 768 -570 -483 435 -213 -1080 269 1750 188 -2357 -1590 992
1586 992 1271 -378 -474 604 -128 -1816 -1010 1195 1113 -934 -1231 295 584 -461 -377 424 -502 -1769
1604 -1769 -472 1911 1495 -1148 -1850 -60 463 -611 -376 1102 769 -1180 -1205 687 1153 -407 -1050
1621 -1050 16 394 -195 432 1547 485 -1818 -1555 1062 1961 163 -670 516 731 -585 -553 1152
1638 1152 1286 -480 -1052 680 1626 378 -373 219 61 -1036 -287 1976 1883 -774 -1848 58 1233
1655 1233 -2 -755 450 793 -647 -1096 595 1212 -620 -1765 -558 550 -34 -228 653 139 -1841
1672a841j91K411J222j808j477J069J204q43q32J050N90j478o12J614J370j017
1688D31j395L40N71n83L15J589K32k022j155J776J600j030j433O35J083o41n16
1705b03J168O66j501j339J024J461j59p29L00K2j278l83J809J196j705j665R83
1722c33J625m38j295J94O89p95p82J257J355r22j650J25Q89r2l00P99M28j481
1740g27j106J352J819q94j963J18J531J57p23L43O74r01j368O97J762j0j133r6
1758d68N88m85l72J009J053j159j722P08K093J66j610n28Q17Q3n35O16J170n77
1776H47j540p3J188L75n66L9M46p82p83J038J531o62j989k38J634O78q03l41M71
1795D70m20r96M93J328J05j240l99N67K38m51M32N76p74j396M99J913K80j642
$$ plain form
1672 -1841 -2032 379 1601 -207 -1684 -615 589 -254 -1086 -36 554 -924 -1536 78 1448 431
1688 431 -964 -624 -53 -636 -321 1268 1500 -522 -1677 99 1699 669 -764 -129 954 313 -203
1705 -203 965 1631 130 -1209 -185 1276 1117 388 688 710 -568 -951 858 2054 349 -1316 -333
1722 -333 1292 854 -441 -247 442 -353 -1135 122 1477 555 -1095 -970 -81 -173 -473 326 754 -727
1740 -727 -1833 -481 1338 444 -1519 -1401 130 287 -436 -93 581 -320 -1688 -991 771 761 -372 -468
1758 -468 120 -365 -737 272 1325 166 -1556 -848 1245 1411 -199 -727 90 173 -362 254 1424 847
1776 847 -693 -766 422 797 231 270 716 -66 -849 189 1720 1058 -931 -1169 465 1143 340 -1 470
1795 470 50 -946 -453 875 980 -260 -659 -92 146 -305 127 703 -71 -1467 -968 945 1225 -417
1813d17q93O70O22k83J6O33k31j153k11J269M85p80m22K80m2l54M27J183l41j688
1833a230m55J523J180p79q33J85K99l55J59Q71K17j034n50O67P21j50j44K10k93
1852B09p64K55J548M54j414j101O94J132Nn17J32m1o48K9Q78M28o88p82K14L89
1872D12j49J88O08l58j369l43J260J021o87j203l4M22J50o4L33p8q54m25O56O30
1892A16j65n16j20p0l64L28R66K64j167r77O45J116L40p00m24J8O3K80M72L54
1912D59n30n56J51N11K82J33J48k57o75j35J034Q23l68j119l02Q17O40p0k48k49
1932D89k90l6L66N78j15n87l63M0J30L26M19j31q80p14M40J026K74q64p36r3M47
1953b74L12J36r1o04l36R5N16J68m6k32l73l26L01O78M55n05r98j30P56Q27n3
$$ plain form
1813 -417 -1310 -640 -18 -301 -285 348 117 -1036 -1247 22 507 -273 -695 -415 -457 -811 -384 799 458 -1230
1833 -1230 -1685 -162 1018 239 -594 -409 -110 -465 -306 565 782 -252 -802 -135 586 436 292 502 209
1852 209 -555 -300 1248 1702 288 -813 -119 1013 1018 501 633 592 -56 -27 851 1279 591 -191 23 412
1872 412 263 451 1059 701 -668 -1011 249 1270 583 -620 -654 -232 -82 -146 187 109 -745 -1170 -514 116
1892 116 -49 -565 -685 -755 -1119 -791 175 439 -728 -1705 -1060 56 396 -304 -728 -710 -647 -367 105 459
1912 459 -71 -627 -476 35 317 450 598 341 -334 -469 565 1388 1020 -99 -401 416 1056 986 738 489
1932 489 199 163 529 1107 992 405 42 82 212 538 957 826 -54 -768 -328 698 972 108 -628 -721 -274
1953 -274 38 174 83 -521 -857 -762 -246 -78 -124 -356 -729 -1055 -754 -76 379 -126 -1124 -1254 -498 329 276
1974B76n66l89o3M36N01K20k81m12j04K03K81M01J95l05n95j94N53P81K0m99p03
1995b44o2P08O23j37n54m90J99K56K81N0r3l53m09k4N31M64r5o63n41M7M28O15
2017E37J06p40p97J28Q47M43m44m63j17O4qL02L82j33n64n10L60N54L55j31m69
2038b98n03n8P45P17k50q43n40O18P02j1k08k08q8k54N2O41M17l87o27j65L03
2059b45M30M07j01m53o97J37J025M71n98q06Q9M91K10m0P3R1n66m40N08P64O7
2080H17n90m37N0N1M01N41p2r39p39P83J069j68q47r9K40j20j55N15N58o90q39
2101f70N5P49K63k31r5j78o09K9R77O75r06j250K53J129J15n64K4K99m69n40N81
2122c63Q38j04r56k70M85K42J16L87nr17o47R18J222j51j279j79O40K62k71K42
$$ plain form
1974 276 -290 -679 -742 -306 195 415 134 -278 -382 -179 102 503 698 393 -202 -396 157 938 958 459 -244
1995 -244 -306 402 1025 888 334 -156 43 299 580 630 537 184 -225 -249 282 746 651 -12 -553 -506 -78 537
2017 537 643 -97 -894 -766 81 524 80 -383 -500 -436 -444 -142 240 107 -457 -967 -607 -53 302 171 -298
2038 -298 -801 -859 -114 603 353 -490 -1030 -412 290 279 71 -137 -225 -479 -427 214 631 244 -383 -548 -245
2059 -245 185 592 491 38 -659 -522 503 974 376 -430 -341 150 360 320 393 484 -82 -522 -14 750 817
2080 817 227 -210 -160 -109 292 833 761 -178 -917 -134 935 767 -80 -179 61 -59 -214 301 859 169 -670
2101 -670 -615 134 397 166 71 -107 -716 -687 290 965 59 -1191 -938 191 306 -258 -234 65 -404 -944 -363
2122 -363 475 371 -585 -855 -370 -128 -12 375 370 -547 -1194 -276 946 795 -484 -663 -23 239 -32 210
2142B10M92m36p34K13R83K20o31k90M1j17KP75O48q78j332K61J304M22q97m39
2162a83M15l2m34K11Q33k06j079l03Q44M05l21j54J60n57p49O27J410k11j472
2181g96n20J128N37n64l62M91o1p35L6J142M18j108o19M97L85k12K93P82n10j345
2201a123j5J610O44j199p71P12N98m68j50P17L3j153k07J123P41n82o32K82j6
2220A44o31L25J302j8j459p28J218J063p12r54L87L84n76q2J003L57j060j008
2238a045O30Q11k78j77N25j35j091j85J497O68j378j140P75J181l05o47L19K55
2256B80q08m98J074J020o40r86J90M64m03j34R50L38j338p69J206J435q13j496
2274i28K28R03j06l21N25O67j009j070O14J185k61p42K72M46o29m27R83Q49j104
$$ plain form
2142 210 702 266 -468 -255 728 948 317 27 68 -49 -47 728 1376 498 -834 -573 731 1153 256 -183
2162 -183 232 200 -234 -23 810 604 -475 -778 66 471 150 -4 156 -401 -1150 -523 887 676 -796
2181 -796 -1316 -188 349 -215 -577 -86 -147 -882 -846 296 714 -394 -1013 -516 -131 -343 -50 732 222 -1123
2201 -1123 -1138 472 1116 -83 -854 -142 456 -12 -162 555 588 -565 -772 351 1092 510 -122 160 144
2220 144 -487 -162 1140 1122 -337 -1065 153 1216 504 -450 -63 321 -255 -337 666 1023 -37 -1045
2238 -1045 -415 396 118 -59 466 331 -760 -945 552 1220 -158 -1298 -523 658 353 -294 25 280
2256 280 -528 -1026 48 1068 428 -558 -368 96 -307 -441 509 847 -491 -1260 -54 1381 568 -928
2274 -928 -700 203 97 -224 301 968 -41 -1111 -497 688 427 -315 -43 403 -226 -653 330 1179 75
2293G5j474P83J551N6j162n5M33l34o51P74J178n94j138J33Q50m9o84M97M60o78
2313b9r38J023J509o40j835q7J286K28n59J18O79n69j132M39J192p2j192k3Q67
2332B65p0p55N56Q40r45j492N27J879L02j473n58O72J07o71L21J081l48j183J15
2351h30J180J91r38j93O84k91o03N90J432k90j800m37J389Q78p67l11O04k2q22
2370c56J31J065J34j229k80J043M08n58j38O38m20j303K10J695N67j449q98P52
2388A2P02o26k87N87K6r87n4J192L90j169p23N52M18p00K47J122l2j652p04J355
2408c31J112q50r02N16M67l85k73Q24J90j181m70J150R04o59n15N35Q1r81q8J497
2428F41O28j215j094Q46J173m59p42K64L52n44j69J056N90j078r64N63P48k77
$$ plain form
2293 75 -1399 -616 935 991 -171 -226 207 -127 -778 -4 1174 580 -558 -425 425 376 -308 189 649 -29
2313 -29 -967 56 1565 925 -910 -997 289 517 -42 76 755 186 -946 -507 685 613 -579 -602 265
2332 265 195 -560 -4 836 -109 -1601 -1074 805 1107 -366 -924 -252 -145 -816 -495 586 238 -945 -830
2351 -830 350 541 -397 -590 94 -197 -800 -210 1222 932 -868 -1305 84 962 195 -116 488 466 -356
2370 -356 -225 840 974 -255 -535 508 916 358 220 858 438 -865 -655 1040 1607 158 -740 12
2388 12 714 88 -199 388 414 -573 -627 565 955 -214 -937 -385 33 -667 -420 702 670 -982 -1686 -331
2408 -331 781 -69 -971 -455 12 -373 -646 178 368 -813 -1283 -133 771 112 -403 132 213 -768 -856 641
2428 641 1269 54 -1040 -194 979 520 -222 42 394 -150 -319 737 1327 249 -715 -152 596 319
2446C19l12P24K26j152p69J082J147p34j317K46R46%m58K52J85p43p19R26J040
2465H89m79r25J80L83m54m81J009P43q90j235O06J417j71j043k81O69j01j75O74
2484C35N74p86j082M22J053q4p07L43M87o74o69P56J165o54j352N9J248L59o69
2503A24j12J93m33m87O24J058m31j071J1P89r8n64L17O35n06j083M96J384j8j255
2523d27m97P07L98j80J86L77n41q00K54R81J44q26q8N16p6n10L54Q85l20j266
2543g29j69J255O07o01n74K09Mk30K85O53k07r74r2Q84K01n45k04L55j9p67J80
2564d78J135J86j187p04N84P92j37k46R9j48o35K17Q52J57q51m60O42L04k93j03
2584b74N96j12r52j95J097P73o49p97J31M38RJ00K99j09q14l0Q48N33o17m90K90
$$ plain form
2446 319 7 731 957 -195 -964 118 1265 531 -786 -540 406 406 -52 200 385 -358 -1077 -151 889
2465 889 410 -515 -335 48 -406 -887 122 865 -25 -1260 -654 763 592 -451 -732 -63 -164 -339 335
2484 335 909 123 -959 -537 516 432 -275 68 555 -119 -788 -32 1133 479 -873 -814 434 793 124
2503 124 12 205 -228 -715 -91 967 536 -535 -524 265 167 -397 -80 555 49 -1034 -538 846 828 -427
2523 -427 -924 -217 181 1 187 564 23 -777 -523 458 602 -224 -312 204 128 -382 -28 857 537 -729
2543 -729 -898 357 964 363 -211 -2 2 -228 57 710 503 -471 -563 321 522 -23 -227 128 109 -658 -478
2564 -478 657 843 -344 -1048 -464 328 191 -55 44 -104 -739 -522 330 487 -364 -824 -182 122 -171 -274
2584 -274 322 210 -742 -937 160 933 284 -513 -382 56 65 165 464 355 -459 -489 359 892 275 -215 75
2605G5J68l62L7Q06J78q91p78O07R08j07n17j32Lj55J23N86N2p85m86M44N84j85
2627A73l33J78K9n70j16P25O07n47q32l5O79K42q2q4k32l94m8P53L43l89n42K0
2649d55M54j26P3K79J76o25m56M32P93J17p24l17J98K13K14K35r0n57l48N03O49
2670F38j81m44q0R9r7j13L78N36m30p89l2O65M15k90k93k91l5J40M94K52m87o37
2692e82J36N35P8j11j8M7l14k29K80O27Oo43l26J57M15K81K3l47n44L9N07M25
2714D42p3m42k59J62J11J79J20Q9l31l79J4N19L92k15l99m21J36M48L91j42m66
2735a24l38J80L82J77l8l06k06O7O6K08K69n3m51k81J14N20M02k71m83l24K38
2756b52N26J87j89l74k40K22K74J98Ok23j79j81J55L31K44q8n40l69L50N94J80
$$ plain form
2605 75 243 -119 -82 724 902 11 -767 -160 748 641 124 -8 -5 -160 -37 549 601 -184 -670 -226 358 173
2627 173 -160 18 47 -523 -639 86 693 146 -686 -721 -42 200 118 34 -198 -592 -640 113 456 67 -475 -455
2649 -455 -1 -127 -54 225 401 -224 -680 -248 545 662 -62 -379 -181 32 246 481 391 -166 -514 -11 638
2670 638 457 13 -67 32 -65 -178 200 736 306 -483 -515 150 565 275 -18 -309 -344 -204 290 542 55 -582
2692 -582 -446 89 167 56 38 85 -229 -458 -178 449 455 -188 -514 -357 58 339 362 15 -529 -490 17 442
2714 442 369 -73 -332 -170 -59 120 240 329 -2 -381 -367 152 544 329 -70 -491 -355 93 484 342 -124
2735 -124 -462 -282 100 277 239 -67 -273 -206 -140 68 337 284 -167 -448 -334 186 588 317 -166 -490 -252
2756 -252 274 461 272 -102 -342 -120 154 352 358 135 -44 -225 -70 261 505 417 -123 -492 -142 452 632
2777F32l50n91q1L38L34Q2j92l07j39J3K59J82Jk29k58j34J11M19K27k04o42k50
2799g79N04N55J0n22l42J48J72K21J75l7l78k26J85L00J37p2o3k54k14K27O37
2820C84K38n76n48J01N72L73k58j45k10r0P2L80L20l22m11m3K07J03J52J63j47
2841C15n46k87O07O64j99p74j74L31J77N7P8m0m22k81L10M95j5l65j04k1n3j3
2863b60N27K43o22o83J78Q52L20n14l47L5R6M3L30K17m17m19Q4M32K45k35l9P1
2885A37l28k83M60P69k30q81k31N56N10j96k17J1k40j51L76M96o9o69j96L41J84
2906A49j75J77K92m33p24K60Q63L15p78n70L85L15m0R3J85l63n40J60O64K94o16
2927h7j49J51j8l19L50O83q8r80l46Q37O54l53o00Q7J91k06K47N30j69p17k35
$$ plain form
2777 632 282 -309 -390 -52 282 364 172 -135 -274 -261 -2 180 181 -48 -306 -440 -329 90 317 113 -529 -779
2799 -779 -275 280 290 -232 -574 -426 -254 -33 142 105 -273 -499 -314 -14 123 51 -12 -266 -480 -253 384
2820 384 622 46 -502 -401 171 544 286 141 -69 -159 -87 293 613 291 -120 -163 44 147 299 462 315
2841 315 -231 -518 89 753 554 -220 -394 -63 114 171 249 209 -213 -494 -184 311 296 -69 -173 -194 -247 -260
2863 -260 267 510 -112 -795 -617 235 555 41 -306 -271 -175 -132 198 415 -2 -421 -337 95 340 105 66 137
2885 137 -191 -474 -14 755 525 -356 -587 -31 479 283 66 77 -163 -314 62 558 489 -180 -376 -35 149
2906 149 -26 151 443 10 -714 -454 409 724 -54 -624 -239 76 36 129 314 -49 -589 -429 235 529 -87
2927 -87 -236 -85 -103 -422 -72 611 523 -457 -803 34 688 335 -265 -178 13 -193 54 584 415 -302 -537
2948e37N69L92l09j62L36r9p53J44R25K78r28o08M15O62n5l35Q5m0m74J4Q25K46
2970E91o04o24L59K80j44p4N78Rq68l29Q17P32m24q16J66M46Oo2M01l8o55l70
2992f23O74O01l69m41K44J80l90j58O75M25q22p45M99R25q0o85r1K08k79n4O09
3013C03M20q01n67L70O39l20l76K98L09o32m05P74Q03n49j090M0Q52J77k94M6
3033cR6m76l52O02P04l00q23K55N71j83l97M53M48o11q48N34J099Lq94k78M09
3054IJ19j56L38L98m52q03L84Q87j82p21J06M44k42m88M70Q05m11j121j37J069
3074C16L36n45j98K44k28m01L87O54k77r42K6Q94J43n91q7N02l16p22K70J113
3094E78J74j106m49O13L16k99O9M21l08o38K32R15O0r39k07O25J52l94J05O57
$$ plain form
2948 -537 32 424 115 -47 289 190 -563 -419 506 784 -144 -752 -337 325 270 -65 20 -20 -494 -480 345 591
2970 591 -13 -637 -278 2 -142 -216 362 371 -497 -826 -9 723 299 -517 -351 95 101 39 440 402 -253 -623
2992 -623 51 652 283 -158 86 266 -124 -282 393 818 -4 -749 -250 675 595 -90 -181 27 -252 -306 303
3013 303 723 -78 -645 -275 364 44 -332 -34 275 -357 -762 12 815 266 -824 -784 68 245 -49 -3
3033 -3 93 -383 -735 -133 571 271 -552 -297 274 91 -306 147 595 -16 -864 -330 769 772 -122 -400 9
3054 9 128 -28 310 708 256 -547 -163 724 542 -179 -73 371 129 -359 111 916 505 -616 -753 316
3074 316 652 107 -91 153 -75 -476 -89 565 288 -654 -628 266 409 -182 -269 233 -83 -805 -535 578
3094 578 752 -354 -803 -190 126 -173 -104 317 9 -629 -397 518 578 -361 -568 57 209 -185 -80 577
3114E77j17j081k12J100N50o15n72L65K33l80O4N98j80r04o0R32M64o91m60M53
3134F4Q4o40K9R52L18j016n72N85O67k86l97K18R5m30M1Q09J75r66m78N93O27
3155D72l31l60N64R7p79l48Q86O70n79p60K27N81j29j93L06m6p08j56Q96N94o64
3176B40p63L55L97l74j91N81M11p68o92O11Q45l02p08M8L08j40%M69K33q79n73
3197h92O13P60k07o15K15L56l72n22O47P11n47q13K31P75J18m63M9L5l89k28P51
3218B13O80o18q34L37N73r4m11K65M01m68n89M28Q73k03r39q2N43R7j05K00K08
3239D75o36n91N04Q27j64q04k8N92n6m19J86N17k68q05P7Q51K97n78l55K39j06
3260b45j05M23N80m39q54J01Q84J35o39j19M50m5n17K80P05p9p80l21O32L74k18
$$ plain form
3114 577 460 -621 -833 267 817 202 -370 -5 228 -152 -88 510 330 -574 -634 298 762 71 -389 64
3134 64 148 -492 -463 489 807 -209 -781 -196 471 185 -212 6 101 -329 -288 521 696 -270 -748 -155 472
3155 472 141 -219 345 442 -337 -685 201 871 292 -468 -241 340 211 18 324 278 -430 -586 310 904 240
3176 240 -523 -168 229 -145 -336 245 656 -112 -804 -193 652 350 -358 -310 -2 -142 -142 327 560 -319 -892
3197 -892 -279 481 274 -341 -126 230 -142 -664 -17 694 147 -666 -435 340 458 -5 44 79 -310 -538 213
3218 213 893 275 -559 -222 351 257 -154 111 512 44 -545 -117 756 553 -386 -468 75 172 67 267 475
3239 475 -161 -752 -248 579 415 -389 -417 175 119 -300 -114 403 135 -670 -593 258 555 -23 -378 -139 -245
3260 -245 -350 73 653 214 -640 -539 345 480 -159 -278 172 127 -390 -110 595 516 -264 -585 47 421 203
3281B03k3J66l89l92K15Q42q1q78j67O55K60l92j71M34q2p26M5P89K67o25m78
3302e28K27K70j34K05L03l46o51L5Q65K39o44l59M07J85k71k1N63J9o57m08N91
3323a10N75k23l25N5l0k23K10O34j05o62k63O06N13l78m24K76Q7l54r9N80M20
3344G60n97n55J93M22L4j27rq6m49K0O74L02n50o21L31M26j04k23J26R4m13j87
3366e39L69N14j27n31r0K08N9J39K40m8o01k32O32N13k34n60N0L57j50o0K63K64
3388D36k77n06J88M61J55k38j80o5j06N8N02L01o06n11J39O35Q4l70j33J33k08
3409a08k47L43M30j41n40p5J32K45M2K0p8m88o5M37N07k99o04M0K07K53j87K9
3431a47K09k57k90K07L78J38l14j77%QK02L16L0l72m46J90N80K16l94k23R8L9
$$ plain form
3281 203 180 346 -43 -435 -220 622 541 -337 -504 151 411 19 -152 282 200 -526 -481 308 575 -50 -528
3302 -528 -301 -31 -165 40 343 -3 -654 -619 246 485 -159 -518 -111 74 -197 -218 345 364 -293 -701 -110
3323 -110 465 242 -83 -28 -58 -281 -71 563 458 -204 -467 139 652 274 -150 126 213 -141 -240 340 760
3344 760 163 -392 -199 223 257 130 121 35 -414 -394 280 582 32 -589 -258 168 64 -159 -33 61 -352 -539
3366 -539 -170 344 217 -314 -404 -196 -137 2 242 194 -407 -639 -7 506 272 -288 -238 119 -31 -91 172 436
3388 436 159 -347 -159 302 457 219 39 -26 -132 -74 428 729 123 -388 -249 386 470 100 -33 100 -108
3409 -108 -355 -12 418 277 -263 -338 -206 39 81 101 23 -465 -530 -93 414 115 -489 -449 -242 11 -176 -147
3431 -147 62 -195 -485 -278 100 238 -76 -253 -253 -245 -43 273 303 -69 -515 -325 255 471 77 -146 -48 -9
3453iK2K02J37j00l75j39K98L01l2j11j38k52P8L49L03k25n01j55L62L35j33j54
3475F3j06m2j64J80K77P4k00l47RJ77K38J13j46l80j45K46L86J24l95l46J02L48
3497F6N4K4k5j39k13K0K26J65J22k78k40k6J96K92J58l41l57n8L95L40r4k83j72
3520a68N3Q1K03L5j09j46j27l5K45J92L3k74k76o2K80L82k0l72k47J7M03J47j12
3543A23k08j83Q3J43J44P2J5k01k38KL35K38n4l34k38N1M39J71j66k11k20Q4K51
3566I8K33q9k83o1N6m8O2K35N4l38k46P3M53J63k03l46j40R0K94K05j25l24j71
3589c58J32K69R0j27n0m1j71j4K70L46k17m14j13K56L62J6j96j78o8NM33J62j96
3612A98m39J8K64P2m9J05J33l26l04K02N67P0m02k70k2K70Q8J08o2l74k29K59
$$ plain form
3453 -9 13 215 352 252 -123 -262 36 337 305 194 56 -196 -118 231 534 309 -192 -347 15 350 217 63
3475 63 -43 -85 -249 -69 208 282 82 -265 -256 -79 159 272 126 -254 -399 -153 233 357 -38 -384 -282 66
3497 66 120 144 119 -20 -233 -213 13 178 300 22 -218 -244 -48 244 402 61 -296 -354 41 381 287 4 -168
3520 -168 -115 -34 169 204 95 -51 -178 -213 32 224 257 -17 -293 -355 -75 307 287 -85 -332 -315 88 235 123
3543 123 -85 -268 -185 -42 102 174 189 -12 -250 -248 87 325 271 -63 -301 -250 189 360 194 -17 -237 -153 98
3566 98 331 242 -41 -102 -46 -94 -32 203 257 -81 -327 -254 199 362 159 -187 -327 -237 57 262 137 -187 -358
3589 -358 -226 43 133 6 -44 -85 -256 -270 0 346 129 -285 -398 -142 220 236 40 -138 -206 -201 232 394 198
3612 198 -241 -223 41 113 64 169 302 -24 -328 -126 441 511 109 -161 -183 87 175 283 221 -153 -382 -123
3634a23N09p1k81k07J30L3q4J44K44j76m80j07M03L76k34k00j74P0K6K62J78j79
3656E9m67j9N16J32k59r9P5k4k64J38N45M3n33l11L74K38K9q0mj73j95J92N72
$$ plain form
3634 -123 386 315 34 -173 -43 -10 -94 50 294 118 -362 -469 -66 310 76 -124 -298 -228 -202 60 238 59
3656 59 -408 -427 89 221 -38 -137 -62 -86 -350 -212 333 376 -157 -468 -94 144 173 93 89 -84 -279 -87 485
$$ [...]
8191A
##END NTUPLES=NMR FID
##END=
