##TITLE=1H_AM A490
 CDCl3, 8 sc, 
 2.7.2019
##JCAMPDX= 6.0         $$ Bruker NMR JCAMP-DX V2.0
##DATA TYPE= NMR FID
##DATA CLASS= NTUPLES
##ORIGIN= UXNMR, Bruker Analytische Messtechnik GmbH
##OWNER= root
$$ XWIN-NMR		Version 3.5
$$ Tue Jul  2 15:44:28 2019 Russian Standard Time (UT+4h)  she@DPX200
##.OBSERVE FREQUENCY= 200.13155
##.OBSERVE NUCLEUS= ^1H
##.DELAY= (6, 6)
##.ACQUISITION MODE= SIMULTANEOUS
##.ACQUISITION SCHEME= undefined
##.AVERAGES= 8
##.DIGITISER RES= 18
##SPECTROMETER/DATA SYSTEM= spect
##.PULSE SEQUENCE= zg30
##.SOLVENT NAME= D2O
##.SHIFT REFERENCE= (INTERNAL, D2O, 0, 15.7039)
##AUDIT TRAIL= $$ (NUMBER, WHEN, WHO, WHERE, WHAT)
$$ ##TITLE= Audit trail, XWIN-NMR		Version 3.5
$$ ##JCAMPDX= 5.01
$$ ##ORIGIN= Bruker BioSpin GmbH
$$ ##OWNER= she
$$ F:/spectra/data/she/nmr/H-F/1/audita.txt
$$ ##AUDIT TRAIL=  $$ (NUMBER, WHEN, WHO, WHERE, WHAT)
(   1,<2019-07-02 15:43:35.57 +0400>,<she>,<DPX200>,
      <created by zg, POWCHK disabled, PULCHK disabled
       configuration hash MD5:
       00 E9 B6 7A A2 85 ED C7 34 08 36 98 17 FE 4E 26
       data hash MD5: 16K
       C9 43 6A FF 90 D0 B6 35 6E 39 83 DF 7A 81 43 62>)
$$ ##END=
$$ 
$$ hash MD5
$$ A6 10 82 15 E9 07 53 8F 09 EF 2B 4F CE 4A 8D 7A
##$RELAX= 
##$RELAX= 
##$RELAX= 
##$RELAX= 
##$RELAX= 
##$RELAX= 
$$ Bruker specific parameters
$$ --------------------------
##$DU= <F:/spectra>
##$EXPNO= 1
##$NAME= <H-F>
##$PROCNO= 1
##$TYPE= <nmr>
##$USER= <she>
##$AMP= (0..31)
100 100 100 100 100 100 100 100 100 100 100 100 100 100 100 100 100 100 
100 100 100 100 100 100 100 100 100 100 100 100 100 100 
##$AQSEQ= 0
##$AQ_mod= 1
##$AUNM= <au_zg>
##$AUTOPOS= <>
##$BF1= 200.13
##$BF2= 200.13
##$BF3= 200.13
##$BF4= 200.13
##$BF5= 200.13
##$BF6= 200.13
##$BF7= 200.13
##$BF8= 200.13
##$BYTORDA= 1
##$CFDGTYP= 0
##$CFRGTYP= 5
##$CHEMSTR= <none>
##$CNST= (0..31)
1 1 145 1 1 1 1 1 1 1 1 1 1 1 1 1 1 1 1 1 1 1 1 1 1 1 1 1 1 1 1 1 
##$CPDPRG= <>
##$CPDPRG1= <>
##$CPDPRG2= <>
##$CPDPRG3= <>
##$CPDPRG4= <mlev>
##$CPDPRG5= <mlev>
##$CPDPRG6= <mlev>
##$CPDPRG7= <mlev>
##$CPDPRG8= <mlev>
##$CPDPRGB= <>
##$CPDPRGT= <>
##$D= (0..31)
0 1.2 0 0 0 0 0 0 0 0 0 0.03 0 0 0 0 0 0 0 0 0 0 0 0 0 0 0 0 0 0 0 0 
##$DATE= 1562067814
##$DBL= (0..7)
120 120 120 120 120 120 120 120 
##$DBP= (0..7)
150 150 150 150 150 150 150 150 
##$DBP07= 0
##$DBPNAM0= <>
##$DBPNAM1= <>
##$DBPNAM2= <>
##$DBPNAM3= <>
##$DBPNAM4= <>
##$DBPNAM5= <>
##$DBPNAM6= <>
##$DBPNAM7= <>
##$DBPOAL= (0..7)
0.5 0.5 0.5 0.5 0.5 0.5 0.5 0.5 
##$DBPOFFS= (0..7)
0 0 0 0 0 0 0 0 
##$DE= 6
##$DECBNUC= <off>
##$DECIM= 24
##$DECNUC= <off>
##$DECSTAT= 4
##$DIGMOD= 1
##$DIGTYP= 9
##$DL= (0..7)
0 120 120 120 120 120 120 120 
##$DP= (0..7)
150 150 150 150 150 150 150 150 
##$DP07= 0
##$DPNAME0= <>
##$DPNAME1= <>
##$DPNAME2= <>
##$DPNAME3= <>
##$DPNAME4= <>
##$DPNAME5= <>
##$DPNAME6= <>
##$DPNAME7= <>
##$DPOAL= (0..7)
0.5 0.5 0.5 0.5 0.5 0.5 0.5 0.5 
##$DPOFFS= (0..7)
0 0 0 0 0 0 0 0 
##$DQDMODE= 0
##$DR= 18
##$DS= 0
##$DSLIST= <SSSSSSSSSSSSSSS>
##$DSPFIRM= 0
$$ [...]
##$SUBNAM2= <"">
##$SUBNAM3= <"">
##$SUBNAM4= <"">
##$SUBNAM5= <"">
##$SUBNAM6= <"">
##$SUBNAM7= <"">
##$SUBNAM8= <"">
##$SUBNAM9= <"">
##$SW= 24.9336996594482
##$SWIBOX= (0..15)
0 0 2 0 0 0 0 0 0 0 0 0 0 0 0 0 
##$SW_h= 4990.01996007984
##$TD= 16384
##$TD0= 1
##$TE= 0
##$TE2= 300
##$TE3= 300
##$TEG= 300
##$TL= (0..7)
0 120 120 120 120 120 120 120 
##$TP= (0..7)
150 150 150 150 150 150 150 150 
##$TP07= 0
##$TPNAME0= <>
##$TPNAME1= <>
##$TPNAME2= <>
##$TPNAME3= <>
##$TPNAME4= <>
##$TPNAME5= <>
##$TPNAME6= <>
##$TPNAME7= <>
##$TPOAL= (0..7)
0.5 0.5 0.5 0.5 0.5 0.5 0.5 0.5 
##$TPOFFS= (0..7)
0 0 0 0 0 0 0 0 
##$TUNHIN= 0
##$TUNHOUT= 0
##$TUNXOUT= 0
##$USERA1= <user>
##$USERA2= <user>
##$USERA3= <user>
##$USERA4= <user>
##$USERA5= <user>
##$V9= 5
##$VALIST= <valist>
##$VCLIST= <CCCCCCCCCCCCCCC>
##$VD= 0
##$VDLIST= <DDDDDDDDDDDDDDD>
##$VPLIST= <PPPPPPPPPPPPPPP>
##$VTLIST= <TTTTTTTTTTTTTTT>
##$WBST= 1024
##$WBSW= 4
##$XGAIN= (0..3)
0 0 0 0 
##$XL= 0
##$YL= 0
##$YMAX_a= 66000
##$YMIN_a= -62778
##$ZGOPTNS= <>
##$ZL1= 120
##$ZL2= 120
##$ZL3= 120
##$ZL4= 120
##$ABSF1= 10
##$ABSF2= 0
##$ABSG= 5
##$ABSL= 3
##$ALPHA= 0
##$AQORDER= 0
##$ASSFAC= 0
##$ASSFACI= 0
##$ASSFACX= 0
##$ASSWID= 0
##$AUNMP= <proc_1d>
##$AZFE= 0.1
##$AZFW= 0.1
##$BCFW= 1
##$BC_mod= 2
##$BYTORDP= 1
##$COROFFS= 0
##$CY= 11.3945322036743
##$DATMOD= 1
##$DC= 2
##$DFILT= <>
##$DTYPP= 0
##$F1P= 18.9103706918063
##$F2P= -1.10871071338519
##$FCOR= 0.5
##$FTSIZE= 0
##$FT_mod= 4
##$GAMMA= 1
##$GB= 0.15
##$INTBC= 1
##$INTSCL= 1
##$ISEN= 128
##$LB= 0.24
##$LEV0= 0
##$LPBIN= 0
##$MAXI= 10000
##$MC2= 0
##$MEAN= 0
##$ME_mod= 0
##$MI= 1.114404
##$NCOEF= 0
##$NC_proc= 0
##$NLEV= 6
##$NOISF1= 3.799351
##$NOISF2= 2.8
##$NSP= 1
##$NTH_PI= 0
##$NZP= 0
##$OFFSET= 15.70392
##$PC= 1
##$PHC0= -8657.822
##$PHC1= 15.40097
##$PH_mod= 1
##$PKNL= yes
##$PPARMOD= 0
##$PSCAL= 0
##$PSIGN= 0
##$REVERSE= no
##$SF= 200.130013532006
##$SI= 16384
##$SIGF1= 3
##$SIGF2= 2
##$SINO= 400
##$SIOLD= 16384
##$SREGLST= <1H.CDCl3>
##$SSB= 0
##$STSI= 0
##$STSR= 0
##$SW_p= 3612.71676300578
##$SYMM= 0
##$S_DEV= 0
##$TDeff= 0
##$TDoff= 0
##$TI= <>
##$TILT= no
##$TM1= 0
##$TM2= 0
##$TOPLEV= 0
##$USERP1= <user>
##$USERP2= <user>
##$USERP3= <user>
##$USERP4= <user>
##$USERP5= <user>
##$WDW= 1
##$XDIM= 8192
##$YMAX_p= 0
##$YMIN_p= 0
$$ End of Bruker specific parameters
$$ ---------------------------------
##NTUPLES= NMR FID
##VAR_NAME=  TIME,          FID/REAL,        FID/IMAG
##SYMBOL=    X,             R,               I
##VAR_TYPE=  INDEPENDENT,   DEPENDENT,       DEPENDENT
##VAR_FORM=  AFFN,          ASDF,            ASDF
##VAR_DIM=   8192,          8192,            8192
##UNITS=     SECONDS,       ARBITRARY UNITS, ARBITRARY UNITS
##FACTOR=    0.0002004,     1,               1
##FIRST=     0,             0,               0
##LAST=      1.6414764,     0,               0
##MIN=       0,             -62778,          0
##MAX=       1.6414764,     66000,           0
$$ Real data points
##PAGE= N=1
##DATA TABLE= (X++(R..R)), XYDATA
0@%%%%%%%%%%lJ1j6J6j6J6k4L2l2M0m8N6o4P2q4R4j07J22j39J57j79K02k26K54
34A34k83L14l51L91m33M81n33N89o52P23q00Q87r84J096j225J370j543J750j996
53a065K304k704L239m000N179p267J2076m3509j2615Q0830J6970k8660n5079k3051
67e7352J2498N0045M0975m275n5992m4779J0045N6148M2607l021m4923m5723p813
80e1560M4854N6673J3375m5140n4826j2242L8341N0532K0758k7732n3057k9474
92d9498K6924N7520K9126k7914n3242k8168J7604M4830L6014m696m7069m9805
104d8374j367N1901N1944k183n1388m7318j005M0522M3644R628l3641m9477j9352
117e6466L2379N4238K1839l2003n3081k4535K4202N0132L2619j5547n1886l9227
$$ plain form
0 0 0 0 0 0 0 0 0 0 0 0 -3 8 -8 8 -8 8 -16 16 -16 24 -24 32 -32 40 -44 50 -57 65 -74 83 -96 106 -120 134
34 134 -149 165 -186 205 -228 253 -280 309 -343 380 -420 467 -517 579 -646 724 -819 931 -1065
53 -1065 1239 -1465 1774 -2226 2953 -4314 7762 -35747 -48362 32468 49438 20778 -34301 -57352
67 -57352 -44854 5191 46166 41891 -14101 -58880 -48835 7313 49920 46899 1976 -43747 -51560
80 -51560 -6706 49967 63342 18202 -36624 -48866 -10525 40007 60765 33033 -20024 -49498
92 -49498 -22574 34946 64072 36158 -17084 -45252 -27648 17182 53196 48500 1431 -48374
104 -48374 -49741 2160 54104 51921 533 -46785 -47790 -7268 36376 46004 12363 -37114 -56466
117 -56466 -24087 30151 51990 19987 -33094 -57629 -33427 16705 49324 33777 -18109 -57336
129e7336J3769N3141L8903j1164m6361l8344K473M2665M6570M586m5568m9977
141d6643k543M4164M4187P099l0099m2484k2321K2311N3188L1450k7583n7659
153b6933k5426K9089M8306K3196j7216m2000l3420P543M6947M1065p983m8246
165e078l8964M652L9597L9521O392l5113m7140j2295L7209M8574J0733l4333m4076
178c0321j5432K5178M5283K5296k2459n1967k8984K4089N0011K6076j8284m1585
190a3099k9860N528L8445L9814Q95m3248m4833L38M4244M2169N18l7984m0693
203c7766q086L1667M4217J6055k9282m7120j9056K6943M5584K1708k0474m2887
215a8497k6949J4716M4425L2054j2407m4790l2352J0168M0856L4008k173l6997
$$ plain form
129 -57336 -43567 9574 48477 37313 -9048 -47392 -44919 -2254 44316 48902 3334 -46643
141 -46643 -49186 -5022 39165 46264 16165 -26319 -48640 -26329 26859 58309 30726 -26933
153 -26933 -52359 -23270 25036 48232 31016 -10984 -44404 -36861 10086 51151 43168 -5078
165 -5078 -44042 -39390 207 39728 46120 11007 -36133 -48428 -11219 37355 48088 13755 -30321
178 -30321 -45753 -20575 24708 50004 27545 -24422 -53406 -29317 20694 46770 28486 -13099
190 -13099 -42959 -37431 1014 40828 41723 -1525 -46358 -46020 -1776 40393 40911 2927 -37766
203 -37766 -45852 -14185 30032 46087 16805 -30315 -49371 -22428 23156 44864 24390 -18497
215 -18497 -45446 -30730 13695 45749 33342 -11448 -43800 -33632 7224 41232 39059 2062
227B062l9601m108L8244M3636M794l7160l9741o042K8613L6727J5360k0535m2189
240a9940k4398K1493M7780K4414k3357m4767k2950J6422L8852K8119p772l9451
252e555l5093M800M0270L5074l426l5867l4975l968L0962L9367R831l1885m2964
265c3429j1069L0316M0247J3373k3352l9288k1416J7852M3017K6188j7993m3929
277a9483k4930J6098L8129K5245p372l3497l1778p6L5518L8082J635l6690l7691
290c6810j927L3067L6157P439k7056l7259j2963K4917L9598J6092k2287l8125
302a9157j8341J7751L7387K3444j2852l8263k7440J0798L8580K8578p965l5302
314b782k9763J996L2061L3564L197l2278l6977m831L1291L5432N983k6566l3929
$$ plain form
227 2062 -37539 -41647 -3403 40233 45027 7867 -31874 -37916 -9303 27424 42784 22249 -19940
240 -19940 -44338 -22845 24935 49349 25992 -18775 -41725 -25303 13549 41668 33896 -5555
252 -5555 -40648 -35848 4422 39496 36070 203 -34772 -38740 -7778 31589 41420 9535 -33429
265 -33429 -44498 -14182 26065 39438 16086 -23202 -44618 -26766 16251 42439 24446 -19483
277 -19483 -44413 -28315 9814 35059 27687 -5810 -37588 -37664 -2146 35936 37571 881 -36810
290 -36810 -38737 -5670 30487 37926 10870 -26389 -39352 -14435 25163 41255 18968 -19157
302 -19157 -37498 -19747 17640 41084 28232 -10031 -37471 -26673 11907 40485 32520 -2782
314 -2782 -32545 -30549 1512 35076 38273 5995 -30982 -35813 -4522 30910 36893 10327 -23602
327b3602j2225K0013L5788J8856j8325l9756k2091J7689L9005K2003j4573l6262
339a3480k4661Q826L4479K8389n121l4190l0147K173L1449L1242K820k8228l3713
352c0162p510K6990L6222J0331k5126l5390j2267K1136L4737J7205j6313l5733
364a5880k1312J4937L7150K2650j2953l4175k2905Q081L0713K6424j505k9629
376A596l1043j894L0092L2986L562k8503l2835o656K5090L3023J0297k2248l3938
389b0471j3726J9103L3500J6444j5545l3302k0462J1621L3322K3454r315l3094
401h471k5327O125L1028K6735j909k9092k9516k159K8039L1608M575k6789l1634
414b6787o755K3490L1189J0455j9296l1240j4967J5923L2667J8949j3560l3333
$$ plain form
327 -23602 -35827 -15814 19974 38830 20505 -19251 -41342 -23653 15352 37355 22782 -13480
339 -13480 -38141 -29315 5164 33553 28432 -5758 -35905 -33732 -2283 28959 31779 3551 -30162
352 -30162 -37672 -10682 25540 35871 10745 -24645 -36912 -15776 18961 36166 19853 -15880
364 -15880 -37192 -22255 14895 37545 24592 -9583 -32488 -24407 6306 32730 31225 1596
376 1596 -29447 -31341 -1249 31737 35299 6796 -26039 -32695 -7605 25418 35715 13467 -20471
389 -20471 -34197 -15094 18406 34850 19305 -13997 -34459 -22838 10484 33938 24623 -8471
401 -8471 -33798 -27673 3355 30090 28181 -911 -30427 -32586 -4547 27061 31636 4847 -26787
414 -26787 -33542 -10052 21137 31592 12296 -18944 -33911 -17988 14679 33628 20068 -13265
426a3265k1120J1726L2893K2606q641l1042k4001N053K9182K6029j090k7128k7943
439b6741k540K5397K9644N926k3545l0558q972K1211L1123J1877j8266l1396j5183
452c2023J5458L1607J8127j2972l1714k0065J0391L0593K1479p235k8559k3383
464b8296L069K6591K5795Q91k5309k8163m359K4184K9983O834k3086l0534q767
477c1167K0661K9681J1242j6857k9361j5047J3309K9953J8344j1259l0010k0024
489c0535Q539K8466K1739m747k6958k4598J190K6391K6651J111k5333k7168l736
502b8988K2835K7894P166k0491k8921r736J8653K8630J1956j5080k7577j5493
514b9152J0918K8455J9826q812k9774k1232P995K8732K1416n050k5611k2786O12
$$ plain form
426 -13265 -34385 -22659 10234 32840 24199 -6843 -30844 -25791 3391 29420 28330 1202 -26741
439 -26741 -29281 -3884 25760 31686 8141 -22417 -31389 -10178 20945 32822 14556 -16840 -32023
452 -32023 -16565 15042 33169 20197 -11517 -31582 -21191 9402 30881 23646 -4913 -28296
464 -28296 -25227 1364 27159 28050 2741 -25422 -29781 -5597 24386 31220 8134 -22400 -31167
477 -31167 -10506 19175 30417 13560 -15801 -30848 -17539 12414 30758 19499 -10511 -30535
489 -30535 -21996 6470 28209 23462 -3496 -28094 -26904 -513 26138 27249 1916 -25252 -28988
502 -28988 -6153 21741 28907 8416 -20505 -30241 -11588 17042 28998 13918 -13659 -29152
514 -29152 -18234 10221 30047 21235 -8539 -29771 -21776 6956 28372 23322 -2289 -25075 -24463
527b4463K3899K5623K741k3390k6777m492K1326K6545P473j8172k7145j1415J5632
540a2615K8414J4059j4170k8778j5918J1705K7838J7824q769k7150k0310N837
552b2033K6371K1762l605k4896k2479K67K2060K3922M038k0270k6676p287K0223
565h603K8309Q269j9204k6986r559J5468K5887J3606j1474k6930j7146J0254K7892
578I783J7889q715k5268j8447M293K3022K2063Lk3703k4836r44K3595K4325K597
592B5657k0190k4141p204J7119K6814J0344j7447k7368j0259J5209K4418J2067
604B5019r759k3832j7626O623K6461K0424p249k6706j9426N343K2925K0011Q5
617B2293k0747k3707l349K1431K5111L781k0043k3505n886J6086K3687J0424j3577
$$ plain form
527 -24463 -564 25059 27800 4410 -22367 -26859 -5533 21012 28485 10313 -16832 -28247 -12615
540 -12615 15799 29858 15688 -13090 -29008 -17303 10535 28359 19590 -7560 -27870 -22033
552 -22033 4338 26100 22495 -2401 -24880 -24613 -2553 21369 25407 5137 -21539 -28826 -8603
565 -8603 19706 27975 8771 -18215 -27774 -12306 13581 27187 15713 -11217 -28363 -18109 9783
578 9783 27672 18957 -6311 -24758 -20465 2557 24620 24623 920 -23916 -24860 -1265 23060 25657
592 25657 5467 -18674 -25878 -8759 18055 28399 10952 -16416 -26675 -11466 12952 25019
604 25019 15260 -8572 -26198 -19575 6886 27310 20061 -6645 -26071 -20728 2197 22208 22293
617 22293 1546 -22161 -25510 -4079 21032 24813 4770 -18735 -24621 -8535 15152 25576 11999
630A1999k5801j3229J3094K6296J4063j0807k4599j5899O880K3800J9048m289
642B0556k4184k0691L188K3337K0369j217k0400k0874l246J7913K3622P119j7735
655G757k5998q346J7408K4947Q850j3843k3063j2208R752K3794J6135q524k5475
668h814j6823Q437K3765J6264m472k0534j9337m60K0910K3206J632k1622k2436
681b0284j875J8111K0833O248j4067k3416j0538J4741K5900J0179j5037k3300
693a2505r944R693K0812J5234m902k3196j9726N215K4839J8256n232k0948j7168
706a9572K71J7485K0652L966j8827k3560l894J8994K1973M857j4900k1145r733
719b3433J1376K3532J3302j1360k4572j3052J0228K1960J3546o134k0357j6950
$$ plain form
630 11999 -13802 -27031 -13937 12359 26422 15615 -8984 -24883 -18003 5797 24845 20556
642 20556 -3628 -24319 -21131 2206 22575 21358 958 -19916 -23162 -5249 18373 25492 7757
655 7757 -18241 -26587 -9179 15768 24618 10775 -12288 -24496 -14744 9050 25185 16661 -8814
668 -8814 -25637 -17200 6565 22829 18357 -2177 -21514 -21974 -1064 22142 23774 2152 -20284
681 -20284 -22159 -4048 16785 23033 8966 -14450 -24988 -10247 15653 25832 10795 -12505
693 -12505 -22449 -12756 8056 23290 18388 -4808 -24534 -19319 5520 23776 18544 -2404 -19572
706 -19572 -19301 -1816 18836 22802 3975 -19585 -23479 -4485 17488 22345 7445 -13700 -23433
719 -23433 -12057 11475 24777 13417 -11155 -24207 -13979 7981 21527 15393 -4964 -21914
731b1914K845K1629J9538k445k1857j9216J153J8756J9007L258j5571k1277p388
744b3482J5132K3541Q398j5307k2689p939J2731K0709J0536q787k1194j4544P243
757a5652K3165J6061o854k1791j5504L715J8393J7566J274j7836k1030k564J9234
770a823K0910J800j7185j8816m763J2906K0454R768j2414k3910j0671J3056K2236
783A1548R604r279j8584j3125L675J9363J7806l209k2381j7737M632K0198J5773
796A8284j405j6376j8200l862J6290K1936M934j7146k0821m647J3628J8535Q327
809A9477r248j9872j2467R127K2519J2680r717k0844j2005O456J8647J5158k006
822A7905j9174j8532J211J9937J8185r02j7049j6467k506J3253J8250O810j2966
$$ plain form
731 -21914 -19069 2560 22098 19653 -2204 -21420 -20267 -1511 17496 20754 5183 -16094 -23482
744 -23482 -8350 15191 23589 8282 -14407 -22346 -9615 11094 21630 12843 -8351 -22895 -15652
757 -15652 7513 23574 16720 -5071 -20575 -16860 1533 19099 20373 2537 -18493 -21057 -1823
770 -1823 19087 20887 3702 -15114 -19877 -6971 13483 23251 10837 -13073 -23744 -10688 11548
783 11548 21152 11873 -6711 -19836 -16161 3202 21008 17799 -4582 -22319 -17687 2511 18284
796 18284 16879 503 -17697 -21559 -5269 16667 21601 4455 -16366 -21013 -7385 11150 19477
809 19477 10229 -9643 -22110 -12983 9536 22216 12499 -8345 -20350 -13894 4753 19911 17905
822 17905 -1269 -19801 -18590 1347 19532 18630 1581 -14886 -17392 -4139 14111 20921 7955
835G955k1127q077J3907K1169P751j1853j9544j0045P765J9403J3693n928k0765
848e696j4820N720J9339J3694l429j6327j5108q66J5671J8585K644j7166j9705
861a7464k514J5927J8175M701j1835j8687r166J0269K1061J0521j1007k0276r166
874a9461Q892J7127J0876m210j6874j5406K273J9418J7170k962j8846j5633Q18
887a6818J5105J6540L769j3790j9411n329J4887J9306M544j3206j6924o471Q986
900h812J7471J0990p415k0088j2721P913J9663J2090n539j6860j3518J400J6275
913H49J6710N4j7622j7025O25J6315J5293J428j2754j6012n815J1060J8997Q157
927B0260j1737j9624q016J0138J7541R312o601j7173j2510M849J8574J3685n229
$$ plain form
835 7955 -13172 -21249 -7342 13827 21578 9725 -9819 -19864 -12099 7304 20997 15069 -5696
848 -5696 -20516 -14796 4543 18237 14808 -1519 -16627 -17493 -1822 16763 19407 2241 -17464
861 -17464 -19978 -4051 14124 18825 6990 -11697 -20863 -10594 10467 20988 9981 -10295 -19461
874 -19461 -10569 6558 17434 13224 -3650 -19056 -16783 2635 19805 16843 -2003 -17636 -16818
887 -16818 -1713 14827 18596 4806 -14605 -19934 -5047 14259 18803 5597 -11327 -17798 -8812
900 -8812 8659 19649 12234 -7854 -20575 -12662 7001 19091 13552 -3308 -16826 -15426 849
913 849 17559 17613 -9 -17034 -16409 -94 15199 16627 3873 -12139 -17954 -6894 12103 20260
927 20260 8523 -11101 -19117 -8979 8562 17874 11273 -5900 -18410 -13561 5013 18698 13469
940A3469j8226j2881L499J5361J3740N46j4174j6818l100J4829J8093L173j3911
953C600j6622m591J0683J6611Q133r204j8626r692R861J9048R106q458j6614j0056
967a6821M507J5563J3686j663j6701j5464J654J6562J4693l02j3937j4889k822
980a5934J2489J7142M992j3151j7988m874J2128J6428O150q838j5895r553O337
993a0567J7295J1511o203j7597j1296M950J5427J1948j800j4650j4781l14J5571
1006e06J6054J80j5283j5013j353J2150J4614M879r906j6589p307R820J7557P564
1020A6861r133j6204q379O546J5677J1054m393j6717j2789M262J6830J2614l137
1033A3092j4494j2641j00J2882J4828K605j2938j6141k941J2468J5438M170j0130
$$ plain form
940 13469 -4757 -17638 -14139 1222 14962 15508 1334 -15484 -18584 -3755 14338 17511 3600
953 3600 -13022 -17613 -6930 9681 17814 8610 -10016 -19708 -9847 9201 18307 9849 -6765 -16821
967 -16821 -12314 3249 16935 15272 -1429 -16893 -15239 1323 16016 15714 1777 -13112 -15934
980 -15934 -3445 13697 18689 5538 -12450 -17324 -5196 11232 17382 8544 -7351 -16904 -10567
993 -10567 6728 18239 12036 -5561 -16857 -11907 3520 15468 13668 -982 -15763 -16077 -506
1006 -506 15548 15728 445 -14568 -15921 -3771 10843 15722 5816 -10773 -18080 -8260 9297 16861
1020 16861 7728 -8476 -16855 -10309 5368 16422 12029 -4688 -17477 -13215 3615 16229 13092
1033 13092 -1402 -14043 -14143 -1261 13567 16172 3234 -12907 -15848 -3380 12058 16228 6098
1046F098j5275o990Q347J6776R102q252j7383r160P489J5560R396m410j4223j1790
1060a4715J902J4552J3431j156j4588j3638L8J2913J3884K335j1506j5420m545
1073a6513J1345J6266N039j0713j5331n931Q349J4658Q039o084j5311j0111N441
1086a0857J5671J0581m388j4464j1295K002J3588J3176P0j3825j4461o16J3611
1099a207J4138J506j1648j3804l778R773J4722O068q994j5527o992Q107J5175
1112G539P948o171j4635r859M378J4934J1281l390j4941j1692K494J3734J1867
1125A3487m83j2243j3053j565J1504J4118K944j1098j4111m105R401J4206O059
1138A5061p969j4782p842P131J5237Q580o323j4653r081M591J3612J0207k405
$$ plain form
1046 6098 -9177 -16167 -7820 8956 18058 9806 -7577 -16737 -9248 6312 15708 11298 -2925 -14715
1060 -14715 -12813 1739 15170 14014 -574 -14212 -14174 -1261 12623 14958 3452 -11968 -16513
1073 -16513 -5168 11098 16137 5424 -9907 -15838 -7489 7169 15208 9124 -6187 -16298 -10857
1086 -10857 4814 15395 11007 -3457 -14752 -12750 838 14014 14084 259 -14202 -14818 -1207
1099 -1207 12931 14437 2789 -11015 -14793 -5020 9702 15770 6776 -8751 -15743 -7636 7539
1112 7539 15487 9316 -5319 -15178 -10800 4134 15415 12025 -2916 -14608 -12114 1620 13487
1125 13487 13004 761 -12292 -13857 -2353 11765 14709 3611 -10500 -14605 -5204 9002 15061
1138 15061 7092 -7690 -15532 -8401 6836 15416 9093 -5560 -14641 -10050 3562 13769 11364
1151A1364j3091j1839R48J2881J2523K62j2039j2949j957J0852J3799L707j0186
1164D275j4592m802R585J4441N616q153j3902p025O250J3956Q750n030j3974r829
1178a4434L900J3412J0519j963j2617j1817K63J2456J2819Q90j2111j2968j773
1191a3424J0787J3055L368r223j3459m978Q184J3733O238o880j3584p570N441
1204h312J3500R131m208j3656j0005L235J3089J0612j822j2317j1394J87J1637
1217c23J2146R59j0774j2350k547R407J2684M338q394j3506n768P728J3596O651
1231A3847o575j3416p881N079J3449Q971m115j3235r584L079J2266R968j022j1288
1245d57j1281p07J0918J2420J826j0403j2543k998R235J2938M582q270j3356n582
$$ plain form
1151 11364 -1727 -13566 -12618 263 12786 13048 1009 -11940 -13897 -3045 10754 14461 4275
1164 4275 -10317 -15119 -5534 8907 14523 6370 -7532 -14557 -8307 5649 14399 9369 -4605 -14434
1178 -14434 -10534 2878 13397 11434 -1183 -13000 -12737 -281 12538 13428 1317 -11651 -13424
1191 -13424 -2637 10418 13786 4563 -8896 -13874 -5690 8043 14281 7401 -6183 -13753 -8312
1204 -8312 5188 14319 10111 -3545 -13550 -10315 2774 13386 11564 -753 -12147 -11960 -323
1217 -323 11823 12782 2008 -10342 -12889 -3482 9202 13540 5146 -8360 -14128 -6400 7196 13847
1231 13847 7272 -6144 -14025 -8946 4503 13474 9359 -3876 -13460 -10381 1885 11853 10831 -457
1245 -457 -11738 -12445 -1527 10893 12719 2316 -10227 -13225 -3990 8948 13530 5260 -8096 -13678
1259a3678P556J3213O435o219j2707p323M467J2356Q784l079j2166r759J725J1704
1273A309J0731m51j1121j1539r67J0754J1937J959r944j2272l099Q899J2385M160
1287A2741p848j2210n421O227J2060O941m671j2326q599L881J2665R190l193j1997
1301b560r553J576J1182J0667J13j1174j1487m86J0665J1023J534q625j1079l909
1315a2113P302J2484N521p225j2867n826O502J1925O765m389j1949q674L454J2703
1329C613R216l454j1912q695J759R956R604P65r518j1353j978R681J1676K257
1343A1617q698j1139l933P017J1933N678o670j2742o139O350J2082O412m729j1085
1357d046p474K739J0902R086j622j0973r569P68J0237J0095P06r377j0810k139
$$ plain form
1259 -13678 -6122 7091 13526 7307 -5400 -12723 -8256 4100 12884 9805 -2361 -12120 -10395 1309
1273 1309 12040 11589 468 -11071 -12038 -1284 10653 12612 2668 -9604 -12703 -3804 8581 12741
1287 12741 4893 -7317 -12738 -6511 5549 12490 7819 -4507 -13106 -9225 3440 12630 9437 -2560
1301 -2560 -12113 -10537 645 11312 11425 251 -11236 -11722 -1057 9966 11500 2875 -8204 -12113
1315 -12113 -4811 7673 13194 5969 -6898 -12724 -6222 5703 12468 8079 -3870 -12544 -9090 3613
1329 3613 12829 9375 -2537 -11232 -9473 483 10087 10852 1334 -10019 -11997 -2316 9360 11617
1343 11617 2919 -8220 -12153 -5136 6797 12475 5805 -6937 -13076 -6726 5356 11768 7039 -4046
1357 -4046 -11520 -8781 2121 11207 9585 -1388 -10957 -10189 48 10143 10849 1472 -9338 -11477
1371a1477R021J1663L075q623j1721l656P689J1272M529n951j0917o127M367J1264
1385D408P551l675j1576q165K969J0884Q429j260j0094r938l22J0252J0909N44
1399A0916j0181j0273j109Q213R701L265o532j1001n060O491J1892N203o168j0932
1413e575n660M016J0424Q004k560j1454r176K920J1588Q283k118r454q284l86
1427i432Q278J0166K137q883j1033j987Q555J0173K920o262j0271n386N251J1763
1441E989O473n800j1696n961M848J0056O431k506r666q399J211J0299R118j079
1455I318r885r040j18Q241R562K211p654j0848l436P812J1152L327p173j0317
1469f848l926N556R774N632m060j0490o934L685J0791P331k953r844p615J129
$$ plain form
1371 -11477 -2456 9207 12282 3659 -8062 -11718 -4029 7243 11772 5821 -5096 -11223 -6856 4408
1385 4408 11959 8284 -3292 -11457 -8488 2396 10825 9565 -529 -10467 -10789 -537 10372 10916
1399 10916 735 -9538 -10647 -2434 7267 10532 4000 -7001 -12061 -5570 6322 11525 5357 -5575
1413 -5575 -11235 -7219 3205 11209 8649 -2805 -11981 -9061 2527 10810 8692 -762 -9046 -9432
1427 -9432 -1154 9012 11149 2266 -8767 -10754 -2199 7974 10894 4632 -5639 -11025 -5774 5989
1441 5989 12462 6662 -5034 -10995 -6147 3909 10340 7834 -1832 -10231 -9020 1279 10397 9318
1455 9318 -567 -9607 -9725 -1484 8078 10289 2635 -8213 -11649 -3837 7315 10642 3469 -6848
1469 -6848 -10774 -5218 4556 10188 6128 -4362 -11296 -7611 3180 10511 7558 -2286 -9901 -8772
1483h772Q928R127O00r218j0192n51R392R705P68p952q924k621O218J0120M703
1498A1331o187j1107m831N893J0164N062l877r201o996K059J0065Q559k373j0781
1512b220p901K308R206P411k25p720r078j971Q107J0359K163q272r561k337O065
1527c666Q998M464m569j0270o053N013J1079N554m938r827n521K849Q850P409
1541I372j006r445q784R19R402Q361k55p920q107j679O647R491L306p240j0457
1556g395l090P236R817L216n456r007n061L727R706O627l291j0187o693K988R082
1571B219O539j244p904p984l96Q436R322O36q953r036o36P558Q476K312n792r122
1587e569m374N449J0149M507n431r389m368L913Q350N854k065r160p705J986J0055
$$ plain form
1483 -8772 156 9283 9883 665 -9527 -10078 -686 9019 9787 1835 -7089 -9710 -3492 6628 11331
1498 11331 5144 -5963 -10794 -4901 5263 10325 6448 -2753 -9749 -7690 2375 10934 8561 -2220
1512 -2220 -10121 -7813 1393 8804 8579 859 -8219 -10190 -2083 8276 10439 2167 -7394 -9731 -3666
1527 -3666 5332 9796 5227 -5043 -11096 -6083 4996 10550 5612 -4215 -9736 -6887 1963 9372
1541 9372 8366 -1079 -9863 -8944 458 8819 8564 644 -7463 -9142 -2495 6996 10302 3062 -7395
1556 -7395 -10485 -3249 6568 9784 4328 -4679 -9740 -6013 3693 10320 7029 -3158 -9851 -6863 2219
1571 2219 8758 7514 -390 -8374 -8770 -334 8988 9624 671 -8365 -9001 -1443 7033 9345 3553 -5569
1587 -5569 -9943 -4494 5655 10162 4731 -4658 -9026 -5113 3237 9091 7026 -2134 -9839 -7853 2202
1602B202P648k171q964p084L84P217Q122J603p084r423j987P460Q867J948o106
1617B632q279l423M344R210N432m399j0406n578M625R545N293l039q138o433R50
1632g664Q380P888n91q773p757P13P689P369R40o209q473l031O429R906L286o662
1648C440r406l056N358Q295M300l400q583n968L030R324O124l030q645n968J631
1663f554P531P015L15p596q718q59Q156Q521P63p130p796j880N343Q088L638n053
1679C784r298l990N187Q843L976m079p905n299K136Q266P021j554r088p295J861
1694g434Q421O566p21o805p156j099O646Q525J696p027q443j711O101P815L111
1709H485m336q248m857L803R400N344m053q920m839L075P770N621j395p562p102
$$ plain form
1602 2202 9850 7679 -1285 -8369 -7985 -768 7354 8957 1873 -7550 -9537 -2077 6790 8738 2632
1617 2632 -5647 -9070 -4726 4484 9916 5517 -4889 -10467 -5842 3703 8996 5957 -2181 -8614 -7664
1632 -7664 716 8604 8013 -760 -8517 -7804 -115 7254 8194 1985 -6488 -9519 -3090 6816 10102 3440
1648 3440 -5966 -9022 -3664 4631 8931 5531 -3052 -9020 -5990 3334 9458 6428 -2217 -8185 -6554
1663 -6554 977 7992 8307 711 -8007 -8866 -710 7811 8574 1444 -6352 -8232 -2889 5199 8837 3784
1679 3784 -5514 -9504 -4317 4526 8502 4423 -3482 -8781 -6645 1621 8642 7088 -2000 -9295 -7434
1694 -7434 987 7553 6832 27 -7129 -8228 -1582 6943 8639 1612 -6831 -8542 -2441 5374 8485
1709 8485 4149 -4099 -8956 -5153 4247 9591 5538 -3382 -8221 -5146 2624 8245 6850 -712 -7814
1724g814O42Q182P349o55p425o933o06N719P646K444n499q740l207N834Q717K822
1740H476n144p850l707L574P868N116k870q645n773K839Q162N488j650p003o379
1755g498j0O777P677P59p197p994o47O804P411J433n371p587k970M918Q388L739
1771H632m744q252l811L909P499M618k248p358n999J463Q044O638j484p871o308
1786g272Q75O732O663O28o160p630j602O267P854J670n575p282k459M058P323
1801D090M080l488q157m956L527Q248M745l020p368n188J488O960O364n60p435
1816f70o781M08O869O404M23n559o826j990N006P804K821n278q035k803M772P419
1832C984L587l574p333m725K783P838N164k463p510n068J619O703N666l04o225
$$ plain form
1724 -7814 -7172 1010 8359 7704 279 -6654 -7260 -1541 6105 8549 3050 -5690 -8897 -3063 5654 8476
1740 8476 3332 -4518 -8225 -4651 3217 8333 5463 -3182 -8955 -6116 2046 7534 5884 -1119 -7498
1755 -7498 -7508 -731 6946 7705 508 -7486 -8133 -1329 6082 7515 2144 -5443 -8413 -3495 4893 8632
1771 8632 3888 -4364 -8175 -4266 3233 7851 5603 -1755 -7754 -6291 1753 8391 6907 -964 -7272
1786 -7272 -6397 335 6998 7626 1466 -6164 -7766 -1499 6355 8025 2450 -4832 -7291 -3233 4090
1801 4090 8170 4682 -3475 -8431 -4904 3344 8089 5069 -2299 -7487 -5999 961 7325 6765 -670
1816 -670 -7451 -7043 -174 6230 6653 1094 -5732 -7722 -2716 5088 7909 2631 -5404 -8207 -3435 3984
1832 3984 7571 3997 -3336 -8061 -5278 2560 7724 5261 -2249 -7317 -5698 1005 6671 6367 142
1847A42o803m57O517P160Q02o039o998j516N201P180K496m541p543l220M235P551
1863D167L525l500p150m148K482O807N166j590o941n903R66P045O101n88o450
1878a1o265l47N820O631J329n532p143j794N139P040K043m141o694l318L171P165
1894C093M335l006p471m614K700P016M687j558o599n553O97O622O163k69o492
1909b49o015j55N407O176J492m710o879k450M823P262K653m294o942l116L286
1924c711O907M135k639p164m593K446O828M732j520o237n244M62N969N924K35
1939F530n802o351p61N395O388J506m738o791k294M440O853K567l887o707l243
1954f895L073O579M003k463o637m518J850O305M936j031o107n625M08N976N901
$$ plain form
1847 142 -6661 -7118 -601 6559 7361 1322 -5676 -7192 -1991 5189 7685 3144 -4399 -7619 -3384 4167
1863 4167 7692 4192 -2958 -7106 -4624 2183 7349 5759 -1182 -7085 -6119 926 7027 6439 -11
1878 -11 -6276 -6623 -803 5828 7157 1625 -5518 -7312 -2173 4867 6910 2769 -3925 -7243 -4072 3093
1894 3093 7428 4422 -3049 -7663 -4963 2053 6740 5182 -1417 -6970 -6273 349 6512 6243 -249
1909 -249 -6264 -6419 -1012 5164 6656 1946 -4933 -7383 -2560 4702 7355 3061 -3881 -6997 -3711
1924 -3711 3196 7331 4692 -2472 -7065 -4619 2209 6941 5421 -816 -6060 -5598 371 6295 6530
1939 6530 728 -5623 -6384 -989 5399 6905 2167 -4624 -6918 -2478 4375 6942 3055 -3652 -6895
1954 -6895 -3822 2757 6760 4297 -2340 -6858 -5008 1297 6233 5202 -905 -6530 -6122 -146 5755
1969E755J67n618o062p50N029O203J696m537o554k185M167O536K641l331o283
1984c126l559K614O661M252k236o623m351J672O184M854r09n822n467L52N654
1999A50N737J69n187n828r63M570O086J864m165o499k424L888O365K836l169o384
2015b954l563K554O478M025k178o272m287J466N621M837m57n644n365qN421N495
2031E169N15m835n694j418M358O272K011m274o327k248L735O064K742k787n944
2046b661l621K132O305M074j953n957m160J151N364M891k10n375n588r8N406N586
2062E286L91m748n405j300M001N859K162l803o182k371L471N871K716k557n663
2077b272l706J779O158M255j706o000m373J148N501M640m25n002n075l83M884
$$ plain form
1969 5755 5922 304 -5758 -6508 -1479 4724 6420 1883 -4671 -6856 -2689 3847 6488 3157 -3126
1984 -3126 -6685 -4071 2590 6842 4606 -2017 -6368 -4696 1488 6342 5433 -389 -5856 -5504 150
1999 150 5887 6056 869 -4959 -5922 -1352 4734 6598 2433 -4066 -6490 -2602 3763 6599 3430 -2954
2015 -2954 -6517 -3963 2515 6540 4362 -1910 -6197 -4731 890 5727 5270 -374 -5739 -5747 -326 5169
2031 5169 5684 849 -4845 -6263 -1905 4367 6378 2104 -4223 -6471 -2736 3328 6070 3283 -2661
2046 -2661 -6282 -4150 2155 6229 4276 -1681 -5841 -4690 674 5565 5355 -20 -5608 -5706 -300 5286
2062 5286 5677 929 -4476 -5776 -1775 4084 6246 2443 -3739 -6110 -2639 3232 5948 3391 -2272
2077 -2272 -5978 -4199 1959 6214 4508 -1492 -5865 -4717 784 5424 4999 -3 -5078 -5461 -577
2092e77N446P52m532n453j319L835N545K134l313n834k756K968N960L201k706
2107C351n842l384K062N615L807j394n276m451P31N246M755k27m940m904l37M354
2123h34N174J194l987n713j789M006N900J810l577n361k377K669N375L226k061
2138C655n693l705J945N611L632j390m786m145K00M716N086J81n079n290q8M716
2154d34M849P46l691n111j855L414N697K226l401n655k113K659M968K975j667
2169C607n196l978J291N627M197j374n241m001O39M474M523K96m331n155p46M443
2185i25M982R14l753m765j660K835N142K599k561n682k935K572N587K921k051
2200C220m995l418J255M828M092n63n099m282N72M634M222O3l837m558j055L685
$$ plain form
2092 -577 4869 5621 1089 -4364 -5683 -1848 3697 5831 2518 -3316 -6072 -3104 2856 6057 3351
2107 3351 -2491 -5875 -3813 1802 5609 4215 -1061 -5512 -4781 465 5220 4993 53 -4851 -5188 -834
2123 -834 4340 5534 1547 -4166 -5955 -1949 3951 5761 2184 -3177 -5554 -2885 2490 5716 3655
2138 3655 -2038 -5743 -3798 1813 5445 4055 -731 -4876 -4676 40 5126 5307 228 -5062 -5150 -434
2154 -434 4415 5161 1470 -3641 -5496 -2082 3615 5841 2440 -3215 -5328 -2669 2299 5274 3607
2169 3607 -1589 -5567 -4276 1351 5548 4174 -1067 -5068 -4429 45 4568 4864 533 -4622 -5368 -925
2185 -925 4057 4971 1218 -3547 -5207 -2372 2770 5369 2808 -2874 -5809 -3237 2350 5271 3220
2200 3220 -1775 -5193 -3938 890 4982 4419 -680 -4962 -4390 244 4466 4529 692 -3866 -4921 -1236
2216a236N127J696l709n505j564L385N096J994k571m949k934K082N300L341k076
2231C477n201l183J456M498L550l98m245m626j31M576M894J16m466m476n54L428
2247a285M550J649l100n180k035L182N238J898k791m610k348J639M518L544j079
2262C790n091l997J319M987L664p47m251l774k35L896M587P65m174m753n64L759
2278h19M412J033k768m475k196K297N111K837k489n281k554K187M480K884j256
2293C403m324l764P41M744L996q50m542l719L05L686L846R05l253m753j460L468
2309a571N003J372l329m440j593K274M400K500j800m849l118K009M924K854j594
2324C042m167l016M47L780M029K02m135m381j24M070M094L50l328m041j229K777
$$ plain form
2216 -1236 3891 5587 1878 -3627 -5191 -1806 3290 5284 2713 -2236 -5170 -3088 2212 5553 3477
2231 3477 -1724 -4907 -3451 1047 4597 4199 -46 -4672 -4803 -227 4667 4783 317 -4159 -4713 -1285
2247 -1285 3265 4914 1814 -3366 -5401 -2219 3019 4917 2126 -2484 -4832 -3193 1325 4869 3790
2262 3790 -1301 -5298 -3979 1008 4672 3925 -326 -4100 -4335 -439 4148 4913 739 -4014 -4578 -819
2278 -819 3593 4626 1858 -2617 -4813 -2516 2595 5432 2943 -2338 -4892 -2705 1775 4659 3403
2293 3403 -921 -4685 -3944 800 4796 3946 -596 -4315 -4010 -324 3522 4427 1174 -3579 -5039 -1571
2309 -1571 3432 4804 1475 -2965 -4558 -2284 2116 4616 2816 -2033 -5151 -3142 1782 4636 3042
2324 3042 -1125 -4141 -3694 86 4115 4317 182 -4199 -4323 -253 3841 4191 863 -3178 -4407 -1630
2340a630M725J854l009m980j657K698M328J983j717m014k961R55M559L527j178
2355C483m583l268R26L977L379q5l572m149n92L835M550N02l709m079o96K705
2371a376L885J790k149m370k372K099M773K313k053m333k450J376L959L256o75
2386C673m254l870O99M245L526l78l477l417n63K875M036J331l115m514j220L082
2402a341M149J383k406l929k234J672M386K840j722m554k660J546L971K584p34
2417B951l379l346k9L655L909O0l757l826r9L221L664R89k607m223j622K785M438
2434B784J602k708l970j623J866L657K420j152l956l101J104M307L062j028l729
2449d65l062K09L168L718M74l368m109m76L369L765N16k700l472j356K046L825
$$ plain form
2340 -1630 3095 4949 1940 -3040 -4697 -1999 2329 4312 2595 -1419 -4380 -3425 1134 4661 3483
2355 3483 -1100 -4368 -3442 535 3914 3829 257 -3892 -4484 -649 3901 4403 694 -3385 -4081 -1376
2371 -1376 2509 4299 2150 -2220 -4592 -2493 2280 4593 2540 -1793 -4243 -2867 1092 4348 3673
2386 3673 -581 -4451 -3752 493 4019 3641 164 -3253 -3816 -941 3095 4426 1311 -3203 -4423 -1341
2402 -1341 2808 4191 1785 -2144 -4378 -2706 1680 4520 2798 -1756 -4416 -2870 1101 3685 2951
2417 2951 -428 -3774 -3803 -148 3761 3821 64 -3762 -3861 -640 3024 4013 1406 -2817 -4439 -1654 2784
2434 2784 4386 1678 -2292 -3915 -2049 1608 4028 2876 -1080 -4181 -3077 1230 4292 3264 -465
2449 -465 -3527 -3318 -150 3568 4042 674 -3435 -3911 -542 3223 3739 1039 -2433 -3789 -1743 2082
2465B082K130k056m353k095K011L902K190j283l611k775N88L751L386n93m005
2480g31l087M66L333L167J77k814l518r19K854L992J097k834l879j197K311L659
2496B077J786j616l919k351J638M140K290j533l755k291J007L208K806j50l268
2511F9l467j01L516L415J03k981l313o86K412L569J348k417m011j469K483L824
2527B294J349j982l332j991J219L466K622q55l863k764R51L410K747m18k926l108
2543c181l59L031L635L76l141l501l61K773L090R72j907l449j734J891L790J955
2559C880j945l591j819J324L255K402p50l433k874O62L585K827n87l180k711m9
2575c004K695L110O39k643l423q16K492L429J008k159l314j493J733L462J959
$$ plain form
2465 2082 4212 2156 -2197 -4292 -2281 1621 3811 2528 -1083 -3858 -3270 481 3867 3274 -731
2480 -731 -3818 -3352 -19 3148 3325 511 -3007 -3926 -1072 2920 4017 1183 -2696 -3893 -1582 2077
2496 2077 3863 2247 -1672 -4023 -2385 1755 4045 2512 -1243 -3534 -2527 681 3487 3337 69
2511 69 -3398 -3499 17 3432 3535 554 -2759 -3445 -1033 2536 3884 1467 -2544 -4013 -1530 2294
2527 2294 3643 1661 -1671 -3662 -2443 1023 3645 2790 -1073 -3837 -2886 524 3271 2853 -73 -3181
2543 -3181 -3540 -509 3126 3502 361 -3140 -3501 -728 2362 3334 1427 -2022 -3756 -1865 1925 3880
2559 3880 1935 -1656 -3475 -2151 1104 3506 2756 -677 -3551 -2889 696 3523 2936 -244 -2955 -3004
2575 -3004 -309 2801 3440 797 -2626 -3442 -950 2479 3487 1328 -1986 -3479 -1746 1716 3675
2590C675j606l607k026J347L357K317j053l139k441L99K991K860n8k985l077j69
2606c215K885K980N74k436l162j075K265L412J402k270l467j354J880L191J630
2621C240j249l156k149R05L243K482p62l300k413M90K826K684R0k679l155l50
2637c253K873L192L26k605k865p94J937L146J323j766l306j616J695L286J663
2652C236j360k898k063P26L059K622p58l136k538M89K965K512j6k610k813l58
2668b941K444L026O45k308l041q85J941K987J362j623l232j598J484L216J783
2683C260j276l126k019R03L018K156o25k786k427K80K717K530J00k494k821k98
2699b908K291K842O72k041k941j066J898L122J237j791l044j293J434K882J647
$$ plain form
2590 3675 2069 -1538 -3564 -2217 1140 3457 2404 -735 -3176 -2777 214 3074 3016 31 -3046 -3215
2606 -3215 -330 2650 3224 788 -2374 -3449 -1184 2228 3630 1360 -2107 -3461 -1581 1610 3240
2621 3240 1991 -1165 -3314 -2409 834 3316 2554 -746 -3159 -2669 157 2841 2931 252 -2903 -3253
2637 -3253 -380 2812 3138 533 -2332 -3126 -1189 1957 3280 1514 -1792 -3408 -1713 1573 3236
2652 3236 1876 -1022 -3085 -2359 700 3322 2564 -572 -3110 -2621 344 2856 2840 230 -2583 -2941
2668 -2941 -497 2529 3174 866 -2175 -3060 -1119 1868 3230 1607 -1625 -3223 -1739 1477 3260
2683 3260 1984 -1142 -3161 -2258 760 2916 2291 -495 -2922 -2642 75 2605 2705 211 -2610 -2908
2699 -2908 -617 2225 2897 856 -2085 -3151 -1253 1869 3106 1315 -1729 -3022 -1588 1294 2941
2714B941j027k799k059P86K885K216n45k680k347J28K552K606K22k505k899k89
2730b814K473K765N10k124k708r43J686K912J297j628k942j441J283K751J779
2745B856q71k764k225P19K804K316o04k703k226J92K404K491J67k377k563m36
2761b820K168K664O22j809k620j168J657K902J335j507k914j476J275K781J751
2776B841r11k784j928O89K774J997m43k416k221J40K165K481K89k176k654m57
2792b614K057K621P48j823k687j042J517K822J271j459k775j400J267K523J594
2807B620p82k449j976M75K572K075l63k340k247R0K193K379K24k061k557m87K034
2824f00K497P52j793k461j045J432K612J293j246k591j485J037K546J651p25k539
$$ plain form
2714 2941 1914 -885 -2944 -2158 727 2943 2398 -282 -2629 -2501 51 2657 2879 374 -2525 -2814
2730 -2814 -341 2424 2934 810 -1898 -2841 -1155 1757 3054 1426 -1516 -2957 -1674 1077 2856
2745 2856 1985 -779 -3004 -2285 519 2835 2231 -472 -2698 -2506 -102 2389 2556 179 -2384 -2820
2761 -2820 -652 2012 2634 825 -1795 -2963 -1306 1596 2931 1424 -1490 -2966 -1691 1090 2841
2776 2841 1930 -854 -2782 -2093 681 2678 2235 -181 -2402 -2262 -97 2384 2673 497 -2157 -2614
2792 -2614 -557 2064 2812 989 -1698 -2740 -1223 1599 2870 1411 -1364 -2764 -1497 1026 2620
2807 2620 1838 -611 -2587 -2112 460 2535 2172 -168 -2415 -2325 -132 2247 2471 410 -2147 -2634 -600
2824 -600 1897 2649 856 -1605 -2650 -1218 1394 2687 1441 -1150 -2635 -1598 948 2599 1874 -665
2840f65j867M51K458K071k83k298k284J26K186K288J57j999k303n00J708K443
2856A689Q00j563k522j073J499K490J236j224k415j508R52K500J725p98k534j720
2872b466N70K283J808j54k045k074k10K094K283L50k009k306m66J664K319Q21
2888B462j365k541j074J369K578J147j273k423j198Q51K249J540m16k365j917
2903b376M00K295J920k72j924k083k32J849K329L52j815k354n20J788K252O40
2919B249j367k143j096J018K405J339j001k390j457Q96K222J548m98k098j874
2934b247K84K143K015j39k048j994J3J871J879L77j549k083q23J580K309Q40j457
2951I71k259r31J108K138J260q32k260j550P74K319J521o98k058j563L10J847
$$ plain form
2840 -665 -2532 -2081 377 2448 2165 -133 -2417 -2291 -105 2183 2340 341 -1962 -2462 -754 1689
2856 1689 2489 926 -1596 -2669 -1170 1320 2556 1332 -1083 -2591 -1639 861 2586 1788 -746 -2466
2872 -2466 -1896 387 2195 2041 -4 -2078 -2288 -194 2089 2439 430 -1876 -2342 -678 1641 2462
2888 2462 1097 -1444 -2518 -1149 1429 2576 1303 -1120 -2318 -1467 782 2322 1906 -459 -2376
2903 -2376 -1976 319 2239 1967 43 -2040 -2272 -423 1906 2258 443 -1911 -2431 -643 1609 2249
2919 2249 882 -1261 -2357 -1339 1066 2405 1404 -986 -2443 -1547 675 2223 1725 -373 -2247
2934 -2247 -1963 180 2195 2056 8 -1986 -1973 -102 1777 2154 605 -1478 -2301 -721 1588 2428 971
2951 971 -1288 -2219 -1111 1027 2287 1455 -805 -2355 -1581 738 2259 1561 -497 -2060 -1750 97
2967I7J779P1j908j973k09J823K051K25j596j940o54J329K225R59j321k336j008
2984b386J307K176R57q11k003j328N46K025J714n26k125j603L42J994J615L7j738
3001A93j910l27J721K170L84j708k029m04J344J896P48j067j958j153R38K203
3017A041J189r52k017j301O55J880J471k64j891j840J50K027J786j72j805j676
3033a719j15J429J778N23j322k086o47J397J996O86j174j818r39P48J947J358
3049B042o95k129j381P96J953J230l93j704j440M1J637J839O9j755j848m8J464
3066c22J759M25j150j929q38J248K018R45j272k016p83R39J807R87n19j838j383
3083a922M74J956J397m54j748j393J46J416J658L04j562j881k72J572J867K43
$$ plain form
2967 97 1876 1947 39 -1934 -2143 -320 1731 1956 360 -1580 -2234 -905 1320 2279 958 -1378 -2386
2984 -2386 -1079 1097 2054 1243 -760 -2088 -1542 483 2197 1671 -454 -2057 -1715 279 1894 1931 193
3001 193 -1717 -2044 -323 1847 2231 523 -1506 -1910 -566 1330 2078 1011 -947 -2100 -1162 1041
3017 1041 2230 1278 -739 -2040 -1385 495 1966 1702 -189 -2029 -1879 148 1934 1762 -43 -1719
3033 -1719 -1834 -405 1373 1896 574 -1512 -2159 -762 1234 1920 746 -1072 -2011 -1263 684 2042
3049 2042 1347 -782 -2163 -1367 586 1816 1423 -281 -1721 -1680 -43 1796 1865 110 -1738 -1786 -322
3066 -322 1437 1862 712 -1217 -2055 -807 1211 2156 884 -1132 -1915 -976 831 1818 1299 -539 -1922
3083 -1922 -1448 508 1905 1451 -297 -1690 -1544 -128 1530 1834 272 -1609 -1881 -309 1558 1801
3099A801j409j673n22J071J749Q47q88j952j048R59J907R62o01j711j167L17J661
3116C03J537k71j805j534L19J645J373K7j354j632l78J297J822N74j349j809n62
3133a797J172J625P86q86j663j093O80J931J068p19j828j032M88J579J237j56
3149A392j500j550PJ619J581N7j580j288l50J182J569N95j138j779o90J148J833
3166A108O60r97j681p00N95J618J098m46j791j117L79J736J127k85j426j234r9
3183a455J271J742K12j560j652j67J359J498M14j102j588o36Q78J745Q00r75j701
3200i17p08P07J502R43l49j610j291L81J656J338l15j599j250J61J323J288K70
3217A530j252j567l07J214J623L07j143j430n44Q45J550P84p25j615r98P75J576
$$ plain form
3099 1801 392 -1281 -1803 -732 1017 1864 976 -976 -2024 -1065 842 1804 1203 -508 -1675 -1358 303
3116 303 1840 1569 -236 -1770 -1451 194 1567 1594 240 -1392 -1770 -473 1349 1923 574 -1235 -1797
3133 -1797 -625 1000 1786 900 -763 -1856 -1176 755 1823 1104 -724 -1756 -1268 311 1548 1392
3149 1392 -108 -1658 -1651 -32 1549 1606 26 -1262 -1612 -430 1139 1734 596 -1183 -1873 -725 1108
3166 1108 1768 771 -910 -1610 -1015 603 1701 1255 -536 -1653 -1274 462 1589 1304 -122 -1356 -1455
3183 -1455 -184 1558 1770 210 -1442 -1609 -250 1248 1662 560 -1028 -1664 -786 959 1759 784 -917
3200 -917 -1625 -918 584 1527 1178 -432 -1723 -1342 314 1652 1337 -262 -1512 -1351 -28 1260 1530
3217 1530 278 -1289 -1596 -382 1241 1548 405 -1025 -1569 -724 826 1610 885 -730 -1728 -953 623
3234F23R35m82j567r13K32J411J242j45j475j390J83J403J213J14j100j440l35
3251a491R78J621N90j086j704n26J085J401O25p41j386r02N28J564J026n15j647
3268e80r10M80J303J037j37j219j385n8J383J476Q0j423j239k02J121J331M14
3285A472r51j551n90J001J541N49p99j357p37N49J307J026l63j544j091M70J444
3302C76J015k13j231j149j39J304J308R0j198j352j90J087J321L55q75j306o27
3319a424P09J509P53p48j438q17N99J402Q54m40j335j034K77J363J177j73j437
3336b03j089Q1J150J169J55r78j347m06J028J552L60j066j402l22P69J227P12
3353A390o12j403q39O02J357Q82m70j261q84K52J100J126p1j116j400M8J273J221
$$ plain form
3234 623 1558 1076 -491 -1404 -1172 239 1481 1336 -139 -1529 -1346 57 1270 1384 284 -1156 -1491
3251 -1491 -513 1108 1698 612 -1092 -1618 -533 868 1493 752 -634 -1536 -1008 556 1582 1067 -580
3268 -580 -1490 -1010 293 1330 1193 -26 -1411 -1469 -86 1390 1470 47 -1192 -1394 -273 1058 1472
3285 1472 521 -1030 -1620 -619 922 1471 672 -685 -1422 -873 434 1460 1097 -447 -1538 -1068 376
3302 376 1391 1178 -53 -1202 -1341 -37 1271 1361 163 -1189 -1379 -292 1029 1384 509 -797 -1424
3319 -1424 -715 794 1547 799 -639 -1456 -857 545 1399 959 -376 -1410 -1133 230 1407 1234 -203
3336 -203 -1292 -1211 -61 1108 1263 285 -1062 -1468 -440 1112 1472 406 -996 -1318 -549 678 1390
3353 1390 778 -625 -1464 -862 495 1377 907 -354 -1238 -986 114 1240 1169 53 -1347 -1299 -26 1195
3371A195l2r83j251k85R95J335M75r85j340m75Q35J234O06o47j233p24L25J404
3389D49R83m51j423q13L18J234R62r9j176j228J2J211J150J20j075j173j67Q28
3407c38J235M03p94j342m58P04J307O00o88j325o61O46J155P80l50j202j002L40
3425i90J211R36j30j142r61rR96J163Q5r85j184k94R69J190M11q28j264m42O93
3444e75J299N41n64j313o15N07J199P73m07j147q60K04J100J030n5j146j129O4
3462a094J082J074R4q90j190k86R35J201K59r06j120l90P13J140N94n48j229p08
3480a269M67J216Q10m03j195q14K93J046J019j65j066j079J02J014R87J10q83
3497A90j082k81R30J115L48p75j195m58O81J169N98o07j162p27O08J128P27m13
$$ plain form
3371 1195 1163 180 -1071 -1356 -361 974 1449 464 -876 -1351 -516 718 1324 677 -556 -1280 -955 449
3389 449 1432 981 -442 -1255 -937 297 1259 1160 -16 -1244 -1232 -21 1129 1249 174 -999 -1166 -338
3407 -338 897 1300 506 -836 -1294 -590 717 1317 629 -696 -1357 -711 444 1224 874 -328 -1330 -990
3425 -990 221 1157 1027 -115 -1076 -1085 -89 1074 1159 174 -1010 -1304 -335 855 1266 438 -826 -1268 -575
3444 -575 724 1265 701 -612 -1227 -720 479 1252 845 -302 -1162 -958 142 1172 1117 -29 -1158 -1094
3462 -1094 -12 1062 1156 266 -924 -1210 -275 926 1185 279 -841 -1231 -518 622 1216 668 -561 -1269
3480 -1269 -802 414 1224 821 -374 -1188 -895 151 1170 1005 -61 -1140 -1038 -24 963 1073 190
3497 190 -892 -1173 -243 872 1220 445 -750 -1208 -527 642 1240 633 -529 -1256 -648 480 1207 794
3515G94j117p39K06J040Q25n5j016r55kR64J021J59r37j163j73Q56J170L31p97
3534D12j162m36O80J126N58o20j171n67M88J099P61l98j117p50K00J080R49j55
3552I77j037r81j7J094R11O7r24j035p2Q08J016L23p55j107l87O35J197L94m98
3571F09j171n50M23J091P61l83j146p74K82J102Q10j50j054q39K9R36R62J14r76
3590G6j003j71Q21J097K52p60j036m47O42J119N23n98j131n14M63J094O65l37
3608G55j071p88K79J089P93j93r19q30K3Q20R70J05q49j046j82Q66J048J99p46
3627C23j059l58O89J021N19o16j031n15L80J058O26l93q61p99K03R73Q43j15j055
3646a67q51J30Q88Q63k0q18r11j32P96R40K94p54r42l95O37J021M79n50r57o85
$$ plain form
3515 794 -323 -1062 -856 184 1009 954 -62 -1017 -1019 -55 966 1125 188 -975 -1148 -292 878 1209 412
3534 412 -750 -1186 -506 620 1178 558 -613 -1180 -692 407 1168 770 -347 -1097 -897 183 1132 977
3552 977 -60 -1041 -1058 36 947 1014 90 -945 -1017 -209 807 1130 375 -732 -1119 -484 713 1107 609
3571 609 -562 -1112 -689 402 1163 780 -366 -1140 -858 244 1054 904 -150 -989 -960 -24 938 1052 76
3590 76 -927 -1098 -277 820 1072 312 -724 -1171 -529 590 1113 515 -616 -1130 -667 427 1092 755
3608 755 -316 -1104 -825 264 1057 864 -55 -885 -862 -42 928 1033 184 -862 -1044 -178 870 1069 323
3627 323 -736 -1094 -405 616 1135 519 -512 -1027 -647 411 1037 644 -217 -1016 -813 160 1003 888 -167
3646 -167 -1018 -888 0 863 843 25 -886 -1018 -222 718 1012 258 -684 -1079 -442 579 1058 508 -449 -1134
3666a134N26J088O20l65j048o81K41J025O81j22r11q63Q4Q56Q66M8q29q59j15
3685h92O95R64K41o70j000l33O22J033M12o30r53m86M40R61N92l65j045o40L66
3704f88R30O65j52q90p58PP55R44R8q54j012K4Q22R02J02o25r25l65N63J044L92
3725I79n18j021m28M70R61M57k44r20p80L01R95P64l17q44q23J69Q11Q69P2q81
3745G2r42o5Q37R29O3o91q51k46N25J008L51m74j041n08N20J047M97m21r94n05
3765h89J94Q90P13r3r91p68K10Q56O90j2p79p80j81P46R07K66p56r54k59O84Q89
3786E83L07m62r50m78N02R43N39m00r79n92L71Q58N68j37p61q50J07R05Q55p1
3806H58r15o95o5O72Q80K06o81r52k64N97J001K66n59q41m38M03R45N82l35j051
$$ plain form
3666 -1134 -608 480 1100 735 -313 -994 -753 272 953 831 -80 -943 -859 -3 863 911 82 -777 -892
3685 -892 -197 767 1008 338 -662 -995 -373 660 1072 442 -511 -997 -557 404 996 631 -414 -1054 -688
3704 -688 242 907 755 -135 -893 -886 -131 813 911 57 -955 -931 -109 793 895 270 -655 -1020 -457 587 979
3725 979 461 -560 -988 -518 443 900 656 -264 -1044 -743 252 1016 699 -145 -968 -799 12 881 953 72
3745 72 -870 -935 -98 831 894 203 -648 -894 -369 639 990 516 -525 -1033 -513 534 1031 610 -384 -889
3765 -889 -695 195 908 815 -176 -944 -734 122 812 800 21 -759 -940 -194 713 979 223 -731 -990 -306 583
3786 583 890 428 -522 -1000 -498 445 984 584 -395 -987 -616 242 810 673 -88 -938 -831 74 929 858
3806 858 -57 -752 -817 -145 735 941 260 -692 -956 -359 642 908 349 -492 -930 -527 418 1000 665 -386
3826c86o14L76R32N28j46q72o78R9Q44Q09n1p99q43o4Q10P33J37o04q84k28O04
3847b97Q94M14o14r35l75M79R11M34k95r17n99K20J027O64l49r42n49J64P49O55
3867G39N0o68r06p1P38R28R6p64q19j37N65Q33L19n37r19m53N52R37M60m55q96
3888d08m34K26Q11O37o4r12p27J51Q18P47n3q05p12j09P21Q66K15p60r22k29P77
3909a66P65J53m05p51n23M06R62N02m03r65n20L83Q92N03k32p89o84Q3Q63Q31
3929I05j31p92p71L1O68Q08J08o38q19l01P13Q49K12n16q79l52M50Q97M83l99
3949E26r45n32L86Q84O14l23q22n79J22P66O70k5o73r53R8O63R06Q8o58q87k12
3970h86O60Q22L46o38q80l43N66P98M07l83q21m80J92Q77O38k19q59o90K43Q15
$$ plain form
3826 -386 -1000 -624 308 836 690 -182 -860 -761 83 892 841 42 -801 -865 -55 678 815 211 -673 -901 -297
3847 -297 597 1011 397 -538 -913 -434 477 911 616 -301 -900 -680 347 1011 662 -280 -829 -665 84 739
3867 739 789 121 -785 -856 -118 810 906 142 -677 -814 -249 584 903 366 -553 -1006 -454 483 943 488 -408
3888 -408 -842 -616 195 832 768 -144 -871 -720 98 845 792 -13 -725 -834 -113 753 968 208 -714 -943 -166
3909 -166 599 752 347 -404 -927 -521 441 943 540 -425 -945 -562 330 833 601 -188 -872 -789 74 905
3929 905 774 -18 -789 -758 -90 718 826 188 -631 -932 -219 630 842 326 -553 -905 -455 442 925 526
3949 526 -419 -951 -565 319 933 610 -212 -791 -669 97 767 742 69 -884 -786 -123 783 871 213 -674 -886
3970 -886 -226 596 942 304 -576 -919 -353 445 852 469 -352 -832 -640 237 875 656 -203 -893 -650 165
3990A65O16n5o75q24q0P54P92J18o87q15o4N80P04L35n22q91m06N90Q99M32n00
4011D66q02n06K91P78O10j62r06o14J03R27N90j40o84p09KO70Q05J88p86q83j02
4032h64P14P81K15o01p38l68M22R01M76m44q83n25L92Q61N37k55q23n94Q6P24
4052A4P75l0q23p00LP34Q12K1o29q20k34P07Q20K24o30p51k89M47Q74L69l51q73
4074c30n43K69Q96N89l13q06o22K13P92N95K4p76q12MQ04P71m0o56p44j15M89
4095c11Q64L02n54r10l12O06P59L81m27p14n38K63Q77O49l55q75n04J62Q52N70
4115G85j08p15p32J0P51P84O1p09p34j30N49Q09J92m87q40l59N53Q54L77m76r16
4136d81l29L56P47N55k62q12o78K21Q47O28j27p37p46Q7O53P68J11p75q20m7O70
$$ plain form
3990 165 781 726 51 -773 -853 -99 693 811 124 -691 -755 -175 529 864 342 -549 -955 -365 534 966 466
4011 466 -336 -842 -551 227 837 675 -231 -845 -742 185 775 635 -49 -758 -756 -86 719 907 121 -762 -864
4032 -864 -150 631 846 245 -493 -861 -439 462 938 494 -389 -914 -522 339 876 621 -202 -796 -710 14
4052 14 789 759 -64 -764 -761 -27 785 806 177 -643 -877 -170 650 874 244 -507 -796 -349 525 894 543 -330
4074 -330 -873 -604 292 881 568 -238 -860 -647 145 740 764 -12 -824 -820 -16 755 715 59 -685 -800 -311
4095 -311 553 855 301 -609 -921 -315 444 825 398 -316 -854 -591 286 935 580 -295 -799 -637 215 785
4115 785 677 -38 -770 -760 -9 775 836 127 -607 -737 -188 621 813 326 -514 -873 -320 534 911 435 -481
4136 -481 -810 -454 293 848 586 -226 -904 -683 164 792 665 -72 -818 -731 -78 690 801 26 -794 -841 -171
4157a71Q10K01n51q83k62L95R15M42m57q73m95M22Q47N23k55q35n94J66Q07P14
4177H66r1q87p10J68O94P29J6o20p01k46N50R02K03n42r52k27N10Q64L55m81q33
4198d33m37L77Q75M89k80q92n66K26P82O13j08p35o61j3P45P20P3o81p76j53N87
4219b48Q13K72n11r73k80O27Q25L37n19p78m34L58Q28N88l30q51o01K79P86O07
4239G95p3p35p27p4Q11P67P8q08p30r5O57P57K22o48p53k95N26Q20L60n04p91
4260d40m67M28Q15N27l06q23n46J29Q37O92k04o93p22P5O92P48N0p15q01r5O42
4281a77P42K65n61q51k40N33P93L51m70r03l81M67P88N42l79q05n46J72Q69N65
4301G74q6q12o54N2O95P16J08o43q73j39P04Q07K05o72q04k02M74Q92L06m60p97
$$ plain form
4157 -171 639 840 289 -594 -856 -461 454 896 439 -434 -929 -507 340 863 608 -227 -821 -655 152 866
4177 866 775 -112 -822 -654 40 769 785 165 -536 -782 -232 670 873 331 -621 -848 -338 526 881 400 -433
4198 -433 -870 -493 382 871 591 -301 -867 -641 141 754 646 -89 -750 -763 -18 702 775 94 -682 -835 -248
4219 -248 565 837 326 -647 -927 -300 525 862 343 -435 -869 -511 317 905 575 -276 -877 -598 188 795
4239 795 722 -13 -740 -814 -3 764 842 34 -696 -791 -134 623 845 197 -556 -851 -325 495 855 351 -440
4260 -440 -907 -479 336 863 557 -266 -812 -683 154 846 642 -51 -773 -698 -6 742 792 77 -724 -819 -177
4281 -177 565 830 269 -582 -822 -289 504 855 385 -518 -899 -432 356 898 519 -286 -832 -660 209 774
4301 774 688 -124 -778 -726 -31 685 793 150 -723 -862 -158 649 854 182 -622 -824 -350 542 848 388 -409
4322d09m57L95P97N59l37q32n26K07P86O66j42q47o36J09P02P64Qp39p70j10O44
4343a68Q00J58n10q80k63N60Q38L34m74q62m11L57R53M11k76q97n27K09Q44N98
4363G94j55p25p19R2P84O77o1o54p67n6O46P90J45n78p70l41N58Q74K97m49q66
4384d84m09M30Q33N10l80q37m62J86Q87N97k09p81p07J25P73P35m9p07p58r0O08
4405a89Q24J97o43q13k25N17R07K43l93q72m14M26Q18M96l38q55n21J50Q08O84
4425H07j09q94n81M4P50P52M7p91p72j2O55P82J61o50p91l40O35Q13L78m91q50
4446d57l78L24Q38N85k94q33o25K35P97P09k31q83n51J11O55P71K4p05p72j28
4466h08O74Q53J58o75p91k43N32Q37L50m92q93m09M79Q61M09m07p82n36K56Q41
$$ plain form
4322 -409 -866 -471 326 885 548 -284 -810 -603 183 849 707 -140 -776 -667 35 799 807 68 -702 -812 -168
4343 -168 632 790 280 -600 -863 -303 535 869 395 -467 -878 -521 432 843 567 -330 -857 -648 196 794
4363 794 639 -86 -805 -713 71 748 687 33 -734 -790 -144 646 791 213 -557 -898 -340 534 831 382 -484
4384 -484 -893 -463 370 880 500 -337 -799 -613 274 871 662 -119 -826 -701 72 807 758 51 -707 -797 -189
4405 -189 635 832 189 -624 -849 -332 575 818 425 -447 -861 -435 383 879 541 -314 -835 -685 123 807
4425 807 698 -196 -777 -733 17 769 816 25 -747 -759 -104 678 839 189 -602 -942 -307 506 884 393 -457
4446 -457 -835 -511 327 912 618 -215 -840 -605 192 901 670 -213 -764 -653 2 773 797 92 -680 -808
4466 -808 -134 719 877 202 -589 -832 -300 537 887 395 -498 -907 -428 433 842 435 -347 -883 -627 214
4486B14O18k24p10p06R8P92O61K4p04p96j00O85Q62K08p19q05k81N95Q60L12m93
4507C91p64n08L46Q92N74m33p96n69K82Q32N24j24p71o30k3Q02Q03k4q44p02n9
4528h01O57P76K07o01q49l28O01Q64L07m89q25l77L64Q11N41k80r57n96M61P85
4548B71N56k57o48o51M4O78P87Q2q32q14nP18P36K04n92q18l12N63P91M84o47
4569C38q53l55N44P37M49l18q00n25K15Q09O20j57q04p81J26Q11P47l4p24p79
4589g34j83P91Q15J08o34p86k04N22Q23L68n19q86l98M13R00M56k91r05m75K39
4609e80P74O77j92p47p72P7Q87P45j46o66p29j14O34P64K24m88r66k83O64Q00
4629E63L40m60q63m84L21R59N29l19r69n27L50Q47N80k18p56p49M6P96Q32o9p84
$$ plain form
4486 214 832 608 -102 -808 -710 82 743 767 63 -733 -833 -148 714 922 203 -602 -883 -288 572 884 391
4507 391 -373 -881 -535 357 931 498 -298 -867 -585 247 771 647 -124 -754 -777 25 828 804 -40 -742 -801
4528 -801 -144 632 839 238 -611 -939 -338 526 833 344 -481 -858 -494 317 858 578 -379 -975 -514 271
4548 271 827 570 -78 -729 -685 -7 780 862 30 -784 -789 -71 665 869 277 -541 -853 -290 501 985 338
4569 338 -515 -870 -326 411 860 542 -258 -783 -568 241 861 704 -100 -881 -755 56 803 769 45 -734
4589 -734 -917 -126 689 797 163 -623 -827 -305 518 886 367 -519 -917 -504 396 852 561 -344 -819 -580
4609 -580 194 871 679 -68 -840 -763 124 869 723 57 -672 -786 -152 612 836 348 -618 -901 -237 563
4629 563 903 443 -420 -904 -583 376 905 586 -383 -910 -560 287 867 649 -107 -856 -810 -14 818 749 -35
4650c5p52j6O42P66K24n69r40l03P15Q61L30o12q23l79L72Q84N69l59q68n72K03
4671f62R06O80k05q26o50P6O91Q07P7q03q50q5P14Q46R6o22p85k67N06Q64M22
4692I30n41r44l09M63P25M56k44q12o08J25R09O90j93p86p65J41Q02P43l1o42
4712A09q43j42O84R06J70p26q09k31O03P70L78m22r34m30M25R59N31m98q27m51
4732g78J93P35O23m9q38p20O5Q62P09r2o52p38j44O97Q22L35p81r27k39N86Q96
4753E65L50m53q80n22L55R03N82l09r76m83K39Q07O44j80o22r09K8Q58Q17P7q59
4774C2p91o4O88P83K06n68r42k54O13Q30M25n66q96m02L53R13N76l34q78o59K46
4795f89J041O29k64q31o45j2Q10P92pp58q35j19P78Q35J02o17q05l06M90R02N47
$$ plain form
4650 -35 -787 -803 -161 605 829 260 -680 -983 -268 593 923 311 -512 -891 -519 365 934 575 -293 -865 -662
4671 -662 244 924 719 -107 -757 -681 10 817 894 91 -759 -844 -130 716 812 190 -595 -862 -356 508 930
4692 930 389 -555 -864 -401 324 780 536 -276 -884 -759 150 840 647 -139 -904 -763 39 782 751 109
4712 109 -734 -876 -192 714 884 158 -651 -882 -279 491 869 447 -487 -917 -492 467 998 500 -327 -778
4732 -778 -585 150 773 724 -114 -834 -769 93 802 710 58 -680 -824 -127 695 1030 249 -678 -917 -331 565
4753 565 915 462 -418 -940 -585 318 900 591 -385 -868 -629 178 822 642 20 -889 -861 -3 814 891 32
4774 32 -759 -823 -135 648 854 286 -656 -910 -297 533 958 392 -504 -906 -553 360 936 602 -276 -935 -689
4795 -689 352 981 717 -114 -759 -771 39 831 824 66 -769 -888 -110 725 827 210 -595 -901 -411 491 1038
4816A038n93r74n06M87J014M39l75p72o95K28Q72P58j78r18p12Q5Q31P16Jo58
4836H8q46j49O47R66K40p13q75k75N43R39M01n21q99m51L83R51N79m68q10n91
4856h61K48Q14P24j33q50q12O8P96Q34J4p64p49k28P19P84K87o28r04k86O00R17
4877E90L51m83r41m38L42Q44O60k46r49o55K33Q86O59j09p97q35rQ70Q02R1p80
4898H6q14j82P23R16J39n61r12l87O23R39M58n48r82m70M33Q77N91l00r26o75
4918i72K20R65O83k07p97p07kP46Q46Q0o86r23j23O13J016K21o89q78l21N55R09
4939E49M79n58r61n20N09R03N63k64j022n76J49R26O97o1q82q21L3R12P07J00
4959H62o76r29k22P51Q95K83o38r92l01O05Q46M36l69r31o01M00R09O52l19r93
$$ plain form
4816 1038 445 -529 -1035 -548 466 905 530 -242 -937 -709 163 921 743 -175 -887 -802 29 745 746 88
4836 88 -758 -907 -260 706 946 233 -642 -917 -374 565 966 445 -454 -905 -522 429 1008 540 -270 -861
4856 -861 -613 201 925 792 -58 -870 -802 -6 828 842 78 -671 -899 -180 604 891 263 -641 -927 -327 590
4877 590 941 458 -483 -921 -579 265 925 679 -270 -925 -692 194 853 744 -53 -888 -897 -27 775 866 86
4898 86 -728 -910 -187 729 868 307 -605 -992 -369 570 1028 480 -502 -972 -539 338 929 629 -297 -972
4918 -972 -752 213 896 689 -108 -815 -817 -71 775 855 169 -754 -877 -264 752 973 284 -594 -915 -360 549
4939 549 1028 470 -491 -1011 -502 401 964 700 -322 -898 -749 177 874 813 -69 -890 -857 55 762 862
4959 862 186 -743 -965 -214 681 964 326 -666 -967 -362 484 920 551 -380 -981 -581 328 980 661 -332
4979c32o23J60R30P91j68p86q17jQ37Q31O7p58q67j26O22R25K41o55q60l36N32
5000c93R46M42m96r23n15L06J019O00l11r44o63K02Q60P37j03q40p43o0P43Q65
5020G29J38p20r18k02P45Q39L26n85r49l72N63R36M21m56j010m75L58R60N24j25
5040G27r46p59K21Q48P26p4p51q71K0P53R10J14p22r86j47P54Q60L64p03r40l28
5061i30M61R94M67m45r63m96L46R16O39k89r28o83J32R11Q12j88p64q24q6Q85
5081c3Q43N0p03q36k29O50R30L14n93r71m50M74J072M92n48q16o53M01R32O13
5101I39k53r47p01K06P99Q08n0q13p69j65Q88P96J94p36r86j39P04R11K95o35
5121C46r68l41O06Q88M85m56r98n78M19Q69O95k28r29p15P9R31Q01m3q48q57q9
$$ plain form
4979 -332 -955 -795 135 926 758 -28 -845 -846 -9 822 889 131 -736 -862 -240 685 926 271 -589 -925 -393
5000 -393 553 995 499 -424 -939 -633 386 986 675 -269 -932 -730 130 867 764 -76 -819 -879 -136 729
5020 729 867 147 -771 -973 -228 611 937 352 -597 -969 -406 530 951 495 -515 -990 -632 328 852 727
5040 727 -219 -978 -757 91 817 743 -8 -879 -859 -106 804 918 196 -790 -937 -183 677 1041 338 -602 -930
5061 -930 -469 525 992 547 -416 -912 -566 350 989 700 -228 -911 -779 132 944 756 -8 -832 -918 -33
5081 -33 810 860 157 -679 -908 -258 672 986 393 -578 -1028 -554 518 1010 462 -354 -1007 -606 326 939
5101 939 686 -261 -962 -756 43 851 801 -12 -781 -946 -58 738 932 196 -790 -929 -225 686 981 346
5121 346 -622 -963 -357 531 1016 560 -438 -1016 -597 272 967 739 -190 -905 -826 105 906 863 15 -842 -931
5142i31Q56R01J05p44r35k05O81R50L11n21j068l75M64Q95N96m03r57o55L05J020
5162B90O93k22r87p88J97R31P70m3p75q68p9P68Q82K20p74r52j50N51J002L09
5182I75n12j042n05O07J058M43m15r60n25K14R24O70j53r69p19J36Q58Q07r0p59
5202D3q36j62P70R66K24p98r58k51O33R68M30o35q79m95M80R70N09m03r54o00
5222i78L71Q47P25j79r26p81R6Q54R20m8q22q70q6P63Q64J65o66r49k57N87J113
5243G43L14o30r50m68N06R35N59l57r08p91L18J009P27k37r48p66R2Q63Q50J06
5263I67r08r14p9Q11Q98J21o91q52l57N12J074L83m95j044m78N47R12N46l29q65
5283b41p30K20J029P71k16r86p69J26Q41Q78L2q00r67j07P01J071K02p49r89l20
$$ plain form
5142 -931 -75 826 931 187 -748 -953 -272 678 989 468 -600 -975 -511 384 980 577 -380 -1035 -730 290
5162 290 983 761 -226 -1014 -817 114 884 841 66 -802 -881 -113 769 989 215 -737 -887 -336 666 975
5182 975 463 -579 -1084 -477 581 1024 609 -351 -876 -662 262 932 779 -190 -909 -773 85 892 802 43
5202 43 -793 -955 -185 781 1005 207 -751 -1002 -369 599 1029 394 -485 -980 -500 470 979 576 -378 -978
5222 -978 -607 240 965 786 -140 -921 -825 29 949 901 79 -791 -877 -114 750 915 249 -700 -957 -370 743
5243 743 1057 427 -523 -991 -485 450 1009 652 -256 -1047 -729 280 1007 770 -178 -944 -852 11 861 967
5263 967 59 -855 -934 -123 775 896 205 -647 -1004 -492 582 965 470 -574 -1052 -505 407 953 624 -241
5283 -241 -971 -751 278 1049 833 -153 -922 -796 45 923 955 155 -812 -919 -218 853 1055 306 -683 -1003
5303a003N97R83M51n25j071m58M80R93O33m25r48o21J23R63P84j32r37q13n6R99
5323A7Q71k1q27q50j38P33R03L28p02j105k66O22R80M89o20r00m59L39R69O63
5343A026k90j044o88K17J010P98l11p58q45j8Q69R92N7r75q22r1P56Q18L35o48
5363C88r44m87N87J115M46n83j022n40M93Q37O44k54r85p30J97J062P17k02q45
5382a06q24J4Q00R45J65q19r86k83R04R62K27o99r15m08N04J089N50n77j068m98
5402a023M33J071N08k92q99q13J76R70Q71j36r45q02k5R03Q82Lo66r61k58P32
5422b71J025K31o88r55l37N67R19M95l87r68p18L65J068P83l75j107o54K06R46
5441A45O99M6r75r15Q2Q18R95N2q19r03k11O43R83L57m72j157m48O65J047M64
$$ plain form
5303 -1003 -406 577 1028 503 -568 -1026 -546 447 1080 655 -293 -914 -791 172 956 824 -113 -926 -982 17
5323 17 888 867 40 -810 -948 -215 688 1016 314 -791 -1057 -435 545 1034 414 -486 -945 -606 363 1026
5343 1026 736 -308 -996 -779 231 1029 718 -40 -885 -903 -34 958 1015 40 -782 -873 -117 701 1036 388
5363 388 -556 -1043 -456 659 1105 522 -500 -1040 -547 290 934 680 -305 -1035 -838 224 941 739 -106
5382 -106 -930 -916 -116 829 994 175 -811 -1094 -190 772 999 300 -615 -1023 -519 570 1120 543 -525 -1023
5402 -1023 -590 481 989 697 -202 -1015 -839 131 1002 866 -79 -881 -906 -3 879 882 216 -745 -1003 -271
5422 -271 754 985 297 -658 -995 -428 491 986 599 -369 -1087 -722 346 1129 754 -353 -1007 -801 145
5441 145 844 890 -85 -1000 -918 -100 895 947 128 -775 -986 -343 640 997 525 -632 -1080 -415 632 1096
5461A096n16r65o44L30J008P93l04j091p16K36R39P56j14p50q90k33R14J004J40
5480I93p94j042k23P94R69K96n45r81n86N17J172M39m17j029n82L42R10P08j75
5499G66r27q38J43R66Q38j4j002p86j13Q40R44J66p87j001k78P81J069K31n74
5518D24r70m53M95R25O78m27j115o58L79J049P55l71q06r12J78P91R16O7r22r34
5538i11q8R25Q88J28o06r97l42N74J099M40o75j020n04N74R93N15l11j059p21
5557a098L05J076P86k80r64p86J87Q90P26J09q53j003q2Q25J053P1p33r17l33
5576a021O08J021M62n48j046n47N03J086N24m43r66o25K07R97P89j83r28r56J51
5595i15J037P67L1q80r44j12P04J160J96p73j003k69O28J017L65m77j018n42M31
$$ plain form
5461 1096 580 -385 -1029 -699 309 1102 798 -293 -1009 -773 166 922 808 58 -832 -1065 -151 853 993
5480 993 199 -843 -1066 -272 697 993 448 -533 -1119 -602 570 1009 592 -437 -1019 -677 233 941 766
5499 766 -161 -999 -856 110 948 934 -68 -854 -967 -127 817 983 196 -805 -1083 -302 767 998 424
5518 424 -546 -999 -504 421 1099 672 -443 -1101 -722 327 1082 711 -95 -1007 -829 -38 878 945 23 -911
5538 -911 -999 -74 814 942 336 -661 -1003 -429 670 1110 435 -585 -1089 -515 478 993 682 -377 -1098
5557 -1098 -793 283 1069 789 -175 -961 -774 116 842 951 98 -905 -987 -162 891 962 229 -688 -1021
5576 -1021 -413 608 1070 522 -524 -1071 -568 518 1042 599 -367 -992 -785 212 1001 818 -110 -1066 -915
5595 -915 122 889 920 40 -904 -1016 -312 848 1044 271 -732 -1001 -373 644 1009 532 -486 -1028 -597
5614e97J058O59l91j173n94K79R56Q42j33r70r40O7R54R74m5q43r85l1P58Q92
5634G37K65o27j049m03O41J064M38o03j025m56L20J065O91l28j082p86L37J047
5652B46P67j80j038o90MQ20R58J17r06r16k15Q14R20L31n96j108m50O50J174L64
5672A066n26j101m45M42R66N75k21r88p73J77J047R11k59r51r04J9R77R05R2q45
5692A64r97l07Q61J072K79p52j027l45O31R81N23n09j109o02M29J096O15k14j099
5711c10p36K07R53Q82j52r63r43N9R79R19M8q12r50k16P03J095K82o20j077m22
5731a074N43J080O10n86r30p03L58J063P35k51j134p96L26R49P57nr18r16n0Q24
5751a18J026J68q92r76k62P15J074L38o32j089m99N82J131N41n35j081n24L02
$$ plain form
5614 -597 461 1120 729 -444 -1038 -759 197 1039 906 -64 -1004 -937 17 991 946 103 -882 -913 -155 737
5634 737 1002 375 -674 -1077 -436 628 1066 463 -562 -1018 -698 367 1058 730 -352 -1138 -801 246
5652 246 1013 833 -205 -895 -891 -71 887 1004 98 -818 -1033 -219 701 1032 436 -672 -1122 -472 702 1066
5672 1066 540 -561 -1006 -564 402 977 756 -232 -1005 -828 219 1130 871 -80 -984 -965 12 917 1009 164
5692 164 -833 -1140 -279 793 1072 320 -707 -1052 -421 560 1083 574 -535 -1137 -708 388 1003 789 -310
5711 -310 -1046 -839 114 996 844 -119 -1062 -1003 -24 895 943 131 -819 -1035 -332 763 1045 425 -652 -1074
5731 -1074 -531 549 1159 573 -357 -1060 -702 361 1096 845 -289 -1085 -759 190 947 942 24 -892 -942 -118
5751 -118 908 1076 184 -792 -1054 -339 735 1073 441 -648 -1147 -565 566 1107 572 -509 -1033 -731
5769g31J012P91l52j007p46J59R81Q82q5r21q87j11Q31J029K19q21j078k07P09
5788c33J065L37n66j152m00N56J042N80n10j055o57L25J145P21k45j008r10J52
5806i13J030R52q4r61r26q4Q20J080J03q05r38l79P88R81M29o55j079m38N03J081
5826E05N89m92r61q52L89J134P88k68j032q39J68Q85R91m5q96r83j61R16R88J77
5846A001o91j085l08O94R45N56o40j073n27O05J024O26m90j085o17L20J042Q10
5864A107k66j046p04M8Q97R50K4r40r91j18Q76R75K82q98r63l67O90J143M85p56
5884D28j067m87M93J092O01l36j104p14K25J145Q26j73j074q58J12R04R43P6r35
5903I7j006j50R03R41K67p31r78l91O16J056N47o61j143m77M94J109N68l33j041
$$ plain form
5769 -731 281 1072 720 -287 -1033 -874 107 989 904 -17 -904 -1015 -184 845 1064 243 -835 -1042 -333
5788 -333 732 1069 503 -649 -1049 -493 549 1129 619 -436 -1093 -768 377 1098 853 -155 -1065 -913
5806 -913 117 1069 985 24 -902 -986 -166 914 1017 212 -726 -1105 -317 664 1093 438 -641 -1079 -576 505
5826 505 1094 602 -359 -1211 -822 312 1100 832 -200 -1039 -871 14 1005 960 64 -919 -1080 -164 824 1001
5846 1001 310 -775 -1083 -389 556 1112 472 -601 -1128 -523 501 1127 637 -448 -1065 -745 297 1107
5864 1107 841 -205 -909 -861 36 986 1010 70 -921 -1039 -163 812 1094 196 -767 -1134 -444 699 1184 428
5884 428 -639 -1126 -633 459 1060 724 -380 -1094 -869 276 1102 929 -145 -1003 -891 13 956 1032 97
5903 97 -909 -1059 -156 785 1052 321 -657 -1048 -432 624 1171 510 -633 -1110 -616 493 1061 728 -313
5922c13p86K67J082Q18j81j033q61J33R50Q72O1q92j005j46P63J060L55p34j140
5941g30m44O87J125M99n35j180o23N24J166O00m03j017p33J89J053R07j98r63
5959g6r35J7R51R93R9r04r72j95P03J117L19o88j144m74P33J113N73o56j064o07
5979a097L73J033Q17l05j145p75K12J019Q80j24r89r50m6R82J041J54r25j086
5997i31j26P89J007K37o28j033m47N82J175N29n41j053o23L33J096O60k07j063
6015b44r19K37J126R26k32r88q52J0Q34R78K68q52j153k17Q03J097L14p26j043
6034f33m29M72J115O75n31j165o19M37J064P79l99j005q18J16J036R35j15r36
6052b1r91l6Q95J056J35q09j004m09Q43J118L69p37j130m11O07J094N84n43j018
$$ plain form
5922 -313 -1099 -832 250 1068 887 -146 -1007 -874 76 948 1009 117 -888 -1034 -271 789 1144 410 -730
5941 -730 -1174 -487 638 1137 602 -578 -1201 -677 489 1089 686 -331 -1064 -875 178 1085 887 -76
5959 -76 -1011 -994 -43 950 1049 145 -827 -1022 -319 798 1117 429 -715 -1189 -456 657 1230 574 -490 -1097
5979 -1097 -724 309 1126 821 -324 -1099 -887 132 1012 888 -101 -1051 -1097 -115 926 1080 155 -931
5997 -931 -1057 -268 739 976 348 -685 -1132 -550 625 1154 613 -440 -1063 -730 366 1026 819 -244
6015 -244 -1163 -926 200 1126 894 -94 -946 -936 -102 876 1144 292 -861 -1078 -275 822 1136 410 -633
6034 -633 -1062 -590 525 1200 669 -496 -1115 -678 386 1165 766 -239 -1057 -941 95 1030 915 -21
6052 -21 -1012 -1048 -153 903 1038 229 -775 -1184 -341 777 1146 409 -721 -1132 -525 569 1153 610 -408
6071d08p20K99J153Q33k61j177p65J17R64R66K4r30j032r9R00J059K10r52j030
6090h49k59P32J051M71o61j136n08O13J106N49m60j033p73K86J176P65j26j139
6108a95r14J09J159Q57j52q28j003j42Q81J145K03q59j109k70P61J094L57n96
6126D98j104n41N16J137O79m40j216p08M88J029P26k15r63r80J21J035J007l6
6144A033j020r28j06Q17J021L06p71j185l90P80J226L87o81j117n56N97J016P25
6162A154m35j097q03L77J097Q62k61j049q59J0R13J073J75j010j060j64R38J042
6180I03J59p58r91m21O36J136N57o29j138o59N53J089O43l20j071q65K69J118
6198B11R85k83j073q92Q3R69R47Q1q23j112k21Q69J132K50q12j030l75O07J096
$$ plain form
6071 -408 -1128 -829 324 1157 896 -281 -1046 -929 35 1001 1025 95 -937 -1036 -136 923 1133 181 -849
6090 -849 -1108 -376 675 1146 485 -651 -1159 -546 560 1109 649 -384 -1157 -871 305 1070 944 -195
6108 -195 -1109 -1000 159 1016 864 36 -967 -1109 -228 917 1120 261 -848 -1118 -357 737 1094 498
6126 498 -606 -1147 -631 506 1185 745 -471 -1179 -691 338 1064 849 -114 -1094 -973 62 1069 1033
6144 1033 13 -915 -1021 -204 817 1123 352 -833 -1223 -443 783 1170 489 -628 -1184 -587 429 1154
6162 1154 719 -378 -1181 -804 293 1155 894 -155 -1014 -1004 -91 982 1157 147 -913 -1077 -139 903
6180 903 1062 304 -687 -1108 -472 664 1221 592 -546 -1205 -652 437 1080 760 -311 -1176 -907 211
6198 211 1196 913 -160 -1052 -969 0 947 1028 205 -907 -1128 -259 873 1123 311 -719 -1094 -487 609
6217F09N65n13j168p59N45J197O67m35r98q01K92R45R23qj145r70L0J056R65N8
6237A055r08r85k90P87J190M24p80j296m21P34J150N16n56j041p39M09J182P67
6255A198m11j107q55L01J053Q58j59q78j040o6J022J087R8r68j125j30P77J054
6273G09M14p04j068n87O95J207M78n57j163n33L45J113P99k33j153r43J71J211
6291B01J015l10j019q72oQ55J114J81q97j163k23Q06J152L33p43j029n91N35J184
6310E23P21o06j154o37M17J149P67l36j068q75J22J069J006j17j059r09r6J017
6328f6Q76K54p75j125l76Q06J165M22p29j261l33N98J103N77m17j139p74L84J238
6347D28P73l53j063q10N8J001J003N7r77j086j41J029J111J07r11r93l25O25J163
$$ plain form
6217 609 1174 661 -507 -1266 -721 476 1143 708 -290 -1091 -799 146 1069 1061 -84 -1054 -1024 32 997 1055
6237 1055 147 -838 -1128 -341 849 1273 493 -803 -1224 -490 660 1176 620 -421 -1160 -751 431 1198
6255 1198 787 -320 -1175 -874 179 1037 878 0 -1040 -1106 -84 1003 1101 133 -992 -1122 -345 709
6273 709 1123 419 -649 -1236 -541 666 1144 587 -576 -1109 -764 349 1148 915 -238 -1181 -1010 201
6291 201 1216 906 -113 -985 -991 -136 978 1159 262 -901 -1124 -318 834 1167 424 -605 -1196 -661 523
6310 523 1244 638 -516 -1153 -736 413 1180 844 -224 -1099 -977 92 1098 981 -78 -987 -1083 -66
6328 -66 810 1064 289 -836 -1212 -406 759 1181 452 -809 -1142 -544 559 1136 719 -420 -1194 -810 428
6347 428 1201 848 -215 -1025 -967 34 1037 1094 117 -969 -1110 -81 1030 1137 226 -767 -1092 -467 696
6366F96N78p66j192n53O24J130O26m48j046p39J92J241Q18k42j089j074K43J084
6384H3R91q5r97r58j84R57J091K62r41j086k67O91J128M41n53j192o26N64J232
6403E51P06n24j153p36L36J148Q01j96j086j007K12J042J019p7r33r26k80Q60
6421b43J093L40q39j128m11P82J161M52o23j155n74M86J100P94m48j217p28K69
6439h89J100Q54j66j083q97k9J082J035N2r33j135j61Q93J252J65p82j107m79
6457a228P16J176O00p02j124o46M94J149P12l50j029r04K33J104R92k58j056r44
6475a065J39R38R91J98j031j072k28R44J043L07p81j078m68O41J132N89n66j184
6493e51p44N88J144Q18n18j062q41K17J117R26j94r66j033K3J042J012J25q73
$$ plain form
6366 696 1274 508 -684 -1237 -613 517 1143 695 -351 -1090 -898 343 1161 919 -170 -1244 -1001 83
6384 83 1074 989 -8 -966 -1150 -193 898 1160 219 -867 -1134 -443 685 1126 573 -619 -1245 -681 551
6403 551 1257 733 -420 -1156 -820 328 1129 933 -153 -1160 -948 94 1113 1036 103 -823 -1103 -243
6421 -243 850 1190 351 -777 -1188 -406 755 1207 584 -571 -1145 -659 441 1235 787 -430 -1158 -889
6439 -889 211 1065 899 -184 -1081 -1110 -28 1007 1059 126 -1009 -1170 -277 975 1140 358 -749 -1228
6457 -1228 -512 664 1264 562 -562 -1208 -714 435 1147 797 -232 -1136 -903 201 1193 935 -121 -1065
6475 -1065 -926 12 1003 1201 170 -902 -1130 -186 857 1164 383 -695 -1163 -522 610 1199 633 -551
6493 -551 -1295 -707 437 1255 737 -325 -1166 -949 168 1094 900 -66 -1099 -1076 -34 978 1103 230
6511B30j099k73Q05J144L67p48j187m55O86J124O45n79j212p14N33J210O42k90
6529H29j126q18K43R90R29j9j059r67l4R85J095J19r33j101k76Q07J129M50q07
6548D36j123n36O30J154O72n41j167p22M06J176P07j62j147j009K05J138R14k9
6566A002j042j022j6R36J042K47r18j103k47P82J116M04p06j121n09N22J169P57
6584A293n70j213p05L53J196P97k13j132r22J70J076R70k7j098r52j25R45J085
6602I28J84q43j143k95P34J257M19o58j188o07N43J200O70m66j118p55L02J184
6620C48P83j79j114q99Q5R89J125j38r49j021j28Q51J152L17q44j248l65P96J122
6639F83M78o32j142n93M87J230P15n39j088o97K56J087Q64j64j116r27L4J078
$$ plain form
6511 230 -869 -1142 -337 807 1174 426 -761 -1216 -530 594 1239 660 -552 -1266 -733 477 1119 829
6529 829 -297 -1115 -872 118 1047 1028 -31 -998 -1032 -47 1048 1167 234 -867 -1143 -336 793 1243 436
6548 436 -687 -1223 -593 561 1233 692 -475 -1197 -791 385 1092 930 -217 -1226 -1021 117 1031 1002
6566 1002 -40 -1062 -1078 -142 900 1147 229 -874 -1121 -339 777 1181 475 -646 -1155 -633 536 1293
6584 1293 723 -490 -1195 -842 354 1151 938 -194 -1116 -946 130 1100 1073 -25 -977 -1102 -157 928
6602 928 1112 269 -874 -1169 -435 822 1241 583 -605 -1212 -669 531 1201 735 -383 -1138 -836 348
6620 348 1131 952 -162 -1061 -976 13 1138 1000 51 -970 -1098 -247 905 1222 378 -870 -1235 -439 683
6639 683 1161 529 -613 -1206 -719 511 1226 687 -401 -1098 -842 245 1109 945 -171 -1098 -1064 14
6657A4R95pr40j038j23Q70J174K27p43j275l05O33J234M73o14j190n99N44J145
6676D75P47l59j168q82K59J136J012k96j039r64L5J068J000J32r99j070k45R02
6694b56J139L16p94j121m11O32J161N86o91j141o36M88J183P50l63j226p45K34
6712h95J111R69k54j051r56qJ018J003J41q91j138k27Q46J213L18q55j102m61
6730a219P90J023O06n90j125p34N28J158P15l40j099q81K92J101Q50l3j122j097
6748a177J15J033J064K2q80j048l40R22J151L04p39j104n69Q40J039N06m07j185
6766d53o70L47J178Q25l40j217q38K19J124Q83j01r64j015m0R70J117P3r22j053
6785h77k20P73J094L86o81j159o07P22J214O46o18j188o38M75J037P93j85j246
$$ plain form
6657 14 1009 1002 62 -976 -1099 -229 945 1172 429 -846 -1151 -518 716 1189 575 -615 -1214 -670 475
6676 475 1222 863 -305 -1187 -928 208 1220 924 -115 -1079 -1044 24 1024 1156 157 -913 -1158 -256
6694 -256 883 1199 405 -716 -1127 -495 666 1252 561 -580 -1216 -728 455 1205 842 -384 -1129 -895
6712 -895 216 1185 931 -120 -1076 -1084 -66 937 1078 187 -951 -1178 -332 881 1199 344 -758 -1219
6730 -1219 -429 594 1200 610 -515 -1249 -721 437 1152 812 -287 -1168 -876 225 1075 1042 -80 -1177
6748 -1177 -1062 -29 1035 1057 177 -871 -1211 -289 862 1166 427 -677 -1246 -406 633 1139 732 -453
6766 -453 -1123 -776 402 1227 887 -330 -1168 -949 175 1058 957 -7 -1022 -1062 -92 1025 1098 176 -877
6785 -877 -1097 -324 770 1156 475 -684 -1291 -569 645 1291 673 -515 -1153 -678 359 1152 967 -279
6803b79q67J93J155R44j37j005j020m0R26R89L13r00j165l01Q32J130M30p45j116
6822f63n15O17J087O30n06j145p09M53J117O97k18j001r70J16J082J029j30r55
6840A6j064l6R74J002K66r05j056l53P33J176M35p05j167m07M78J224N01l41j131
6859c60q83L78J210Q55l61j005q87J11J037R34P7j089j010p4Q94J126J94r09j014
6878g76l71O39J173N63o19j249o10O08J210O23m77j163o70K03J171Q66k70j072
6896b21q79J70J014Q62J0r11r89j76Q70J154L24r05j152l29P59J094N18o39j169
6915e95o51N48J264P01n31j090p63L42J098P80p6j106j004J4J076J101j2j039
6933E7j055n2P96J048L19p35j226m02P80J200L87n41j165n62M67J044P60l07j159
$$ plain form
6803 -279 -1146 -953 202 1146 1009 4 -1016 -1056 -130 859 1172 272 -893 -1194 -362 768 1198 453 -663
6822 -663 -1178 -561 526 1156 650 -495 -1204 -751 366 1063 845 -156 -1126 -1010 72 1101 971 16
6840 16 -1048 -1084 -110 892 1158 253 -803 -1156 -423 753 1188 483 -684 -1091 -613 611 1112 771 -360
6859 -360 -1243 -865 345 1200 839 -166 -1053 -942 95 1029 1106 17 -993 -1067 -173 953 1147 238 -776
6878 -776 -1147 -508 665 1228 609 -640 -1250 -642 568 1191 714 -449 -1119 -916 255 1121 851 -221
6896 -221 -1100 -930 84 946 956 45 -944 -1120 -250 904 1228 323 -829 -1158 -399 695 1213 574 -595
6915 -595 -1246 -698 566 1267 736 -354 -1117 -775 323 1103 1027 -79 -1083 -1069 7 1108 1096 57
6933 57 -998 -1050 -254 794 1113 378 -848 -1250 -470 730 1117 576 -589 -1151 -684 360 1120 813 -346
6952c46q23K76J094R28j51j080r34j19J019J189R7j027j108L0P46J056K94o97
6970D44j107n40P19J194O23o88j151o98N33J138O79l01j158q87K78J192R03k23
6988I50j056q89J4Q44J088J49r02j175k56R00J190L09q22j086l96O40J151N40
7006A193m99j244p21N05J238O65m10j091p43K18J009R66k7j124j013J07R81R32
7024I42J49q22j063l44P86J221L58p90j185l32N72J155M88m38r92q62L62J200
7042D05P87l27j183p56J69R98R60o0r80j020j49J093J027R9q74j077k25P50J068
7061G05M30o22j218n29O22J198N32m37j148p19M18J031Q52k46j147q50J93J112
7079A77Q60l5j032q47k23R22J097K50r27j079k78Q11J102L25o63r73o24N03J241
$$ plain form
6952 -346 -1169 -893 201 1129 978 -102 -1036 -1155 -136 1053 1150 123 -985 -955 -209 847 1141 444
6970 444 -663 -1203 -484 710 1333 645 -506 -1204 -671 467 1146 845 -313 -1200 -922 270 1173 950
6988 950 -106 -995 -981 -137 951 1100 198 -977 -1233 -333 857 1166 344 -742 -1138 -498 653 1193
7006 1193 694 -550 -1271 -766 472 1137 727 -364 -1107 -889 120 1086 1059 -65 -1078 -971 10 942
7024 942 1091 269 -794 -1138 -352 869 1227 437 -748 -1080 -508 647 1135 697 -295 -1157 -795 405
7042 405 1192 865 -318 -1074 -905 93 1053 993 13 -1007 -1156 -63 964 1063 189 -888 -1113 -363 705
7061 705 1135 513 -705 -1234 -612 586 1118 681 -467 -1186 -768 263 1115 869 -278 -1128 -935 177
7079 177 1037 1002 -30 -877 -1100 -178 919 1169 242 -837 -1115 -304 798 1123 460 -513 -1137 -634 607
7098F07O24n15j170p42M32J133O96k64j001q90K3J137R32m9r77r05j59P67J194
7117H73K65p75j228l72P88J264L68p63j060m64N00J106O25l73j199p46M24J120
7135C53Q27l07j074q53Q8R41J103L0j049j085o2R52J114Q5p62j016m22O96J172
7154G31M77n94j259n32N60J127O36l69j134p91L41J073R15j89j171r21J38J023
7172F1R43m7q69j092p7Q14J167K47q77j089l92Q08J065M82n31j236n61N43J199
7191E58O36n21j023p36K85R95Q43n5j043j024N4J050R56M9r23r84k71Q87J132
7210H65K79p65j165m52Q17J051N18n88j038o49L91J116Q05m19j084p80K26J086
7228B14Q51j24r62j020m5J082J016N8r53j076j56Q64J007L84p40j101m54O74J112
$$ plain form
7098 607 1231 716 -454 -1196 -764 369 1065 801 -200 -1090 -1067 70 1002 953 -24 -929 -1088 -321 873
7117 873 1138 363 -865 -1237 -449 815 1183 420 -640 -1104 -604 502 1127 754 -445 -1191 -767 353
7135 353 1180 873 -201 -1054 -966 -25 1078 1108 59 -1026 -1088 -136 978 1063 301 -715 -1137 -441 731
7154 731 1208 614 -645 -1177 -617 510 1146 777 -357 -1148 -807 266 1181 992 -179 -1100 -962 61
7172 61 1004 957 88 -1004 -1081 -267 900 1147 270 -819 -1211 -403 662 1144 613 -623 -1184 -641 558
7191 558 1194 673 -350 -1086 -801 194 1037 982 -61 -1085 -1031 19 975 1024 101 -883 -1154 -267 865
7210 865 1144 379 -786 -1238 -421 630 1148 560 -478 -1127 -736 380 1185 766 -318 -1098 -872 214
7228 214 1065 941 -21 -1041 -1086 -4 1012 1070 117 -959 -1115 -251 756 1140 400 -701 -1155 -481 631
7247F31N20n41j132o33M61J114P39l20j126q65K75J091Q44q7j062r55R3Q63J014
7266I24R6r02j002k17Q04J114L16p11j121n34O46J186N89n71j184n65M33J124
7284D25O83l19j084p90J47J033R62l8j049j006nR56R94J61q48j038l06P70J194
7303H42L82q16j139l78O23J110M44l87j141p01M30J134O95k33j128p77J58R82
7321A00R77m0j012j051l8R41J089M0q40j057k12P36J111L83o72j149m16N51J108
7340E49N65m38j100p02L61J101Q40k50j199q26K23J015Q88r2r41r82m3Q90J032
7359H91K14p77j215k28P11J117M17o39j085n84O00J187N64m68j113p34L49J133
7377C40O62j83j015q30J14R11J000Kr03j060j57R62J070J54q30j098k69P07J123
$$ plain form
7247 631 1151 610 -522 -1155 -694 420 1159 839 -287 -1152 -877 214 1058 971 -91 -1046 -953 -90 924
7266 924 1020 118 -884 -1101 -297 817 1133 422 -699 -1233 -587 599 1188 617 -567 -1132 -699 425
7284 425 1108 789 -295 -1085 -938 95 1057 1019 -30 -1036 -1041 -85 909 1070 222 -816 -1122 -352 842
7303 842 1224 408 -731 -1109 -486 624 1068 681 -460 -1161 -731 403 1098 865 -263 -1040 -882 100
7321 100 1077 1037 25 -1026 -1064 -123 966 1006 166 -891 -1103 -367 744 1127 455 -694 -1110 -559 549
7340 549 1114 676 -424 -1126 -765 336 1176 926 -273 -1099 -876 139 1027 935 -6 -988 -1031 -141 891
7359 891 1105 328 -887 -1115 -404 713 1130 491 -594 -1178 -578 609 1173 705 -408 -1142 -793 340
7377 340 1002 819 -196 -1026 -912 -1 999 1001 98 -962 -1119 -157 913 1067 237 -861 -1130 -423 700
7396G00M04o20j147n35O24R73P50m16j111p40L06J079P73j33j040q82N6J009R50
7415A000M4r20j060j13R41R89K37q11j019l46O78J101L90n46j108n87N22J070
7433D62O61l92j074q38L22J110Q26j53j085r23J57R38R69n2q66j036rP68R79L43
7453A107p97j111m18P40J075N35o00j131o28O00J083P13l60j163p80L53J015Q20
7471A053j67r54q65n4R50J027Q0r27j021j78Q58R63K97o52j080m37O39J123N17
7490A172n81j170n30M65R82O93l20r76p72K06J031Q18j10j032r51O8R22J029P9
7509A023q05j150k06Q50J087K82q12r76l86N86J090N54n14j135o44N12J125O05
7527A086k75j091q23K62J020Q99o0j078r91Q7R54R15R7q59q93k84O51J198L24
$$ plain form
7396 700 1104 484 -663 -1198 -574 399 1149 733 -378 -1118 -812 267 1040 907 -133 -1015 -959 50 1000
7415 1000 1044 124 -936 -1049 -108 881 1118 307 -712 -1058 -380 721 1111 565 -543 -1130 -608 462
7433 462 1123 731 -343 -1181 -859 251 1077 924 -161 -1084 -927 11 980 928 62 -974 -983 -215 764 1107
7453 1107 310 -801 -1219 -479 596 1131 531 -600 -1228 -628 455 1168 808 -355 -1135 -782 233 1053
7471 1053 886 -68 -933 -987 -37 990 1070 143 -878 -1056 -198 765 1062 410 -670 -1107 -468 655 1172
7490 1172 591 -579 -1109 -644 338 1031 711 -265 -1037 -831 200 1018 908 -124 -1075 -1007 -85 944 1023
7509 1023 218 -932 -1138 -288 799 1081 269 -707 -1093 -507 583 1137 623 -512 -1156 -644 481 1086
7527 1086 811 -280 -1103 -841 179 1078 1018 -60 -1051 -964 -10 905 1002 143 -750 -1034 -383 815 1139
7546A139p45j125l89O06J097M96n12r93p34M10J158P07l30j111p49K38R81Q35
7564I79n0r29r67j14Q86J133J12q87j034k15P37J013M11n67j218m65O60J078M94
7583A057m55j131n02L39J063O51j25j122q13J73J004R04j13r30r11o1Q89R31K92
7602A140r23j033k24P45J061L24n73j147n38N75J122O02n22j051p32M07J043O82
7620I58j58j042q14P0J108R19j38q56r92j7P84R97J73o86j052l77P53J062M95
7639A187p27j053m70N45R65O77l33j172p82L83J153P59l71r22p94Q5R38Q38Q1
7658I87q56j066r2R04R52K38q13r80l18O47J049N09o30j175m69O20R34N97m01
7677F37r72p46J62J113Q18j51j074p73J03Q78R21N5q42r26k79P80J150K78r03
$$ plain form
7546 1139 394 -731 -1120 -514 583 1079 567 -426 -1160 -750 408 1115 785 -326 -1075 -837 144 979
7564 979 929 0 -967 -1081 -195 938 1050 163 -871 -1086 -349 664 1075 508 -710 -1175 -515 563 1057
7583 1057 602 -529 -1031 -692 371 1022 897 -225 -1038 -865 139 1043 930 0 -911 -972 -83 848 1140
7602 1140 217 -816 -1040 -295 766 1090 517 -630 -1168 -593 529 1131 609 -442 -1174 -767 276 958
7620 958 800 -242 -1056 -986 122 1041 903 47 -945 -962 -178 819 992 306 -746 -1123 -370 692 1187
7639 1187 460 -593 -1063 -518 447 1124 791 -381 -1163 -780 373 1132 761 -161 -955 -870 68 906 987
7658 987 131 -935 -1027 -123 829 1067 254 -726 -1044 -397 652 1161 531 -644 -1113 -493 441 1038 637
7677 637 -335 -1081 -919 194 1012 861 -213 -986 -883 -5 916 971 129 -797 -1076 -296 854 1132 229
7696B29j019k69O73J043M34n59j049o15M89J174O42n26r82o24K06J002Q20j13
7714I56j040r33Q7R55R82rr29q95j21P44R20L54p84j070l42P12J015M70n68r55
7734d51o61M50R86P68l80j129p24L64J022P39j43r16q51n1Q43J105P4r55r76j33
7754a019P54R80K90o27r80m97O07J144N07n99j079n39N02R36O97l02r93p76J99
7773g95J020Q18j68r54p95m3P76J002J14o89j108k85Q51J016L12p22r63n07O14
7792e06J017O04m60j165o06M25J055N59j29r82q03J65R28R28m7j056r40K7R58
7811b8Q72J58p60r83l19P09J069L38o61j013m05M93J073N40m16j029p03K78J173
7830C86P21l38j065o48J85P83Q72M7r34r57m9R06R74N2p59r10k60N91J057M50
$$ plain form
7696 229 -790 -1059 -386 657 1091 532 -517 -1132 -643 531 1173 647 -335 -959 -753 249 1069 956
7714 956 -84 -1017 -930 25 1007 998 69 -826 -947 -203 717 1071 287 -783 -1125 -413 602 1072 504 -451
7734 -451 -1112 -662 324 1092 712 -417 -1141 -777 245 984 841 -75 -926 -977 -134 971 1045 90 -886 -1019
7754 -1019 -265 715 1005 378 -602 -1099 -492 652 1159 560 -519 -1058 -556 380 1077 775 -218 -994 -795
7773 -795 225 1043 875 -79 -874 -917 -141 861 975 286 -822 -1107 -256 760 1072 350 -613 -1120 -506
7792 -506 511 1115 655 -510 -1116 -691 364 923 794 -188 -991 -826 102 1030 983 -73 -1013 -986 -28
7811 -28 844 1002 242 -741 -1060 -351 718 1056 395 -618 -1023 -530 543 1083 667 -362 -1065 -787 386
7830 386 1107 769 -296 -944 -759 24 896 943 9 -948 -997 -91 883 935 176 -734 -994 -403 654 1104
7850A104o89j002n67O35J092M37m17r96o24K93J005Q08k71j026p69J60R28Q26
7868I27n0p68r73j49Q73R30L06q46j061k26Q10R49L27n81j000n52N13J084N66
7887A079m85r32o48K35R39O96n2r13r84J31R74R39j4r83q47p5P40J016J37o87
7907B66r56l43O67J026M20o83q71m71M21R62O02k78j091p35L57J040P62k66j046
7926b17p32R0Q50Q62J18q32j063PP19R71K09o75r62m26O37J099M47o00j112m69
7946a079N03R54O09k83j020o96J95J092P33k56r33p06M3Q26Q67J66q65r42k62
7965a054P91J090K36p91r34l81O37R63M78n01j040n23M52J004N84l33r63o95K14
7984g66R77Q06j38r42q55K1Q78Q95J01q44r31j86P47J029K57p29r84l84O58R50
$$ plain form
7850 1104 415 -587 -1154 -519 573 1010 593 -403 -1027 -734 271 1079 808 -218 -987 -827 101 927
7868 927 877 109 -864 -1013 -140 790 1096 250 -811 -1037 -227 722 1049 468 -532 -1084 -571 513 1079
7887 1079 594 -338 -986 -751 188 884 832 -81 -1065 -934 40 979 965 -18 -865 -940 -200 816 953 266
7907 266 -690 -1033 -366 660 1080 397 -474 -945 -524 438 1040 762 -329 -1064 -707 333 1095 829 -217
7926 -217 -949 -859 -9 853 971 139 -924 -917 -198 773 982 307 -655 -1081 -444 655 1102 502 -610 -1079
7946 -1079 -576 378 987 704 -316 -1012 -817 275 1008 752 -181 -887 -844 -18 849 1015 150 -792 -1054
7965 -1054 -263 827 1063 272 -662 -1043 -406 557 1035 534 -506 -1029 -577 427 1011 678 -285 -980 -766
7984 -766 211 1017 879 -63 -918 -897 -19 876 977 133 -798 -984 -237 792 1049 320 -664 -1048 -390 560
8004E60M77m66j048n44K86J083O69l31r51p34K38R66P71j30q55q91k8Q54R80O9
8024I75q73r42j43O82R65L16n98r43m68M88J108M70m70j068m76L91R74O23k62
8043G49j009p22J91R01Q63j42p87q88o3Q00R00J96q36r07k89P80R51L55o26j016
8063e99m37N13J109M79n29r62n55L10R70O41k42q77p82J49R19P97n4q34q98l9
8083i21P95R60J71q30q87k48O69J000L51o59q69n16N01R38N91l62j033o58K89
8102g18J036O89k27r20p91J06R05Q18Kq54r42r9Q73R25J32o82r84k62O46R03M42
8123I98n48j024n17N52R99N49m49r50o28L06J055O86k62r55p19O0R01Q14op49
8143A13r17j35P54J021J65p60r31l29O36R79M02n13j009n24N78R73N66m51r17
$$ plain form
8004 560 1037 571 -477 -1021 -735 348 1017 686 -265 -999 -761 205 976 846 -9 -900 -928 -74 906 975
8024 975 102 -840 -983 -301 664 980 382 -561 -1029 -541 567 1037 567 -501 -977 -586 388 1011 749
8043 749 -260 -982 -791 110 973 831 44 -844 -907 -107 793 989 153 -754 -1043 -263 688 1043 417 -599
8063 -599 -1036 -523 586 1065 536 -426 -981 -671 299 940 698 -179 -961 -812 107 904 850 16 -882 -921
8083 -921 -126 834 1005 175 -712 -960 -291 709 1060 401 -468 -984 -483 455 1046 684 -349 -1007 -718
8102 -718 318 1007 780 -140 -931 -825 80 898 900 46 -896 -995 -122 803 935 253 -731 -993 -347 556 998
8123 998 450 -574 -1091 -539 460 1009 560 -390 -1018 -712 343 1029 767 -188 -907 -847 54 868 862 113
8143 113 -804 -939 -185 836 1001 241 -690 -1019 -383 596 998 485 -524 -1048 -470 503 1069 618 -299
8162b99o30J97R74O58j48r25p65J03Q40Q75K7q55q94r4P11R45K22p16q33l55N59
8183d03R67L88m82r34n30M44R53O09
8191A012
$$ plain form
8162 -299 -929 -732 242 900 752 -173 -938 -835 5 880 907 52 -842 -936 -225 720 942 226 -607 -962 -403
8183 -403 564 952 470 -464 -994 -550 403 1012
8191 1012
$$ Imaginary data points
##PAGE= N=2
##DATA TABLE= (X++(I..I)), XYDATA
0@%%%%%%%%%%%%%%%%%%%%%%%lRj1J2j5J6j6J6j6J7k2K6k7K9l1L7m3M5m9N5o1O9
45C7p7Q4r4J07j21J36j58J86k20K69l39M50o44J044k203J1099N4356o666n8026
64g80m5234L342M0177M5790J6417l2390n6412k2360L8280N8906J9534l4345n2326
77b1401k5651K2356N3756L6940j9264n9951m0556J7864N4098L7344j0525m7253
89b243m4203j265M6424M9739P23m9949m9003j585M1367M3718J0800l0870m9947
102c6294k5923K7720N9168L0527l1125n9708k7143K8684N1846K7553j7782m5896
114a8373l4570R603M8786M3145o118n0056m3728M463M6152M5003N268l8813m9458
127c8696j3422L8829N4180J5328l6956m9994j6522K8988M8354K5642k3036n3785
$$ plain form
0 0 0 0 0 0 0 0 0 0 0 0 0 0 0 0 0 0 0 0 0 0 0 0 0 -3 6 -5 7 -8 8 -8 8 -8 9 -13 13 -14 15 -16 21 -22 23 -26 29 -32 37
45 37 -40 44 -50 57 -64 72 -86 100 -120 149 -190 260 -384 660 -1543 9556 63912 57246 -780
64 -780 -46014 -42672 -2495 43295 59712 27322 -29090 -51450 -13170 45736 65270 30925 -21401
77 -21401 -47052 -24696 29060 66000 46736 -13215 -53771 -35907 18191 55535 45010 -2243
89 -2243 -46446 -47711 -1287 48452 49175 -774 -49777 -51362 -9995 33723 44523 13653 -36294
102 -36294 -62217 -34497 24671 55198 24073 -35635 -62778 -34094 17752 45305 27523 -18373
114 -18373 -52943 -43340 5446 48591 42473 -7583 -51311 -46848 -696 44307 49575 10762 -38696
127 -38696 -52118 -13289 40891 56219 19263 -30731 -47253 -18265 30089 55731 32695 -21090
139b1090l1475K4797N4660K8344k1049m4608l0876N073L9402M3939L915m7222
151C810n1185O26M9290M3371k366l8772l9604r723L0075M7118J8767l2568n2193
164c3354j8744L0400M6743K1200k0149m4694l1416J3834M8979L5356j5123m8339
176a5307l2815J0756M1204L6043o12m0395m4927l388M4262M6298K012l9773m0612
189c7254p631K8530M1221J9928k2967m8302k5962K5642N1662K4718k4787m6973
201b2175k4724J7749M3251L1268r482m3333l6875O085M3605L8395k533l8842l8289
214c5900l753L4267M2040R948l3325m4810j1811L2032M3294J4495k5735m2326
226b1584k1930J9860M5532K7631j9529m7002k6818J7354M0308K6033q008l4816
$$ plain form
139 -21090 -52565 -27768 26892 55236 34187 -10421 -41297 -36224 3178 47117 51032 3810
151 3810 -47375 -46749 2541 45912 43546 4774 -34830 -44553 -14478 32640 51407 18839 -33354
164 -33354 -52098 -21698 25045 46245 26096 -18598 -50014 -36180 12799 48155 33032 -15307
176 -15307 -48122 -37366 3838 39881 39269 -1126 -46053 -49441 -5179 41119 43131 3358 -37254
189 -37254 -44885 -16355 24866 44794 21827 -26475 -52437 -26795 24867 49585 24798 -22175
201 -22175 -46899 -29150 14101 45369 35887 -7446 -44321 -38236 5369 43764 41231 2389 -35900
214 -35900 -39653 -5386 36654 46602 13277 -31533 -43344 -11312 31982 46477 20742 -21584
226 -21584 -43514 -23654 21878 49509 29980 -17022 -43840 -26486 13822 39855 31847 -2969
238b969l4058j463L7449M1497J282m1294m0618n66L5647L6968P061k8138m0244
251b9446j5791K6139M3973J7726k5326m1902j9081J8853L9281K5468j2963m1779
263a4848l0647J2234M2807L0559r496l7622l1408J525L4191L7839M860l5680m0659
276c6345m239L4822L7545O310k6793l5197j4157K0558L9809K1941j9986m3419
288a9151k2820K0062M1444K3017j4801l7461k6630Q475L6730L0852n262l6343
300a888l2072K051L2868L2998L128l0019l6397q564K8839L8496J0349k7429l7815
313b5455j3331K1866L6450J8531j7504l8852k3421J5916L9741K3683j4611l6581
325a3568k4035Q294L2297K8546j177l2203l4093j913L3643L5810K923l1197l4448
$$ plain form
238 -2969 -37027 -38490 -1041 40456 41738 444 -40174 -40740 -5093 31875 38936 10798 -29446
251 -29446 -45237 -19098 24875 42601 17275 -24627 -43708 -24855 14426 39894 26931 -14848
263 -14848 -45495 -33261 9546 40105 30609 -7013 -38421 -36896 -2705 35134 39994 4314 -36345
276 -36345 -40584 -5762 31783 38093 11300 -23897 -38054 -17496 22313 44254 24268 -19151
288 -19151 -41971 -21909 19535 42552 27751 -9710 -36340 -27865 8865 39717 34455 -1888
300 -1888 -33960 -31909 959 33957 37085 7066 -29331 -37895 -9056 29440 39789 12360 -25455
313 -25455 -38786 -16920 19530 38061 20557 -18295 -41716 -25800 13941 37624 23013 -13568
325 -13568 -37603 -29309 2988 31534 30357 -1846 -35939 -37852 -4209 31601 34524 3327 -31121
338c1121n959K6722L5069J1759k3316l6472j4682K1351L6626J7561j6867l5095
350a4424k1336J2481L5884K5754r725l5815k6897P368L3344K8022k295l0263l1207
363b9109k750K9682L4104M649k9348l3581o354K4776L1893J0802j9432l3293j7325
376c5286J6386L5691K0240j5657l6072k1747J2689L3874K3483q729l2656k6231
388c4015M921L1209K7808j624k8913k9413k931K6609L1721O935k5106l3265r385
401c5449K3175L3216J2420j9412l2897j6231J6175L3930J9851j3798l4025k1391
413c4436J1683L2612K2585p482k9754k4780K686K8077K8112J631k7328l0608m304
426c1306K6443L1688O496k4376l1557r293K1280L1300J2457j7840l1480j5940
$$ plain form
338 -31121 -37080 -10358 24711 36470 13154 -23318 -38000 -16649 19977 37538 20671 -14424
350 -14424 -35760 -23279 12605 38359 28634 -7181 -34078 -26710 6634 34656 32361 2098 -29109
363 -29109 -31859 -2177 31927 36576 7228 -26353 -32707 -7931 23962 34764 15332 -17961 -35286
376 -35286 -18900 16791 37031 21374 -14698 -36445 -23756 10118 33601 24872 -7784 -34015
388 -34015 -29094 2115 29923 28299 -614 -30027 -32958 -6349 25372 32307 7201 -26064 -35449
401 -35449 -12274 20942 33362 13950 -18947 -35178 -19003 14927 34778 20980 -13045 -34436
413 -34436 -22753 9859 32444 24962 -4792 -29572 -26886 1191 29303 30934 3606 -27002 -31306
426 -31306 -4863 26825 33321 8945 -22612 -31905 -10625 20675 33132 15292 -16188 -32128
438c2128J4502L1527J8921j1632l1281k1607Q538L0445K3611n432k9102k5662
450b9300J743K7632K7558J531k6317k9247m274K4771K9711O713k2180k9616r785
463c1060J8785K9596J3391j5329l0153j7075J2528L0802K0152j0321l1069k1920
475c1673Q259K9986K2822n378k7459k4138J088K5322K6571K738k4206k8289n261
488b9618K2739K8545P963j9591k8828j1623J6695L0059J5020j4933l0494j6634
500c0700J2722K9422J8743r246k8351k1277O235K8031K2709l758k5828k3490k42
513b5030K2957K5875N006k2106k8911p253K2004K9322Q030j9797k7834j0709J5347
526a3099K7788J4587j2689k8830j7372J0916K8116J8433q118k6423k0684M039
$$ plain form
438 -32128 -17626 13901 32822 21190 -10091 -31698 -23160 7285 30896 25464 -3638 -29300
450 -29300 -27557 75 27633 29164 2847 -26400 -30674 -5903 23808 30521 8341 -21275 -31060
463 -31060 -12275 17321 30712 15383 -14770 -31845 -19317 11485 31637 21316 -9753 -31673
475 -31673 -23414 6572 29394 24016 -3443 -27581 -26493 -1171 25400 28138 3932 -24357 -29618
488 -29618 -6879 21666 29629 10038 -18790 -30413 -13718 16341 31361 16428 -14066 -30700
500 -30700 -17978 11444 30187 20941 -7410 -28687 -22452 5579 28288 24530 -1298 -24788 -25030
513 -25030 -2073 23802 28808 6702 -22209 -29462 -7458 21864 29894 10097 -17737 -28446 -13099
526 -13099 14689 29276 16587 -12243 -29615 -18699 9417 27850 19732 -6691 -27375 -23336
538b3336K5369K3330j114k5094k5134j114K3729K5753L715k1515k6577o768J9505
551i251K7607R418j7542k7449j1165J4782K6458J4201j0862k5977j7910P924K7620
564G854K0829o917k7642k0856N529K5104K1235j090k2209k3909l094K1916K6420
577B3170M527k1443k5432o051J7492K4701J0370j4008k6884j4439J3385K8100
589A3488J4999j2269k6111j6287P615K4678J9858m296k5917k2125L999K4777K0682
602B3091j565k0373k1534m353J8319K5720P800j9695k7493p368J8641K5061R127
615B5378j3650k4281j3885J0494K6440J6619j0195k6361j6303Q106K3530J7685
627B3577l521k2234k1211M06K2849K3063P58k1802k2935l196J8690K3499P057
$$ plain form
538 -23336 2033 25363 24249 -845 -25979 -27093 -3364 22389 26104 4589 -21988 -28756 -9251
551 -9251 18356 27774 10232 -17217 -28382 -13600 12858 27059 16197 -9780 -27690 -19766 7854
564 7854 28683 21766 -5876 -26732 -21203 3901 25136 24046 1837 -22072 -25166 -3250 23170
577 23170 27697 6254 -19178 -25229 -7737 16964 27334 13326 -13558 -27997 -14612 13488
589 13488 28487 16218 -9893 -26180 -18565 6113 25971 21675 -4242 -26367 -22368 2409 23091
602 23091 21526 1153 -20381 -24734 -6415 19305 27105 7410 -20083 -27451 -8810 16251 25378
615 25378 11728 -12553 -26438 -15944 10496 27115 16920 -9441 -25744 -17638 5892 23577
627 23577 20056 -2178 -23389 -22983 -134 22929 23687 1885 -21050 -24246 -5556 17943 25000
640B5000j6665k5360r538J5963K5718J0263j4307k4035j1849J0286K3109J5854
652B4439o719k4272j9245N628K5237J9645m653k2792j9040R99J9466K1331L638
665B3662j9086k4122m754J9683K3740N073j6578k1984q831J2180K3869J3666j1480
678A5038k6016j4307J1310K3845J3825o953k1001j7545K490K2399K1009k657k3777
691b340j9814K529J9534J8661L099j5744k2714q329J6744K5757P745j7309k3085
704a5266p477J2392K0720J1992q348k3196j5911Q768K4712J5397q098k1895j5697
717b1907L176J9553J9541Q09k0458k2067j087K0157K0651K260j6576k0147o257
730b2352J3966K2675R479j4168k4055r942J3361K2510J0829r153k0653j4514N162
$$ plain form
640 25000 8335 -17025 -26563 -10600 15118 25381 11074 -12961 -24810 -14524 8585 24439
652 24439 17720 -6552 -25797 -20169 5068 24713 20060 -2732 -21772 -20773 -1307 20024 23662
665 23662 4576 -19546 -24300 -4617 19123 24196 7618 -14366 -23197 -11017 12852 26518 15038
678 15038 -10978 -25285 -13975 9870 23695 16742 -4259 -21804 -19314 3085 24094 21437 -2340
691 -2340 -22154 -19625 -91 18570 21669 5925 -16789 -25118 -8374 17383 25128 7819 -15266
704 -15266 -22743 -10351 10369 22361 14013 -9183 -25094 -16326 8386 23783 15685 -6210 -21907
717 -21907 -18731 822 20363 21172 714 -21353 -22440 -2283 18368 20628 4052 -16095 -22352
730 -22352 -8386 14289 23768 9600 -14455 -24397 -11036 11474 22303 13150 -7503 -22017 -16855
743a6855K1485J7997m041k2475j8094M061K0683J7117j178j7531j8761l227J7003
756c816K2025N060j7470k2365n298J4829K0262Q391j0375k0976j2871R012K3277
769I685J3740j0094k2154j2546P261J8915J4969k239j9602j9424R62K1522J9317
782B0312j526j8529j7127k431J3519J9308Q035j3548k3123q238J5457K2170O932
795B1211j2591j9211j0025P816K0592J5019o860k2675j5139P080K0209J4162k928
808A6660j6703j6639j628J7162K0217K032j8713j9693j649J6125J8284N125j2522
821H058k0371r544J2087K2314R985j1957k0628r752Q380J7722J2371m238j8485
834d058j6286L097K0477J6888l507j9459j6235Q96J6293J7611L396j5190k0114
$$ plain form
743 -16855 4630 22627 18586 -3889 -21983 -17922 2761 19878 18700 1169 -17592 -20819 -3816
756 -3816 18209 23269 5799 -16566 -21864 -7035 13227 21618 11243 -9733 -22604 -13592 9685
769 9685 23425 13331 -8823 -21369 -14108 4807 19776 17537 -2065 -21489 -20527 995 20312
782 20312 18786 257 -16870 -19301 -5782 13526 21561 8013 -15110 -23348 -7891 14279 21211
795 21211 8620 -10591 -20616 -12800 7792 22811 15951 -6724 -21863 -14783 5426 19588 16660
808 16660 -43 -16682 -18310 -1148 19069 21101 2388 -17305 -18954 -2829 15455 20580 8058
821 8058 -12313 -21857 -9770 12544 22529 10572 -10056 -19808 -11428 6294 18665 14427 -4058
834 -4058 -20344 -17247 3230 20118 16611 -2848 -19083 -18187 -1894 15717 19113 3923 -16191
847a6191n223J5389J9927N130j3216j7871p109R420J8259J1347p944k0828j2929
860b1839Q601K0776J2453o288j7957j4075J861J7259J7656L0j8541j7904P22J7031
874b15J5763J329j2712j6709o282J1651K0249Q623j3105k0924p843J1439J8411
887I675R539o923j8000j3480N181J9783J4347n814j8889j2870L730J5530J4312
900A6121Q49j4950j8153k797J6361J8775K767j4801j7190m998J0807J7797Q822
913A9410r706j9945j0033J0547J9406Q876q760j6650j0559M301J6237J4533k163
926A5494j8026j6172K018J7384J5221k44j4439j5740l367J3099J8111N051j3886
939D504j8516m622J2565J6931O308q928j6689j0175O817J8686J2330o755j8539
$$ plain form
847 -16191 -21414 -6025 13902 19032 5816 -12055 -19164 -9744 8515 19862 11918 -8910 -21839
860 -21839 -13238 7538 19991 13703 -4254 -18329 -16468 791 18447 18477 -64 -17968 -17246 -215
874 -215 15548 16877 4165 -12544 -18826 -7175 13074 21697 8592 -12332 -20175 -8736 9675
887 9675 19214 12291 -5709 -19189 -14008 5775 20122 14308 -4581 -17451 -13721 1809 16121
900 16121 16970 2020 -16133 -18930 -2569 16206 18973 4172 -13018 -18016 -7209 10588 19410
913 19410 9704 -10241 -20274 -9727 9679 18555 9795 -6855 -17414 -13113 3124 17657 15494
926 15494 -2532 -18704 -16686 698 15919 15675 1236 -14504 -17871 -4772 13339 18390 4504
939 4504 -14012 -18634 -6069 10862 17170 8242 -8447 -18622 -11805 6881 19211 12456 -6083
952f083j1838N323J6223J2800j679j5210j5536q7J6541J6788k02j5984j5369j206
966a5519J2627J5406N331j0519j7779p965J0741J8594P859r755j7011q733O536
979a0187J6177J1725m749j7663j3504M710J7536J2717l401j5029j3244n26J3354
992b084J5657K943j3765j7015l220J3195J5849M181j0253j5751p568Q711J7731
1005H611R493q946j8196r082P958J6138R788m230j4743j2535J642J5655J4492
1018A6045j177j5525j4069L76J3520J4245K664j2030j6229m733J2353J7292M997
1031A7729j1497j6078n987Q580J5236Q775o229j6339j0912N796J6690J0884m784
1044A1864j5123j1679J915J4036J3927J30j4691j5329o81J4229J4667J460j1874
$$ plain form
952 -6083 -17921 -12598 3625 16425 14746 -464 -16000 -16087 454 17242 17040 1056 -14313 -15519
966 -15519 -2892 12514 17845 7326 -10453 -18418 -7677 10917 18776 9021 -7990 -16723 -10187
979 -10187 5990 17715 12966 -4697 -18201 -13491 4045 16762 13361 -1668 -14912 -15438 -2084
992 -2084 13573 16516 2751 -14264 -17484 -4289 11560 15741 5488 -10263 -17831 -9120 8611
1005 8611 18104 9158 -9038 -18120 -10162 5976 15764 11534 -3209 -15744 -14102 1553 16045
1018 16045 14868 -657 -14726 -14350 -830 13415 16079 4049 -12180 -16913 -4560 12732 17729
1031 17729 6232 -9846 -15833 -7253 7983 16758 10529 -5810 -16722 -10926 5764 16648 11864
1044 11864 -3259 -14938 -13023 1013 14940 15070 379 -14950 -15631 -1402 13265 14725 2851
1057B851j4208m353R705J5428O697r300j6367p331Q580J5533Q291o285j4952j0484
1071a6195M373J5645J2186l659j5856j2013K742J4080J2213j46j2311j3850k185
1084a4976J2263J5076L098j1779j4745m098R824J4716O522q067j5760q478P725
1097h679J6317Q844p073j5178r196M621J4051J0967k359j4046j2538J140J3862
1110G33J2995O0j2558j3478k140J1304J4579M030j0914j5348m876J0185J4876
1123I448N660q231j4394p437O292J4552R243n141j4685j0159L998J3906J0901
1136A3953k038j3064j2339J98J2815J3500R27j2567j3766j704J1313J3412L456
1149A4096r460j3934n453Q361J4470O831p437j4469p832N980J4053R225m263j4043
$$ plain form
1057 2851 -11357 -15710 -6005 9423 16120 6820 -9547 -16878 -8298 7235 15526 9241 -5711 -16195
1071 -16195 -11822 3823 16009 12350 -3506 -15519 -12777 1303 13516 13370 1059 -12791 -14976
1084 -14976 -2713 12363 15461 3682 -11063 -15161 -5337 9379 15901 7834 -7926 -16404 -8679
1097 -8679 7638 16482 9409 -5769 -14965 -10344 3707 14674 12315 -1731 -14269 -13129 733
1110 733 13728 13788 1230 -12248 -14388 -3084 11495 15525 4611 -10737 -15613 -5428 9448
1123 9448 15108 6877 -7517 -14954 -8662 5890 15133 9992 -4693 -14852 -10854 3052 13953
1136 13953 11915 -1149 -13488 -13290 -475 13025 13952 1385 -12381 -14085 -2772 10640 14096
1149 14096 4636 -9298 -14751 -6390 8080 14911 7474 -6995 -14827 -8847 5206 14431 10168 -3875
1163c875j0742L191J4102J1402k296j3257j1519N61J1962J2422J426j1124j3496
1176a1243k778J0598J3663M021r186j3614n766P637J4250P508o850j4644q182
1189a4586O033J4010Q745m309j3230r953K565J2713J1081j185j2180j1692l85
1202a2373J1109J2469K204j0508j3372l416R823J3491M484q773j3464n822P347
1215f801J3658O988o265j3475p897M779J2812R091l044j2457j0498J647J2376
1228I14J1433n95j1764j1912q49J1067J2630K219j0333j3048l160R504J2796M279
$$ plain form
1163 -3875 -14617 -11426 2676 14078 11782 -1475 -12994 -12433 -471 11951 13377 2253 -11243
1176 -11243 -14021 -3423 10240 14261 5075 -8539 -14305 -6668 7582 15090 8240 -6404 -14586
1189 -14586 -8553 5457 14202 9893 -3337 -13290 -10725 1988 13069 11884 -296 -11988 -12373
1202 -12373 -1264 11205 13409 2901 -10471 -13887 -4064 9427 13911 5138 -8326 -14148 -6801
1215 -6801 6857 13845 7580 -5895 -13792 -9013 3799 12890 9846 -2611 -13109 -11462 914
1228 914 12347 11752 -12 -11924 -12773 -1706 10924 13143 2810 -10238 -13398 -3894 8902 13181
$$ [...]
8191A84
##END NTUPLES=NMR FID
##END=
