##TITLE=1H_AM A491
 CDCl3, 8 sc, 
 4.7.2019
##JCAMPDX= 6.0         $$ Bruker NMR JCAMP-DX V2.0
##DATA TYPE= NMR FID
##DATA CLASS= NTUPLES
##ORIGIN= UXNMR, Bruker Analytische Messtechnik GmbH
##OWNER= root
$$ XWIN-NMR		Version 3.5
$$ Thu Jul  4 14:07:47 2019 Russian Standard Time (UT+4h)  she@DPX200
##.OBSERVE FREQUENCY= 200.13155
##.OBSERVE NUCLEUS= ^1H
##.DELAY= (6, 6)
##.ACQUISITION MODE= SIMULTANEOUS
##.ACQUISITION SCHEME= undefined
##.AVERAGES= 8
##.DIGITISER RES= 18
##SPECTROMETER/DATA SYSTEM= spect
##.PULSE SEQUENCE= zg30
##.SOLVENT NAME= Pyr
##.SHIFT REFERENCE= (INTERNAL, Pyr, 0, 15.7039)
##AUDIT TRAIL= $$ (NUMBER, WHEN, WHO, WHERE, WHAT)
$$ ##TITLE= Audit trail, XWIN-NMR		Version 3.5
$$ ##JCAMPDX= 5.01
$$ ##ORIGIN= Bruker BioSpin GmbH
$$ ##OWNER= she
$$ F:/spectra/data/she/nmr/H-F/1/audita.txt
$$ ##AUDIT TRAIL=  $$ (NUMBER, WHEN, WHO, WHERE, WHAT)
(   1,<2019-07-04 14:06:36.09 +0400>,<she>,<DPX200>,
      <created by zg, POWCHK disabled, PULCHK disabled
       configuration hash MD5:
       00 E9 B6 7A A2 85 ED C7 34 08 36 98 17 FE 4E 26
       data hash MD5: 16K
       D7 95 45 A7 90 38 0B 36 BD B8 6F 71 08 54 EE 99>)
$$ ##END=
$$ 
$$ hash MD5
$$ E4 CC 44 1F 67 99 10 D3 53 EF 29 10 17 CA 65 DF
##$RELAX= 
##$RELAX= 
##$RELAX= 
##$RELAX= 
##$RELAX= 
##$RELAX= 
$$ Bruker specific parameters
$$ --------------------------
##$DU= <F:/spectra>
##$EXPNO= 1
##$NAME= <H-F>
##$PROCNO= 1
##$TYPE= <nmr>
##$USER= <she>
##$AMP= (0..31)
100 100 100 100 100 100 100 100 100 100 100 100 100 100 100 100 100 100 
100 100 100 100 100 100 100 100 100 100 100 100 100 100 
##$AQSEQ= 0
##$AQ_mod= 1
##$AUNM= <au_zg>
##$AUTOPOS= <>
##$BF1= 200.13
##$BF2= 200.13
##$BF3= 200.13
##$BF4= 200.13
##$BF5= 200.13
##$BF6= 200.13
##$BF7= 200.13
##$BF8= 200.13
##$BYTORDA= 1
##$CFDGTYP= 0
##$CFRGTYP= 5
##$CHEMSTR= <none>
##$CNST= (0..31)
1 1 145 1 1 1 1 1 1 1 1 1 1 1 1 1 1 1 1 1 1 1 1 1 1 1 1 1 1 1 1 1 
##$CPDPRG= <>
##$CPDPRG1= <>
##$CPDPRG2= <>
##$CPDPRG3= <>
##$CPDPRG4= <mlev>
##$CPDPRG5= <mlev>
##$CPDPRG6= <mlev>
##$CPDPRG7= <mlev>
##$CPDPRG8= <mlev>
##$CPDPRGB= <>
##$CPDPRGT= <>
##$D= (0..31)
0 1.2 0 0 0 0 0 0 0 0 0 0.03 0 0 0 0 0 0 0 0 0 0 0 0 0 0 0 0 0 0 0 0 
##$DATE= 1562234795
##$DBL= (0..7)
120 120 120 120 120 120 120 120 
##$DBP= (0..7)
150 150 150 150 150 150 150 150 
##$DBP07= 0
##$DBPNAM0= <>
##$DBPNAM1= <>
##$DBPNAM2= <>
##$DBPNAM3= <>
##$DBPNAM4= <>
##$DBPNAM5= <>
##$DBPNAM6= <>
##$DBPNAM7= <>
##$DBPOAL= (0..7)
0.5 0.5 0.5 0.5 0.5 0.5 0.5 0.5 
##$DBPOFFS= (0..7)
0 0 0 0 0 0 0 0 
##$DE= 6
##$DECBNUC= <off>
##$DECIM= 24
##$DECNUC= <off>
##$DECSTAT= 4
##$DIGMOD= 1
##$DIGTYP= 9
##$DL= (0..7)
0 120 120 120 120 120 120 120 
##$DP= (0..7)
150 150 150 150 150 150 150 150 
##$DP07= 0
##$DPNAME0= <>
##$DPNAME1= <>
##$DPNAME2= <>
##$DPNAME3= <>
##$DPNAME4= <>
##$DPNAME5= <>
##$DPNAME6= <>
##$DPNAME7= <>
##$DPOAL= (0..7)
0.5 0.5 0.5 0.5 0.5 0.5 0.5 0.5 
##$DPOFFS= (0..7)
0 0 0 0 0 0 0 0 
##$DQDMODE= 0
##$DR= 18
##$DS= 0
##$DSLIST= <SSSSSSSSSSSSSSS>
##$DSPFIRM= 0
$$ [...]
##$SUBNAM2= <"">
##$SUBNAM3= <"">
##$SUBNAM4= <"">
##$SUBNAM5= <"">
##$SUBNAM6= <"">
##$SUBNAM7= <"">
##$SUBNAM8= <"">
##$SUBNAM9= <"">
##$SW= 24.9336996594482
##$SWIBOX= (0..15)
0 0 2 0 0 0 0 0 0 0 0 0 0 0 0 0 
##$SW_h= 4990.01996007984
##$TD= 16384
##$TD0= 1
##$TE= 0
##$TE2= 300
##$TE3= 300
##$TEG= 300
##$TL= (0..7)
0 120 120 120 120 120 120 120 
##$TP= (0..7)
150 150 150 150 150 150 150 150 
##$TP07= 0
##$TPNAME0= <>
##$TPNAME1= <>
##$TPNAME2= <>
##$TPNAME3= <>
##$TPNAME4= <>
##$TPNAME5= <>
##$TPNAME6= <>
##$TPNAME7= <>
##$TPOAL= (0..7)
0.5 0.5 0.5 0.5 0.5 0.5 0.5 0.5 
##$TPOFFS= (0..7)
0 0 0 0 0 0 0 0 
##$TUNHIN= 0
##$TUNHOUT= 0
##$TUNXOUT= 0
##$USERA1= <user>
##$USERA2= <user>
##$USERA3= <user>
##$USERA4= <user>
##$USERA5= <user>
##$V9= 5
##$VALIST= <valist>
##$VCLIST= <CCCCCCCCCCCCCCC>
##$VD= 0
##$VDLIST= <DDDDDDDDDDDDDDD>
##$VPLIST= <PPPPPPPPPPPPPPP>
##$VTLIST= <TTTTTTTTTTTTTTT>
##$WBST= 1024
##$WBSW= 4
##$XGAIN= (0..3)
0 0 0 0 
##$XL= 0
##$YL= 0
##$YMAX_a= 48376
##$YMIN_a= -39767
##$ZGOPTNS= <>
##$ZL1= 120
##$ZL2= 120
##$ZL3= 120
##$ZL4= 120
##$ABSF1= 10
##$ABSF2= 0
##$ABSG= 5
##$ABSL= 3
##$ALPHA= 0
##$AQORDER= 0
##$ASSFAC= 0
##$ASSFACI= 0
##$ASSFACX= 0
##$ASSWID= 0
##$AUNMP= <proc_1d>
##$AZFE= 0.1
##$AZFW= 0.1
##$BCFW= 1
##$BC_mod= 2
##$BYTORDP= 1
##$COROFFS= 0
##$CY= 11.3945322036743
##$DATMOD= 1
##$DC= 2
##$DFILT= <>
##$DTYPP= 0
##$F1P= 18.9103706918063
##$F2P= -1.10871071338519
##$FCOR= 0.5
##$FTSIZE= 0
##$FT_mod= 4
##$GAMMA= 1
##$GB= 0.15
##$INTBC= 1
##$INTSCL= 1
##$ISEN= 128
##$LB= 0.24
##$LEV0= 0
##$LPBIN= 0
##$MAXI= 10000
##$MC2= 0
##$MEAN= 0
##$ME_mod= 0
##$MI= 1.114404
##$NCOEF= 0
##$NC_proc= 0
##$NLEV= 6
##$NOISF1= 3.799351
##$NOISF2= 2.8
##$NSP= 1
##$NTH_PI= 0
##$NZP= 0
##$OFFSET= 15.70392
##$PC= 1
##$PHC0= -8650.241
##$PHC1= 6.000959
##$PH_mod= 1
##$PKNL= yes
##$PPARMOD= 0
##$PSCAL= 0
##$PSIGN= 0
##$REVERSE= no
##$SF= 200.130013532006
##$SI= 16384
##$SIGF1= 3
##$SIGF2= 2
##$SINO= 400
##$SIOLD= 16384
##$SREGLST= <1H.CDCl3>
##$SSB= 0
##$STSI= 0
##$STSR= 0
##$SW_p= 3612.71676300578
##$SYMM= 0
##$S_DEV= 0
##$TDeff= 0
##$TDoff= 0
##$TI= <>
##$TILT= no
##$TM1= 0
##$TM2= 0
##$TOPLEV= 0
##$USERP1= <user>
##$USERP2= <user>
##$USERP3= <user>
##$USERP4= <user>
##$USERP5= <user>
##$WDW= 1
##$XDIM= 8192
##$YMAX_p= 0
##$YMIN_p= 0
$$ End of Bruker specific parameters
$$ ---------------------------------
##NTUPLES= NMR FID
##VAR_NAME=  TIME,          FID/REAL,        FID/IMAG
##SYMBOL=    X,             R,               I
##VAR_TYPE=  INDEPENDENT,   DEPENDENT,       DEPENDENT
##VAR_FORM=  AFFN,          ASDF,            ASDF
##VAR_DIM=   8192,          8192,            8192
##UNITS=     SECONDS,       ARBITRARY UNITS, ARBITRARY UNITS
##FACTOR=    0.0002004,     1,               1
##FIRST=     0,             0,               0
##LAST=      1.6414764,     0,               0
##MIN=       0,             -39767,          0
##MAX=       1.6414764,     48376,           0
$$ Real data points
##PAGE= N=1
##DATA TABLE= (X++(R..R)), XYDATA
$$ [...]
1483I45n23j151m53J075J295J98j310j166L22J364M35m89m10l4k16l88L70J185
1501A049L00j341j406M71J683O93r19j238j57O18M71J91J2l34n69m51L63Q98N40
1520H74m71j218o28Q06J266L50q91j102p2Q17P19m0l92j91k02k47K02R56O67p05
1540D98j617j70J410J408n07j422m55P37N80o5O1J93l96q73j33J184R56l27j374
1559c12q14O68J257M22p48r31l55N07M65L13q6j86o44m80K95R79O87o55j320n28
1579a466R83J278O7r77p79J00N33M45l6J58j34p11n19P09J268L12j189j182L28
1598h12J245P09n08p89l29K31L57L25K46mn80p82O9R90R47l93j236p40O71J127
1618G44K72o44o30l06K19M11L09J61l35o87m82L99J039N81q09j225m00J091J131
$$ plain form
1483 945 422 -729 -1182 -107 1188 1386 76 -1090 -768 596 1031 542 132 98 -118 -506 -136 1049
1501 1049 1349 8 -1398 -927 756 1449 530 -708 -865 -247 224 415 427 93 -476 -927 -564 334 874
1520 874 403 -815 -1443 -637 629 979 88 -1014 -1086 -269 450 410 18 -173 -375 -622 -420 536 1203 498
1540 498 -1119 -1289 121 1529 1022 -400 -855 -118 462 397 458 651 255 -618 -751 433 1389 1062 -312
1559 -312 -1126 -458 799 1221 473 -458 -813 -306 159 472 386 200 -444 -924 -629 350 1037 382 -938 -1466
1579 -1466 -483 795 862 -115 -894 -794 -261 184 148 306 172 -539 -1058 -349 919 1231 42 -1140 -812
1598 -812 433 1142 634 -155 -484 -253 104 429 675 671 91 -691 -622 368 1315 922 -314 -1054 -383 744
1618 744 1016 372 -258 -564 -345 66 375 536 201 -486 -968 -569 470 1051 242 -983 -1383 -292 839
1637H39j87q67n20J36K73K88L91K69n50r57j87R93J134j06j182q20M10R91N10
1656H58l13n88k59j14K65N80M78k14r31n65L48J083N42n00r96n88N18R37M33n13
1676D61p26k66J34L97L80K33k76r22m74O07J067L54r37j116O5Q71O67j09n04l58
1696d52k13J58L55O40J44p50q78J56R37Q05k77r72n35M35O62M69K7n28n48k33
1716e98N03P29L01m85o94m78M03Q11N68l84j009m50M70Q91J61l53n11l66KM00
1736h9N89K10n79q44k19O96R14O9p77p44j16O83N76J16l55n96m39K98O98N71k03
1757D59q06m81J39P84O36j11p17o04M7P34O85J5o84n82lM53N71K83l41p45l66
1778f34L52R23L01m20p84l05K23P34M67k23p58n71J24O51M78N1o02o26j04N42
$$ plain form
1637 839 652 -215 -735 -599 -326 -38 353 622 72 -885 -1072 -79 1055 949 -233 -1053 -643 348 858
1656 858 545 -43 -302 -416 -151 429 907 693 -238 -803 -455 628 1170 670 -326 -914 -396 541 974 461
1676 461 -265 -531 -397 0 380 613 337 -585 -1059 -452 615 969 32 -1084 -1019 -148 519 410 -94 -452
1696 -452 -665 -507 -152 488 632 -118 -996 -840 97 902 625 -347 -882 -447 215 684 711 183 -365 -598
1716 -598 -95 634 935 450 -244 -722 -319 492 1060 676 -333 -783 -313 578 739 386 -125 -491 -489 -89
1736 -89 500 710 131 -713 -932 -236 678 747 -30 -774 -890 -207 369 485 130 -466 -905 -607 91 662 459
1757 459 -347 -828 -689 95 731 620 -97 -701 -654 80 765 780 96 -486 -489 -36 535 818 477 -268 -634
1778 -634 -282 641 942 522 -262 -567 -344 390 857 634 -124 -695 -571 80 558 609 7 -619 -723 -181
1798a81O12K60n71p83k64N12P82L33n75o86k89N14N66K27j38m93n79N7P51O72
1818G27r7q71m61J48O33N77n7m33o13j01M45Q49J51o45n69k21M28N71L80k69p01
1839a29n76J51Q77O78m60p59n25L48O38K90q7m73m40k26L55P84L70o99r12k06
1859a001P54P11Q6n49n04k53K30O26N64k71o86n07K66O62M00J3n62n32j56O82
1879b7Q49Qp72o71J51N71M95%l14l54m46K00P16N18k57r53n13M70Q55L31m17o48
1901b08l10P1M74M52J48m65p99j80O36P43L1n41o53k69N12P10L01m93q01j32M80
1922b93N06J71k07l29m76j01O74Q02p2q66o37L10P77M54j44n22m16r4M46N50K59
1943G92l63o66l92M34P32L13k76p49m56L40P75K82k42p07l35J37M68M01o8l39
$$ plain form
1798 -181 431 691 120 -663 -927 -415 367 700 125 -561 -850 -336 230 457 319 -174 -753 -696 55 727
1818 727 630 -241 -702 -554 79 656 599 166 -447 -548 -103 746 897 252 -317 -538 -110 461 841 572 -129
1839 -129 -705 -554 323 1001 541 -218 -743 -395 243 533 446 -27 -467 -693 -338 446 816 117 -795 -1001
1859 -1001 -247 464 550 1 -503 -756 -526 100 664 393 -293 -800 -534 128 528 541 -21 -553 -709 -27
1879 -27 822 830 58 -613 -462 109 604 604 290 -64 -510 -310 406 924 667 -286 -799 -329 526 857 440 -208
1901 -208 -518 -447 27 479 627 162 -637 -817 -181 562 593 52 -601 -870 -358 352 653 160 -641 -773 -293
1922 -293 213 384 177 -152 -628 -729 -55 747 675 -191 -828 -518 259 713 569 47 -369 -463 -17 533 792
1943 792 429 -237 -629 -195 537 850 574 -175 -631 -291 484 766 524 -183 -518 -381 87 488 420 81
1963H1o16j41L62Q63K28p25q80k8O69O05l2m08l58k84J08O30M77q1q26n32K93
1984e95P64M96k57n08n17rO53O79j00n59m99j6M42M79K47k53o27m70L65Q19M34
2005I68m93p66k75L99O47J47k33l66m11j26N39O07L8o62o99j9O50N87j05m62n34
2026e69j13L32N69L29l88o53k79L49N78K55r0n67n25R7P79O27j99q29m03L07N72
2047A79K86J1k74n16k53L71Q06L38n66p90k00O25N68J18k91n79k29O7N73M81j35
2068E90o29n84J88O12M23j35m85n38p3M80O48J18o65o00j18N79N27Q2l01m89l48
2089g18N5P01O89l46q36m54M01P55K79k35m87k40K0K73N91K58m65o99j31N41P21
2110F73J12o15n46p9M56M67J12j44m88m58K09O04M85k05o92m56J32N43N07pn84
$$ plain form
1963 81 -535 -676 -314 549 777 52 -828 -856 -187 418 386 -22 -380 -664 -556 74 551 470 -356 -888 -595
1984 -595 169 665 408 -100 -617 -626 27 706 606 47 -452 -468 -26 453 700 447 -180 -650 -285 534 968
2005 968 475 -291 -566 -167 480 627 394 28 -383 -509 30 637 675 13 -686 -705 -55 532 427 -35 -569
2026 -569 -682 -350 219 548 160 -493 -772 -423 155 410 320 -247 -772 -675 104 731 532 -297 -700 -393 179
2047 179 465 476 202 -314 -567 -196 610 948 382 -408 -608 17 585 703 412 -167 -396 -329 244 725 590
2068 590 -39 -623 -435 177 600 465 -20 -558 -631 -151 497 615 -50 -650 -768 -189 338 420 119 -370 -718
2089 -718 -663 38 727 381 -455 -909 -508 247 526 291 -196 -436 -416 -143 448 706 241 -458 -589 -48 673
2110 673 785 170 -376 -455 1 468 580 436 -52 -510 -301 303 788 583 -109 -565 -433 110 617 610 26
2131B6o49K9N56N16q0m32m15j84K06O03L01k74o13m21M19O68L12m12n74l32L76
2152c74N91K22j21l72m04k5L67O24K61n79q02k5O57O35L0n75l81j26K87N53K09
2173F52j54n23m42J72O45L65j44o35m60Q0O37N16j72o41m74J29M45L33M2l23n52
2194e04j39K31P39K94l17q13m39M13Q42K83m61n82j91K80L75L61J6l95n58j14
2214f79O14O86J2o19o01P5N11N12M5m15m34j21M06M45J79j31n78m15J61O50N18
2235H21k09p60m81K23O91L80k48n15l31O1K33M31J80l12n83k81L51P14K58n32
2255I1o12j70M49M90J42k85l78l30J45M65M32r2m95l79nN47M97J65o30o64M1O70
2277I4N11j13l48l39p7J02M58L48j66m85n00J84P03L77k44o47m21K35N96J99j66
$$ plain form
2131 26 -623 -594 -38 478 398 -34 -449 -633 -427 176 477 203 -410 -831 -412 256 568 156 -418 -750 -374
2152 -374 217 439 318 -54 -458 -483 -116 508 769 190 -612 -637 20 655 685 110 -271 -397 -110 443 652
2173 652 498 -25 -467 -295 350 715 571 -64 -524 -444 193 709 537 -104 -578 -449 -4 329 371 48 -504
2194 -504 -643 -412 327 621 304 -509 -948 -535 307 590 129 -453 -644 -364 11 372 388 -7 -565 -679
2214 -679 -65 621 633 14 -587 -512 -1 511 556 141 -293 -414 -8 437 616 485 -93 -508 -347 303 821
2235 821 612 -148 -629 -406 285 665 417 -98 -429 -368 -135 296 476 164 -419 -700 -349 365 623 91
2255 91 -521 -691 -242 248 390 105 -273 -603 -458 7 439 347 -148 -527 -532 15 512 677 47 -617 -576 94
2277 94 605 492 144 -195 -272 -170 288 636 470 -15 -515 -331 372 749 505 -142 -563 -328 268 467 301
2298C01l60l25o3L13N10K22m49p37j66N40O14J68n10n50k02L91N39K28k75n14
2318c25k71J28M64M07K3n57m29oO09N29p1m80m91K9M87M56L6l37m26k36K87N34
2340C60K74k53n19m27K53P18L81l81o35j91K14L99K52q2l32n41j4L77N64P0l87
2361A00o03j20M55N62N0m03n74q0L87N13J45k58m52k93Q6N91M47j09o01m09J28
2382d38M59N07j3n27m89N2M99M71Q0m25m48q4K44N09K73k99o18l05K73O14K66
2403F01k28m96l78K20M58L46r4m26m53J4L98N08J32n77n07j28M66M86R0m40m22
2424d30j83K96N02K59k23n11l83K60M90L62m7n65l35M4N70L78n4m31m14m5M83
2445B3M91K7l39m61r7L42M49J89k60m84k55J44N81L23l43m46k71J17M38L12j3
$$ plain form
2298 301 -59 -384 -447 -134 376 598 149 -588 -754 -214 400 568 58 -492 -694 -303 236 464 189 -325
2318 -325 -596 -468 -4 403 426 -131 -560 -566 43 572 501 21 -470 -441 46 502 538 201 -225 -461 -174 360
2340 360 634 381 -138 -565 -312 406 787 406 -229 -420 -206 193 445 363 31 -510 -524 -147 417 487 100
2361 100 -503 -623 -168 394 444 41 -533 -613 -226 287 432 174 -278 -571 -485 106 553 444 -157 -566 -438
2382 -438 21 528 515 -12 -501 -449 50 521 601 176 -272 -356 -112 397 670 371 -247 -552 -279 335 601
2403 601 373 -123 -501 -281 177 523 429 3 -450 -436 -38 470 602 25 -482 -610 -144 342 432 -8 -430
2424 -430 -613 -317 185 444 221 -290 -673 -413 77 439 392 -173 -508 -464 106 484 430 -1 -415 -460 23
2445 23 514 541 202 -259 -356 -14 435 624 364 -120 -375 -231 350 673 330 -116 -387 -270 168 480 467
2466D67n13m73N0M06M25K7m13m77%L17M34J88m08m54k24L17N58K73l69m55k43
2487e67K11N17K66j26n04k68J4N38M08K5m70n43O3N18M63K0m45m01r1L25M39K03
2509E95k40n37k72K55M82L26k18n25l21Q2N72K89j07m95l33J9L66M59P9m98m60
2530d82p4M13M22J52l67m70k66L01N71J98k97n33j79K83M41K96j81l36l57L0L78
2551e7N60l1n43l49J2M78M39l9l63l73j8K30M05K41k00n46l10L38M94K97l46m98
2573a79j64J12L64K78J9m68l75J8M28M11k0m85l85p2L66L60K19l64n53j91L38
2594c43N81J93l61m46j58K72K78L01o3l45m41lN36M96k2o44l30J69M38L37k2k76
2616A47l12k44K50N53K56l36n36k22L39M77J90k50l90k52J12L88L59j07m67l84
$$ plain form
2466 467 -46 -519 -469 -63 362 389 -24 -501 -501 -184 250 438 30 -424 -648 -331 227 500 131 -324 -567
2487 -567 -356 161 427 301 -203 -471 -457 81 489 514 44 -499 -436 82 545 565 120 -281 -372 -47 392 595
2509 595 355 -182 -454 -199 283 609 391 -134 -455 -373 199 488 381 -114 -447 -428 -62 397 476 -22 -482
2530 -482 -556 -143 279 431 64 -406 -672 -371 200 398 101 -432 -611 -328 113 409 228 -108 -465 -435 -57
2551 -57 503 472 -71 -420 -408 70 509 470 107 -266 -284 -54 351 592 392 -154 -464 -126 368 665 319 -179
2573 -179 -343 -231 133 411 430 -38 -413 -395 33 444 424 -61 -446 -518 -152 208 427 63 -490 -681 -343
2594 -343 238 431 70 -376 -534 -262 16 317 254 -91 -532 -535 1 497 475 -169 -499 -330 108 445 423 147
2616 147 -165 -409 -159 394 650 314 -222 -444 -105 372 562 312 -78 -330 -218 170 529 422 -45 -429
2636d29K5M48L40j05k79m08j14K82M97J96l46n17k51M82M01R2l01l43j00M6L12
2657g2M24J5m83n00J92N44L79k39m01j88O2L14K65J33k73l51j91L19M89J27l23
2678B42n18o1K91L70J85j75m12k57J07M52K96j52m14l35N2L33L97o1l06n09j3
2699d88L93M70Q0m71m19J2K64L09J03j25l71l53J60N83K84k20m70k60J40M99K31
2720C51m7l26l63j9L23L88J61l16m17j57L11N61J54l38m99j14K64M51P2j85l39
2741h4k94J55M18K99j65k97m32k4M24N05q4m07m05p9L85L77J4k23m01j75K78M12
2763A97Q5j43m07k22K08L85L47k63m18k81K29M03K34j31k35k83p0L02M86P1l46
2784A48n42l6M40M51O3l91l32j12J92M25J94r7n20k86J87M05K70j00l75m33N5
$$ plain form
2636 -429 -404 44 384 279 0 -408 -522 -240 257 453 107 -410 -661 -179 222 314 13 -330 -430 -384 -72
2657 -72 352 367 -116 -616 -424 120 499 260 -141 -329 -267 47 312 445 172 -179 -370 -51 438 565 242
2678 242 -276 -337 -46 324 509 334 -78 -335 -228 224 520 368 -46 -381 -329 4 401 340 34 -475 -488
2699 -488 -95 375 455 -16 -435 -423 -159 150 253 128 -243 -596 -436 147 431 211 -259 -519 -379 120 351
2720 351 304 -22 -385 -404 -81 307 468 152 -265 -422 -111 450 604 266 -233 -347 -83 368 440 255 -84
2741 -84 -378 -223 195 494 329 32 -400 -424 0 505 421 14 -391 -470 -85 292 306 83 -318 -493 -215 197
2763 197 282 139 -268 -490 -282 103 450 187 -231 -512 -283 120 354 223 -12 -295 -365 -63 423 494 148
2784 148 -394 -430 10 461 524 133 -199 -311 -119 306 500 403 -117 -403 -216 189 459 359 -16 -449 -394
2805c94M68M46k03l38m07l4L96M07n3k80l47j10J96L72L13k81n87k18L73M51K78
2826D48k63l78j77P7K26L44N4k98l68j04M44M52L3l70m13%K91L71Q3l11l31l4
2848b24J60L00J89j60l40k81N9M77L46j59m08l72J17M13K47k4l61k84%J38L99
2869B32P2k19m18j75J80N01J75j62m87k34K00M99J85k29l79l3R6K72J77Q0l16
2890A7l69p8L66N47J4m76m11P2M18K98k6k02j66k36O5L52L57j96m33l38J90M89
2912B54K35j96l60l50J26L69L21r9k99l54l7L24L35O8k53l89k01K36M30K82l61
2933H1m55j71L80L90M3j36k99r3p8L01L33J58m39m30Q6M42L78j89l09k07j8K18
2955a4L47P8j87m33q6J07M63K15j04m75l19K43L79K98k60m15k09J41L08K57r5
$$ plain form
2805 -394 74 520 317 -21 -428 -462 -66 341 288 8 -339 -449 -253 119 432 151 -436 -654 -281 170 448
2826 448 185 -193 -370 -293 -67 277 331 33 -335 -439 5 457 490 120 -293 -293 -2 369 452 141 -190 -224
2848 -224 -64 236 425 265 -75 -356 -297 180 526 367 -41 -413 -296 117 364 340 -21 -305 -305 -167 232
2869 232 304 85 -333 -508 -328 173 348 186 -301 -535 -335 164 349 120 -259 -292 -196 76 253 333 17
2890 17 -352 -430 -64 483 497 21 -390 -318 100 398 372 170 4 -232 -167 185 542 346 -87 -425 -235 254
2912 254 489 293 -67 -417 -291 78 399 300 1 -353 -390 -66 269 337 84 -305 -506 -270 160 442 81
2933 81 -374 -545 -165 225 268 132 -167 -260 -338 -37 296 454 15 -415 -329 113 491 302 -7 -214 -232 -14
2955 -14 333 411 224 -209 -295 -188 275 490 386 -89 -408 -165 214 512 252 -163 -372 -231 77 334 239
2976B39k61k95j4J30M28J14k39m89j15L01L93J32l24l25nJ08K82J87o7l05l38
2997d63O7M64L14n2l68l65P7M03L09K0l66l59J5L24L23Q1k25l63r1J35L77K51
3019E08k17m38k03J47M36J12Mm64j39L7L15J99Rk61l69j43L10M43Nl04l78l3K27
3042a97M29L5j92l17k17J62L63K51j96l02j98M6L96L10Mm79k74K5M31L13o3k84
3064D6k73o4L61K78R0k18l54j94K36M15J56k05m07k04K80L26J96j61l02k91j4
3085c03M30J89K6l04l70m1K58M30Nl48l34m3K72L30J28l39k85o0Q0L59J63k2l97
3108a76k65J26L30L34j09l94k85J33L87K49k9k22l07o8J88M32J32j83m71j65L25
3129c8L70Q4j76l57q1P9L24K45j45l35k71J05K89K48j5l52k42j02L11L62Jl19
$$ plain form
2976 239 -22 -317 -331 -201 227 341 102 -387 -502 -201 192 324 0 -325 -330 -222 60 247 180 -125 -463
2997 -463 -396 68 382 330 -38 -403 -326 77 386 406 40 -319 -304 20 343 424 199 -164 -255 -120 257 508
3019 508 291 -147 -350 -203 233 345 349 -115 -254 -217 98 297 306 45 -324 -467 -157 286 291 -13 -391 -424 -197
3042 -197 232 267 75 -242 -459 -297 66 317 121 -181 -379 -333 63 373 377 -102 -376 -351 80 393 330 46
3064 46 -227 -291 70 348 438 220 -134 -328 -92 323 479 274 -133 -337 -57 269 465 304 2 -289 -303
3085 -303 127 316 342 38 -332 -373 -115 315 320 -28 -362 -405 -133 197 325 -14 -299 -359 -279 80 243 221 -176
3108 -176 -441 -315 15 349 240 -154 -439 -306 81 330 301 79 -228 -296 -108 324 456 273 -198 -363 -38
3129 -38 332 416 240 -117 -198 -119 205 450 305 -30 -301 -196 93 341 326 -26 -268 -370 -59 303 304 -15
3151a5l21kJ78L24P8j45l39j72J14M14J71j75l13k47Q8M15K77q3l97j59L8L33
3173F2L44o5l15k70J6J92L53O9k51l23j02K40L52J21k33l23q8J20L18K51r5l31
3195D2l42K6L74L17r5l93k33mL58J84N0k21l01k04K11M28J93k81m48j29K71L69
3217A72J07j43k81k38J04L22K78qm35k58J27K99L50q2k62l04k7K13M22L0k52l45
3239b11m2K25L74j7j38k48j53l8L96K99o7m37l16K21L57J77j17k57l13Q1J54L27
3261B57O8k65l79n0K32L53R9k91l40n4J50L03K41p8l90k10M3M01K13j07k81k26
3283c11M1J86L72L2k76k68n6L10K52O3k89k57m6J98K94O5j13j97l07J00L91K01
3305C85j31l32k11Q1L23K32k9l55k33l2K41K11J67k95k38j25J77M48k0j43l12
$$ plain form
3151 -15 -336 -338 -160 164 242 97 -242 -414 -300 114 285 110 -203 -450 -362 53 330 247 -150 -309 -271 62
3173 62 406 341 26 -244 -228 -36 317 386 135 -188 -290 -50 302 423 190 -133 -221 -101 217 468 373 42
3195 42 -300 -274 100 417 322 -71 -304 -308 50 234 284 63 -238 -442 -231 197 390 109 -339 -468 -197 172
3217 172 279 136 -145 -383 -279 43 321 313 -122 -380 -253 46 396 314 52 -252 -279 -66 356 386 134 -211
3239 -211 -253 -28 346 329 191 -57 -210 -248 148 447 380 -57 -373 -152 205 382 265 8 -305 -224 -70 257
3261 257 325 60 -319 -369 -137 216 315 24 -316 -370 -220 83 324 246 -144 -354 -311 90 303 196 -85 -311
3283 -311 -270 -84 288 320 44 -224 -280 30 282 345 56 -201 -247 -49 245 310 197 0 -307 -207 184 385
3305 385 254 -78 -289 -208 115 347 318 -37 -270 -302 -61 150 317 22 -216 -341 -164 284 264 121 -191
3326a91k36K35K90J82j98k74j61J72K86K13j19k68k94O8L94K55j8l97k75Q0K88
3347C2K51L4j86k61j45J84L51J33j44l41k30K07L14K25j68m05o8P3J70K39P1l37
3369al08qK97K68K5k82k78m4K01L09J25k27m18l7K34L09O1j06k79k05R0K67L08
3392C01n5k99k24rL79K65j19k92j88pK04K86Q3j87l27j18K41L64R9j78l13j33
3414b27J97K09J38j57k32j32lL68J31qk91k75L7K35K45P7l11l09m9K97K59K5k06
3437A8k76o8J25L50M3n0l00k12P4L84K01j51k62k26J15K79K15J14l73k46j9K81
3459A6K75M7k55k71m1J95K69J45j39l44j34J64L60N7j34l83m9M8K36K32J9l20
3481gl43M7K50L87o3k85k61p5K45K91k4n6k52j73R7L43K09j79l61j32J18L13J85
$$ plain form
3326 -191 -427 -192 98 280 82 -192 -353 -181 105 318 199 -69 -363 -295 99 354 336 -61 -336 -256 32
3347 32 283 317 131 -130 -275 -91 260 393 249 -92 -322 -115 199 424 256 -149 -217 -144 26 265 336 -1
3369 -1 -309 -317 -20 248 273 -9 -287 -331 -130 179 304 77 -341 -378 -144 165 226 120 -159 -364 -274 -7 301
3392 301 246 -53 -277 -286 93 358 239 -53 -241 -248 -44 242 325 138 -189 -307 -66 298 397 219 -94 -227
3414 -227 -30 179 317 160 -72 -204 -207 161 292 284 -7 -282 -245 -10 235 312 1 -308 -357 -60 199 224 18
3437 18 -258 -326 -201 149 192 142 -158 -370 -296 88 289 138 -124 -350 -235 44 259 373 0 -246 -265 16
3459 16 291 338 83 -188 -229 -34 235 380 241 -103 -237 -73 287 344 210 -173 -222 -174 62 294 313 -7
3481 -7 -350 -303 -53 334 271 -14 -275 -350 -105 186 162 106 -146 -319 -222 121 330 151 -210 -342 -224 89 274
3504B74j63j93k26O4K81K08pk18k45j3K31L01Qk19k63o9K31L09O2j97k51r7J59
3527c3K34J22q9l06k31J62K73K00r1l05k39L9K80K25k9k24k72p2K44K78k3j04
3549C9l27o1J80K17K40j79l04k36K07L47J55j36k53k08R6K57J99J7j85l27k5K71
3571a6L39K4l10k79M7K16K18Q2j79j75j73J20K74J85j53k76k08J12K40K56q6k96
3593c8k25J4K35K09P8l24j88m1J80K30J14k19k42j81J52L39J67j22l84n9J37K92
3615A24J03n1k81r8k7J59L25j9k51k39%K88K73l1j85k81j0J93L31j2r2k70j13
3638a64J08K09J56k3l28j55J06J69K30p0k63k08J9K23J42J12k79k14l1J47K82
3659A68Q5k23k74j12J75K75J57j45l57r0J77K08J34Nl67l2mJ96K68j9k53k12K9
$$ plain form
3504 274 111 -82 -308 -244 37 245 238 20 -225 -238 -7 294 302 83 -180 -249 -18 291 353 156 -95 -192 -33
3527 -33 201 323 234 -72 -303 -141 132 332 241 -64 -303 -264 16 241 212 -12 -284 -356 -112 166 143 39
3549 39 -288 -349 -169 48 288 109 -195 -431 -224 123 278 142 -111 -319 -223 34 233 250 65 -262 -287 -16
3571 -16 323 347 37 -242 -195 21 239 321 142 -33 -206 -86 188 373 220 -56 -264 -152 88 344 258 -38
3593 -38 -263 -249 -14 195 273 -51 -239 -280 -100 130 244 25 -217 -398 -246 93 260 138 -246 -305 -168 124
3615 124 227 176 -105 -203 -230 -71 254 235 -16 -255 -255 33 306 275 90 -191 -201 -8 323 311 219 -51 -164
3638 -164 -56 153 309 286 -42 -197 -91 78 308 238 -25 -233 -214 9 151 263 -16 -230 -261 -114 168
3659 168 253 30 -244 -356 -181 94 251 106 -251 -341 -164 44 178 183 -184 -216 -220 -24 244 225 -28 -240 -211
3682b11J50L84Jk61k81O8K01J78Q7j56k42j47J61K09J58r2l52j47J27L13J39m0
3704B47k93j78O5K18K04oj30l09j08K04K71O0j63l03j24K89K18L4j28l03o7J17
3726a85K09K04j00k13j86K7K94J87pk69k23kL30K20p0j56k00n0J49K62Q1j56j64
3749a8k02O8L31J80j53l71j0M8K50J58j12k19j70jK77J68N2k57k60j3J39L10R1
3772B86k41k71m0J88J76J55k12k32o6J58J42J73j8k94j94M4K63J97k6k00k64N2
3794b24K57J70nj04k33j37L06J67J58k13l20o7J93K74J17j07l18j96J05K99J53
3815B75r0k35j61k4L15J64n8j24k69rJ33K40J17j92k96q7J88K51Rp0k81r9J21
3838a82K57J37q2k34j63M7L03J38J4l22k14R2J76J65P8j63j54j30J89K90J10j63
$$ plain form
3682 -211 -61 323 324 63 -218 -150 51 229 316 160 -82 -229 -68 141 299 207 -145 -292 -165 148 287 247
3704 247 -46 -224 -159 59 263 257 127 -182 -290 -86 185 245 82 -221 -345 -56 162 196 68 -235 -302 -185
3726 -185 24 228 128 -85 -271 -244 50 237 230 -39 -262 -264 66 286 216 60 -140 -190 -41 221 302 146 -18
3749 -18 -220 -152 179 359 206 -165 -175 -127 123 281 169 -50 -220 -221 56 224 276 19 -241 -254 -115 195 286
3772 286 45 -226 -266 -78 98 253 41 -191 -257 -99 43 216 198 -96 -290 -246 17 214 188 -12 -276 -224
3794 -224 33 203 198 94 -139 -276 30 197 355 142 -178 -245 -52 222 339 232 -86 -282 -177 122 275
3815 275 185 -50 -211 -235 80 244 186 62 -207 -216 -83 157 274 82 -214 -301 -113 138 147 77 -204 -303 -182
3838 -182 75 212 130 -104 -267 -220 83 221 235 -87 -301 -209 -33 132 210 47 -107 -237 -48 242 352 189
3860A89l26r2J95K24J60j83l14o6R2K01J98o2k38j72J5J94J70L0k48j45n3J94
3882c7K68P5k72k09k07L08J92N3j15k02j32J10K63J81j04k83j59K2K95J74o1k25
3904f5r4l3K30J79K4j64k19q9J73K95N3j73j87j42J22K36J27j20k14j43P9K40
3926A15J80r2k76j50QK88J45J2k43j83j2J21K41O4k08j91n4J39K72k8j03j95j47
3949b97J63J44K02j15j98j36J9K20K06nk93p0L4J51J99Lj52k51k6J88K10J17k49
3972F4j56j07J69K05Q7j43j52j33QK33K18m0k92j45k1K84J26o8j55j95l7J94J62
3995A06P9j77j93j48K83K15Q3j72k25r2O2K12J22o4j56k44N8L16J25j4k20j43
4017a87K2J37K35J10k65j88l4J82K00N6j52k25p9J90J52R6n4k63j25Q5K31J20
$$ plain form
3860 189 -137 -229 -34 190 350 167 -147 -213 -121 80 278 216 -22 -194 -179 15 185 215 -33 -178 -231 -37
3882 -37 231 306 34 -175 -382 -74 118 171 56 -146 -278 -168 95 276 172 -111 -270 -248 47 221 160 -65
3904 -65 -159 -192 38 217 241 77 -142 -231 -58 237 290 117 -70 -212 -90 146 273 153 -61 -204 -125 115
3926 115 295 203 -73 -223 -215 73 218 230 -13 -196 -208 -87 154 218 10 -181 -235 -96 176 148 45 -150 -297
3949 -297 -134 10 212 97 -101 -237 -218 2 208 203 -90 -160 -126 25 224 227 75 -176 -202 -14 196 313 64
3972 64 -92 -199 -30 175 262 119 -33 -166 -158 75 293 253 -39 -184 -205 79 205 137 -18 -213 -250 -56 106
3995 106 185 8 -185 -333 -50 165 248 76 -149 -241 -179 33 155 91 -65 -309 -251 65 190 176 -44 -187
4017 -187 -165 -28 207 317 52 -136 -170 12 212 268 116 -109 -188 2 154 250 196 -67 -192 -107 124 244
4039B44r8j96j37N0J85J13rj12k22j53K72K49j8j45k70j5J94J30Q6j01j98j81
4061c32J94K05J29j08k26j59J22J43K42m6j23k49J00J27J69Mj85k05N9J20J38
4082A19R5j49j65l2L8K70J28q7j88k24R3K47N3K1k62j99Q9K09J74k6j58k58L6
4105a76J51K40n6k01j88m4J66K35L8p8k09j55P2K58J39n7k73j44R0K22J74ok48
4128e0k54P6K00K42jj71j73j4J48J60P8n4k29j66J22K21K47k04k24j24O6K29R4
4151B19lk29j92LK59J87q6j48j70o5K16J86K1j96j57r8J64K02M0j40k15l0Q9J52
4175IJ80j25k46p2j3L35J30j20j33j91J3K53J29P5k14k05j9J42K84L1j33k22j03
4198b15J58J60J63q6k08j81J81J19J26j0k14j38R5R2J69K1k00k46m2K64J76J1
$$ plain form
4039 244 146 -50 -187 -137 48 161 152 40 -182 -335 -63 186 168 23 -247 -262 -68 62 148 47 -151 -332
4061 -332 -138 67 196 88 -138 -297 -175 -32 210 164 41 -208 -108 19 188 192 7 -198 -139 -19 119
4082 119 214 65 -100 -132 -94 176 304 217 29 -195 -102 145 198 219 -43 -242 -153 56 230 204 46 -212 -176
4105 -176 -25 215 159 -42 -230 -274 -108 127 165 87 -122 -277 -205 53 192 135 -138 -282 -192 30 204 198 -50
4128 -50 -304 -228 -28 214 213 42 -131 -145 3 163 241 187 -42 -208 -86 135 382 178 -46 -170 -104 125 219
4151 219 216 -13 -205 -202 57 244 158 10 -160 -225 -9 177 198 2 -155 -253 -89 113 153 13 -202 -232 -143 9
4175 9 189 64 -182 -254 -267 68 198 78 -55 -246 -233 20 149 224 10 -195 -214 -72 212 243 110 -112 -215
4198 -215 -57 103 266 180 -28 -209 -28 91 217 207 -7 -145 -50 42 211 232 32 -214 -256 8 184 195
4220A95j64j88m3R4J99L0p5j76j03M6K90M6l1k43j20J09J51K29j10k37j22L9J61
4243b3K44l9j86j15o2R7K78K2j46j70q7J29K38J03j51j81r2P9J42J22k4j22j77
4266a21KJ97J47k5k03k21K0J36K19J1j84j63k0J29K09L2p2k40j19J60J45J84j85
4289C8j37r4PJ90J25j0k03j32N0J48J97P0k03k22j0J48J98Jp0r2j60J15J95J17
4313B66j53j93j02N6K59J14j26j70q9J1J74J29qj87j52K3J58J42N5k28j71l6J22
4336a06K35P0p6l03j22J58K66J15j43j70k03J36J52J51jj86j49L7P9K55pj23k10
4359a45qJ51J52P0j80j35j18J75J84M9j01k20rL7J86J65j1k71k00R1J91J09k9
4382A33j82r0K9K5J45O0n0j77j67K13K36qp2k99m1J19J74R1m4j94j29J13J43K24
$$ plain form
4220 195 31 -157 -200 -106 93 123 48 -128 -231 -185 105 151 120 -123 -243 -134 17 246 136 -101 -223 -184 -23
4243 -23 221 182 -4 -119 -181 -84 194 216 70 -100 -187 -58 180 283 132 -49 -141 -62 80 202 178 56 -121
4266 -121 -119 78 225 200 -3 -224 -204 -68 151 162 -22 -185 -205 -76 133 165 93 -147 -266 -106 39 223 38
4289 38 -99 -193 -186 4 129 119 -84 -216 -166 -18 179 249 46 -176 -186 -38 160 161 91 -1 -161 -46 149 266
4313 266 113 -80 -182 -126 133 247 121 -49 -138 -127 47 176 168 -19 -171 -148 10 152 207 -21 -192 -228 -106
4336 -106 129 199 123 -180 -302 -144 122 237 94 -76 -279 -143 9 160 159 -27 -176 -139 -60 195 188 65 -145
4359 -145 -153 -2 150 220 40 -95 -213 -38 146 195 94 -126 -135 -98 88 253 242 -29 -229 -138 53 162 133
4382 133 -49 -139 -110 -85 60 120 70 -107 -274 -61 175 167 95 -204 -245 -126 48 139 95 -99 -228 -115 28 252
4406B52j39j08j93J2K26J17K4j43k33QJ71J92Q8k33j51p8K02J3J79n4j83r8N5
4429g4J13J36j2k01j32O1J43J37k8j61j65N8R3J76N5j26k55K4J24K29Qj67j73
4452a37j00J23J90J04n7k63r3J34J14P7l9j38j02pK47J42O6k75j97K7K31J27K0
4475A94j27j05n3N1J91Q7j05j46r2M5J66J38j09j70j51N1J99J03o7j46m3l9J12
4498a6J58M6j74k23rJ17K34j6j60j52m6J57J63P5j17j14j07O3J72J42q9j93j24
4521b13qK34J27K7j36j40l5J43K13J2j51j10m8N0J60N2o9j70o8N7J97P4n0j74
4545b6r0KJ36J28ok24p8QJ08J75N4j77j70k3Q5J56M2q0j67j21J78J24J74j64j80
4570a36m7QK18P6pj80j37J1K12J94m4j70r3k2J81L9Q9j41j55j8O4J82R1j15j81
$$ plain form
4406 252 113 5 -188 -176 50 167 191 48 -185 -177 -6 186 274 41 -110 -188 14 27 206 152 -31 -129 -74
4429 -74 39 175 163 -38 -170 -109 34 171 143 -18 -183 -125 -32 144 199 73 -182 -158 -34 195 203 36 -137
4452 -137 -237 -114 76 180 123 -140 -233 -99 15 92 53 -85 -187 -194 53 195 261 -14 -211 -184 47 174 194
4475 194 67 -38 -91 -40 151 238 133 -13 -105 -60 106 244 135 -35 -186 -135 64 167 100 -46 -89 -128 -16
4498 -16 142 188 14 -209 -218 -101 133 117 -43 -195 -241 -84 79 154 37 -77 -184 -121 51 193 104 -89 -213
4521 -213 -221 13 140 167 31 -109 -144 -1 212 224 73 -37 -85 -35 125 177 108 -62 -130 -73 124 198 148 -26
4545 -26 -116 -114 22 150 144 -80 -158 -150 -42 133 187 10 -160 -183 -98 58 100 20 -147 -268 -90 34 208 44 -136
4570 -136 -183 -175 43 119 112 -68 -205 -194 18 212 168 -2 -95 -117 64 103 192 51 -104 -122 -58 124 215 100 -81
4595h1n7J10J39O1l8j36j25M6Q3K33n3j70j50qR8J80j4j60j05o7J25J43J04j15
4619D3k25k8O4K02K6m7q5j36RJ53J93n9k12o3N3J93P0m1j62q6k4J48J22K5j11
4644B2j07o0N4J92J7N4j93j33J73J15N1p1j20r7P7J48P6m8j51j69K7J39J41oj20
4669A1j41jP7J25O7r9j46r9N4R9J97n1j93r8J5K64K6k3j03k10O4J78J26m1j52
4694e4o5rJ07K23k4j21j66QR0J40L8k6j90r2J16J56R4n7k07j15R8J39Q6p6J3k07
4720a01o4J93Q9L1j34j36k5R1J76K7r2j78q5N6K06O1o6j86r5Q8J47J23oj90j25
4745a95Q0J03J08q5Lj74kJ87J44p4k2j30r9O2K34O4j04j96q3J66J56N4j11j40
4769e4p0kK49MK3j97r3j4J99Q8J0j09j42m6O5J58P2q3j50j56J28J51J17o8j95
$$ plain form
4595 -81 -138 -28 111 172 134 -2 -127 -81 2 235 182 12 -138 -146 -48 132 118 -42 -147 -214 -89 54 158 43
4619 43 -182 -210 -146 56 82 35 -50 -186 -177 -24 169 110 -102 -165 -112 81 151 110 -52 -138 -162 -14 108 133 22
4644 22 -85 -145 -91 101 118 172 -21 -154 19 134 185 114 -6 -103 -26 122 198 150 -1 -170 -143 -4 137 131 11
4669 11 -130 -131 -54 71 138 39 -107 -206 -152 -53 144 93 -100 -198 -183 81 107 84 -19 -229 -165 13 139 98 -54
4694 -54 -119 -128 -21 202 178 57 -109 -101 -11 129 167 141 -49 -141 -25 131 225 168 -39 -154 -56 83 169 93 106 -101
4720 -101 -165 28 117 148 14 -122 -147 -56 120 147 55 -123 -208 -152 54 115 49 -137 -232 -144 3 126 120 -70 -195
4745 -195 -115 -12 96 11 14 -160 -162 25 169 95 73 -57 -156 -94 140 204 100 -96 -179 -13 143 197 86 -54
4769 -54 -124 -126 123 127 150 -47 -140 -154 45 133 143 34 -108 -154 -89 69 141 58 -92 -248 -120 31 148 80 -115
4794a15j02L6J23J95m2j45j15J3J87J15j1j53j49LJ54J68N6j88j48l6J46R1R3
4817A76r6j28n8N0J33J33j32j02j21%K87J08j23j00j60k8J90P4P6j78j73L1J40
4840aJ37Qj45j15k5L6J36R0p2j66o0O1J70R2n4j57j08J7J66Q9K6j25j53rJ68J06
4866A12J2j08j07k0O9J47N5p7j05j04L7J49J15p3r2j35N0J17J48p0j32j56R7J13
4890D2N3L5j45r2o9J79P2Q2j49r2o6N4J70J14o9k36r2J45J41M9lj48j50L3J55
4915A3J23k4r6j56N1M1J91J3j29j29k4Q7J83N3j27o1j05N2J11J29l2j90r4jK01
4940H0P2n0r3p5J6Q8J07j7j47j04j2Q9J02O5r2k08O1M5J79O7j08j92m3J20O6J19
4966A35k5k09L0m1J67O6K4j63j26J2J18J84m8o7k17R7Q4J50J6p0k32n3J38J14
$$ plain form
4794 -115 -217 -181 -58 137 95 -50 -165 -152 35 150 139 -14 -163 -160 -6 162 218 30 -118 -154 -8 83 176
4817 176 80 -48 -106 -56 77 210 78 -24 -145 -145 142 250 127 27 -133 -161 29 103 179 1 -172 -141 -1
4840 -1 136 144 -1 -116 -141 -105 31 121 49 -117 -177 -116 54 146 92 -65 -173 -156 10 99 125 0 -153 -162 6 112
4866 112 124 16 -91 -111 -42 105 160 83 -22 -126 -89 60 175 102 10 -125 -75 42 190 120 -12 -168 -71 42
4890 42 95 130 -15 -107 -176 3 75 157 8 -84 -150 -96 74 188 119 -117 -209 -64 77 126 123 -25 -175 -142 13
4915 13 136 112 16 -140 -89 -48 143 156 27 -102 -126 -39 144 197 70 9 -96 -44 67 196 164 -26 -120 -121 80
4940 80 152 102 9 -66 -50 38 145 128 -19 -123 -135 -46 56 121 29 -179 -118 -73 106 173 65 -127 -170 -50 16 135
4966 135 110 -99 -69 -110 57 123 147 -16 -142 -130 -12 172 124 57 -160 -63 21 171 187 117 -115 -168 -30 84
4990H4N4qj69p7OJ39J17j1j10j49j4J04J59mj69m7n2J17J36pn7j49l8O8Q0J28
5016A31q8j09r4O8J55J04n4k69j8N1J38O6Q5k11j23jJ68J63o0j20n6k3M2J87M9
5041A81j01j50n4J17M1J44r9j54k2%J96MPo5j48L9P7J23m7r9r8m4J28J44n4p9
5067a3j27rLJ74J07p1k34K6M9R4J22j05j49l8N5J53R5K8j42j12o2Q9J85l9l5j15
5093g1QM3J71pp3j42M0m0K12K6m6j68r9J43N4J38r0j47r0N9J46K3N1j62j14O2
5119g3N1M1J58j66j49j2Q8J09P7o8j13j10O8Q8R7j7j21j12J3J62J21q1n7q5j0
5144a01J36O7L2r5j33l7J05J05Q0j05j26%K7J31O6m6j15j41O9J45J37j45q0r1
5168a15K2J30R7o4j3j21p5O9J78l3j09j52j7J14J45K4m8j20r1M9J36M3j3j43%
$$ plain form
4990 84 138 130 -39 -116 -110 29 146 135 25 -124 -138 -34 125 121 -48 -95 -147 -30 106 99 42 -107 -145 -77 3 131
5016 131 43 -66 -160 -92 63 167 113 -156 -174 -123 15 81 166 -45 -168 -169 -1 162 102 -18 -74 -97 -55 132 181
5041 181 80 -70 -124 -7 34 178 79 -75 -97 -97 99 103 110 45 -103 -64 13 136 89 -10 -108 -152 -24 120 66 -13
5067 -13 -140 -149 -146 28 135 64 -170 -144 -95 -1 121 16 -133 -171 -116 37 132 160 18 -94 -156 -67 118 79 44 -71
5093 -71 -63 -20 151 144 71 -71 -31 -71 141 167 121 -47 -146 -3 51 189 99 -48 -138 -79 67 90 141 -21 -135 -73
5119 -73 -22 19 177 11 -138 -150 -62 47 124 56 -57 -167 -99 -11 86 69 -52 -164 -151 11 132 51 -6 -91 -101
5144 -101 35 102 134 39 -94 -131 -26 79 159 54 -72 -72 -45 86 152 106 -9 -150 -81 64 201 56 -24 -115
5168 -115 -93 37 134 70 57 -64 -139 -70 108 75 -34 -186 -203 -89 56 80 32 -88 -179 -130 6 49 36 -107 -107
5193a07K4J12O5L6j70j11K9Q6R6K1r0j33K0J34J32j6j03j15j5O6Q6J64j01j41
5217c1j20Q0Q0K01j36r9q6L6J65J16j00p0j60m0J96M6O5j21j81M6j1J44P4J7j85
5242g4q9O4J22J55j83p5o3K1J08J53j20p8k1n8J60J20m4r7j29L4O2J15Q5j03j19
5267e4p3J29Q6L6p4j41RN8Q0J35j23j03r5L1J73R4o5j26o8L1M5J30j2k8j99LJ11
5294a0J5J30j03j90n9J20J57L5j22j3j15NJ12J29Mj70o7J0J27R5K7k06ll3J76
5319E1M2L4j28q2q8J08J67M9r0j28rPJ67RLj45n6k4J29Q5k6q3q6J2Q3O7P0r5j66
5348a23k4J13R7P6n7k03pN8M7J15m3j75J1PJ51LK4j53n1P7J05P8K2j76r7o8K29
5375C6K3P4r9j70M6n3K70Mn3n3j57L3J92J0j5p8q9m2J41J00m8j05l1p3J13J17
$$ plain form
5193 -107 -83 29 94 130 -40 -151 -122 -36 60 81 -9 -142 -122 12 144 128 25 -90 -105 -39 47 211 110 -31
5217 -31 -151 -71 9 210 74 -25 -111 -75 90 206 106 36 -124 -164 32 78 143 22 -159 -113 -124 20 94 111 -74
5242 -74 -163 -99 23 178 -5 -80 -143 -122 -14 139 19 -59 -80 -138 22 142 98 1 -128 -94 -32 83 168 65 -54
5267 -54 -127 2 88 124 50 -91 -82 -24 56 191 68 -35 -130 -99 74 168 103 -23 -91 -60 -15 115 103 75 -124 -121 -10
5294 -10 5 135 32 -158 -217 -97 60 95 -27 -40 -155 -150 -38 91 95 -75 -142 -132 -5 90 117 -89 -92 -125 51
5319 51 93 127 -1 -83 -171 -63 104 153 63 -65 -74 -67 100 109 112 -33 -89 -113 16 101 75 -8 -94 -82 1 68 138 43 -123
5348 -123 -147 -34 63 139 82 -121 -128 -70 -23 92 49 -126 -115 -108 43 46 70 -83 -134 -57 48 126 148 -28 -125 -193 36
5375 36 59 133 34 -136 -90 -143 127 131 78 25 -132 -99 93 103 88 10 -79 -121 20 120 72 -33 -64 -137 -24 93
5401I3O2j52j18O0M1Q9L8r6j52J9J6J66M6k8j23q8J7J11N4J7q7j69N7J26J06M
5427A09j23p1L5P0J35k5p7j25l5J25J15k5j2j77l4J02L4P1L0j53r1J5J22O6j1
5452G0j04o1m3J66O8L6j19j38o9J49R3P9j03j23o4R9Q2O2j2j57n1N7J03J02r5
5477B7j37K2l3J48K5L6o5j38j3J36R8K6o9j14LJ6J44K0q0r8JL2L0J15j03o4q3
5504a18P5R2O3k3j15r9m1J82R2M9j87r1l5L2J56J4Lj52j5K7N5J35n9j74j6R7O7
5531A4P7l6q2n4JJ43M9j9m2j03n3J36J04qm5o5o7k4J82N5o0j52l9O7P6L8j6p3
5559Dj09K5O8J48l8j61o7M2R1R2O4j48j85L9K8J54l6l3o2o8J6J92K1j1r4j79J19
5586h8J49k3j7l6o4PO5M7P8r2m8m0M3P7J62j83j03k7R0J59j5m0j59K9k2J09R4
$$ plain form
5401 93 155 3 -115 -55 -14 75 113 17 -135 -116 -100 66 112 84 -39 -127 -110 1 55 72 -15 -184 -127 -1 105 109
5427 109 -14 -85 -50 20 155 130 53 -72 -107 18 133 108 96 -81 -115 -13 21 92 122 -31 -122 -107 15 81 70
5452 70 -34 -95 -138 28 96 132 13 -125 -194 -45 48 127 24 -99 -163 -64 18 80 68 -89 -140 -83 20 122 27
5477 27 -110 -88 -121 27 52 88 23 -115 -128 8 106 132 63 -51 -48 -32 112 132 52 -46 -45 -13 17 132 29 -35 -118
5504 -118 -43 49 112 89 -26 -125 -166 16 108 157 -30 -121 -156 -124 32 46 49 -103 -118 -91 -36 99 40 -134 -150 -53 14
5531 14 91 55 -27 -81 -80 63 112 93 51 -52 -105 31 135 127 82 17 -50 -74 108 163 103 -49 -88 -21 55 93 77 4
5559 4 -105 -80 -12 136 98 -63 -130 -88 3 95 159 11 -174 -135 -107 47 11 -22 -84 -152 -136 56 77 66 -28 -207 -88
5586 -88 61 38 21 -15 -79 -72 -7 40 118 26 -22 -62 -19 58 220 37 -66 -93 -3 156 141 101 -58 -29 -51 58 152
5613A52q1j42oJ3J07L1L9j11o9j0L7J01m2J3j66mJ10R5l7m0j05m4J46O9Ll7o8
5640d6o1K1J61n2L5o9j19Q0J7J46N0j17j45K2Q3P0J4j14l2%O4OQ6o2r1k9L8K27
5668A83L1j78m0q5K8J04O4Qj30m9j2J02P1J8j18p7j00J15J58l7l9r2n0J9P7J11
5694H2nj44q0N5R5L1O7j34j01K4P3J48n4Kj13k9P6Q5M3r1q3k0N0R4j2m7l8J4P3
5723F1M9K0l1q8q4lJ32Q9p5n6j12L3R9K9J0p6r2N9O1N1Rj20o9M2%R1O9p1k3j51
5753a47P4J05j2M1j45n1L0J05O8j3m2q9j8Q1N9R8j20p6r0J59J09lj18l5J9r7J17
5780IO7K4j11m8J4P9J05l4j51k9l3J32O3Kp2p5j29J89K8Q2j12j8q8M9J00m1O5
5807F7j57qL7J20j5Oq0q6P3jJ85p2r1m1n7O7J62K3j17r1%J09l9J21m9p8n5kR7
$$ plain form
5613 152 71 -71 -77 -64 43 74 113 2 -67 -77 -40 61 19 32 -134 -138 -28 67 30 -10 -115 -159 -13 56 59 22 -46
5640 -46 -107 -86 75 23 58 -11 -130 -50 -33 113 163 46 -99 -77 6 76 90 -24 -56 -56 8 14 100 38 -53 -82 -44 183
5668 183 214 36 -4 -89 -61 43 107 115 -15 -64 -76 26 97 115 -3 -80 -180 -65 93 56 17 -75 -125 -106 -29 82
5694 82 77 -67 -147 -92 3 34 101 -33 -134 -110 -37 111 57 59 -54 -83 -7 78 121 30 -53 -73 -23 71 59 12 -26 -12 61
5723 61 110 130 99 11 -73 -76 56 145 70 14 -98 -65 34 63 73 -3 -95 -36 25 76 85 -35 -104 -62 -62 29 98 27 4 -147
5753 -147 -73 32 20 61 -84 -135 -105 0 68 55 13 -76 -94 -13 46 144 24 -52 -142 17 126 123 5 -30 -11 -108 9
5780 9 76 100 -11 -59 -45 34 139 105 -46 -75 -108 24 87 89 17 -58 -187 2 30 112 0 -18 -106 -57 43 2 67
5807 67 -90 -98 -61 59 44 50 -30 -116 -43 -44 141 69 -22 -63 -120 -53 109 132 15 -76 -76 33 -6 115 66 -12 -67 -69 28
5836B8O2j05k1%k5P8J10kj00o5oP2P7L3q0j81R3k4J65Pj51km6O6M8N8k5j29K7
5865c8ML3P9j8r7j12K8K21K5q6q2o1QQ8Q7J1p7k2k9J8O1OK3q8n8M6J26K3l1n8
5895C0r4lJ41k8N7j69j6o1J76J10o8n3o2l1Q1N7m3J2j12j2l5J40P7r0n2k7J0O8
5923CL7k9j6l3j47K24j2O3j01r3N5RN6J02j16r5J8L7J12L5p7r0L4KM7O3ro7r0
5952g8m2J71Q8r0r4r9J30j2R4j2Jj22Lk1J30J9m8o4p9J09O3n0k6o1MM8N9K9k5
5981B5j6p2j6P7P2j5n1o6k0J14P2m6m9r1K1M7J36o4m8q8QpJ66N3j34q0JJ7M6J20
6011A12n0n9p5O7J7Q2m0k5j41Q3n1R8R9j31n3pM7O8O0j34o3j3J8J04L6ok4j09
6039i0L1O0K2R7j59JJ2N4O3Qk4j13N0m6R0N3n0k9j92J13P9P0j15k7k5qJ07J3K
$$ plain form
5836 28 90 -15 -36 -36 -61 17 127 125 25 -40 -46 26 103 136 56 -125 -32 -56 109 116 -35 -37 -83 -17 31 89 64 -65 -38
5865 -38 -34 -1 78 60 -37 -149 -121 100 125 39 -43 -104 -96 -8 79 90 13 -9 -38 -20 41 47 70 -18 -76 -30 96 119 88 30
5895 30 -64 -67 74 46 103 -66 -82 -143 33 143 75 22 -40 -71 10 67 24 36 -76 -88 -123 17 94 4 -48 -75 -65 3
5923 3 40 11 -5 -38 -185 39 27 90 -11 -104 -49 -40 16 118 2 -93 -75 -38 74 109 32 -58 -24 -22 25 88 79 12 -78
5952 -78 -120 51 139 49 -45 -144 -14 -26 68 56 57 -65 -62 -83 47 66 18 -46 -125 -16 47 -3 -29 -90 -86 -38 21 50 25
5981 25 9 -63 -79 -2 70 55 4 -62 -82 32 104 58 9 -82 -61 -14 122 58 10 -78 -70 -77 89 142 8 -72 -71 -54 -8 112
6011 112 62 3 -72 -5 12 94 54 29 -112 -29 -80 18 117 -14 -67 -74 -27 41 101 -33 -96 -109 -91 13 49 43 19 -90
6039 -90 -59 1 23 120 -39 -38 -26 28 91 99 75 -38 12 -34 56 109 59 30 -162 -49 30 100 -15 -42 -67 -75 32 45 47
6068D7p9lj6J18O%p4l7q0J02J03K5j53j1o2J27L9M3q4m2l1rQ2O8Jj13j00Q4O6
6097A7Q5m4j39n7Q3L8J08j7p5o6k0P2J03J9j22l4j7P8J3Q6l2p4j32Q7J05N5l6
6124H4q9p0L7J2J60k3q2j09l3J11J12Mj23p5J1K1R2M8r7p5l1P7M5O6Lj93R8LJ2
6153dL9Q2j64o9P4K4J01l5l9j29J00n5J81M9j46n2M6K0LN8j4o6j32O3Q6K6jMj59
6182a09J14J0J38q6j33O3n5N8J27o9j3q4m3J2O4J54j41j03K1QJ35J6l5q4o9K1
6208h3P3O9lo9m0Q3l6Q2j3p1o0K6L5L2J15p1j20j7Q8L2P7l8j80QM9Q2N4k9m6r0
6238f1m2O8R2j2m3k2k1M2Q9K0j42j2o3O7j1J34j02K7o6k4P4N5qr1L6n2N0K4P4
6267H0p4j35N8J21J1L2q2Nm7O7L8n1K6r0J8K1M2O4p7o4oM7O2J5o0j4k2K4K3O0
$$ plain form
6068 47 -32 -35 -51 67 73 73 -1 -38 -118 -16 87 112 -41 -52 -114 13 52 95 11 -31 -62 -71 11 79 80 -33 -133 -49 17
6097 17 102 58 -81 -138 -55 -17 91 74 -1 -67 -87 -15 88 107 -15 -49 -66 12 25 111 79 5 -127 -40 65 120 84
6124 84 -5 -75 -38 -26 134 111 29 -80 -113 -2 110 114 -9 -84 -73 -52 40 88 -9 -84 -115 -38 7 73 76 -117 -19 -16 -4
6153 -4 35 117 -47 -116 -42 -18 83 48 9 -120 -20 -75 106 155 9 -43 3 23 26 84 70 4 -128 -65 21 47 46 50 -109
6182 -109 5 15 153 67 -66 -3 -58 0 127 58 45 -39 -82 -70 -6 148 7 -96 -75 -67 68 84 49 -35 -104 -83
6208 -83 -10 59 56 -13 -53 30 -6 76 63 -8 -68 -42 -7 25 140 69 -51 -68 20 52 129 91 -89 -81 -32 50 104 75 29 -61
6238 -61 -103 -35 57 45 2 -20 -41 1 90 110 -32 -44 -107 -40 -51 83 -19 8 -58 -82 -8 47 39 -52 -16 -68 -18 6 80
6267 80 6 -129 -71 50 61 93 11 16 -31 36 74 23 49 -41 -23 -2 40 104 27 -37 -43 4 66 81 21 7 -15 9 32 92
6297I2L6m4j19o1J23P9J1j45k9kM0K0J27o4j61k5M5J40J2l5p0p4N9J02K9n5l3
6324bl6l4P1N6P6j25m4k8J4J17J4J2j98j9Q7J23n4P3q9p0Q9M4Km0J2o0K5m6R1
6353F1k2kr9MQ6J3L0o8m0Ml9P2P6k1n8l9M1K3N0k2p3p8N0Q0M5n0l2o6J1M6N3M1
6385G7o2l8k1R9k0Q7j07p0m3J1J52k7N2m3j61N3J05M7m3Oj44K1J33%J0m2q4L8
6413a4MM9O7j11m2k5L1P5Jn8o2MN3J6M1o6mm8Q2L3K7Rl8p7N5j5J68j13M0j33k5
6444g6R4K3P9r8jl4n9J18O7o9n2j01J19pP8l8q0k7O5k5P2K0m4q8J1PJ08jOj54
6474h7O1j9J35m0K2l2j33M9Q1nN0j01j4M2j7R1o9m5p3O4N0N7M0q4j08K3J4J75
6502A27k3l7m3q8P8L7K9o9m5j6L4P6m8L4n1j43O5J15L8j6o2l9K5nR2Lr6j7o4O9
$$ plain form
6297 92 128 84 -35 -96 27 106 117 -28 -57 -59 -19 1 128 64 -97 -122 -77 63 75 40 -30 -104 -45 57 86 31 -2
6324 -2 -38 -72 -1 55 131 6 -38 -66 -52 65 79 91 -107 -126 -39 84 30 103 14 -56 33 77 79 39 51 -9 16 -30 61
6353 61 39 37 -62 -58 28 41 71 3 -37 -33 -72 0 76 55 -3 -42 -1 22 72 50 -23 -101 -51 29 74 24 -8 -74 -63 -17 36 77
6385 77 15 -23 -44 55 35 122 15 -55 -98 -87 65 38 90 47 -114 -61 44 91 48 54 -90 -69 64 64 74 32 -52 -14
6413 -14 -10 39 106 -5 -47 -72 -41 34 35 -23 -85 -81 -28 -12 29 -37 -41 -89 -7 26 53 62 24 -53 2 -13 155 42 82 -51 -76
6444 -76 18 41 120 22 21 -13 -72 46 113 44 -8 -109 10 3 81 43 -37 -64 1 -24 48 68 24 -64 -53 -46 62 61 67 -87
6474 -87 -26 -45 90 50 72 40 -93 -44 37 32 82 -19 -33 9 -8 83 14 -31 -104 -40 10 67 107 23 -85 -62 -48 127
6502 127 104 67 24 -64 14 51 80 11 -34 -50 -16 60 12 46 -5 -148 -83 32 70 54 -8 -47 -22 -27 65 68 -28 -45 -109 -40
6532d0J00Mr3l4j8PJ04L3l7q9o3R7K8R9o1j05j8j0J13L3O3k3j78M8L8K3L7pq7
6561c6j15J58k1P8l2j08J8N3L7M7j2j08l9k2O5Q9m2n5mpJ3N4L6o0o8j0P0L6L3
6590D8j3p3N2n0L8N9p3j6p3pJ46N2k3n7J7m1M9J02l6r4PjnN8Nj23N9l9N7N2K2
6621I9j4r3q4J09pQ8L1j31n7k0J16J21j10l8m8j8J3R3J0k1j06MJ0RQ9l7n7l4M1
6650d2M6Lk5j00L8NQ0M6m5l7J1lj3O3K0m2p9P0l1J21J8j0j39j5Q2M0J4r8L6p7
6680f3J07l1M6P8j61qm6J03N6L4j23%K3n6J24n9l3k0l4%K8R6m3r1NM7N0Nr5N7
6710dq6N5O5N5j2q1m6J1j6J05N4j04k1M7k0L2O1p9p7N2n7K16k5r4l6n5P2N1Jj
6740F3n5k4K9M6O3n3p1j6n4N9R0k6Jj16J0N8L3M9m0j16o5J49Kko0l4J1J7Q9L2
$$ plain form
6532 -40 60 64 -29 -63 -81 -74 30 63 26 -63 -126 -29 -1 98 37 -68 -86 -96 17 50 113 90 -88 -40 -2 21 58 51 -36
6561 -36 -151 7 -14 64 32 -76 -58 -5 32 79 67 -41 -80 -102 -37 52 10 -45 -49 -56 -43 11 47 -13 -81 -91 -21 15 48
6590 48 35 -38 14 -36 2 61 -12 -28 -101 -108 38 90 67 10 27 -14 35 137 101 7 14 13 8 66 71 -52 7 -32 25 77 99
6621 99 85 -8 -92 17 10 98 129 -2 -59 -79 37 158 48 10 -38 -56 -43 50 60 39 -67 -63 -53 -44 45 8 -49 -83 -42
6650 -42 4 7 -18 -118 -80 -75 5 51 6 -31 -20 -23 -36 27 47 5 -74 -4 -35 86 104 94 -45 -60 22 62 76 -22 14 -63
6680 -63 44 13 59 137 -24 -32 -78 25 81 115 -8 -8 15 -41 83 24 -9 -29 -63 -63 -35 61 18 -73 -68 -21 29 34 -61 -4
6710 -4 -90 -35 30 85 73 -8 -54 -43 -59 46 100 -4 -25 22 2 34 95 16 -61 -9 -66 150 125 31 -5 -60 12 63 64 63
6740 63 8 -16 13 59 122 69 -2 -18 -72 -13 77 51 52 -64 -54 4 37 86 46 -70 -135 14 16 14 -46 -80 -69 -52 37 69
6770F9Qm0j30jJ28J3Nj0j26M2K6R7p6O5p3j03Q8J1Q1k3p7J5J1J45n5p8J7on6M8
6800A5N0jl4o0l5M8N2m0M5j10oM9J39n3l0n4n7N5jP8l3m4k7nM1Q3k8q9j0l3J05
6831A0M0k2j5p5J6N2L3Rk3k3J0kL0L3n0m0j17J58M9N0j04j9q9P4K2J5J5m6rOk6
6862c8Q3M8n9j02pP3L2rk6l1j0nJ57o8L3m9j08O6L5J8n6L2j13N8P2J8K3n8q6N0
6892b7P3ml3J9k9J3r2P0R7p2k8l8jJ03K5mp1n7N9P4k6m9l6K1lP8l6O9k9j73M8
6923e9N7L0P2r8p5L2jL8R0o7l3n9Q7K9Ol5k7l9M5qQ9m4k8p2RP9K2kj9n5p7J32
6955A9nN8j6p5k5N4J5l9P3p7j6L5PO2n8l3l2k8N8M2J1Nn3lkQ9m0k5l0J2l3K5R7
6988G2l2k7q8L0N3M9l5qq2P1L1Rom5Mk2L8L4O6j10oj38J44pL1Lo1l5L6L5J08m8
$$ plain form
6770 69 77 37 -93 -94 34 47 52 42 -84 -42 -16 81 5 70 -3 -106 -18 -7 74 51 -26 -11 0 145 90 12 29 23 -33 15
6800 15 65 64 30 -30 -65 -17 35 -5 40 -70 -76 -27 112 59 29 -25 -82 -27 -28 50 17 -27 -54 -59 -18 65 37 -52 -62 -95 10
6831 10 50 28 13 -62 -46 6 39 48 25 2 12 10 40 73 23 -17 -134 24 73 123 19 0 -89 -15 7 22 37 -9 -18 -12 -38
6862 -38 45 93 34 -68 -75 -2 30 21 -5 -36 -46 -51 106 38 71 22 -86 -20 15 33 -23 9 -104 -46 26 44 67 9 -77 -27
6892 -27 46 42 9 28 -1 12 -80 -10 87 15 -13 -51 -52 51 76 72 1 -56 3 77 51 2 -34 -13 -16 62 26 95 66 -107 -59
6923 -59 -2 28 100 2 -73 -41 -42 -4 86 19 -14 -73 14 43 49 14 -13 -52 -7 -15 74 30 2 -70 -61 18 40 38 19 -36 -113 19
6955 19 14 72 56 -19 -44 10 25 -14 59 -18 -34 1 8 70 12 -21 -53 -81 -23 19 30 35 -18 -21 -23 66 26 1 -29 -17 -50 -25 72
6988 72 40 13 -75 -45 8 57 22 14 -68 3 34 43 37 -8 -4 -26 12 46 112 2 -4 -142 2 -5 26 29 -32 -67 -31 4 112 64
7020F4j08l4O9K7J04j02k6l8l3L8k8R7l2j6o4N3L8J8nm9K7m3N1nPl2l9k1J14m4
7050a2J3k5m6M9L7M5j9o8ll1M1J18j02R0j69JJ32o1P4o9l9l0J00k6K2Q5j09K9
7078B7p3N2O5qm3j17J09QnJ8k6j04L7Q4k9R7o5j12J9L2Q3m3l8M7j43RJ73n7O4
7107F1k3n6J2j4K9pj5Kl5L2O7k7l5l7n6Q7Q7L2n0j18NM5N5l1J5ln6J0O9J6r2K7
7139dK9m5J1O3J0n1kk1kJ8L6k6n9K7o8J16rk8q6jL9M7j2L1q4J4LM8K8K3q4QM0
7172IK2m4J06k4r7l5N0J00o6l1j8J2nJ04q7N7K5m8k9N7M5j04m6k0L0P8nk4Lm9
7202c4k9pO6O3j5p4k7O1j7R2o2l5j11P0mJ24l3m8l6M0KRRk0l4j6J0O5OK3o6j9
7234d7O6QNPn3o9K4R8m8M7Ko0N3K4n3K6n3j4K2k8J52p4m2k4j6K4J3K5Pq1J4j8
$$ plain form
7020 64 -44 -78 -9 18 122 20 -6 -44 -77 -39 -67 30 -2 -18 -82 -29 9 27 22 -27 0 -43 8 3 10 -22 -61 -82 32 -12
7050 -12 1 -24 -70 -21 16 61 42 -26 -29 -60 -19 99 -3 87 -82 -81 51 -10 64 -5 -44 -74 26 0 22 107 -2 27
7078 27 -46 6 71 63 20 -97 12 20 15 33 7 -97 -60 24 -5 92 27 -85 -66 -34 49 6 -32 15 -128 -119 54 -3 61
7107 61 38 -18 -6 -20 9 2 -13 -11 -46 -14 53 26 -9 -46 -102 -15 72 104 54 -64 -59 -14 41 10 25 22 -34 -24 45 61 -31 -4
7139 -4 25 -20 -9 54 64 13 11 -10 -12 6 42 16 -43 -16 -84 32 23 -5 -91 -92 -53 -6 -18 13 -71 -57 -54 -6 22 45 -39 -31 9
7172 9 31 -13 93 69 -28 -63 -13 87 21 -10 -28 -16 -21 83 -4 53 78 30 1 58 103 -1 -47 -67 -37 41 36 12 15 -34
7202 -34 -63 -70 -4 59 44 -30 -57 4 -13 79 17 -18 -129 -59 -63 61 28 -20 -56 -16 -14 -5 4 -16 -50 -66 -56 9 15 38 -28 -47
7234 -47 19 27 32 39 -14 -83 -59 39 -9 38 40 -20 33 57 4 30 -23 -37 -15 -43 109 35 -7 -31 -47 -23 -10 15 22 -59 -45 -63
7266f3L3M3m7ln3L4N8Rkr9KP8l5M7K3p0n7L2J01J7l6L5o2k0P4jM9Nj05m8P9rJ1
7299B0k0n3k4O6M3N6k0r9j8j7P4J7L5o5K6n8kM2Ko1M9p2J19Ln2N6m5m7O8M0k2
7330D1m2l9j4jP8l0L0o4N7o2L0M8qo0P2r6N1O6M2r9K6p4M0J5O5n1l5krJ9P6jm1
7363B8m9l4R9M6j8o4p5J6K0J01%q6%k9JL4K9Nq9K8J4P3J9mn4r2M8N7l6M8o4J4
7395a4k4J3N7L0j18K2K0%P2j5k4K1m5o4J02J4n8j2j3L7J2O7m8k0j4J5nOL3Nj9
7426C3l4K7J7K4m5J4n0l3J12K9r9k2l9N1lQ2p6Ll9O1oJ8Rm2qo5O4N4J0o9j0K7
7458ej5K8K4j10J2qJ3Q8rk8l3l6J3J09l5L4L1j69Q0J9P6k6n1n8RN1R6o7j0l2n
7489a4L3k7k5Q5n5n6PQ2k0j7l3L3K2l7L2K8k6q6Q7J1L1mJ8j11KJ14r4O3M7j61
$$ plain form
7266 -63 -30 13 -34 -37 -90 -56 2 11 9 -90 -88 -10 -45 2 25 -45 -102 -70 31 48 12 47 -15 -35 39 38 87 92 -13 -61 18 9 20
7299 20 0 -53 -77 -11 32 88 68 -31 -49 -66 8 25 60 -5 21 -37 -39 3 5 -56 -7 -79 40 43 -9 47 2 -45 23 63 41
7330 41 -1 -40 -54 -55 23 -7 23 -41 16 -46 -16 32 24 -36 36 -60 -9 57 99 0 26 -48 -8 7 72 21 -14 -16 -25 -6 70 69 28
7363 28 -21 -55 44 90 72 8 -67 -51 -31 70 70 -16 -16 -45 -44 -10 19 24 -65 -37 -23 50 69 65 11 -81 -33 24 -12 36 -28 -14
7395 -14 -38 -25 32 62 -56 -34 -14 -14 58 43 19 40 -5 -69 33 47 -11 -23 -36 1 13 80 32 12 -2 13 8 14 47 52 33
7426 33 -1 26 43 67 22 36 -14 -47 65 94 -5 -27 -66 -15 -18 64 -12 -9 -48 13 7 25 34 -8 -16 -81 -17 37 47 -22 -32 -5
7458 -5 -20 8 32 -78 -66 -74 -61 27 18 -10 -43 -79 -66 43 8 42 73 -96 -16 3 79 53 2 -56 -47 4 100 33 23 -9 -14
7489 -14 19 -8 -33 52 -3 -59 -52 30 10 -7 -40 -7 15 -22 10 38 12 -74 13 24 55 51 69 -42 -40 74 -20 43 90 -71
7519g1K0N2L4k5Lln8J2L7N7p2lM3n8l5P6j0lp9K9P8l6j2L5n7N1k9N7K2m6n3J0
7551c4P1ml5j2Lk2Kj4N5JOp6O5P0n3K5j7o6J6N3j2O9m8K2j34M5JJ11n5r6M5k1
7583c9Q8jK6j13j6J1L2M6J5j0m1o7P7RL9p8kL8n1O1K9q0j5k7M5j7J11o9p3KN5
7614a5J4Jm2J00k4o4L8RL5j4j48O0J1J18m8n0Rm3L7J1J14l8o8Mk4R1m3lq2N4m5
7645d5K1J7M4j8m4p%N4k1J8p3j2OJ04k0m6l1L8pJ3K5j3l4J7nJ6N0J8q1k9m4M7
7677d2K6O5r5j6K0L9M7L7j06k5o5J41L2L2m9n5q5J02K6rL5o9n5J37nJ1N7j22j2
7706cJ5m8J39o4n3j8n0J01mJ4k2p5NML5J13p1m1r1O7M7J23j05o6J4qN7J5M2o5
7736Gl2n5L6O9N9q8l7P4lj8Q6j5o6n9M8K9mJ9K8j03K8o4J30l1Q8j28jJ9k3N6p1
$$ plain form
7519 -71 -51 1 35 10 13 10 -48 -36 1 58 -14 -17 26 -32 -67 9 -1 -4 -83 -54 24 -12 -24 11 -46 5 -24 33 55 9 -44 -34
7551 -34 37 33 -2 -14 -11 -33 -31 -45 10 11 17 -59 6 76 23 48 31 -35 -19 34 22 91 43 65 -69 -24 -23 88 33 -63 -18 -39
7583 -39 49 48 74 -39 -55 -44 -12 34 49 39 -2 -69 8 17 56 -22 -24 14 -37 24 53 -27 -42 -69 -24 -41 70 1 -72 -70 -15
7614 -15 -1 0 -42 58 34 -30 8 17 52 38 -110 -50 -39 79 31 -19 -10 -53 -16 -5 109 71 3 7 -17 74 31 28 -54 0 -45
7645 -45 -24 -7 37 19 -25 -32 -32 22 1 19 -54 -66 -60 44 24 -22 -53 -15 -22 -9 16 3 -31 -14 -19 -3 47 65 -16 -45 -89 -42
7677 -42 -16 49 -46 -62 -42 -3 44 81 -25 -50 -115 26 58 90 41 -14 -99 3 29 20 55 -14 -69 68 63 74 131 9 -3
7706 -3 12 -36 103 39 -14 -32 -82 19 15 29 7 -68 -63 -59 -24 89 18 -23 -114 -47 0 123 18 -48 -34 -42 15 30 72 7
7736 7 -25 -80 -44 25 84 -4 -41 33 30 12 98 83 17 -42 6 35 31 50 78 -25 3 -61 69 38 126 -2 -3 16 -7 49 -22
7767b2k5J2O1j5L9o1Oj1k1l3Q7l4q8O1%K1M1N3j19M5pkj9P2k6r4L8N4J3J9l8l1
7799b4m2J11rM8p0L5j63M5P3N9l2n2p4L1P6N3p2J9K6k8m4J13r3Qk7m0J15n2nM2
7829B7l5j6N8k0L6o8L3r5J03n8N1j9L2k6O0m1o5K4Qj4l2J7J4L8k2l9J7J3N7j4
7859B4j7rLLOQN7l7n3qK6R9m5m2Kn9J4Q0o6P9p8K1o2Q6J3p5J8k6j7P7PP0j63P3
7893Ij5o2M5N4l9l8J8O8p2N4mNop7O4JJ4j49J40m1N5J7k1Nn0M9j0oK2m5K3J1m0
7926b1O7n3k1M2k9K0K4m5J5l4J5k7O7J4nj04M7LJ0J8MKj5k7N5j2K1n9l5N0K9j1
7958Ej7J0m3J4K4PK7k3K5n8K3L9nj5p4J9mN7K8q8k4k1O3L5M0Qp4j4L1J7L3On9
7991hq3M8MJ07L3j36%K6k4N3mpJ4k2k3K7O7mj13lM0L5k8pK1J7m2P5MN4q6o6r4
$$ plain form
7767 -22 -47 -35 26 11 50 -11 -5 -16 -37 -70 17 -17 -105 -44 -44 -23 18 71 -48 -3 -10 -12 -31 41 15 -79 -41 13 26 45 7 -24
7799 -24 -66 45 36 84 14 49 -114 -69 4 63 31 -21 -95 -64 12 65 -7 12 38 10 -34 79 -14 -6 -33 -73 42 -10 -15 27
7829 27 -8 -24 34 14 50 -18 15 -80 23 -35 16 -3 29 3 63 22 -43 -19 -11 -25 -57 -40 -26 12 -10 -49 -32 -19 38 24
7859 24 7 -2 1 4 10 18 75 38 -15 -23 3 102 57 15 17 -42 -28 52 -14 65 -13 8 -54 32 45 -30 -12 -38 -55 22 29 99 -64 9
7893 9 -6 -68 -23 31 -8 -46 -28 40 -32 22 18 23 17 -60 4 5 19 -130 10 -31 24 41 20 25 -25 24 14 8 30 -15 8 19 -21
7926 -21 46 -7 -28 14 -15 5 29 -16 -1 -35 -20 -47 20 34 29 -75 -28 -25 -15 3 7 9 -6 -33 22 10 31 -28 -63 -13 16 5
7958 5 -12 -2 -45 -31 -7 0 27 4 29 -29 -6 33 28 13 -61 -42 -46 11 39 -49 -73 -94 -31 4 44 52 -22 -36 -5 12 45 51 -8
7991 -8 -91 -43 -39 68 101 -35 -35 -9 -33 20 16 9 23 1 -22 5 72 68 -45 -48 -8 27 -1 -8 13 30 -12 63 67 121 35 -31 -125
8024a25J50K0k2Jr8n3J05O9k6l4M5l1m2Q7J6K7Qj60J0N0j2J8K5n8l2O6O2p0k8
8053c2j8j9PK4O0k2P5j55M0r1J48J8r2O2Rn5J01l7l2rrQ7n2J2j2r0RJ15J2J2M0
8084A06j68N2L1Nj8K1o6M7m6J08j8m2K0n5k2J09m5n7mN0o1K3l0Q5J4l4o2L4M8
8113B5K4n6o2J8J5M0j1ml5J06o7K0KM0p7OL4J3oJj0M6n0j1J2NR8j22k8j2R1o0
8145a5PK1Ml5K2K5K2o9K8rM1k5l5L4q3N9m2L8J0J4m5mL8K9J7Oj1r1M7l3j8J5N8
8178B0n7j3NR3%o3KkPJ9R3q6J1
$$ plain form
8024 -125 25 45 23 24 -74 -127 -22 47 21 -13 32 1 -41 46 62 89 97 -63 -53 -3 -15 3 28 -30 -62 4 66 -4 -32
8053 -32 -50 -69 -62 -38 22 0 75 -80 -40 -131 17 35 -57 5 14 -41 60 23 -9 -18 -27 60 8 20 8 -82 -73 42 54 66 106
8084 106 -62 -10 21 26 8 29 -37 10 -36 72 54 12 32 -23 -45 64 19 -38 -42 8 -53 -30 -60 25 39 5 -57 -23 25
8113 25 49 -7 -69 -51 -36 4 -7 -11 -46 60 -7 13 15 55 -22 -16 18 31 25 26 16 62 12 1 13 18 116 -6 -34 -46 45 -15
8145 -15 -8 13 17 -18 4 29 51 -18 10 1 42 17 -18 16 -67 -8 -50 -12 -2 12 -33 -37 1 30 47 53 42 -49 -2 -35 -53 -38 20
8178 20 -37 -50 -45 48 48 -15 -13 -15 -8 11 104 18 29
8191B9
$$ Imaginary data points
##PAGE= N=2
##DATA TABLE= (X++(I..I)), XYDATA
0@%%%%%%%%%%%%%%%%%%%%%%%%%%%%KmNoQj0J1j3J4j5J7j9K0k1K2k4K8l1L4m1M6
49B3n0O0p3Q7j06J35j80K56l93O94j602Q190M1335l2880n5263J7486N1721m786
67B4654m5944k296M1228R396l7028j7701K9456K5100j7649k6834N348K1667J407
80A0804j3668j366Q712k953r182N515J2294n044j4510L213J4379l676j5568N308
94e742K0458m145k7883l450L1860J5229k8783k5624K0093L0605j1014l1253M286
107a5363L1522J862l2141r766L0388J9707k3224k7034J1605K8384O82k2835q396
120a4609J4916J1060q606j1039M960J2027j095j3024m698J1202J0541m888j2207
133e460l048P763P402l02o106n292J361O322K240n437l743N385M784o685q825
$$ plain form
0 0 0 0 0 0 0 0 0 0 0 0 0 0 0 0 0 0 0 0 0 0 0 0 0 0 0 0 0 0 2 -2 3 -3 5 -5 6 -7 7 -8 9 -10 10 -11 11 -13 15 -16 18 -23 23
49 23 -27 33 -40 47 -59 76 -104 152 -241 453 -1149 7041 48376 15496 -39767 -22281 29440 24654
67 24654 -21290 -23586 17642 27038 -9990 -27691 1765 26865 9216 -17618 -12270 9397 10804
80 10804 -2864 -4230 4482 1529 -7653 -2138 10156 5112 -9398 -6185 8194 4518 -11050 -5742
94 -5742 14716 10571 -17312 -20762 11098 26327 -2456 -28080 -7987 22618 11604 -19649 -15363
107 -15363 16159 18021 -14120 -23886 6502 26209 2985 -24049 -12444 15940 16622 -6213 -14609
120 -14609 307 11367 2761 -8278 -3318 8709 7614 -5410 -10108 1094 11635 6747 -5460
133 -5460 -8508 -745 6657 6355 249 -5043 -3682 2640 4880 -557 -4300 1085 5869 -816 -9641
148i641N821J3970n51j6575p976J3343J4727n896j6380k029J3752O615j0002q717
162i539P730J1258n516j4998M35J7885Q136j5745j6085Q421J9874M41j7647o194
176a1544J3351Q295j0283q899R000J1298o449j4135J023J3859N837r101r140J840
190e048P341K896k654l363q70J111J213J37o14J95J318m76m023k486M945P885
206G507j844j1943n165J1184J1286o320j3828J129J2975J697j1994l082J2781
219D383N965j3170j1271J0583J6164l964j6952l037J3416P124q052p094M883N776
233D754l780n626L033P003k37o901l625L863N495J035l385m114j102L023M197
248C633O19m021l294J794L204r22k765J927L920k550p448Q2R851M805q888r307
$$ plain form
148 -9641 -3820 10150 9599 -6976 -14952 -1609 13118 7222 -9158 -11187 2565 9180 -822 -9539
162 -9539 -1809 9449 3933 -11065 -10630 7255 15391 -354 -16439 -8018 11856 12297 -5350 -11544
176 -11544 1807 10102 -181 -9080 -80 11218 4769 -9366 -8343 5516 11353 2252 -6888 -5048
190 -5048 2293 5189 2535 -828 -1698 -587 626 763 149 344 1662 1186 -2837 -5323 -378 7507
206 7507 5663 -6280 -11445 -261 11025 4705 -9123 -7994 4981 6678 -5316 -8398 4383
219 4383 10348 -2822 -14093 -3510 12654 8690 -8262 -11299 2117 9241 1189 -5905 -1022 4754
233 4754 974 -4652 -1619 5384 5147 -1754 -5379 -1516 3979 5014 1629 -2485 -3587 -564 3633
248 3633 4252 231 -3063 -1269 1935 1013 -1752 175 4095 1545 -5903 -5821 4030 8835 -53 -9360
264i360M395J0388k3q368j934O176J586n817k075O644M433n450p354J544P919
279B704L089m534n175L25L746J955r08j152R7pj172m15K051K720l82l737k755
296c550J807M630J820l043m448l67L744L014j459k846j86J396p38j424J987L493
312C830j399n650j901N001M802j859n101j490K562K134j94n88m8o70j425l18J936
329c78K526J3l272k834J240M080J893k179l180m87J796J714N91j85j166j428l57
346a613J250K013J058j032k696j836J713L945J112l096l145O90K370R18l92K9
362A288n78k168q18K427K787n54l070j912P59K094J595n4j970k109m6J867J716
379A254K58j265j777j079R10K451J331j282k394r80R97J948J499k50k347j916
$$ plain form
264 -9360 -4965 5423 5400 -2968 -4902 1274 2860 -2957 -5032 1612 6045 595 -6759 -5215 2704
279 2704 5793 1259 -3916 -3591 155 2110 1202 50 147 140 -1032 -1447 604 3324 2942 -795 -3550
296 -3550 -1743 2887 4707 1664 -2784 -3151 593 3607 2148 -698 -884 512 -226 -1650 337 3830
312 3830 2431 -3219 -5120 -119 4683 2824 -2277 -3767 -1205 929 735 147 99 -571 -1996 -2314 -378
329 -378 2148 2161 -1111 -3945 -2705 1375 3268 1089 -2091 -2578 -782 932 1523 1338 172 -1256 -1613
346 -1613 -363 1650 2708 1676 -1020 -2856 -1143 2802 3914 818 -2327 -1637 733 1651 1259 1288
362 1288 710 -1458 -2276 151 2938 2384 -686 -2598 -1839 255 1850 1796 -174 -2283 -2329 -462 1254
379 1254 1512 247 -1530 -2609 -1699 752 2083 801 -1593 -2573 -1576 372 1871 1621 -726 -2642
395b642Q00K650J315p90j413j124l56J039K305J127j907k846j02K318J642j05
411A911q74j191j444K19K494K042j349l056q66J522J719N79m17j378j517k07J521
428b92J891L09j759k111o29J784K484L11k183k033J37J394J284M48l00j505j616
445b386N00K402J539r27k085j143O35J656J646J50k021k125M84K430J399o66j293
462A95p74n05L32J856J786j035l045j179J827K532M79j482j792p31P58J558R80
479A760n59j142j303n82J008K497Q74k554k892N78K615J236q24r22q90r01L38
496a663K148J474j252k239p42R94J529J298o5k031k011O89K644J432j068j640
512e03o41J52P25J513Q68r46k166r12J336K451P53j491k405m79J695J798J15j130
$$ plain form
395 -2642 -1842 808 2123 1333 -80 -1204 -1560 -521 1784 2911 1004 -1842 -1944 374 2016 1911
411 1911 1037 -154 -1598 -1379 1115 3157 1808 -1248 -2114 -592 1127 1706 1289 -89 -1606 -1813 -292
428 -292 1599 1908 149 -1962 -2591 -807 1677 1988 -195 -2228 -2091 -697 587 1035 735 -770 -2386
445 -2386 -1886 516 2055 1128 -957 -2100 -1465 191 1837 1987 -34 -2159 -1675 755 2154 1488 195
462 195 -579 -1084 -752 1104 2890 1855 -1190 -2369 -542 1990 2469 987 -805 -1536 -778 780 1760
479 1760 1201 59 -1244 -1826 -818 1679 2553 -1 -2893 -2315 300 1536 712 -210 -1100 -2001 -1663
496 -1663 485 1959 707 -1532 -2274 -1280 249 1547 1482 -549 -2560 -1871 773 2205 1137 -503
512 -503 -1144 -992 -267 1246 2114 1168 -998 -1910 -574 1877 2630 1139 -1266 -1745 -50 1748 1863 733
530G33r57n79j51Q99J716O21k030k653J61K697J933j013k252j065N68J116R25
547F69L33p38j356q67M63J692J480m29k468j771J221L020R63j880j928P8J023
564d95O84N35N31n38j827q55J401K348P12j683k419m49K135K312j13k068j476
581a265O19R73K99M24N49p80k140p46K201K574l62k957j987J023K593J089j284
598H23j852l26O98L75N9R12N72j540k496J83L366K229k008l558m44K601K062n82
616A074j472m86L59k04n4J001J562l73k567j699J957L531N62l254k583J201K870
633A425O95j345r64L03o2p04L65J723J015j737k772l72L004K850j114l873j549
650c112K534K687o28k146j45J113n68j599J028K793K57l374k741J968M026R33
$$ plain form
530 733 -224 -803 -954 -55 1661 2282 252 -2401 -2240 457 2390 1377 -875 -1940 -1372 -256 669
547 669 1002 264 -1092 -1959 -1496 196 1676 1247 -1221 -2992 -1771 1249 2212 332 -1596 -1518 -495
564 -495 189 724 1255 717 -1110 -1965 -564 1784 2496 813 -1606 -2055 80 2392 2279 211 -1265
581 -1265 -646 327 626 1050 1599 819 -1321 -2067 134 2708 2346 -611 -2598 -1575 1018 2107 823
598 823 -1029 -1355 -657 -282 -223 689 1261 -279 -2775 -2592 774 3003 995 -2563 -3007 -406 1656 1074
616 1074 -398 -884 -525 -729 -783 218 1780 1407 -1160 -2859 -902 2629 3191 -63 -2646 -1445 1425
633 1425 2120 775 -189 114 52 -652 -287 1436 2451 714 -2058 -2430 574 3424 2310 -1563 -3112
650 -3112 -578 2109 1481 -665 -810 303 -265 -1864 -836 1957 2214 -1160 -3901 -1933 2093 3026
666C026l237k843Q62K857Q63j450j025Q47L47j407o39K287K391j303l944j061
682c429L458L525r13l822j524K146K474l89j683M2J168n98j943K12L269J723l104
699F12m155R28M860J880l373l483Q19K888M54j647m02J317K6k067j139K272L042
716B832p65l977k176K756M160j50l873j985J936K440n96j532O28J424r33k418
732b229J19L352K264k362m311k01M284K980k169l916n0L112J229k098r75K112
748A141J118k728k550K322M419j42m803k795K850M350p9l652j820J790J852q91
764C82j352R53J770j102l084k67L585K592k315m181m64L568K667j442k924n69
780b183J660J322p97q31R07J271j382k693N05M162K105l649m577J247N227J654
$$ plain form
666 3026 -211 -3054 -2192 665 1528 78 -947 -100 247 -1160 -1799 488 2879 1576 -2368 -3429
682 -3429 29 3554 2641 -1181 -2705 -559 1915 1526 -157 -115 1053 455 -1488 -1276 1993 3716 612
699 612 -3543 -2615 2245 4125 752 -2731 -1912 976 1430 -217 -619 698 724 -1343 -2482 -210 2832
716 2832 2067 -1910 -4086 -1330 2830 2680 -1193 -3178 -1242 1198 602 -930 -302 1122 189 -2229
732 -2229 -2110 1242 3506 1144 -3167 -3368 916 3896 1727 -2189 -2239 873 2102 4 -971 1141
748 1141 2259 -469 -3019 -697 3722 3580 -1223 -4018 -1168 3182 3103 -549 -2369 -579 1273 382
764 382 -970 -17 1753 651 -2433 -2700 885 3477 1162 -3019 -3483 85 2752 1310 -1614 -2183
780 -2183 -523 799 2 -829 78 1349 -33 -2726 -2221 1941 4046 397 -4180 -2933 2294 3948
796C948l778k879J870K699j005k269J101K992n52m091j513M078L996j995n126
811b524j055M079K863j966k839M83J779m30j623O75K214K8k594j969J475L006
827A602J017k156l075k56K861K436j164k812n47K151P21j599n37K403J202l039
843g92l102K251M984M11m995l056L068M424p25l784n93K859Q25k685r95L233K324
860C652l054m095J204M854J429l602l088J203K605M90j169m99J64j94n66J7R71
877C22J033j96j819j709Q76K982J308k613l255O78L331J312k181j837J006J402
893F40r98j328J458K484q74l839j097L726L553j784m257n88L144K017j573j593
909i09J016J087j420j520J427K810r8l087j916J671L022N07k064k165L49J852
$$ plain form
796 3948 170 -2709 -839 1860 855 -1414 -313 2679 2127 -1964 -3477 601 4597 2602 -2524
811 -2524 -3579 500 3363 1397 -1442 -959 820 390 -1233 -558 1656 1684 -910 -2879 -1404 1602
827 1602 2619 463 -2612 -2868 -7 2429 1265 -1547 -2094 57 778 -821 -1358 1045 2247 -792
843 -792 -3894 -1643 3341 3752 -1243 -4299 -1231 3193 2468 -1316 -1909 950 1775 -910 -1905 1328 3652
860 3652 598 -3497 -2293 2561 3990 388 -2700 -1497 1108 1598 429 -70 94 -100 -666 -649 322
877 322 1355 1159 -660 -2369 -1493 1489 2797 184 -3071 -2393 938 2250 69 -1768 -762 640
893 640 -358 -1686 -228 2256 1382 -2457 -3554 172 3725 1941 -2316 -2904 240 2257 684 -909
909 -909 107 1194 -226 -1746 -319 2491 2393 -694 -2610 -939 2083 2590 526 -1639 -1290 562
925E62Q22q03p30L45m0r26l27J632J613j009k870r21K215K505k47k477j643J023
943a276J799L05q92l81L42l30r91L12K033J059j903k587K91K911J817j551k525
960a567j58J788R92n48m94M20L9j184n30J537K129n84k921j383K106K701j95k387
978b39r85Q63Q02q8J32N16l34j447p48J234J701J73j457j742M6J461J568k63j631
997d38j150L83J190N72k08l47l94o90k20R37J491J52j751j665N24K334J203j297
1015F26j830l1J125N91r1K72J86r42j328N00K116J025j477j933j13J488J219r4
1033A309q42q24l16K70R11O62j51r74r32j56J008J312M1j400j378J63J301J172
1051A176k96j011r37j71P12J076L43o42j042o41L62J212R77l82j479q75O29J445
$$ plain form
925 562 1384 581 -149 196 156 -770 -1097 535 2148 1139 -1731 -2652 -437 2068 1821 -656 -2299 -1276
943 -1276 523 828 -64 -445 -103 -433 -1424 -1112 921 1980 77 -2510 -2219 692 2509 958 -1567
960 -1567 -1725 63 1055 507 13 433 472 -712 -1242 295 2424 1840 -1081 -2464 -358 2343 2148 -239
978 -239 -1224 -361 441 353 485 1001 667 -780 -1528 -294 1407 1580 123 -1619 -1573 -112 1456 1193 -438
997 -438 -1588 -1205 -15 557 349 2 -392 -1082 -1302 -365 1126 1278 -473 -2138 -1614 720 1923 626
1015 626 -1204 -1235 -110 481 390 662 848 -94 -1422 -922 1194 2219 742 -1191 -1304 184 1403 1309
1033 1309 467 -357 -673 -403 508 1170 1019 45 -887 -1043 -35 1277 1318 -82 -1460 -1297 4 1176
1051 1176 880 -131 -1068 -1239 -527 549 892 250 -792 -1433 -1071 141 1118 736 -743 -1618 -989 456
1069D56O09m67r77o32J52Q27R73K02r35j092n8Q05J213L23p64j215n17Q98J319
1088A120K93p53j004m41K82R66Q66j88j357j013L48J332P47l35j001p52r2O37
1106c45R91L86q68j245m35R58J336K69j031j159j56Q52P65L77k49q01p98o1J164
1125e0J254j10j525j029N73J249O27k02o49q28k58P85J172L24r04r77j98N45Q72
1144F71N63k11j205r83N40J494P31q16j332m39N86Q18K87j11l83q42n03N68J310
1163G43O68j214j714m9J494J093l35r78n50m2J98O44Q09o9j079j021L25J220R54
1182A097k80j183q67K03J220J112k72j301p18N14O97M43J52j78p00r16L65J437
1200H25J065j002j722m99J180J343Kq62o91j98J36L11P65N26p70j434m24J311
$$ plain form
1069 456 1065 598 -379 -1011 -859 -32 941 1143 208 -884 -942 -137 1076 1399 635 -580 -1097 -199 1120
1088 1120 1413 660 -344 -785 -503 463 1329 1141 -216 -1229 -881 451 1198 863 -138 -890 -982 -345
1106 -345 646 1032 164 -1081 -1516 -558 778 1047 16 -1143 -1299 -447 318 695 446 -355 -1153 -1214 -50
1125 -50 1204 1094 -431 -1460 -887 362 989 787 138 -690 -948 -163 1009 1333 429 -548 -746 -201 671
1144 671 1234 1023 -182 -1165 -625 869 1600 784 -548 -987 -401 417 704 593 210 -632 -1135 -567 743
1163 743 1411 197 -1517 -1566 -72 1021 686 -292 -842 -884 -686 -42 767 698 -381 -1402 -1077 143 1097
1182 1097 817 -366 -1233 -1030 190 1302 1030 -271 -989 -475 222 665 817 639 -61 -977 -612 825
1200 825 1890 888 -834 -1333 -153 1190 1192 330 -361 -559 -423 -112 653 1179 409 -1025 -1449 -138
1218a38J374k35j238q88J28O81Q50K61o41j120k66P08R20K34l20n42p56k02J001
1237a89J442o5j636j209P54J661L91o97p59L3r5O4O26R53j88j562r46R84J747
1256A309L61j341j125J71P26M15K04K9o18q04j97R89J040k23j130q12K11P88O83
1275F76K13p31j236k84J137J157k42r12n54j9J34M04R79J75j203j307L35J795
1293E17Q08q28j300k06O78N99K29R8k36q02n04N58J310N72r94j421k26J265J028
1312A145n5p31p47l24M14P58O36k56r63p43R9R69Q78K2j093j162K8J276R20l84
1332F87j020n57J56L69N57N62l88j009q24O56J312O48q24j212l33N67R83M91l44
1351D77q76n31K18P45O77J31n68r04m24Q56J165M11j041j174j04J063R31j24o07
$$ plain form
1218 -138 1236 1001 -237 -1125 -997 -316 534 795 154 -966 -1232 -524 396 630 310 -232 -988 -1190 -189
1237 -189 1253 1188 -448 -1657 -903 758 1149 452 -307 -274 -369 -305 321 1274 1086 -476 -1422 -438 1309
1256 1309 1670 329 -796 -625 101 516 720 749 131 -673 -870 119 1159 936 -194 -1006 -795 -7 676
1275 676 889 158 -1078 -1362 -225 932 690 -222 -776 -795 -661 -257 722 897 -306 -1613 -1278 517
1293 517 1325 497 -803 -1009 -331 268 497 595 359 -443 -947 -389 921 1493 499 -922 -1148 117 1145
1312 1145 1090 359 -388 -712 -298 460 1096 840 -123 -866 -767 202 1080 1102 9 -1153 -1125 151 1071 687
1332 687 -333 -890 -734 -365 192 754 366 -643 -1467 -811 501 1149 325 -887 -1220 -653 330 821 477
1351 477 -399 -930 -712 33 710 841 273 -631 -1055 -199 966 1377 336 -838 -942 121 1052 928 321
1370C21n31k15J53N46P09J24r93j169J6J532R86p39j360l86O15O34K01Q2k71q44
1390e89o50N51J265M69q54j108l44P03J036M16n76j093l45O04Q47K83k97n19m76
1409f77j12N45J038K92r18j235N2J212J055k12j095o95L08P17L42Q6j14m51q73
1428g35k0J051J197m90j380r19P29J305L77o62q41l45K80M42M35J68l40p59o58
1447a165M37J218P16q98j529k89J245J072j43q82m73N2J03L94O52K95o64j130
1465i89j79J118J164l0j240r48K89J190P16l60p30l99L0L23M78L72K1p86q78J04
1485g34J206R66m44j484p85Q47J337K24r55o47J41R2o9L77P36j80j394q61R78
1504f49J669J92j475j041L03J020M53j80l12l52k86j9O21P01J07q20j060J37J133
$$ plain form
1370 321 -210 -425 -272 274 983 1107 114 -1055 -1039 493 1479 740 -620 -1006 -391 243 444 526 255 -589
1390 -589 -1239 -688 577 1046 192 -916 -1260 -557 479 895 319 -774 -1119 -515 332 615 318 -201 -677
1409 -677 -789 -244 794 1086 168 -1067 -1015 197 1252 1040 -55 -750 -442 275 617 703 589 138 -735
1428 -735 -755 296 1493 1003 -377 -1296 -567 738 1115 453 -388 -733 -453 -11 424 592 252 -507 -1165
1447 -1165 -728 490 1206 308 -1221 -1510 -265 807 664 -218 -691 -639 -536 -142 510 805 141 -989
1465 -989 -1168 -50 1114 1084 -156 -1104 -815 375 1091 731 1 -398 -368 -45 433 805 826 40 -838 -734
1485 -734 472 1438 994 -490 -1275 -428 909 1133 178 -469 -328 -236 -305 72 808 628 -766 -1627 -649
1504 -649 1020 1212 -263 -1304 -1001 19 472 292 -20 -372 -658 -677 -56 645 752 -68 -1128 -991 142
1523A42R41q6j304p17L46J162M72l61o67j73oJ01L65P16J77j102j156M00J641
1542H91Q55j090j598j0J059O09l16j87p0l44o16L63J009N59q54j282l21J058J236
1561I51j25j099p90R8P97O60j12l79l78k96r5N35R08K03r96j143K13J313R34m53
1581G46j196m51N66P86J89j96j54k60m36m9Q37R18l51j407p32Q56J412K23r99
1600C02q65K4N62M25N7j1l38o11k95M11J019L71q64j287o4J044R37j88q60o12
1620h43J09N08M45J28j55n33m15NO75Q35nj009r85L03J300Q37o34j113k84N56
1640b75N35J37J78q0o50o24K43J216O36o06j275l76Q69J017J03p89o16p6K80M18
1660B65L08J90o01q57j16P13R16M5q50r41r1R52P74m3q35o92N7O07M26J44j72
$$ plain form
1523 142 1083 997 -307 -1024 -678 484 956 595 -72 -245 -251 -150 215 931 1108 6 -1150 -750 891
1542 891 1746 656 -942 -952 107 716 400 213 143 -201 -817 -454 555 1114 260 -1022 -1343 -285 951
1561 951 826 -273 -1063 -965 -168 492 380 1 -377 -673 -768 -233 675 878 -118 -1261 -1048 265 1199 746
1581 746 -450 -901 -335 451 640 444 290 30 -406 -455 382 1300 949 -458 -1190 -334 1078 1301 302
1600 302 -563 -539 23 448 505 494 156 -455 -750 -339 680 1051 187 -1100 -1164 -120 817 629 -231 -843
1620 -843 -734 -226 219 347 192 -341 -756 -751 -76 759 754 -255 -1240 -937 363 1200 566 -547 -831 -275
1640 -275 260 397 575 495 -155 -779 -536 680 1316 710 -565 -941 -72 945 1048 259 -357 -433 -153 265
1660 265 573 763 162 -695 -811 -98 818 863 13 -928 -1019 -67 707 664 -171 -863 -806 -199 227 371 199
1681A99m38o09l4Q77Q33p0j223p54N21J115M00m41o68l47K37M08M77J88k27p54
1701c10m63N43R42N12p77j069j39P58P13R0m14n42l91J86O93M69j87o66m75j51
1721f78O21P30J44p48q78q5P98P81j46o71n38m9L27N78L00k00o82n63K59Q32N89
1742G21k34r90m69M16Q10M61k81n60m63R3M59O34K23n31q51j64O78P45K32m92
1762D37p84k65M58P90L29m41p91l68L53N89M25j83n93n47j02P66O68o4p58o99
1782g80K6O25O04O7m65o75k17M27P19K40l55p39l52L28P34M44k39p59m06J05P58
1803I0O15q7p46o58K38O69N26q4m22m05k81L98P16L54m62r30j09M85O55K25l69
1824D18o29l80K80P08M57k76p82n18K79O35M01r1n02o01k31N80P84K17p38q31
$$ plain form
1681 199 -239 -848 -882 -5 828 758 -465 -1219 -698 417 817 376 -292 -639 -402 6 483 671 444 -310
1701 -310 -773 -230 712 1224 447 -622 -761 -3 710 800 386 -156 -547 -361 332 801 614 -52 -527 -678
1721 -678 -57 673 817 69 -809 -894 -96 685 539 -132 -670 -719 -392 186 486 286 -396 -959 -700 132 721
1742 721 487 -503 -972 -556 254 715 434 -126 -589 -496 -37 597 820 289 -562 -726 -48 697 929 437
1762 437 -347 -612 -154 636 965 524 -267 -635 -282 307 732 549 -44 -591 -693 73 741 677 -81 -780
1782 -780 -754 -129 475 542 77 -598 -815 -388 331 571 216 -523 -875 -547 187 631 392 -367 -773 -668 90
1803 90 705 618 -128 -786 -548 121 647 563 141 -264 -545 -147 569 923 461 -469 -578 -93 562 787 418
1824 418 -211 -591 -311 397 854 578 -204 -722 -443 192 593 502 0 -601 -832 -252 532 749 11 -820
1844h20n4O77O73j7m77m33k03Q3N49O05q1q40o44L57Q61N84m09p32k77J10M50
1865c8N37K96n72p95j15P12O24J87m79o00l50K81Q25M86l79r20m42M63P88K30
1885G39k99n62k88n1L36N76K87o11q71j93Q75P21r3p83n38Q2M57M22K79l20n31
1906c66n16K63Q23M39k08q34m47K48O52N97o8p34o09K56P27M05j11m00m46j09
1926d38K55O51M20l47r58l74P11P72J38n51n18k14K26N08M06r8p06m66l4O59N66
1947F08Q2o80p27n7O86O38P5p07o34J1N17N36Q3m21l93k90R7O40O01j37q45o30
1969i47L88R07L11l66n81j89J6M03N51L06n06p84k38O60P87J66m82p42k19M04
1989a55O54M33m21o85k85K11N98K77j85m52n17k4N81O53K3q06o31J3O80N16j6
$$ plain form
1844 -820 -874 -197 476 459 -18 -451 -654 -571 -22 583 502 -338 -982 -625 236 820 411 -321 -598 -488 -38
1865 -38 499 795 223 -572 -687 25 649 836 357 -243 -593 -312 513 999 620 -300 -742 -279 509 739
1885 739 440 -122 -410 -461 -125 451 738 127 -744 -937 -62 659 566 -217 -755 -673 -216 206 485 165 -366
1906 -366 -882 -619 204 643 435 -399 -846 -598 54 651 583 -151 -760 -504 223 628 517 117 -329 -438
1926 -438 -183 468 888 541 -417 -791 -80 692 830 279 -239 -453 -227 281 687 589 -117 -583 -617 42 608
1947 608 690 10 -717 -774 -88 550 625 -82 -716 -705 -188 348 431 10 -383 -673 -576 64 665 528 -317 -947
1969 -947 -559 348 659 293 -288 -477 -461 -58 493 799 293 -491 -729 -69 718 884 402 -340 -559 -155
1989 -155 499 932 511 -174 -459 -248 350 627 442 -10 -527 -551 30 683 706 -100 -731 -718 -38 478 462
2010D62n91m76j1K97M82L27k27o88n00L95P74L95l81o49l58J73O96M59j31n23
2030g5n31J11N69M17Q5m24m85k22M20P64K69n87q13q9O77M87M5l28l61k66j9N40
2052A84N71m0p62p18L03O94M85k26n55m79rM34M61K37m86o64k31M06P06K70n03
2073G8n85k45K71O56L80k33p50m27L25P87K57j59m86l44r3M21O64L15o19q29n0
2094f66P57O08k2m86m91m7K63M11L38j14n59n05J06P21M78k64p13m31K56N85L53
2115E78j71m52l99j41L90N63K07m99o92j70M94O10L02m71o40l40L26P27K47k77
2135A92n49k23R0M67L96Q6m22o30r5O89O47ro24n51J7O39N22m7l81m87q1J70N31
2158C47M09k07o52n02K84P45L86l17p04l10K36M36L43k8m67m25j11L83N46J86
$$ plain form
2010 462 -129 -605 -616 -319 163 490 263 -425 -925 -530 244 639 258 -391 -749 -576 120 579 448 -75
2030 -75 -606 -495 74 491 576 152 -333 -555 -135 629 898 311 -502 -591 86 573 618 290 -71 -337 -356 184
2052 184 755 715 -47 -765 -462 232 717 491 -64 -543 -552 -118 343 580 94 -570 -801 -395 311 581 78
2073 78 -507 -752 -481 175 555 322 -428 -855 -530 257 514 355 -131 -475 -568 -147 517 832 213 -616 -666
2094 -666 91 699 677 191 -300 -347 -84 327 665 551 -8 -513 -407 314 792 528 -185 -616 -360 225 578
2115 578 407 -45 -444 -585 -195 368 575 76 -616 -786 -292 318 620 149 -491 -831 -505 222 469 192
2135 192 -357 -580 -490 -23 373 459 37 -593 -688 1 648 639 15 -536 -519 120 642 595 214 -273 -354 -184 347
2158 347 756 549 -103 -605 -321 424 810 493 -211 -521 -285 151 494 466 -1 -426 -537 -154 392 578
2178E78m47p03j90M47P61O7m92o59m8L94M85K64l41m11k95N8N14M91M3n72o52
2199g08j6P09O80j24o49m57K13M47K90K10k25m81l77J97O96M74l50q20k08K62
2219b37O69L09l29n12m03K30M32L15m7m88l88j08L83N28K69m24p78j81N17P42
2239D99ln51m92m5K81M59J55l8m02m68mN78O07j12o37n27J89P18L19j03m37l43
2261c57k9L68M79J04k68n66j36K84N81K32k44o50l74L55O91K34l39n70j98J07
2281b96M63K66K2l54n47j41M20O95O6n48o37q8M94O00m2l82m12j66K32L94L41
2302C80p2o07n10K57O37N21j91n91n10J78N82M86j79l93m49N7M06L59J65k71m70
2323b15l24L68O78L63n08o45j86L41N76J25j53n57k97J09M15L90O9n54m60n7M41
$$ plain form
2178 578 131 -572 -762 -315 446 513 21 -638 -686 -292 193 457 116 -295 -590 -532 -18 473 516 -56 -708
2199 -708 -724 -15 665 541 -108 -565 -352 95 385 595 370 -111 -488 -291 405 879 529 -291 -499 -237
2219 -237 432 741 412 -100 -503 -273 159 474 427 -61 -449 -557 -174 354 623 199 -579 -760 -243 499
2239 499 496 -55 -547 -592 -311 148 303 265 -137 -605 -609 -31 576 464 -173 -700 -511 207 526 423 -14 -357
2261 -357 -386 -18 461 565 297 -269 -405 -121 460 692 448 -202 -576 -221 470 704 365 -205 -403 -296
2281 -296 167 433 455 101 -446 -587 -167 528 594 46 -591 -679 -185 415 373 -9 -421 -587 -355 39 380
2302 380 308 -299 -809 -552 85 606 415 -176 -686 -508 74 560 381 -12 -461 -404 2 361 526 255 -215
2323 -215 -539 -171 507 870 362 -283 -469 -128 448 573 420 -137 -434 -325 90 480 549 -5 -465 -522 -81
2344h1N64R9o73n45O4M80L94R6l84m19k20K10M94M25k51n78l21K04N79L72j90
2365C19n61l78J95N49L62m7m60l69m5M39N32N3l49n94j40L81N11L08l34n85k96
2386e09L38N49K30k61m48l36J26M23L92m7m85m59l0M52N32J9m95m96p5M83L87
2407B90J00l64m43j74K23N20L03k52n93l12K92N86L10j31n25l23J38L69M72n8
2427D28l43m98j05M92M93J27m02n51n6L01N34K43l37m56k75J76N65K64k49m98
2447a47l31J88M70L29r1m79m40P6L57N22k3m56n09M9K94M48J75l72l74l16K93
2468c37N55K53l15m75k99K24N52K69j24m48m38J49M84L81N9m80m17p4N61M18O7
2489E65m06m99J1K51N20J93l59m97k51L03N61K88k99n73k52J71M16L01j01l08
$$ plain form
2344 -81 483 582 -91 -636 -572 -92 302 398 14 -405 -625 -415 79 504 253 -325 -646 -442 137 509 319
2365 319 -242 -620 -425 124 486 439 -21 -390 -435 4 536 589 240 -354 -494 -113 398 706 372 -213 -509
2386 -509 -171 378 608 347 -101 -437 -311 112 504 457 -28 -487 -517 -65 467 486 -9 -505 -580 -97 290
2407 290 390 26 -417 -591 -368 152 455 203 -390 -702 -410 176 486 355 -170 -493 -355 14 486 428
2427 428 85 -413 -518 -26 467 594 192 -359 -415 -114 420 663 326 -130 -405 -229 336 600 351 -147
2447 -147 -478 -290 180 509 418 -61 -501 -425 -68 454 431 -25 -534 -485 -191 257 432 60 -314 -630 -337
2468 -337 218 471 156 -319 -618 -394 158 427 303 -145 -583 -434 50 431 490 10 -407 -481 80 498 565
2489 565 159 -340 -329 -78 442 635 276 -221 -472 -169 392 680 381 -192 -444 -273 143 444 343 35
2509C5m81RM12M33m2l89m93m7L43M82J39l91m47j69K84N24J94k30o00j80K21M65
2531G2L16j75l47l85K5M70N41o4m19m75nN28L78P9l94l54j86K61M48K63j65n47
2553a35l35K65O44J84l11m99j50J27L35L53j20k95m78k2M12M66n7m46n74J58M31
2574d7L43N6k90m48k67L47M53K80k16n24k31K03M66K66q9m14l63Q7N12M03r9m85
2596e7l85J32M23L33K9l42l40j85K49N34L07m28n57j49L80N03J25k82l52k28%
2617b90L58M21R5n47m69L5M47M04j02l41l58j14L19L35J95l84m80p7K70M51J68
2638C36k27m32k05J72M34L34o4n28l63Q5N70L87j82m15k20O1K04L92J22j43o36
2659c18j67L90N53J77m84l96o9K84L18J83j12l99l70J43N26K96j86m44l66M8M53
$$ plain form
2509 35 -446 -437 -25 408 366 -23 -516 -563 -220 262 401 10 -437 -606 -322 202 396 166 -434 -614 -393 72
2531 72 388 213 -134 -519 -494 -24 517 453 34 -441 -446 82 460 539 145 -209 -395 -134 314 577 412 -135
2553 -135 -470 -205 439 623 312 -187 -337 -210 125 478 358 63 -415 -437 -25 441 384 -62 -636 -478 -47
2574 -47 296 352 62 -386 -653 -306 147 427 211 -313 -544 -341 125 391 302 -112 -475 -388 124 527 428 -57
2596 -57 -442 -310 113 446 475 133 -207 -392 -143 391 698 270 -287 -436 -56 447 572 290 -62 -290 -290
2617 -290 68 489 584 37 -432 -397 50 454 352 11 -347 -461 -142 193 388 4 -476 -553 -283 168 336
2638 336 109 -323 -528 -356 78 412 348 -180 -543 -458 112 499 317 -98 -318 -257 -53 339 461 318 -318
2659 -318 -485 -95 458 635 151 -245 -314 -30 288 471 359 -40 -410 -267 259 555 369 -75 -441 -393 60
2680F0K84K2l07m62j28M14M13J22l51m71j01K08M74J18j34m27l21J69N55L12k30
2701B19n09k94K92L62K41n9k44l66r7L88M60J45m06m78o5M06M29Q5l37l53j12
2722b93R4M84K61k23l34m24J55L79M62j36m95m16J73M47K56n4l46l55n8K75L57
2743B09J79k83m48j81K87M85P6j85n05j89K36M42K24j64l11l06R3L62K88J3l12
2764A0l28j08L86M17J29l58m49j46N02L69mk46l43p2J27L42K82n8n93k61K19M10
2786B27L42k68m03k37kM02K72K3l02m24q6L35M32jj85n08j42L54L48J63j90m66
2808c16k35K76M13K14k10l45j89K4L65L05J05l73m94J2M34N36r2m43l13K1L46
2829D1K32J92j97l42k87J85L86L34j93n18j92M3O05K19k40l84k26L0M15K88l0
$$ plain form
2680 60 344 366 59 -403 -531 -117 296 418 67 -404 -505 -297 177 295 161 -266 -587 -418 137 449 219
2701 219 -290 -584 -292 70 311 252 8 -358 -455 -67 393 538 132 -346 -411 -5 424 509 172 -181 -293
2722 -293 -199 285 546 323 -11 -435 -280 99 561 425 -70 -486 -313 134 390 336 -10 -365 -423 -148 209
2743 209 388 105 -343 -524 -237 248 324 139 -366 -555 -319 123 347 183 -128 -434 -341 21 309 322 10
2764 10 -318 -426 -40 377 506 148 -301 -447 55 424 420 174 -169 -241 -114 228 510 452 -141 -402 -183 227
2786 227 569 301 -102 -339 -341 61 333 356 54 -370 -456 -121 311 310 125 -383 -525 -171 177 340 150 -316
2808 -316 -551 -275 138 352 142 -203 -392 -368 -3 302 407 34 -460 -448 -14 522 430 -13 -326 -305 41
2829 41 273 465 268 -74 -361 -176 210 544 351 -167 -359 -316 289 508 268 -116 -342 -312 103 391 361
2850C61k83m35j23L09M08J86m07m50j09L10N05J05k82l79j20J85L78J94j32k81
2870f0l97P6L36M00m7l87l26Q0L24L68N9l64l37K0K87K43J24j96k92k87K50L84
2892B58L47k80n01k91L26M34J62j92l01k73O7K10L67J1k71m52j07M32M48k6m28
2913f0l30q8K72L12J47k09l86j43K09L33K39o1l96l01J05L81M07k9n15l49J04
2934c58M78L28j29k63k50p0J71L16K99j39m77k77K51M94K33l11m95j01J93K90
2954A83J64m2m10k67K2M09K69ll51l58m5L38M29N9l20l52j81L20L54N7k45l55
2976c25m9L9M17K16q7l00l41%M98L48j60l55k79J01L15K35M9j77l21j93K76M51
2998C58Q3k61m05j35K25N13J40k62m05j69J93K62K48p8l84k56OL82L31K1l97m17
$$ plain form
2850 361 78 -357 -480 -171 237 423 16 -434 -543 -233 272 377 95 -284 -404 -219 159 353 221 -60
2870 -60 -457 -381 -45 355 308 -79 -405 -325 -1 367 426 62 -275 -255 32 275 399 203 -89 -376 -126 258
2892 258 605 325 -176 -467 -141 293 455 263 -38 -311 -244 -34 333 344 73 -379 -486 -54 394 368 -60
2913 -60 -390 -478 -206 106 253 44 -342 -485 -276 57 296 235 -161 -462 -357 24 431 402 -113 -462 -358
2934 -358 120 448 319 56 -194 -264 -93 223 522 383 -94 -371 -120 374 607 296 -199 -300 -107 183
2954 183 347 305 -105 -372 -350 59 328 325 -26 -384 -429 -91 338 397 77 -275 -456 -136 218 275 30 -325
2976 -325 -374 -335 82 298 211 -89 -430 -430 68 416 256 -99 -378 -277 38 273 322 145 -176 -369 -93 358
2998 358 441 180 -225 -360 -135 378 518 256 -149 -318 -125 137 385 307 -77 -333 -327 55 386 407 10 -407
3020d07L4K80M65o2l89k91N2J48L32N2j07l32k18J22M09K70j40m70k38J75M70
3041A55J44o3l25l24J26L40L59k0l43k48p6K48L08J79j73m50j78K43M10J37j44
3062C05m41p9R6L50P6m7l02k20lK87L62m0l88l77N4L41K75K9l11k68j27K16L42
3085A30K12k14l73k24K26L89J73j28m05k70K23K53L24m8l31l10J30K92K49N9j99
3106A58m30l1K98L33J47k70m65o4K93L12J17j58l43j81J10L18K24j0l43l58Q8
3127b55L67L14l2m43k49pK48L02K3k50k83j35K43L76J19l16l64q3J60L74J64j19
3149A54l60k59J77L33K73j15k37l79J02L01L45O6l44l37o9L02M10Q3k70k74j37
3170b35J95K72K30j98k99k55O6M25J81q8l07l15R6K96K94l8l01l36L3K93K36M1
$$ plain form
3020 -407 -373 -93 372 310 -79 -370 -318 -170 162 214 107 -225 -443 -321 88 358 218 -252 -490 -315 155
3041 155 299 236 -89 -413 -287 53 412 392 49 -199 -275 -27 281 460 287 -163 -341 -98 312 449 305
3062 305 -136 -215 -119 231 307 260 -42 -262 -265 22 384 344 -44 -421 -367 -26 249 278 -33 -301 -428 -212 130
3085 130 342 128 -245 -469 -243 146 319 191 -214 -484 -261 -8 316 268 -63 -373 -243 49 298 357 158
3106 158 -272 -303 -5 328 475 205 -260 -324 -31 281 398 240 -103 -284 -174 144 368 358 15 -343 -255
3127 -255 112 426 394 -49 -298 -305 -57 245 268 18 -265 -400 -157 219 338 22 -342 -425 -265 109 273 154
3149 154 -206 -465 -288 45 318 203 -34 -413 -311 -10 335 401 57 -280 -349 -47 363 446 176 -98 -235
3170 -235 -40 232 462 264 -35 -290 -224 201 382 294 -13 -328 -232 64 358 320 19 -317 -284 9 245 286
3192B86l07k00k20K84L04K08k77l90j52K60L81O4j81k19k27Q0L43K24o4k54l67
3213d24J70K71K81ok72j92k01L29L46Q2k89l13o4K58K61K71k27l42k44R8M43J99
3235D35j11l46l37J18M43K00j62k35k90j5K39L29O3k88l55m4L01L50p8k35k20
3256b38j83K22K67J85l6m04j83O8L53L07j27l70j65N9K90K24L0k55k87j07M12
3277F2K76J2j79l64k1J37K66K32j70l18k32J07M34J68j60l67j42J38J85K31m6
3298B49j93k98r8K94L50Pl31l47n0L16K68O0j37l33j25O2M02J58q0l26j91O8L47
3321G2K43j00k95k39R6K31L05Pl27l23P0K99K71L6k30k63j43K09L35K33k17m51
3343a81j61K27L11K00j59l31j06RK29K55m9k53k74m7L05L10K2l22l06J0K10K50
$$ plain form
3192 286 -21 -221 -441 -157 147 355 78 -312 -464 -204 177 241 60 -159 -386 -306 37 261 197 -57 -424
3213 -424 -254 17 298 292 20 -172 -373 -44 302 384 95 -218 -282 -24 237 508 281 -61 -305 -207 236 435
3235 435 324 -22 -359 -241 202 402 240 5 -285 -300 -61 268 331 43 -312 -356 -55 295 217 -18 -238
3256 -238 -421 -199 68 253 217 -187 -370 -302 51 358 231 -139 -304 -245 45 269 299 44 -243 -350 62
3277 62 338 350 171 -193 -214 -77 189 421 251 -67 -299 -192 242 410 250 -117 -259 -121 64 295 249
3298 249 56 -242 -340 -46 304 311 -20 -367 -417 -101 167 227 90 -243 -368 -306 96 254 174 -152 -343 -275 72
3321 72 315 215 -80 -319 -223 8 313 320 -7 -330 -260 39 310 346 116 -147 -290 -81 254 487 270 -181
3343 -181 -342 -115 196 396 237 -94 -200 -191 38 293 244 -9 -283 -330 -25 285 307 -15 -321 -311 -101 149
3365A49R8j99k85j97K41K42K24j37l67j60J92K25K70q4l23k18M4L34K43kk96k33
3387b39r8K90K84J91k67l21j92K33L93J44k06l16j35J83K23J70r5k38k47Q4K78
3408A19K48r3l21k33M7K34K52L8k72k92j01K92K88O7k01k96j79J84L07J61n8m04
3430b13j93J36L00K42j49k57j82R5K34K40L4k33k87lK79K56R1l04l00l0K01L12
3452B69J21j55l55j09Q8K53L05j90k65j94P0K65J69k8k36l00K2K62K68M2l63j92
3474b53q7K13K65J26j89l37j33J92L13J97k11l62j10J30K45K05o8j83k28PK82
3495A4K80j6k73k62L3K54K96j1j94k99r4K69K74nj31k36j21J64K52Q6Ll82j99
3518b98J33L15K12j07l18j98K4K81J76o3j31l00n8J73L78L0j65l60p6J78K86L5
$$ plain form
3365 149 247 48 -237 -434 -193 49 273 136 -231 -391 -199 26 296 212 -111 -329 -285 49 292 290 -6 -239
3387 -239 -337 -47 237 428 161 -160 -352 -119 274 418 212 -104 -239 -56 167 337 242 4 -243 -159 119
3408 119 367 274 -47 -280 -233 1 253 291 19 -273 -374 -82 206 273 72 -224 -403 -219 88 249 191 -213
3430 -213 -406 -270 30 272 123 -134 -316 -221 13 253 287 54 -233 -236 43 299 390 86 -214 -244 -43 269
3452 269 390 235 -120 -229 -141 112 417 227 -38 -232 -162 103 272 244 8 -292 -270 -8 260 302 -61 -253
3474 -253 -340 -127 138 264 75 -262 -395 -203 110 307 96 -266 -376 -246 -1 204 136 -47 -275 -268 14
3495 14 294 278 5 -257 -224 30 326 315 121 -178 -272 -3 271 266 135 -101 -222 -58 194 280 283 -99 -298
3518 -298 -165 150 362 255 -63 -261 -237 44 220 157 26 -274 -332 -159 219 249 84 -276 -352 -174 112 147
3540A47q2k50j02J28K28J88n8k94k31O0L31J73O4k48m02J54K11K46N0k90k35O0
3562a52J83K29J9n5k95k05J11L45J80r4l56j99J60K76J44p4k38j95l8L09J76M1
3584B72k50l24j3K15K73J69l11k96m2J34L28L8j49k56m7P9J56K47l9l09j10p4
3606c09K79L27nl23k66Q4K94J72l2j10j91j26J18L20J19j91k87j45J69K96J60
3627C53j31l16j46J11K65J52o6l02j50N6K01J80M6k38k43j68K87L35N6l33k73
3648c24MJ65K80Q5j08k37k07J20K42J42J3k75j76l3L35K61r5k36k14M8K35K33
3670B58L9j88k67n6J89K23J56k12l10m4J67K77K01k04l07j69J41K37J79j09k41
3691d0j82J3J48K88Kk38k71j2K41K12M3k42j77j48J56K80J40j47k92r3Q7K95J74
$$ plain form
3540 147 65 -185 -287 -159 69 257 199 -95 -326 -266 65 238 302 54 -348 -194 17 263 313 23 -212 -152
3562 -152 31 260 279 224 -71 -276 -165 180 360 266 -90 -289 -129 147 291 217 -21 -216 -254 55 231 272
3584 272 22 -302 -315 -100 173 342 31 -265 -307 -173 155 193 44 -212 -259 -180 -24 223 184 -125 -235 -309
3606 -309 -30 297 292 -31 -297 -213 81 253 221 111 -80 -206 -88 232 351 160 -127 -272 -103 193 353
3627 353 222 -94 -240 -129 136 288 222 -80 -230 -174 27 207 253 15 -228 -396 -109 226 282 -51 -324
3648 -324 -320 -155 125 210 102 -135 -342 -222 20 162 175 -100 -276 -309 26 287 192 -44 -258 -210 25 258
3670 258 297 109 -158 -214 -25 198 354 142 -168 -212 -45 232 433 229 -78 -247 -106 131 310 201 -40
3691 -40 -222 -209 -61 227 229 -9 -280 -292 -51 161 204 -38 -215 -363 -207 73 213 66 -226 -319 -232 63 237
3714B37p2k38k64L7L40J94j7k77j88K4K38J54R4j94k33r2J99L16O4j22l17j46
3736b63J94K96J38j61k69j37J13K28J46l3j93k32o2K66K11Pk82k21o5K19K43P0
3758B13j81k30q4J67K34R5j63k45n4N0K84J29p9k94j11P2K16J91qk80j58P6K10
3781E0J18N3j29k58n3J62L08O9j42l20j21K12L26j9r7k27j09R7J64J59m3k26k03
3804b29%K49K16J5k25k61l9K24J88L1j59j83j03J13K38J25j65k33j23J50K87J16
3826B32r6k56j69P2K35J21P7k33j98K2J40K90jj38k48k0Q8L10Q0r4m00k2J06K72
3850A70J36j47k05j94J54K12J66ql30j36L5K03K12n5k40k36R1J11K26L5j92k40
3872b32l9J18K67L4o3k87j29J37K93R0l7l04j25P2K61J81n7k95q6J14P6J84L5
$$ plain form
3714 237 165 -73 -337 -300 40 234 217 -60 -248 -224 14 168 262 68 -165 -257 -58 258 322 200 -117 -263
3736 -263 -69 227 365 204 -65 -202 -89 139 285 252 59 -173 -235 31 242 249 -33 -254 -319 -100 143 213
3758 213 32 -198 -282 -115 119 214 51 -194 -248 -198 86 215 136 -158 -269 -197 19 210 202 -78 -236 -160 50
3781 50 168 221 92 -166 -219 -57 251 320 178 -142 -263 -51 275 256 159 -68 -177 -80 84 243 200 -26 -229
3804 -229 -229 20 236 251 26 -235 -274 -50 138 169 10 -173 -276 -163 75 200 35 -198 -321 -171 116 232
3826 232 136 -120 -289 -217 18 139 216 -17 -215 -193 -53 237 236 98 -150 -170 -82 228 308 214 -186 -208 -102 170
3850 170 306 159 -46 -240 -86 126 292 284 -46 -182 -147 56 268 213 -27 -263 -172 -61 165 200 8 -232
3872 -232 -271 -153 114 148 85 -202 -331 -194 99 189 152 -152 -277 -205 56 237 180 -115 -201 -87 -11 173 208
3895B08j00k25j22J84K31J04j74k70k8J54J74J48n5k93j22J0K31K06o1k75j76
3916b51K3K24K00J3k54k15j0K28J74Q5j67k64j5J18J64J13j06k98k7M7K66K17
3938B65j44k20j54J04J72K09m2j82j85l6K56J35K5j76j94p4K33K70%j90j46o6
3960a40J16J75J47j25j87k44J21K61J44j2k38k39J7K42K26r1j74k61oK00K37J4
3982A83j85j65j12J38K66K9j07j56j52N8J93K79j19k12k22J17K18J66p4j72j76
4003b05N9J11K35N5j55k66mJ86K54K6j91k58nJ19J97Q0l5k31j79Q7K71J31r1k37
4027d6j80N1J90J77j8j84k18p0J72K93oj12k88m0K14K28K8j04k50m6lK12J83o1
4051A22j94k39J05L11P4m4j72j45L5J16K12N9j98j62m7J19K66P2j79k08q9J42
$$ plain form
3895 208 108 -117 -239 -55 176 280 106 -164 -192 -38 136 284 229 -64 -186 -176 55 261 200 -75 -251
3916 -251 -228 -4 196 209 -45 -260 -270 -42 132 217 50 -214 -229 -111 53 166 60 -238 -265 -218 48 265
3938 265 121 -99 -253 -149 23 232 190 8 -177 -213 43 178 203 27 -167 -241 -8 262 262 72 -74 -140
3960 -140 -24 151 298 173 -14 -258 -137 124 268 256 18 -221 -204 38 264 173 -1 -262 -268 -68 169 183
3982 183 -2 -167 -279 -141 125 154 47 -109 -261 -203 -10 269 150 -62 -284 -167 51 217 143 -29 -205
4003 -205 -146 -35 200 255 100 -166 -170 16 270 296 105 -153 -158 -39 158 238 203 -28 -207 -120 151 282 191 -46
4027 -46 -226 -175 15 192 174 -10 -228 -298 -126 167 161 49 -239 -279 -65 163 191 87 -163 -209 -212 0 183 122
4051 122 -72 -311 -206 105 179 135 -37 -182 -147 -31 181 240 42 -120 -167 -48 218 290 111 -97 -186 -44
4073d4J78J55j03k11j64O3L07J22r7k14j85L0J26K78Rk58k03o0K26K40j9k04j48
4096a76p4J25K26R8j16k22j29P1K94P5j2k77j41J04J95J80n9k04k04P4J65K25
4118B18N2k44j71J7J21J65J17j56k04l5Q0K18J04j44j70k14J33K33Q6kj90j78
4140a64J5J59J81p1j40j47lJ70J62K0j77k14m0J46J84J3r6j21j38J51K11P1k7
4163A45k52k00J06J95K31j56j39j32OJ73J74N6j67j16r9J50K13L2q5k73n5K15
4185B2K13k4j10r6j50M1J85J47L4l12j44J03J03K70p1k33j60j4J42J36N0p5k41
4208a84jK2K40R4j09j96j36J93J52J08j04k06j82J30K10J66p3j66j40m3K29K11
4230B15j6k13j46j5J75J72R3j89j36q7O2K84O5j56j69r2Q6J84J59p9k32k03P5
$$ plain form
4073 -44 134 289 186 -25 -189 -126 181 303 206 -8 -193 -163 -37 241 250 -8 -211 -271 -45 195 176 -28 -176
4096 -176 -250 -125 101 199 83 -139 -268 -197 97 172 160 -117 -258 -154 41 221 162 -42 -246 -172 -7 218
4118 218 270 26 -145 -128 -7 158 275 119 -85 -120 -40 178 282 138 -32 -246 -113 120 206 204 14 -164
4140 -164 -149 10 191 120 -20 -167 -170 0 162 182 5 -209 -249 -103 81 94 -2 -123 -261 -110 101 172 145
4163 145 -107 -307 -201 -6 225 69 -70 -202 -196 -23 151 207 40 -76 -175 -25 188 220 135 -138 -193 22
4185 22 235 211 101 5 -145 -104 81 228 262 -50 -194 -91 12 282 211 -22 -182 -196 -54 82 132 57 -184
4208 -184 -185 -163 77 171 62 -134 -270 -77 75 183 79 -127 -309 -179 31 197 124 -42 -182 -225 4 215
4230 215 199 -14 -160 -175 0 172 265 76 -60 -147 -85 199 264 108 -61 -153 -67 117 276 197 -35 -238 -163
4253a63K35J83j04j34j30j04J82J35M1j22j92q3Q4K81O3j38k39p3J89J65R2j08
4275F0j70j58J13J98J58j4k51j56L7J73J38M6j47j97j1J41K27N3j92p7j68J85
4297a2J99Q0j55j77j32J48Q2K33q9k21j14K1K60R6Oj92j88k4K02J10M9j38k34
4320a90m4J60K20K3j64j71q8J14J87J10j16j39q9M5J40K16j22j13k05m5K44J76
4342A49M2j84j42j6J53J72J0j7k42j81J61K03J16r6j62j37N5K74M8n3j88j35M5
4365a25K22Q6Kj80j75L1J89Q3O0j86j61j25J61K87j5j78j26k7O7J53J04n8k04
4388a15j23J04J09K13q8j20j78Q0J67J26rj41j20o7J64J92Pj29k46QJ38J72O5
4411B09n0k45n4L4K37J41j58j78q8K5J59J18jj48k02M1J54J63M6k23j49n5J89
$$ plain form
4253 -163 72 255 151 17 -113 -217 -35 100 141 19 -173 -256 -172 109 172 34 -205 -278 -89 76 168 60
4275 60 -110 -268 -155 43 201 187 -64 -220 -183 -10 128 174 27 -170 -181 -40 187 240 48 -29 -197 -12
4297 -12 187 267 112 -65 -197 -49 33 266 177 -44 -158 -137 123 219 225 33 -155 -179 23 133 182 44 -190
4320 -190 -234 -74 146 169 5 -166 -254 -140 47 157 41 -98 -187 -142 -2 214 92 -21 -226 -271 -27 149
4342 149 191 7 -135 -151 2 174 184 167 -75 -256 -95 108 224 128 -34 -171 -116 158 206 153 -35 -170 -125
4365 -125 97 183 185 5 -170 -139 50 133 193 7 -154 -279 -118 169 154 -24 -150 -177 -110 43 147 89 -115
4388 -115 -238 -134 -25 188 100 -20 -198 -118 49 175 166 25 -95 -162 2 194 201 72 -174 -166 -28 144 209
4411 209 159 -86 -140 -106 131 272 114 -64 -152 -127 32 150 149 1 -201 -160 -6 157 203 -20 -169 -224 -35
4434c5J39Q5j20k01j11J96J01P2p1j45j34Q6J92J25n6k24p9J6J54J59J1j13j90
4457a43m9J74J83P1j22k43j7O8K43R5r4j85k01J44J33J88j47j27k18J47J12K36
4479B48j16j25j97L3N3K81k7j30k06K0J02J81Q3k19j06k7JK41K7n9j82q8P9K09
4503G6J25j20j08j87P1J82J43o3j22j52Q5M2K30K7k26q7j26J97J63M6n9j79j37
4526a79J04K05Q6j21j81p8N5J38K39j34j87j11l1J87J32K6j46j91j6K05J29jj41
4549a1o9j28J08R4J81n7k04j75J13K35N9o6j89l5o0K51J81p8j14j80j7J71J38
4572A48L3j36j25j6J18J29J9j1k49j00J65K10L6n5k35rl5K35K2P1j88k82M5K03
4596gJ88l9j68j44O1R1J26Jj29r7j22J36J79L1o0k22l5P8J47J38r4o1j84N4J34
$$ plain form
4434 -35 104 189 69 -132 -243 -47 54 126 55 -90 -224 -138 54 179 123 -101 -180 -164 -10 149 160 47 -143
4457 -143 -192 -18 165 236 114 -129 -146 -78 165 260 166 -19 -220 -76 57 245 98 -29 -247 -100 12 248
4479 248 132 7 -190 -157 -104 177 150 20 -186 -166 -64 117 200 -19 -125 -152 -151 90 117 58 -124 -212 -133 76
4503 76 201 81 -27 -214 -143 39 182 119 -3 -155 -70 -28 202 229 3 -84 -210 -13 150 196 137 -42 -179
4526 -179 -75 130 216 95 -86 -164 -109 29 268 134 -53 -164 -195 -8 124 150 4 -187 -203 2 131 130 -11
4549 -11 -80 -208 -100 -6 175 118 -86 -261 -148 87 146 80 -109 -144 -204 47 228 150 36 -144 -161 10 148
4572 148 181 45 -80 -96 22 151 170 159 -90 -190 -25 185 221 166 -69 -78 -113 122 144 215 27 -255 -210 -7
4596 -7 181 142 -26 -170 -109 -18 108 109 -20 -117 -239 -103 76 107 47 -175 -210 -132 15 153 59 -2 -186 -132 2
4621BK11r0j84o2n5J68K29j2j58j23q7J42J69R2j38k14J6J8J85J01p0j32j24L0
4645h6J91N2k0j72o8m3J38J64k4j19k19R5J6K01jo0k24m1J02J19J08k4j71r5k
4670a83K02J19m7j35j18L9J18J75n6j38j10M3L1K37Qj87j42O3N2J38R0q4j51o5
4694a01L1J59J35o2j93j20M6J94N2Pj68q4o5J62J40k1j88j66J8J75J44L3j57j31
4718a60m2Q0J53R2r9j01j23N1J56P4J1j11j64L1J70J13p8q1j82J06J11J28J1j12
4742C4j17j00J32J99N2q5k25l0R7J33J24n6j70r4K9J62J06o4j57q1k6J57J33j8
4766A35j58j63L6J21K3J64j45j43k9L2J96N9p4j74r4J02J08J63p4j87j08j4K60
4789C6J30r8j01j53N2J47R1P1j45j12RM4J49J12j21j75k6L3R5J28lj24j63P7J57
$$ plain form
4621 2 213 123 -61 -123 -178 -10 219 207 49 -74 -161 -19 150 242 104 -110 -94 -76 109 210 140 8 -116 -86
4645 -86 105 157 137 -35 -103 -146 -8 156 132 13 -206 -111 -95 106 105 45 -179 -220 -118 1 109 85 -86 -181 -183
4670 -183 19 138 91 -44 -162 -123 -5 170 114 -24 -134 -91 -60 177 185 -2 -144 -81 -29 109 199 115 -36 -101
4694 -101 -70 89 224 162 -31 -151 -105 89 141 148 -20 -104 -169 -7 133 112 -76 -242 -224 -49 95 128 -29 -160
4718 -160 -202 -122 31 123 24 -77 -200 -149 7 81 92 -19 -183 -152 18 131 53 -28 -210 -104 7 135 146 34
4742 34 -83 -183 -51 148 200 115 -110 -140 -43 90 214 158 -12 -106 -77 85 191 127 -30 -111 -137 20 153 135
4766 135 -23 -186 -150 -29 -6 158 13 -130 -159 -127 69 128 54 -120 -214 -112 -4 159 85 -102 -210 -224 36
4789 36 166 68 -33 -186 -134 13 104 175 30 -82 -73 -29 120 232 111 -64 -90 -57 38 166 163 39 -124 -47 110
4814A10M9Nj96j27M6J33J29m9j08j02j03J79J01O4p9k35pJ08J74M3k7j78o3RJ20
4839dJ83j34k8j74j6J87J09L4j93j31J2J47J25M4j27r7m2J03J05J00j37j21L0
4862b5l9J43J18p5j78j03R6J29J40j13j06j60P4J28O2J0o6j15j23J44J42M9q3
4885D9j88r7J89J05J17j07j52j12P6K02N5m3j27j12K6J36J22j19m1j17K7J55R6
4908A40pj04j52J4R0J55Lp3o9j36J22J12R1m9j33j26Q8N1J67o0j96n1J8J09J37
4933A41pj15j93O2J05J10P2j67j23n5J13J50O1p8j86j28J54J26P5l1j32j28N2
4956a22J29J58o1j95l9l7K47R4m6j36n0k6R6O5J24j09j25m7K0J26J01j51p7k7
4980h8M4J39L2Lj55j07n2K01J30Nj28j20j4P1J14R6j55p9j18P1J49k6k2p8j34
$$ plain form
4814 110 159 164 -32 -159 -113 20 149 100 -8 -110 -213 -34 67 131 52 -183 -190 -82 92 135 108 -70 -133 -124 -4
4839 -4 179 45 17 -157 -173 14 123 157 -36 -167 -155 -8 117 161 34 -63 -105 -2 103 203 66 -55 -25
4862 -25 -64 79 197 122 -56 -159 -63 66 206 93 -13 -173 -99 29 91 101 35 -80 -203 -59 83 132 49
4885 49 -139 -236 -47 58 175 68 -84 -196 -120 82 137 94 -33 -145 -119 17 139 20 -21 -138 -111 44 140
4908 140 133 29 -123 -109 -19 136 139 66 -3 -139 -17 95 186 137 4 -122 -34 17 184 124 -72 -123 -105 4 141
4933 141 134 19 -174 -112 -7 103 175 8 -115 -170 -57 93 154 76 -110 -238 -84 42 117 86 -46 -174 -122
4956 -122 7 165 104 -91 -130 -167 80 174 128 -8 -58 -84 12 77 201 92 -33 -80 -60 66 167 16 -61 -88
4980 -88 -44 95 127 130 -25 -132 -184 17 147 152 24 -96 -110 -39 75 171 16 -63 -181 -110 39 13 -9 -87 -221
5005b21J34R4J65j25p5j42rJ77J34K6j71j38Q0J27N6N7o5j29q1N2J34J61j36j63
5029e8j6mJ75M6m2j22j08Q1J43K7l1j00j45jJ84J10l7j33p8j1O7J38J1n6j62p5
5055a97O1K22J0m6j20m9kJ17J03n6l4j61M3P5J91k5j80n0n7K09O7%p6j35K6O4
5081@Q8J16j11j05p0L3J75Ooj68k9L4J01K9j3o8j42%J24R0o3n6j32K8J05J02J2
5108H0m6j92k2J56R5qk3j05l7Q4P9L2j04r5m9P6M1J80l4j59q9M5R6J82j41j0j20
5135h8j4R1J46M6j01j60rQ3J98rq1j02j00P2J14J13k7k50m5J9R3J10j2q0j15n
5161a13J22J12Nr5q6q5Q4J21j1p0j35m2J10Q7J19j12p4l4j6J42R9m9q1q7OP6J49
5188A42k6r2j11L8K4J83M9p2j96Jk2J12J27l3j05l3p7J65M6k5j45n1l1J49J09
$$ plain form
5005 -221 -87 7 172 47 -28 -170 -179 -2 132 158 -13 -151 -71 56 112 169 104 -25 -106 -54 80 241 105 -58
5029 -58 -74 -78 97 143 101 -21 -129 -48 95 122 91 -9 -154 -155 29 139 102 -31 -109 -120 -53 85 96 40 -122 -197
5055 -197 -136 86 96 50 -70 -119 -121 -4 99 43 9 -152 -109 -34 157 132 -48 -98 -155 54 121 121 45 -90 -64 0
5081 0 88 204 93 -12 -82 -49 126 132 126 -42 -71 -37 64 93 80 12 -130 -130 -6 84 21 -35 -167 -139 -34 68 80
5108 80 34 -158 -180 -24 71 63 40 -65 -102 -18 61 93 -11 -106 -155 -79 -38 142 108 -51 -140 -95 1 183 42 32 -88
5135 -88 -102 -11 135 181 80 -80 -89 -6 192 183 102 0 -100 -28 86 199 172 -78 -123 -104 -11 99 87 7 -108 -113
5161 -113 9 121 126 31 -55 -140 -56 65 54 -16 -151 -193 -83 4 123 11 -63 -97 -113 29 128 79 -2 -89 -83 -7 142
5188 142 116 24 -87 -49 -25 158 207 135 -61 -60 -82 30 157 124 19 -14 -91 74 120 95 -50 -101 -132 17 126
5213A26m1j39n8J8P2J99q0q5j36k8M5K00l7m1p5j14L5J50K5k4j10j1j6R6Q1N8
5239A10j70p9nJ26J38pn0j28j0L4J47N1j35m1q8N5J46Q9m9j37q7L0K06L4p1j18
5265im5o9J63N6N0j03j75mJ42O3M8j16j35j08J59J72Mp0q3n1L9J63Nk1j35j01
5291a61L6J50K1O9q5j63O1J64j8M4r7r6PM2J10R7j21j53n4R7J60j0Pj78K2L7J28
5318A16jMj73j2M2m3J85m4p0j72J00J9K25m1j34p1n9M8J11P5j22n1q9R5J00J16
5344A54j49p3p9Q1J06L4l8j14j6nP5R5P9j51p3l2J13N2M7j5j74k3J06J15N8j00
5370G3j44q1J28J24%l6n4j15K1J74N9r5m4j07j9R7J33k7j17r9L4M2Q7J07j44p4
5396g7r3R3P9J13o5j01Pr6J70R6l8j53j02M1J88L2j1r0j05nJ16R8L9p3j29J7M2
$$ plain form
5213 126 85 -54 -112 -94 -22 177 97 12 -124 -152 -107 93 56 15 -60 -174 -139 11 36 12 -98 -109 -125 -29 52 110
5239 110 -60 -139 -144 -18 120 113 63 -65 -75 -41 106 157 22 -19 -107 -52 94 183 134 -3 -90 -60 146 180 109 -9
5265 -9 -54 -123 40 96 146 43 -132 -136 6 69 117 1 -134 -242 -83 89 93 23 -60 -111 -72 91 96 75 -60 -161
5291 -161 -125 25 46 115 30 -133 -72 92 74 118 21 -75 -68 -26 84 181 60 -93 -147 -50 110 100 107 -71 -49 -12 116
5318 116 115 119 -54 -66 -24 -67 118 74 4 -168 -68 -49 176 135 1 -70 -129 -81 30 105 -17 -68 -157 -62 38 154
5344 154 5 -68 -147 -66 40 74 36 -78 -94 -99 -24 71 150 -1 -74 -106 7 59 106 91 -83 -106 0 115 173 73
5370 73 -71 -152 -24 100 100 64 10 -105 -84 90 149 54 10 -97 -116 -19 114 87 -30 -129 -95 -53 34 141 -3 -77
5396 -77 -170 -77 2 115 50 -51 -44 -140 30 126 88 -65 -167 -126 62 94 83 -7 -112 -117 -1 97 136 63 -66 -49 -7
5423gJ20J2k0j70n6P2P7O5j2p7j03K9J06O7k0r2r5l4J66R2L9r0j70K2O8Q2M5r9
5451A7r3l9N6Q9J21q3j55j11J02J29J00j04j36j8JJ57R2J6j65l3k5N8J75l5q3
5476C3q3M2J0O9L4rj32p4P7K4J74k1j98p1L3P9P4L4n4j57J4J44J5J8n5j08LJ11
5504B6J4J3n0j00m9J21K2R3p4j06K0o4J24J10J6j33p2J3R2O7L4j33n8m7O7J36
5530H2lk2j47r0J41J42l7p1k9n7pJ57J8K8j44m7K8P0J01q0j15j6l1Q9O4J9N2k20
5558a25k8P0J31J18j45j36j0P4P8P5j4j68l9L2Q3Q3p8q3o2O4J07Q9n9l8r3n0J43
5585A9J63j71K3j33rP1J27O6q9j21o5J57k1R6oj21j36J12J22J2M0j62j28J34m3
5610f3J24K2p9p8k8K6R1M2n6j44j4J03O4J19r3o6q4L2R5O2j4j07n0m6J29J42q1
$$ plain form
5423 -7 113 125 105 -65 -121 -49 28 93 81 4 -99 -70 36 103 83 -9 -104 -138 28 120 159 69 -101 -79 -11 71 116 17
5451 17 -76 -115 -59 30 151 68 -87 -198 -96 33 133 29 -107 -125 -124 33 125 141 -24 -57 -82 -24 151 116 33
5476 33 -50 -8 2 71 105 96 -36 -110 -33 -9 165 144 -54 -125 -92 -13 61 95 41 -116 -102 42 57 75 20 -88 -85 26
5504 26 40 53 3 -97 -146 -25 -3 90 16 -90 -70 -134 -10 100 116 -17 -89 -76 16 83 117 -16 -74 -121 -54 82
5530 82 79 57 -90 -180 -39 103 66 -5 -34 -91 -98 59 77 105 -39 -86 -58 12 113 33 -82 -98 -129 -40 24 43 95 -125
5558 -125 -153 -83 48 166 21 -115 -125 -51 27 102 88 -80 -119 -87 -4 79 1 -82 -144 -80 27 116 57 19 -74 -124 19
5585 19 182 11 34 -99 -108 -37 90 156 67 -54 -119 38 17 113 107 -14 -150 -38 84 96 136 -26 -154 -20 -63
5610 -63 61 83 4 -74 -102 -76 15 57 1 -143 -157 -54 10 129 36 -30 -114 -82 13 75 61 -46 -96 -142 -13 129 48
5637D8j17j5M7O2P8Pj7j31l8MJ61M5j01j46l5J11J16L5l4q7q4L7N4J05j0j50m2
5664i7P8L6J00o8j05OOl4J24L3k3j65j6J19L0J8l3l6k0m8R6L0P6j69k7R3m3J08
5692F9M0j07j09N0N4K1J44r6j34k8J21O0M0n7p0j33J40J00kp3r6mlM1J85k0j82
5719d9JnN9J11o6k1j05m8J29l2Q4n1r4l8mJ07R6k9p1n9J1J32K8n8L4j61rJ06J28
5748A26j03p8o1M8R6Ojro8k0M9L1Q6o3k1r9K3J11O4l3n9p4n8J79K2N6j57p5N7
5777b5J3J73n6o5j38K4M7J14Oj6j78p5J04J02L2J2j44K2j1L8J31r6J7j79P0O9
5803iJ12J9j53q1Q8K6N6L4p2o9k5P9J0N4Mq1j15R6J26K1o0r7m8N9O9L2L5p7j14
5832h1M1J9J15j8j16p7N7l4J95J8j37m8p5K7J28P1k2j23p2L4Q4M3lo0M2j03N0
$$ plain form
5637 48 -69 -84 -37 25 103 110 93 -38 -76 -72 89 134 33 -113 -148 -37 79 114 80 -7 -91 -54 0 105 95 -55 -97
5664 -97 -19 17 117 49 -56 -50 -44 -78 46 79 56 -109 -125 -6 24 42 9 -27 -47 -95 1 31 107 -62 -89 4 -39 69
5692 69 109 2 -107 -57 -3 18 162 66 -68 -96 25 85 125 68 -2 -135 5 105 103 30 -66 -70 -73 -32 153 133 -49
5719 -49 -48 -53 6 117 51 30 -75 -123 6 -26 58 7 -87 -125 -129 -22 74 45 -26 -85 -74 58 86 28 62 -99 -108 -2 126
5748 126 23 -55 -116 -68 28 34 33 24 -44 -64 -15 16 102 39 18 -81 -58 53 117 84 25 -49 -107 72 94 150 -7 -82 -25
5777 -25 -12 161 105 40 -98 -74 -27 87 93 77 -101 -176 -72 30 62 74 -70 -48 -59 -21 110 14 31 -148 -78 -9
5803 -9 103 122 -31 -112 -24 2 58 92 20 -49 -74 5 15 69 73 -8 -123 -27 99 120 60 -37 -85 -26 43 75 110 33 -81
5832 -81 -40 -21 94 76 -40 -117 -60 -94 101 119 -18 -66 -141 -114 14 85 63 -60 -132 -98 -14 29 26 -34 8 -95 -45
$$ [...]
8191f4
##END NTUPLES=NMR FID
##END=
