##TITLE=1H_AM 1
 CDCl3, 8 sc, 
 2.7.2019
##JCAMPDX= 6.0         $$ Bruker NMR JCAMP-DX V2.0
##DATA TYPE= NMR FID
##DATA CLASS= NTUPLES
##ORIGIN= UXNMR, Bruker Analytische Messtechnik GmbH
##OWNER= root
$$ XWIN-NMR		Version 3.5
$$ Tue Jul  2 15:41:14 2019 Russian Standard Time (UT+4h)  she@DPX200
##.OBSERVE FREQUENCY= 200.13155
##.OBSERVE NUCLEUS= ^1H
##.DELAY= (6, 6)
##.ACQUISITION MODE= SIMULTANEOUS
##.ACQUISITION SCHEME= undefined
##.AVERAGES= 8
##.DIGITISER RES= 18
##SPECTROMETER/DATA SYSTEM= spect
##.PULSE SEQUENCE= zg30
##.SOLVENT NAME= D2O
##.SHIFT REFERENCE= (INTERNAL, D2O, 0, 15.7039)
##AUDIT TRAIL= $$ (NUMBER, WHEN, WHO, WHERE, WHAT)
$$ ##TITLE= Audit trail, XWIN-NMR		Version 3.5
$$ ##JCAMPDX= 5.01
$$ ##ORIGIN= Bruker BioSpin GmbH
$$ ##OWNER= she
$$ F:/spectra/data/she/nmr/H-F/1/audita.txt
$$ ##AUDIT TRAIL=  $$ (NUMBER, WHEN, WHO, WHERE, WHAT)
(   1,<2019-07-02 15:40:30.92 +0400>,<she>,<DPX200>,
      <created by zg, POWCHK disabled, PULCHK disabled
       configuration hash MD5:
       00 E9 B6 7A A2 85 ED C7 34 08 36 98 17 FE 4E 26
       data hash MD5: 16K
       55 3A 7D EB B5 ED 6D 0D F0 52 6F 45 CE 26 49 CD>)
$$ ##END=
$$ 
$$ hash MD5
$$ 2B FC C4 E0 3D 10 8A 97 C9 68 BE 03 20 96 14 D0
##$RELAX= 
##$RELAX= 
##$RELAX= 
##$RELAX= 
##$RELAX= 
##$RELAX= 
$$ Bruker specific parameters
$$ --------------------------
##$DU= <F:/spectra>
##$EXPNO= 1
##$NAME= <H-F>
##$PROCNO= 1
##$TYPE= <nmr>
##$USER= <she>
##$AMP= (0..31)
100 100 100 100 100 100 100 100 100 100 100 100 100 100 100 100 100 100 
100 100 100 100 100 100 100 100 100 100 100 100 100 100 
##$AQSEQ= 0
##$AQ_mod= 1
##$AUNM= <au_zg>
##$AUTOPOS= <>
##$BF1= 200.13
##$BF2= 200.13
##$BF3= 200.13
##$BF4= 200.13
##$BF5= 200.13
##$BF6= 200.13
##$BF7= 200.13
##$BF8= 200.13
##$BYTORDA= 1
##$CFDGTYP= 0
##$CFRGTYP= 5
##$CHEMSTR= <none>
##$CNST= (0..31)
1 1 145 1 1 1 1 1 1 1 1 1 1 1 1 1 1 1 1 1 1 1 1 1 1 1 1 1 1 1 1 1 
##$CPDPRG= <>
##$CPDPRG1= <>
##$CPDPRG2= <>
##$CPDPRG3= <>
##$CPDPRG4= <mlev>
##$CPDPRG5= <mlev>
##$CPDPRG6= <mlev>
##$CPDPRG7= <mlev>
##$CPDPRG8= <mlev>
##$CPDPRGB= <>
##$CPDPRGT= <>
##$D= (0..31)
0 1.2 0 0 0 0 0 0 0 0 0 0.03 0 0 0 0 0 0 0 0 0 0 0 0 0 0 0 0 0 0 0 0 
##$DATE= 1562067630
##$DBL= (0..7)
120 120 120 120 120 120 120 120 
##$DBP= (0..7)
150 150 150 150 150 150 150 150 
##$DBP07= 0
##$DBPNAM0= <>
##$DBPNAM1= <>
##$DBPNAM2= <>
##$DBPNAM3= <>
##$DBPNAM4= <>
##$DBPNAM5= <>
##$DBPNAM6= <>
##$DBPNAM7= <>
##$DBPOAL= (0..7)
0.5 0.5 0.5 0.5 0.5 0.5 0.5 0.5 
##$DBPOFFS= (0..7)
0 0 0 0 0 0 0 0 
##$DE= 6
##$DECBNUC= <off>
##$DECIM= 24
##$DECNUC= <off>
##$DECSTAT= 4
##$DIGMOD= 1
##$DIGTYP= 9
##$DL= (0..7)
0 120 120 120 120 120 120 120 
##$DP= (0..7)
150 150 150 150 150 150 150 150 
##$DP07= 0
##$DPNAME0= <>
##$DPNAME1= <>
##$DPNAME2= <>
##$DPNAME3= <>
##$DPNAME4= <>
##$DPNAME5= <>
##$DPNAME6= <>
##$DPNAME7= <>
##$DPOAL= (0..7)
0.5 0.5 0.5 0.5 0.5 0.5 0.5 0.5 
##$DPOFFS= (0..7)
0 0 0 0 0 0 0 0 
##$DQDMODE= 0
##$DR= 18
##$DS= 0
##$DSLIST= <SSSSSSSSSSSSSSS>
##$DSPFIRM= 0
$$ [...]
##$SUBNAM2= <"">
##$SUBNAM3= <"">
##$SUBNAM4= <"">
##$SUBNAM5= <"">
##$SUBNAM6= <"">
##$SUBNAM7= <"">
##$SUBNAM8= <"">
##$SUBNAM9= <"">
##$SW= 24.9336996594482
##$SWIBOX= (0..15)
0 0 2 0 0 0 0 0 0 0 0 0 0 0 0 0 
##$SW_h= 4990.01996007984
##$TD= 16384
##$TD0= 1
##$TE= 0
##$TE2= 300
##$TE3= 300
##$TEG= 300
##$TL= (0..7)
0 120 120 120 120 120 120 120 
##$TP= (0..7)
150 150 150 150 150 150 150 150 
##$TP07= 0
##$TPNAME0= <>
##$TPNAME1= <>
##$TPNAME2= <>
##$TPNAME3= <>
##$TPNAME4= <>
##$TPNAME5= <>
##$TPNAME6= <>
##$TPNAME7= <>
##$TPOAL= (0..7)
0.5 0.5 0.5 0.5 0.5 0.5 0.5 0.5 
##$TPOFFS= (0..7)
0 0 0 0 0 0 0 0 
##$TUNHIN= 0
##$TUNHOUT= 0
##$TUNXOUT= 0
##$USERA1= <user>
##$USERA2= <user>
##$USERA3= <user>
##$USERA4= <user>
##$USERA5= <user>
##$V9= 5
##$VALIST= <valist>
##$VCLIST= <CCCCCCCCCCCCCCC>
##$VD= 0
##$VDLIST= <DDDDDDDDDDDDDDD>
##$VPLIST= <PPPPPPPPPPPPPPP>
##$VTLIST= <TTTTTTTTTTTTTTT>
##$WBST= 1024
##$WBSW= 4
##$XGAIN= (0..3)
0 0 0 0 
##$XL= 0
##$YL= 0
##$YMAX_a= 1689
##$YMIN_a= -4325
##$ZGOPTNS= <>
##$ZL1= 120
##$ZL2= 120
##$ZL3= 120
##$ZL4= 120
##$ABSF1= 10
##$ABSF2= 0
##$ABSG= 5
##$ABSL= 3
##$ALPHA= 0
##$AQORDER= 0
##$ASSFAC= 0
##$ASSFACI= 0
##$ASSFACX= 0
##$ASSWID= 0
##$AUNMP= <proc_1d>
##$AZFE= 0.1
##$AZFW= 0.1
##$BCFW= 1
##$BC_mod= 2
##$BYTORDP= 1
##$COROFFS= 0
##$CY= 11.3945322036743
##$DATMOD= 1
##$DC= 2
##$DFILT= <>
##$DTYPP= 0
##$F1P= 18.9103706918063
##$F2P= -1.10871071338519
##$FCOR= 0.5
##$FTSIZE= 0
##$FT_mod= 4
##$GAMMA= 1
##$GB= 0.15
##$INTBC= 1
##$INTSCL= 1
##$ISEN= 128
##$LB= 0.24
##$LEV0= 0
##$LPBIN= 0
##$MAXI= 10000
##$MC2= 0
##$MEAN= 0
##$ME_mod= 0
##$MI= 1.114404
##$NCOEF= 0
##$NC_proc= 0
##$NLEV= 6
##$NOISF1= 3.799351
##$NOISF2= 2.8
##$NSP= 1
##$NTH_PI= 0
##$NZP= 0
##$OFFSET= 15.70392
##$PC= 1
##$PHC0= -8651.396
##$PHC1= 7.600971
##$PH_mod= 1
##$PKNL= yes
##$PPARMOD= 0
##$PSCAL= 0
##$PSIGN= 0
##$REVERSE= no
##$SF= 200.130013532006
##$SI= 16384
##$SIGF1= 3
##$SIGF2= 2
##$SINO= 400
##$SIOLD= 16384
##$SREGLST= <1H.CDCl3>
##$SSB= 0
##$STSI= 0
##$STSR= 0
##$SW_p= 3612.71676300578
##$SYMM= 0
##$S_DEV= 0
##$TDeff= 0
##$TDoff= 0
##$TI= <>
##$TILT= no
##$TM1= 0
##$TM2= 0
##$TOPLEV= 0
##$USERP1= <user>
##$USERP2= <user>
##$USERP3= <user>
##$USERP4= <user>
##$USERP5= <user>
##$WDW= 1
##$XDIM= 8192
##$YMAX_p= 0
##$YMIN_p= 0
$$ End of Bruker specific parameters
$$ ---------------------------------
##NTUPLES= NMR FID
##VAR_NAME=  TIME,          FID/REAL,        FID/IMAG
##SYMBOL=    X,             R,               I
##VAR_TYPE=  INDEPENDENT,   DEPENDENT,       DEPENDENT
##VAR_FORM=  AFFN,          ASDF,            ASDF
##VAR_DIM=   8192,          8192,            8192
##UNITS=     SECONDS,       ARBITRARY UNITS, ARBITRARY UNITS
##FACTOR=    0.0002004,     1,               1
##FIRST=     0,             0,               0
##LAST=      1.6414764,     0,               0
##MIN=       0,             -4325,           0
##MAX=       1.6414764,     1689,            0
$$ Real data points
##PAGE= N=1
##DATA TABLE= (X++(R..R)), XYDATA
0@%%%%%%%%%%%%%%%%%%%%%%%JmOj0J5j6J6j6J6j7K0k2K6l1L4l7L9m5N2n5O1o9
$$ 0 0 0 0 0 0 0 0 0 0 0 0 0 0 0 0 0 0 0 0 0 0 0 0 1 -3 3 -7 8 -8 8 -8 8 -9 11 -11 15 -16 18 -19 20 -25 27 -28 33 -36
45c6P6q4R4j04J15j30J48j68J95k31K75l36M34o11J015m977K151L063j508o72
$$ -36 40 -44 50 -54 61 -69 79 -89 106 -125 150 -186 248 -363 652 -4325 -2174 889 -619 -1291
65a291L65J264p79o69O64J144p84q51N85J287n03q37L59J090l55q41L58J140l72
$$ -1291 -926 338 -441 -1110 -446 698 -86 -937 -352 935 432 -405 -46 1044 689 -152 206 1346 974
84I74j089L78J065j36j134J46R96j24j083R9J006j42j151KR75m2j113j67R81k5
$$ 974 -115 263 1328 1192 58 204 1200 1076 -7 92 1098 956 -195 -193 782 740 -373 -540 441 416
104D16j019j93Q75J41j090k34R41K27r63m26R74L00q40l93Q59M49q29l84Q77N39
$$ 416 -603 -796 79 220 -870 -1104 -163 64 -899 -1325 -351 -51 -891 -1284 -425 24 -805 -1189 -312 227
124B27p67m91Q50O96p38n21Q36P31o58o41Q02P52o91o78P73P44n80p68O13P57
$$ 227 -540 -1031 -181 515 -223 -744 92 823 165 -476 326 1078 387 -291 482 1226 646 -122 491 1248
144A248m73p78M29P95m97q62M36Q34n50r01K16Q58k61j022J41Q54l01r39J03R31
$$ 1248 775 -3 426 1221 724 -138 298 1132 582 -319 -103 755 494 -528 -387 467 166 -773 -670 261
164B61k39j013R4Q79j37q45MQ36j5q53k8Q93J34q75p8R62J50p51j28Q79L44q70
$$ 261 22 -991 -897 -18 -155 -1000 -996 -160 -175 -1028 -1056 -163 -29 -904 -982 -20 130 -621 -749 130 474 -396
186c96j99R24L48p41k00Q01M21p61l49Q43M05p08m57P96M31o79n17O30N19o37
$$ -396 -595 329 677 -64 -264 537 958 197 -152 691 1096 388 -69 727 1158 479 -38 592 1111 474
206D74o82N72O24o99o51N63M67m97p15M11O11n80p02M45O12m66p20K93P30l93
$$ 474 -208 364 988 289 -362 201 668 171 -544 -133 478 -102 -804 -359 253 -213 -933 -640 90 -303
226c03p59K55Q45l00p69K11P86q5p78K10Q00m9q38K27Q75Np68J04Q32k2o73M5
$$ -303 -1062 -807 38 -262 -1031 -820 -34 -119 -897 -687 113 64 -774 -547 328 333 -435 -331 501 479 -194 -149
248a49Q18J14p25q3Q77K7o87j07P78J32p44k26O97K26q15k69O70K66p28m37O36
$$ -149 669 783 58 -25 852 879 192 85 863 995 251 25 722 948 133 -136 534 800 72 -365 271
269B71L48p71m02N63L57o10n21N56M25o25n46N84M49n71m73M42N79m94n48M42
$$ 271 619 -152 -554 9 366 -244 -765 -209 216 -409 -955 -371 78 -493 -966 -524 55 -439 -987 -545
289e45O36l92n86M48O08k76m98L23O66k03o00K85P44k64n23K46O92j55o52J87
$$ -545 91 -301 -887 -439 169 -107 -605 -282 384 181 -419 -134 610 346 -177 69 761 606 -46 141
309A41P13j46n91K1O57n0o53P5O29m6p78rO32ko98j78O66O8p34j65O41qo00k44
$$ 141 854 708 117 138 795 745 92 167 796 750 -28 -37 595 593 -105 -283 383 451 -283 -448 193 185 -415 -659
333f59N47K20p05j72M65L37o54k41N37L29n82l17N94L67n46k51N49M50m79l95
$$ -659 -112 108 -597 -769 -304 33 -621 -862 -325 4 -578 -895 -301 66 -480 -731 -182 268 -211 -606
353f06N14M99m49l91N71M46l84l95M18N24l74m35K88O17l30m87L05N00k79n53
$$ -606 -92 407 -42 -433 138 584 200 -195 223 747 373 -62 226 843 513 26 331 831 552 -1
373aK60N23k44o86K73M38k39n51J08N39j72o52O0N53p7o76l1O34j24n82J2N17
$$ -1 259 782 538 -148 125 563 324 -227 -119 420 248 -404 -344 209 132 -544 -575 59 -65 -647 -635 -118
395a18L6o64nO25Q5o53l8N53J43n15m5O23J81m98k07N80K74l97k60N68K83m65
$$ -118 -82 -746 -751 -126 -41 -694 -732 -179 -36 -551 -596 27 208 -290 -497 83 357 -40 -300 268 551 86
417H6k18N12L45m91k80M13M26l88m23M12L79m96k66L53L63m69l79L10M04l83m56
$$ 86 -132 380 725 234 -46 367 793 405 -18 394 773 277 11 364 727 258 -121 189 593 210 -246
438b46K27M38l78m84K62M08l17m48J04M76k18n02J12M71q5n05J22M31k6m83R8
$$ -246 -19 419 41 -443 -181 227 -90 -538 -434 42 -176 -678 -566 -95 -180 -685 -563 -132 -158 -641 -543
459e43N80j04n31J45N60J2n71R2O37J2m54l7N54J33m84o0N52J27m84j56O30N1
$$ -543 37 -67 -598 -453 107 119 -452 -360 277 289 -165 -202 352 485 1 -59 493 620 136 -20 610 661
481F61m96j30N10J25n04j63M82J53n63j49L43K96n48k96M02J84l91l80L72K76
$$ 661 165 35 545 670 166 3 485 638 75 -74 269 565 17 -279 123 307 -84 -464 -92 184
501A84n01l59L85L82l72m33L41L57l20m09K75M62k82l88L02M90l04l74K56M46
$$ 184 -317 -676 -291 91 -281 -714 -373 -16 -336 -745 -470 -8 -290 -678 -376 114 -190 -564 -308 138
521A38j43m50L00M17n8m60K21M84m8m34J25N17j01m60P8M94O9n74j0M87j4n61
$$ 138 -5 -455 -155 262 204 -256 -35 449 401 -33 92 609 508 48 126 620 689 115 105 592 578 17
543A7J33L15J7m52n7M00%n07j15M62K8m78r1L41M5l89k48M69J28m21k00L91J65
$$ 17 150 465 482 30 -27 373 373 -134 -249 213 241 -237 -328 13 58 -331 -579 -110 18 -403 -603 -212 -47
566d7l79k68M36K26l06l21L78L26l55j85K85L90k48l81L87M27l11k62L24M18k57
$$ -47 -426 -694 -258 -32 -338 -659 -281 45 -310 -495 -210 180 -68 -449 -62 365 54 -208 116 534 277
587B77l08J54M86j84m12J97M44j65m92K22L56j04m09O9M28k22l95K9L70q9m29
$$ 277 -31 123 609 425 13 210 654 489 -3 219 575 471 62 131 559 337 -58 -29 341 252 -177
608a77O0L47m4n56j8M10L2n25k0M15K3m83k2M16L9m18p7M24J57m23j21M68J56
$$ -177 -117 230 186 -370 -388 22 54 -471 -491 -76 -53 -536 -558 -142 -103 -521 -598 -174 -17 -440 -561 -93 63
631F3l48j68M36K92m33j57L65K94l19k33L93K89l05k33L50K34k25k73K51M00l53
$$ 63 -285 -453 -17 275 -158 -315 50 344 25 -208 185 474 169 -64 286 520 295 22 273 673 320
652C20k58J80L42k43m08K43L42k97l43K18L50l43l60J21L03j37m15J11M23k36
$$ 320 62 242 584 341 -67 176 518 221 -122 96 446 103 -257 -136 167 30 -385 -274 149 -87
672h7l92J23L34j86l27N5L93rm89Q3M08Nl61P5L51K6l30k5M74pl74L1M65M2l62
$$ -87 -479 -356 -22 -208 -535 -480 -87 -96 -585 -502 -94 -89 -450 -375 -24 2 -328 -353 121 114 -260 -229 236 278 -84
697h4l4M59J02l17j75L97J26l14j54L58K31l63j90L29J72l57k36K88K31l15k81
$$ -84 -118 341 443 126 -49 348 474 160 6 364 595 232 42 371 543 186 -50 238 469 154 -127
718a27L06J74l00l21K82J81k72k94J99K49k22l11J43L11j94l76J33L73j44l39
$$ -127 179 353 53 -268 14 195 -77 -371 -172 77 -145 -456 -313 -2 -196 -572 -439 -66 -210 -549
738e49J92L41j56l40K14L87j63k84Q2M22n0l41J61L83o3m26J90L18N9l58J7L92
$$ -549 -357 -16 -172 -512 -298 89 -74 -358 -276 146 96 -245 -84 299 236 -190 0 318 377 19 36 428
760D28M4l50m9L45N8l48o7L71Ml28j08L30N4l85j47L22J29l73j93L44P7l65k07
$$ 428 472 122 73 418 476 128 61 432 436 108 0 330 384 -1 -148 174 303 -70 -263 81 158 -207 -414
783d14L45Q8k36k99L27K39l25k26J76K65j85l10K51L14k59j88K09K31j94j75K21
$$ -414 -69 19 -217 -516 -189 50 -275 -501 -325 -60 -245 -555 -304 10 -249 -437 -228 3 -191 -366 -145
804a45L66k14k91K58L18r8l25J71M16j74l21J97K72o6l15J48L00j20k94P6K73
$$ -145 221 7 -284 -26 292 194 -131 40 456 282 -39 158 430 364 49 197 497 377 83 159 432
825D32r4k79k1L43o0l87k5K72L1m10n9L04O7l91n6L38m2k43j73L52J09l87n9L21
$$ 432 338 59 38 381 321 -66 -91 181 212 -198 -257 47 114 -277 -333 5 -37 -280 -453 -101 8 -379 -438 -117
849a17J01l75m6K65K46l88j47L91P2k02j39L21K20k89j27K77K17k47p9K44L01
$$ -117 -16 -391 -437 -172 74 -314 -461 -70 2 -200 -339 -18 202 -87 -214 63 280 33 -46 198 499
870D99k86k47L02J92j47l65K58K91k65k26J75K45j58l35J24L55j61l57N9L24j93
$$ 499 213 -34 268 460 313 -52 206 497 232 6 181 426 268 -67 57 412 251 -106 -47 277 84
891H4k70M7K85q6m17M9L34r1l81L5L84n2l39k7L47nl18L4K71J3j81o0L56R4l59
$$ 84 -186 -139 146 60 -357 -308 26 -65 -446 -411 -27 -79 -418 -445 -98 -103 -421 -387 -116 -103 -284 -344 12 106 -253
916b53M1L24P0k36j00L48P8k26j34L45J98l46m5J92K56l13j99L21J64k89k23K72
$$ -253 -212 112 182 -54 -154 194 272 46 -88 257 455 109 64 256 512 199 0 321 485 196 -27 245
938B45J71j91k57K41J63k73k24J80J95k31k46J25K62k09l16J38K48j27l05J17
$$ 245 416 225 -32 209 372 99 -125 55 250 19 -227 -102 160 -49 -365 -227 21 -106 -411 -294
958b94K96j77l18J19L06j60j76M3L31j09k19P0K63O2k36O2L15q8k36R2K90L7k79
$$ -294 2 -175 -493 -374 -68 -228 -404 -361 -30 -139 -358 -288 -25 37 -199 -137 178 90 -146 -54 236 273 -6
981fm1L68Q1l64M9K76J38l34r7K67O2l10k4J32J96k62j29J91J10k75j91K23J50
$$ -6 -47 321 402 38 87 363 501 167 70 337 399 89 65 197 393 131 2 193 303 28 -163 60 210
1004B10k62j87J88J44k75j35J54J58j86k49J97J93j87j31J14K20j08k51J63J91
$$ 210 -52 -239 -51 93 -182 -317 -163 -5 -191 -440 -243 -50 -237 -368 -254 -34 -142 -393 -230 -39
1024c9j15k25J97L16j95j63J54K46j11k20K07J68l4k18J27K31j05j83P2L33j04
$$ -39 -154 -379 -182 134 -61 -224 -70 176 65 -155 52 220 186 -32 95 326 221 38 110 443 339
1045C39k78J14K15K9l86O4K11K7l00pJ53P9l16RJ67J0k29j48K55R7l46j31L06
$$ 339 61 175 390 419 33 97 308 335 35 28 181 260 -56 -47 120 130 -99 -247 8 105 -241 -372 -66
1068f6P0k78j83K44J41k14j29K88J14k07k06L30Q4j63j57K90J10j33j47J71K87
$$ -66 4 -274 -457 -213 -72 -286 -415 -127 -13 -220 -426 -96 -12 -175 -332 -42 68 -65 -212 -41 246
1089B46j83j38J74K04j68j92K40J92j41j87J36K35j90j68J18K40r6k87P8K35j32
$$ 246 63 -75 99 303 135 -57 183 375 234 47 183 418 228 60 178 418 322 35 113 348 216
1110B16k48J8K63j50k56K5K66m0k62m9K37J6k94j2J84j1k82N9K79r0k14PK53N7
$$ 216 -32 -14 249 99 -157 -132 134 94 -168 -217 20 36 -258 -270 -86 -97 -379 -320 -41 -131 -345 -338 -85 -28
1134b8l00k0L20qk09q8L75M6j71j18K84L8j29l6J85J45k07j59K75J86j55j75J58
$$ -28 -328 -348 -28 -36 -245 -333 42 88 -83 -201 83 121 -8 -44 141 286 79 -80 195 381 226 51 209
1157B09J64j83j70K22J06j82j38J24J76j63j52P7J36r9k72J28K00k23j69L8K50
$$ 209 373 190 20 242 348 166 28 152 328 165 13 90 226 127 -145 -17 183 -40 -209 -171 79
1178G9j88k27J69J59j17k90R5K44n0k53M1K56p2k17J22K31k4j63nK12K4k19Q6
$$ 79 -109 -336 -167 -8 -125 -415 -320 -76 -126 -379 -338 -82 -154 -371 -249 -18 -42 -205 -210 2 26 -193 -107
1201a07J78O5k24qL27K5k24N9J43N6j74m3J92J20k52o7K10R4k18j38K30J03k79
$$ -107 71 136 -88 -96 231 256 32 91 234 290 116 73 265 385 133 66 276 370 152 14 244 347 68
1224F8q7J21O8j45j86J49J51j98j73J21J28j95j21R1J50j67j42K08J43j50j95
$$ 68 -19 102 170 25 -161 -12 139 -59 -232 -111 17 -178 -299 -208 -58 -225 -367 -159 -16 -166 -361
1245c61J12K16j55j36J22K54j26j79R0K81j25j72J69J21L0j42K8K15k7j45J7K58
$$ -361 -249 -33 -188 -324 -202 52 -74 -253 -163 118 -7 -179 -10 111 141 -1 27 242 215 70 87 345
1267C45j0j94n9K09L3k06n1K21M1k81l3J91K0k34l1O8J13k17m1J84m4j77j07J63
$$ 345 335 141 82 291 324 118 67 288 329 48 15 206 226 -8 -39 29 142 -75 -116 68 24 -153 -260 -97
1291i7J23k47n4J85%j73j00K33M4j93j08K02J77j92j47K47J78k17q7J88J64j88
$$ -97 26 -221 -275 -90 -90 -263 -363 -130 -86 -279 -387 -185 -8 -200 -347 -100 78 -139 -226 -38 126 -62
1313f2q1J81J90j56j56J19K62q5j72M2K07k8k31O9K81o2k78J28J68j02k64O2J79
$$ -62 -143 38 228 72 -84 35 297 212 40 82 289 261 30 99 380 318 40 168 336 234 -30 32 211
1336B11M5k56n8K00n7k06O1K07j13j80p9K47o7k45LK31p4k04N2J83K9k32%J96
$$ 211 256 0 -58 142 85 -121 -60 147 34 -146 -225 22 -45 -290 -287 -56 -130 -334 -282 -99 -70 -302 -302 -106
1360a06N8j97n8K24K5p3r4K33P3j08j60K63J07j49l2O8J96k02j3J27J31j55j31
$$ -106 -48 -245 -303 -79 -54 -127 -221 12 85 -23 -183 80 187 38 6 74 270 68 55 182 313 158 27
1383B7J19J42o5j68P0K48j64k15J17J47k10j26O6J82j82j33N8J53j05j43K9J39
$$ 27 146 288 223 55 125 373 209 -6 111 258 48 -78 -12 170 -12 -145 -87 66 -39 -182 -153 -14
1405a4q3k22J39J74j37j79L3J94k8j91O9K04m1j25k1J83P6k26N6J85N7j28m4K30
$$ -14 -97 -319 -180 -6 -143 -322 -289 -95 -123 -314 -245 -41 -82 -207 -228 -45 31 -195 -139 46 103 -25 -69 161
1429A61L8j46j12K41R4k09l1J77J21j62j01J68Q2j99j23K49N1k24j11J52O1j69
$$ 161 199 53 -59 182 276 67 36 213 334 172 71 239 321 122 -1 248 299 75 -36 116 177 8
1451Hq4R9O1j02j37O6J41j65j49J96K9p4j61R9J36j33q5R8Q9o6j43Q7K26j26j83
$$ 8 -76 23 84 -18 -155 -89 52 -113 -262 -66 -37 -111 -272 -173 -37 -170 -255 -157 -68 -134 -277 -190 36 -90 -273
1476b73M3K36k4j72J72J64j09r4Q6J56j15q9L5K55J3k29J8K07p6r0j0J66J1k54
$$ -273 -230 6 -18 -190 -18 146 37 -57 29 185 70 -19 16 271 284 55 73 280 204 114 104 270 281 27
1500B7%K02L2k60K0R6O0k07j26K37L6j96j40J86O6j74l0L6J54k57l1J80M4j64
$$ 27 27 229 261 1 21 117 177 -30 -156 81 117 -79 -219 -33 33 -141 -171 -135 19 -238 -269 -89 -45 -209
1524b09r7J99J13j75j19J78Q0j02j14J47P2n1j17J88J64j16l3J1J94o0j06PK35
$$ -209 -306 -107 6 -169 -288 -110 -30 -132 -246 -99 -27 -78 -195 -7 157 41 8 19 213 153 47 54 289
1547B89q4j75J56P8m6j81J26Q8Ok15P8J70n4k19jJ61j6k12kJ56q2j10L6R2r5j07
$$ 289 205 30 186 264 218 37 163 251 257 42 120 290 236 17 16 177 161 -51 -53 103 21 -89 -53 39 -56 -163
1573a63m3J28K3j65q6J98Oj09l5J63Pj65lJ27J70j80n4J09J05j48p0J66J18k5
$$ -163 -206 -78 -55 -220 -306 -108 -102 -211 -246 -83 -76 -241 -244 -117 53 -127 -181 -72 33 -115 -185 -19 99 74
1597G4j34J66J06r2j06J42M4o6r9J60R8j19j27J23J13j18j52R3J32o2j38jJ70
$$ 74 -60 106 212 120 14 156 200 134 35 195 293 174 47 170 283 165 13 106 238 176 38 37 207
1620B07n2k03K9J58q4j99J6J64o4j50j0J32n8j62P5J11j3j23J0J24Qj62K2J89
$$ 207 155 -48 -19 139 55 -144 -128 36 -28 -178 -188 -56 -114 -276 -201 -90 -103 -226 -216 -92 -84 -246 -224 -35
1644c5p8o2k2K23M1j26m4J54M6j22k6K23M4j65m7J20J30j09q4J04J44k58M4J13
$$ -35 -113 -175 -197 26 67 -59 -103 51 97 -25 -51 172 216 51 4 124 254 145 61 165 309 51 95 208
1668B08J21k14r0J42M3j37p9Q8R8j17j84J76Nj21n6K4J11o8j58M4J04m5j73O4
$$ 208 329 115 25 167 210 73 -6 82 180 63 -121 55 60 -61 -117 -93 18 -50 -208 -164 -60 -105 -278 -214
1692b14Q9l4j04L3J59Kj51N1J47n7q2M3J72J9j33PJ21k3j07N0J91n8r7L8J73l8
$$ -214 -125 -159 -263 -230 -71 -69 -220 -169 -22 -79 -161 -118 54 73 -60 -53 68 45 -62 -12 179 121 24 62 235 197
1718A97j01l6J84N5k24J3J05L1j14l3O6M3j55l6J43Rj51r5J84m8j17j28J18R5
$$ 197 96 60 244 299 75 88 193 224 110 77 143 186 31 -5 138 147 -4 -99 85 37 -80 -208 -90 5
1742Ek11l9J22J06j75q5J28P3j35k8J19J04j25p0N6J35l6r4J24L8k1j26J04J47
$$ 5 -206 -245 -123 -17 -192 -277 -149 -76 -211 -239 -120 -16 -141 -211 -155 -20 -56 -150 -26 12 -9 -135 -31 116
1766A16m0p6Q0J10j56k1O3J78j03j01qK40m2j90J12O4o3j27O1O0o9q2K8R2k4j73
$$ 116 76 0 80 190 34 13 76 254 151 50 42 282 240 50 162 226 163 36 97 157 88 6 34 126 102 -71
1792g1K6J38Nk12n2R9K3j74j6J98l2q6r0Q9J34j99RJ07N5p2j36K12K5j00J1R5
$$ -71 -45 93 98 -114 -166 -67 -44 -218 -234 -36 -68 -154 -244 -155 -21 -220 -211 -104 -49 -121 -257 -45 -20 -120 -109 -14
1818a4J11j87K0R5J06j03JQ8OLq8Q5J41j86l1Q5J02j22l7K1J26n6k34J28M6rj08
$$ -14 97 -90 -70 25 131 28 29 117 123 126 38 123 264 78 47 132 234 112 75 96 222 166 -68 60 106 97 -11
1845a1j3J58o0j88N5J43q1j10r9J94J1j93j8K01o6j08k3J38Nj25l2J70lj45P3
$$ -11 -24 134 74 -114 -59 84 3 -107 -206 -12 -1 -194 -212 -11 -77 -185 -208 -70 -65 -190 -222 -52 -55 -200 -127
1870a27P4P7k15O8K4J15k5p7J38J45j78j0J37L5k3j02J66Oj14o1J33L0j30l0J12
$$ -127 -53 24 -191 -123 -99 16 -9 -86 52 197 19 9 146 181 158 56 222 228 114 53 186 216 86 56 168
1895A68Qp8j27J51j4k1j39N6J27j41p3K2J20j12j34R9M2q5o9Q8R1n6j83J56J4
$$ 168 176 98 -29 122 108 87 -52 4 131 -10 -83 -61 59 -53 -187 -88 -46 -131 -200 -112 -21 -77 -260 -104 -90
1920i0k4j52O1J66K4k34J52Q0k4j17J5J93o1r2N6J81n0n3L6O3O2j15n3J43O7j19
$$ -90 -114 -266 -205 -39 -15 -249 -97 -17 -41 -158 -143 50 -11 -103 -47 134 84 31 67 130 192 77 24 167 234 115
1946A15l2J20Kq8k4J12rj51j7O1J1q8k7J8P5j03r2L9Q5j00o4J45k2q4j06J11P8
$$ 115 83 203 205 117 93 205 196 45 28 89 100 12 -15 3 78 -25 -117 -78 7 -93 -157 -12 -34 -118 -224 -113 -35
1973c5j25p1J41N0r9j04K03Q1o9j36J10P3n4q0J12M9j7r2P7J37n8j99J61J82j39
$$ -35 -160 -231 -90 -40 -139 -243 -40 41 -28 -164 -54 19 -35 -115 -3 46 29 -63 14 151 93 -106 55 237 98
1998I8j3J0J22K0j40k0O0N3o4p4J61n9j35M9O9Mj14j26J64l4j10nJ45j2j61m6
$$ 98 85 95 217 237 97 77 137 190 126 52 213 154 19 68 137 141 27 -99 65 31 -79 -84 61 49 -112 -158
2024a58J38l4j21p4J76qn8n2Q8P5j68k5J02Q8n8q2J28Q3j29r3J39J36j0j36J16
$$ -158 -20 -54 -175 -249 -73 -81 -139 -191 -103 -28 -196 -221 -119 -31 -89 -171 -43 40 -89 -182 -43 93 83 -53 63
2049F3L9M8j63M5J35j06jP9R0o0r2K7J02j9j44P9L8K7j76N3O1l5j12k3mN7n1k6
$$ 63 102 150 -13 32 167 61 60 139 229 169 77 104 206 187 43 122 160 187 11 64 125 90 -22 -45 -49 8 -43 -69
2077f9J2Oq5J9Q1l4j07j6J33k2j39N3J28p8l6k3J13L8j57K5J31M2p4j7J15K1k3
$$ -69 -57 -51 -136 -117 -36 -70 -177 -193 -60 -82 -221 -168 -40 -118 -154 -177 -64 -26 -183 -158 -27 15 -59 -76 39 60 37
2104C7q1R9J60k34K4J06M5n4QL1O5n4r2P0R6p2j31R9N4n5j60J16J7r4%L2Nj0j12
$$ 37 -44 55 215 -19 5 111 156 102 110 141 206 152 60 130 226 154 23 122 176 121 -39 77 94 0 0 32 37 27 -85
2133h5k9J40o2r6m3Q7N5j58j2J30k2j12P2J38j49J1QP4L0j12RJ79Jj24K2J46O6
$$ -85 -114 26 -36 -132 -175 -88 -33 -191 -203 -73 -95 -207 -135 3 -146 -135 -127 -53 -23 -135 -126 53 54 -70 -48 98 164
2160A64j69j9R9P4p1n6J09Q4j48K2J9L1o3k3P4O0j08mO3J08j77p6N6R0j24q6K9
$$ 164 -5 -24 75 149 78 22 131 215 67 89 108 139 76 53 127 187 79 75 138 246 69 -7 49 139 15 -71 -42
2187d2J04j18o4P3K5m3o4Q1l9n9k2O0NLj02N6J26p5p3P0M6Pm7l6J44l5m0N9J02
$$ -42 62 -56 -120 -47 -22 -65 -129 -48 -87 -146 -168 -108 -103 -100 -202 -146 -20 -95 -168 -98 -52 -45 -92 -128 16 -19 -59 0 102
2216A02Or3M9O9O3q8o1J13J9j02MJ19j18o3M8J13m6j00jJ26J2j75RO4l1q3p0J38
$$ 102 108 15 64 133 196 108 47 160 179 77 81 200 82 19 67 180 134 34 33 159 171 -4 5 69 38 -45 -115 23
2244B3P1j33j36J85po4q9M2Q1o5r6J35L0j43o7J55O6p9o7R5L7no3O3O4p0QM7O9
$$ 23 94 -39 -175 10 3 -61 -150 -108 -27 -92 -188 -53 -23 -166 -233 -78 -12 -91 -158 -63 -26 -31 -94 -31 33 -37 -29 18 87
2273H7j7j26J42K6K8p9O0O3l5p3j2J51p2r4M7N9Qq6j8J08mj48l0J13J3j86K1Q1
$$ 87 70 -56 86 112 140 61 121 184 149 76 64 215 143 49 96 155 163 77 59 167 163 15 -15 98 111 -75 -54 27
2301B7m1q5K8O2k8j54k4J95J7j49pJ39o1m4m5J07M8o2n7L6J20n9p9R7P0m7l1L8
$$ 27 -14 -99 -71 -9 -37 -191 -215 -20 -3 -152 -159 -20 -81 -125 -170 -63 -15 -77 -134 -98 22 -37 -116 -19 51 4 -27 11
2329A1J07r3n6J28M6m3j06J65o8k4J5L7j2j3n1L3J01l2r8K1J08j62n9J62m7oq8
$$ 11 118 25 -31 97 143 100 -6 159 91 67 82 119 107 94 43 76 177 145 47 68 176 14 -45 117 70 64 -24
2356b4RR8p1k14J00M1l0p7J1O7N6j32L5j5K8l8jM7M0q7k9J08O4p7K3P5K1r5P1
$$ -24 -15 83 12 -202 -102 -61 -91 -168 -157 -90 -34 -166 -131 -146 -118 -156 -157 -110 -70 -157 -186 -78 -14 -91 -68 7 28 -67 4
2385DQ4k2j9j6J23l7k1o5J81p9pj28J02Q4j59j9J91jr5j59J65J8n2p2L9P6j16
$$ 4 88 66 47 31 154 117 96 31 212 133 126 -2 100 184 25 6 197 196 101 -58 107 125 73 1 40 116 0
2412@r0J15P2j48l1MP6n6l4O7k3n6j18J08P8p1n9P7J4M6j11Q6mJ9Mn5J25o8j4
$$ 0 -90 25 97 -51 -82 -78 -2 -58 -92 -25 -48 -104 -222 -114 -36 -107 -166 -89 -75 -29 -140 -54 -58 -39 -35 -90 35 -33 -47
2441d7LQ6M3l1kR2qj25K4J37j8j1n1K7J4r7M8M6N8j36j00J56m5o5K0J14r3r8M
$$ -47 -44 42 85 54 52 144 136 11 35 172 154 143 92 119 133 36 84 130 188 52 -48 108 63 -2 18 132 39 -59 -55
2470e5K1O5r9OL8M1j54Mj1N2j6K5lK0p2m5O9R7p3m6N6N8pm9L9R3K4j31Q3M6j6
$$ -55 -34 31 -68 -62 -24 17 -137 -133 -144 -92 -108 -83 -86 -66 -138 -183 -114 -17 -90 -136 -80 -22 -29 -78 -39 54 78 -53 30 76 60
2501F0n0N7P6rp7K0Q8N9j04l8R4n0m6k7J01K6j89K1J54r5r3K2O5p9j00N5K7pj11
$$ 60 10 67 143 134 57 77 165 224 120 82 176 126 80 53 154 180 -9 12 166 71 -22 0 65 -14 -114 -59 -32 -39 -150
2530a50N4M1%o9k6Q8j0p2K4j4Q1j00J5P1K4kn3O8O4n3o3P5M2k1k0L0Q8l5l1L2
$$ -150 -96 -55 -55 -124 -150 -62 -72 -144 -120 -134 -53 -153 -138 -67 -43 -45 -98 -30 34 -19 -82 -7 35 14 -6 24 112 77 46 78
2560G8R2j07j4j0J54p0o5k6J36j05q1P0P6m4q7Q7L5n0j07O0O5j36k6K0N4n5m3
$$ 78 170 63 49 39 193 123 58 32 168 63 -18 52 128 84 -3 84 119 69 -38 22 87 -49 -75 -55 -1 -56 -99
2587i9K9O7J9j55P1k3j4k2j4Q9jj07K6R3k9j4j7R9j6rp7Q5R5n8mLM9p2R3RJ4k0
$$ -99 -70 -3 16 -139 -68 -91 -105 -127 -141 -52 -53 -160 -134 -41 -70 -84 -101 -2 -18 -27 -104 -19 76 18 14 17 66 -6 87 96 110 90
2619I0j3Q2K1p9j02J10K6o2n8J22m3n1k7K8M2j06o0J19N7j27n4K3P0o9o5R2k8
$$ 90 77 159 180 101 -1 109 135 73 15 137 94 43 16 44 86 -20 -80 39 96 -31 -85 -62 8 -61 -126 -34 -62
2646f2pm8k2N4K6q1N9L3J9q7NJ36j5o2l9J20j9o5M8O2mm0K1M3L6q8QQ8K3q8l1
$$ -62 -69 -117 -139 -85 -59 -140 -81 -48 -29 -116 -111 25 10 -52 -91 29 10 -55 -7 55 51 11 32 75 111 23 31 119 142 54 23
2677B3J25Kp3m8J12J9k6j64J43nn3l3K2O0j15l3j5R6j02j3N7j6o7n8N3O0m7p6
$$ 23 148 150 77 29 141 160 134 -30 113 108 55 22 44 104 -11 -44 -59 37 -65 -78 -21 -37 -104 -162 -109 -49 -96 -172
2705a72J03l7N9j18P6K8j6k7O4P5j26j8N9R5o1J3k6O1l5O8j8P1l6j14P4J42q4
$$ -172 -69 -106 -47 -165 -89 -61 -77 -104 -40 35 -91 -109 -50 45 -16 -3 -29 32 -3 65 47 118 82 -32 42 184 100
2732A00%o0R3l3pJ3M9oj00l2J21q1k0kN2o1j14K7N1J8j11J6J14p2l9rJ8J0j0n7
$$ 100 100 40 133 100 93 106 155 149 49 17 138 57 37 35 87 26 -88 -61 -10 8 -103 -87 27 -45 -84 -93 -75 -65 -75 -132
2762a32nP5m9J9lO3p6L1M5K5q0J7P7K1l6J9P1n0M6n5L7Q3j8j42P5R5p5nk7P2k9
$$ -132 -137 -62 -111 -92 -95 -32 -108 -77 -32 -7 -87 -70 7 28 -8 11 82 32 78 23 60 143 125 -17 58 153 78 73 46 118 89
2793H9l1M3L4p7%N6K5l7j18L8Nm5M8j37J21l5l7J8K6n2k9mM3n0M7m7R5l0o2n3
$$ 89 58 101 135 58 58 114 139 102 -16 22 27 -18 30 -107 14 -21 -58 -40 -14 -66 -95 -99 -56 -106 -59 -106 -11 -41 -103 -156
2823a56J46j4l6p4J25j7q4N7J7M1k7O5M5k2o1P3RJl5k5OQ6q3k6R4M3m6l8N5j8
$$ -156 -10 -24 -60 -134 -9 -26 -110 -53 -36 5 -22 43 88 66 5 78 87 88 53 28 34 120 37 11 105 148 102 64 119 101
2853A01pl5j7N8qj35K3N7m2j3PL2l5q2KR0j01nL4L6k4j27J09K7m1k6L2M6K1o1
$$ 101 94 59 42 100 92 -43 -20 37 -5 -18 -11 21 -14 -96 -94 -4 -105 -110 -76 -40 -64 -191 -82 -55 -96 -122 -90 -44 -23 -84
2883h4Q3pk4k3O1L5j3j0n2O5J7l7l8J45n8J2n3M0K4k9O1JO4j01L5m3J11j41l8
$$ -84 -1 -8 -32 -55 6 41 28 18 -34 31 48 11 -27 118 60 72 19 59 83 54 115 116 180 79 114 71 182 41 3
2912CR6l9k0n4N3J5m1l7P3rq6n2Q0J4m5q2P5K8L7j46JO3l3kL0O8q9L4O1k0k7n3
$$ 3 99 60 40 -14 39 54 13 -24 49 40 -46 -98 -18 -4 -49 -131 -56 -28 9 -137 -136 -73 -106 -108 -78 -10 -99 -65 -4 -24 -51 -104
2944a04N6R2r6M5L1L6j6j53J68Q0q8oK4L4L8p2K2j3K4l1m6M6j0m5L4j0j8m5j2
$$ -104 -48 44 -52 -7 24 60 44 -109 59 139 51 45 69 103 141 69 91 78 102 71 25 71 61 16 50 40 22 -23 -35
2973c5J19j25J3K6L2Qj18M2K8J5j18lL9K3k2j08J26l4M0m4J1P4o3MP6j9n2L8L3
$$ -35 84 -41 -28 -2 30 38 -80 -38 -10 5 -113 -116 -77 -54 -76 -184 -58 -92 -52 -96 -85 -11 -74 -70 6 -13 -65 -27 6
3002FK0oj6%J7K0l7M8Q8m5k1m3Q9l5k0JN1or2P0K0n9k6m1J09L0j89R8L0q8n0J
$$ 6 26 20 4 4 21 41 4 52 140 95 74 31 120 85 65 66 117 111 19 89 109 50 24 -17 92 122 -67 31 61 -27 -77 -76
3034g6O5l2m3L0K6O1q6m8N6J0r1M9M9%j09J0P6Nn4kQ3l3lPJ1J8l1J3J79j14j0
$$ -76 -11 -43 -86 -56 -30 31 -55 -103 -47 -37 -128 -79 -30 -30 -139 -129 -53 -48 -102 -104 -21 -54 -57 -50 -39 -21 -52 -39 140 26 16
3065A6RO2K9p1OO5J2p2n%J34j25O2m9j4o2j0M5L0k0q0N2O1n9l6J9J2p2pO1ql7
$$ 16 25 87 116 45 51 116 128 56 51 51 185 60 122 73 59 -3 -13 32 62 42 -38 14 75 16 -20 -1 11 -61 -68 -7 -15 -52
3097e2l0J1l2J7q2P1N0l2j0LO4l9RK9Rk7j7j3J17k1m5lO5NK9r1J17K1r3m3O8N6
$$ -52 -82 -71 -103 -86 -168 -97 -47 -79 -89 -86 -22 -61 -52 -23 -14 -41 -58 -71 46 25 -20 -23 42 47 76 -15 102 123 30 -13 55 111
3129A11m2RJ3O4j64O6K2k5kq3M2P2n7m0L7Pl1m2pO1j05J1n7O5n8MP0L9j21L7j5
$$ 111 69 78 91 155 -9 57 79 54 52 -31 11 83 26 -14 23 30 -1 -43 -50 11 -94 -83 -140 -75 -133 -129 -59 -20 -141 -104 -119
3160a19R7l0o8OK8P2o1J13r2O9Rm0L2r5O5K2j5O9qk3O0K2l9J9M6p8p9R8O9m5j6
$$ -119 -22 -52 -120 -114 -86 -14 -75 38 -54 15 24 -16 16 -79 -14 8 -7 62 54 31 91 113 74 93 139 61 -18 80 149 104 88
3191H8n1K1q4P4n7K5J2p1l1P6N8q5p6L9pml6N0N1n3n8qP4L6j32Q6P8n9p7M3M7
$$ 88 37 58 -26 48 -9 16 28 -43 -74 2 60 -25 -101 -62 -69 -73 -109 -59 -8 -61 -119 -127 -53 -17 -149 -63 15 -44 -121 -78 -31
3222c1k9jlL9J2j4%P5Jn4J9L7M0m6L0P3r4mM4k0k2k8M6k1K9J3l8Ql8L8n9j5ll
$$ -31 -60 -61 -64 -25 -13 -27 -27 48 49 -5 14 51 91 45 75 148 54 50 94 74 52 24 70 49 78 91 53 61 23 61 2 -13 -16 -19
3256a9m5O0L2j53O8O2p0j07P2P0Rn7p7J05m5pK3K6L2j07QJ09m2K8q0R9M6r5N6
$$ -19 -64 -4 28 -125 -57 5 -65 -172 -100 -30 -21 -78 -155 -50 -95 -102 -79 -53 -21 -128 -120 -11 -53 -25 -105 -6 40 -55 1
3285AK0Oj8J0O1O7k3o9O0qr8J2N1m1J9NN1m6m4n8P7J1L7j07N3L1p7j2k0M3j4l9
$$ 1 21 27 9 19 80 147 124 55 115 107 9 21 72 31 50 55 106 60 16 -42 35 46 83 -24 29 60 -17 -29 -49 -6 -20 -59
3317e9oL3N0j10j4P9m1k8K2MJ5o1N1kM5q6K1P3J5k3lK9O2r4rN2M7n6J8J9K8M2
$$ -59 -65 -32 18 -92 -106 -27 -68 -96 -74 -70 -55 -116 -65 -67 -22 -108 -87 -14 1 -22 -25 4 66 -28 -37 15 62 6 24 43 71 113
3349A13r5N6J5j8Nj0M1m9jJ6L0q0n8K5R1m5l0N1n5l5O0n9J7n6l1N9K9m4r3N8M1
$$ 113 18 74 89 71 76 66 107 58 57 73 103 23 -35 -10 81 36 6 57 2 -33 27 -32 -15 -71 -102 -43 -14 -58 -151 -93 -52
3380e2l3j8O2kq8L2P6jm1M8p0N5N2p5J9J10j00j0p0J77l8j0Q5l9J3l5K5L0m5n
$$ -52 -85 -103 -41 -43 -131 -99 -23 -24 -65 -17 -87 -32 20 -55 -36 74 -26 -36 -106 71 33 23 108 69 82 47 72 102 57 52
3410E2QPQl2O1m4n8oJ3RlJ7m1J15j60K3k1J2K7M1q6Nj1j3l7L5j6M7m7M7J8m6n1
$$ 52 60 67 75 43 104 60 2 -4 9 18 15 32 -9 106 -54 -31 -52 -40 -13 28 -58 -53 -64 -77 -114 -79 -95 -48 -95 -48 -30 -76 -127
3443a27J3J03n3n7L2P5Ql5J4L4PK5n1M5K3o1n0J64o8j7MR8l1q0lJ09l6m7m1N4
$$ -127 -114 -11 -64 -121 -89 -14 -6 -41 -27 7 14 39 -12 33 56 -5 -55 109 41 24 28 126 95 15 12 121 85 38 -3 51
3473E1K9m3J5n4N8n2k8R9r3j8qK8L2j22M4j8l3O0K5pp3L6kk8R6o0k9J2K2J0m4
$$ 51 80 37 52 -2 56 4 -24 75 -18 -36 -44 -16 16 -106 -62 -80 -113 -53 -28 -35 -108 -72 -74 -102 -6 -66 -95 -83 -61 -51 -95
3504i5K0O6m4%N3LoqL5L1l9jQ5Lk7j6N9Nr7L8j0kL1l7joOl6k8R4m5p5k9R8p0J7
$$ -95 -75 -9 -53 -53 0 3 -3 -11 24 55 16 15 100 103 76 60 119 124 27 65 55 53 84 47 46 40 46 10 -18 76 31 -44 -73 25 -45 -28
3540b8j8Pk9k0MPJ4n3N2K2n3J5J9j6K5ol2O7o7ML7K4J6L9m8K5j3pl2J01K8o9K
$$ -28 -46 -39 -68 -88 -84 -77 -63 -116 -64 -42 -95 -80 -61 -77 -52 -58 -90 -23 -90 -86 -49 -25 -9 30 -18 7 -6 -13 -45 56 84 15 17
3573A7M5J0P0j07M6J2Ll4J5L8p3n3J05k6jo1m1Q7L7j04j9O4q8K8k1L4l1J7qL7
$$ 17 62 72 142 35 81 93 96 62 77 115 42 -11 94 68 67 6 -35 52 89 -15 -34 30 -58 -30 -51 -17 -48 -31 -39 -2
3603bj9n5K8J0l5j2K3K6m7m8N5L6m0j2NP7L6lpJ5n5N6k5J3Nm7J3L7J9M1r1J06
$$ -2 -21 -76 -48 -38 -73 -85 -62 -36 -83 -131 -76 -40 -80 -92 -87 -10 26 23 16 31 -24 32 7 20 25 -22 -9 28 47 88 -3 103
3635A03qq1K6J3k6l0O6nk0nl0N4J5m7nq1N7p8k1O5Qo7L4L4N8p2%p8L6m1N7K5m
$$ 103 95 14 40 53 27 -3 63 58 38 33 3 57 72 25 20 -61 -4 -82 -103 -38 -30 -97 -63 -29 29 -43 -43 -121 -85 -126 -69 -44 -48
3668d8qj4m7Q4n1k0R7jm6J6K2P6p4M5N0o7N8l7J3N5K0k0q1J07j26oJ16l3k1m1
$$ -48 -56 -70 -117 -33 -84 -104 -7 -8 -54 -38 -16 60 -14 31 81 14 72 35 48 103 123 103 22 129 3 -3 113 80 59 18
3698A8N7oJ1l2k6j5L8q6K7J3j9k5%jK2n6k6O8k8l5M4J3K6k5l3J1K3K0nRk0M5p1
$$ 18 75 69 80 48 22 7 45 -41 -14 -1 -20 -45 -45 -46 -24 -80 -106 -38 -66 -101 -57 -44 -18 -43 -76 -65 -42 -22 -27 -18 -38 7 -64
3731f4N0J2j7O5j9J2r4M9J5P7l5l0J8O8j18N4L5k1J0m9J7M6q7N2o9Q2m5K8k7L8
$$ -64 -14 -2 -19 46 27 39 -55 -6 9 86 51 21 39 107 -11 43 78 57 67 18 35 81 -6 46 -23 59 14 42 15 53
3761E3l6p2K0M6pp1K5L3n5J8n1N4k6k3M5M4r7O1M2k7P8j64O1Kj8N4o0N4N3o2N
$$ 53 17 -55 -35 11 4 -67 -42 -9 -64 -46 -97 -43 -69 -92 -47 -3 -100 -39 3 -24 54 -110 -49 -47 -65 -11 -71 -17 36 -26 -21
3792b1j1R3r4N2M2k7M9L8o4J6Ok6K6O4m6q5Q2l4K4p8j9J7mm6K1M6K3p4N5J6l8
$$ -21 -32 61 -33 19 61 34 83 121 57 73 79 53 79 143 97 12 94 60 84 6 -13 4 0 -46 -25 21 44 -30 25 41 3
3823Cm4lM3mm9NJ8l3n8L7J06m7o3N8k9j2K6K5OJ8K1k1KKl8N4J2J1jL2m4N4l3k0
$$ 3 -41 -44 -1 -5 -54 -49 -31 -64 -122 -85 21 -26 -89 -31 -60 -72 -46 -21 -15 3 24 3 5 7 -31 23 35 46 45 77 33 87 54 34
3857C4O2j9Jj5j6P2p2n5Q0k1j2l1Q1p7L6j5pm2L0j3M3k6l2Nk1P6m3p5rL7j1QM
$$ 34 96 77 78 63 47 119 47 -8 72 51 39 8 89 12 48 33 26 -16 14 1 44 18 -14 -9 -30 46 3 -72 -81 -44 -55 -47 -43
3890d3M2j26K8O8K3J5j39J53nj3k8K3kN5m9O4q1R2j23N6P5L1q5L7J5p2K6M1n2
$$ -43 -1 -127 -99 -31 -8 7 -132 21 16 3 -25 -2 -4 51 2 66 -15 77 -46 10 85 116 31 68 83 11 37 78 26
3919B6%j8J4LK3L3p8J8n7M3q9L9O3m0n1M1N5p9k6Q2l9j2q5R0l2J7RL3l1ql3M8
$$ 26 26 8 22 25 48 81 3 21 -36 7 -82 -43 20 -20 -71 -30 25 -54 -80 2 -37 -49 -134 -44 -76 -59 -50 -17 -48 -56 -89 -41
3951d1J2j8qj8LJ13p4K9N3q6O9KJ5l0j6R5l8J1l8qN7k5k2O7o2J7m9L1k9Q2q5l0
$$ -41 -29 -47 -55 -73 -70 43 -31 -2 51 -35 34 36 51 21 5 100 62 73 35 27 84 59 37 104 42 59 10 41 12 94 9 -21
3983b1M0m5Rj1K6J8k8jl1M4m1J7M4j04P3o1o3P4L1j0NJ7m4k2K1n9J09p4M6L3l7
$$ -21 19 -26 -17 -28 -2 16 -12 -13 -44 0 -41 -24 20 -84 -11 -72 -135 -61 -30 -40 -35 -18 -62 -84 -63 -122 -13 -87 -41 -8 -45
4014d5N0m3O5lj7k5P1n4N5PN4n8j8K0K1K6m1K9Jj10L6mJ8Q9o8o8M7%j5K1k3m1
$$ -45 5 -38 27 24 7 -18 53 -1 54 61 115 57 39 59 80 106 65 94 95 -15 21 17 35 124 56 -12 35 35 20 41 18 -23
4046b3K7Kj0l7n5Q6L9o0n4L3k8j0O6m7M3k5l9J8L4N1n4O0P1j02j5kO0O0r1l8R7
$$ -23 4 6 -4 -41 -96 -10 29 -31 -85 -52 -80 -90 -24 -71 -28 -53 -92 -74 -40 11 -43 17 88 -14 -29 -31 29 89 -2 -40 57
4077E7l7K2Ln0P2j0rL3k3j1l9J00Qq6K0J5L5r2j5M7r9OjM8n1Q0o2M2rj1l9n5J29
$$ 57 20 42 45 -5 67 57 48 81 58 47 8 108 116 30 50 65 100 8 -7 40 -59 -53 -54 -6 -57 23 -39 3 -6 -17 -56 -111 18
4110A8j05l2L7O2m3%J7K3q9O7j6Rk2M0oL7K1q9LJ14k2n6j8O0M0k8J9L7J7l8oN7
$$ 18 -87 -119 -82 -20 -63 -63 -46 -23 -112 -45 -61 -52 -74 -34 -40 -3 18 -71 -68 46 24 -32 -50 10 50 22 41 78 95 57 51 108
4142A08k3l5m7M9L9j9l8m2Q0o1N8n6oLJ0rmo4j0N9M0n6n3j1OJ9JM1j01P2J2m5
$$ 108 85 50 3 52 91 72 34 -8 72 11 69 13 7 10 20 11 7 -57 -67 -8 32 -24 -77 -88 -82 -63 -62 -21 -122 -50 -38 -83
4174h3O5m2rlQ0p9J6P8m5L5Pp0Q4l0rO1l6L8o5N8j4J0l0N6J0Jn3j1P9k1m5j2L5
$$ -83 -18 -60 -69 -72 8 -71 -55 23 -22 13 20 -50 34 4 -5 56 20 58 -7 51 37 47 17 73 83 84 31 20 99 78 33 21 56
4207E6k4Qr4Q4k9mL4j1k7M4ll5m3m6PN8l1qj4N1q1N0M2j7J5p5N1J9N2k8q0P7k1
$$ 56 32 40 -54 30 1 -3 31 20 -7 37 34 -1 -44 -90 -83 -25 -56 -64 -78 -27 -108 -58 -16 -33 -18 -93 -42 -23 29 1 -79 -2 -23
4240b3Rl6L6N2om0M6jl6J2N9k2N1j32R4k9l2P8k2rK7oo3K2jnj3O1q3k2J2P9p5
$$ -23 -14 -50 -14 38 32 -8 38 37 1 13 72 50 101 -31 63 34 2 80 58 49 76 70 7 29 28 23 10 71 -12 -34 -22 57 -18
4273a8M9p6P1o6l1j5J3L2j4N5n5J6o2L3PM1m0QOM1n2K3k7M5l6K8R2k4No5K2L3
$$ -18 31 -45 26 -40 -71 -86 -73 -41 -55 0 -55 -39 -101 -68 -61 -20 -60 -52 -46 -5 -57 -34 -61 -16 -52 -24 68 44 49 -16 6 39
4305C9J1kPLl7m4J26o1J9oL0jj15J6P5l9OL1K7j5r8Oj9O3m5K4k6jl1L2K6Qk3l4
$$ 39 50 48 55 58 21 -23 103 42 61 55 85 84 -31 -15 60 21 27 58 85 70 -28 -22 -41 22 -23 1 -25 -26 -57 -25 1 9 -14 -48
4339d8Oqjm1L0R2Mn0l0M2m0k2R8n4l8O5O6r8Q8p2N3j8m1lJ5R7q6rPP4l6K2o5N4
$$ -48 -42 -50 -51 -92 -62 30 34 -16 -46 -4 -44 -66 32 -22 -60 5 71 -27 61 -11 42 24 -17 -20 -5 92 6 -3 4 78 42 64 -1 53
4373E3j5n1L7N1j26J07n0K8m9PJ8rL1p1J8lj1k6j3M6N7j20N3n4J00n0J7Kpj3L4
$$ 53 38 -13 24 75 -51 56 6 34 -15 -8 10 1 32 -39 -21 -24 -35 -61 -74 -28 29 -91 -38 -92 8 -42 -25 -23 -30 -43 -9
4404io7O6Qo1O9l6nP2o2O2l5n7P6K9M1r0O1m2N2k8JJ5J2o9R6m0j8m3Olj4O0l3
$$ -9 -76 -10 -2 -63 6 -30 -35 37 -25 37 2 -55 21 50 91 1 62 20 72 44 45 60 72 3 99 59 41 -2 4 1 -13 47 14
4437A4%lk9M4m7J2m5L6l6L6J4n1j4P0r1m7Q2R5o8o0K0L5k9L8Oj3J6j6O3K3j02
$$ 14 14 11 -18 26 -21 -9 -54 -18 -54 -18 -4 -55 -69 1 -90 -137 -55 40 -28 -88 -68 -33 -62 -24 -18 -31 -15 -31 32 55 -47
4468d7k8P9M4m9RM7j5m4k4J56r6j0P7l6l1l6RK2L0m3RK9m9l6Oj1L6o1nLKN4j9
$$ -47 -75 4 48 -1 8 55 40 -4 -28 128 32 22 99 63 32 -4 5 27 57 14 23 52 3 -33 -27 -38 -2 -63 -68 -65 -63 -9 -28
4501b8j7N3o1M7m8N0k3j7PRl1Q2p6K8k1K0k8J6%J5k1Q4J4m2K0m6j1O8j1k1N4j05
$$ -28 -45 8 -53 -6 -54 -4 -27 -44 -37 -28 -59 23 -53 -25 -46 -26 -54 -38 -38 -23 -44 40 54 12 32 -14 -25 43 32 11 65 -40
4533d0R8mk1l0N6o9N7Kl4j2kQj9Q1n9j7nj5M6q0J4J7mk9K1J7jj4l4K7k6J0J1J6
$$ -40 58 54 33 3 59 -10 47 49 15 3 1 9 -10 71 12 -5 -10 -25 21 -59 -45 -28 -32 -61 -40 -23 -24 -38 -72 -45 -71 -61 -50 -34
4567c4rKl7J11k6lM9m6Jl1jQ9o2M1n8R5j0n4kl8L0Q5k2m5N4n8j2L6NJp0O9l9N1
$$ -34 -43 -41 -78 33 7 4 53 7 8 -23 -24 65 3 44 -14 81 71 17 15 -23 7 92 70 25 79 21 9 45 50 51 -19 50 11 62
4601F2m6OPp1K9K6L8p8J3M4q0L4m5K8pj5L2n6N0j7kj8L5l2oJ1L9rm4K2L9P3p7
$$ 62 16 22 29 -42 -13 13 51 -27 -14 30 -50 -16 -61 -33 -40 -55 -23 -79 -29 -46 -48 -66 -31 -63 -69 -58 -19 -28 -72 -50 -11 62 -15
4634a5n6L6O9o1NN1J8l4mQ0l0m7M1j2lj4N7k7L6n9On2L8l1K5N8k5k3r1N7L6l5
$$ -15 -71 -35 34 -27 -22 29 47 13 9 89 59 12 53 41 38 24 81 54 90 31 37 -15 23 -8 17 75 50 27 -64 -7 29 -6
4666fm9Q6q1K3m5L9Qk3k5o8J05Rk8k3N4kn3P4n8Q7l8l3K8OJ4n5M3N0mnK7j3N3
$$ -6 -55 31 -50 -27 -72 -33 -25 -48 -73 -141 -36 -27 -55 -78 -24 -26 -79 -5 -63 24 -14 -47 -19 -13 1 -54 -11 39 35 30 57 44 97
4699I7k9rL1Qq3nL0K4p5Q3n5J2K9Ok5N0r5O5o1J3Lmk7J9L4o6Rk6L4k3J7O5r2p4
$$ 97 68 59 90 98 15 10 40 64 -11 72 17 29 58 64 39 89 -6 59 -2 11 14 10 -17 2 36 -30 -21 -47 -13 -36 -19 46 -46 -120
4733a20J08jl1M3l5K8o8O7j9nK2m2N5M4k8p9J70j22K4J3L7kj9K7j12R9j01P3L0
$$ -120 -12 -13 -44 -1 -36 -8 -76 -9 -28 -33 -11 -53 2 46 18 -61 109 -13 11 24 61 59 40 67 -45 54 -47 26 56
4762E6o3KJ3PQ2m2k8K4oJ7j08M2pO3p6J9RN4p1K8k4Mo1LM8j18J9J05jk9JN1L0
$$ 56 -7 -5 8 15 97 55 27 51 45 62 -46 -4 -11 52 -24 -5 4 58 -13 15 -9 -5 -66 -63 -15 -133 -114 -9 -10 -39 -38 13 43
4795D3q9J2l8O4j1jl9qR1nl1M5Qk9l8N6j5J2M8j3k5M7k7k7L8k7n7O4n0J6m5L6
$$ 43 -46 -34 -72 -8 -19 -20 -59 -67 24 19 -12 33 41 12 -26 30 15 27 75 62 37 84 57 30 68 41 -16 48 -2 14 -31 5
4827EK6k4j9j8N9k4O1Kj00R3p9m7O9l2jqM8n2N3j7Mkj8l%l6J2O0on2Q1l3q2R5
$$ 5 31 7 -12 -30 29 5 66 68 -32 61 -18 -65 4 -28 -29 -37 11 -41 12 -5 -1 -3 -21 -24 -24 -60 -48 12 6 -46 35 2 -80 15
4861A5m1r1J74l3j2j8Q0J3kr0M5qJj4j8Q9p8L9m3N4o0J7K7K5n6M6l6L5o2%M4k3
$$ 15 -26 -117 57 24 12 -6 74 87 85 -5 40 32 33 19 1 90 12 51 8 62 2 19 46 71 15 61 25 60 -2 -2 42 19
4893A9n3J1K2Rj13P4j5Kl1N1Jk7N1m3K7l0Jm9Q9m4oM0M5Jk5K6j9k2ML0k5P3J3
$$ 19 -34 -23 -1 8 -105 -31 -46 -44 -75 -24 -23 -50 1 -42 -15 -45 -44 -93 -4 -48 -54 -14 31 32 7 33 14 -8 -4 26 1 74 87
4926H7q4n1J66j03J6Q4m5o8J7K7m2k1L4lj4K1j00R4j2L7m2m3P3r0M3n0J9N1m3
$$ 87 3 -48 118 15 31 115 70 2 19 46 4 -17 17 14 0 21 -79 15 3 40 -2 -45 28 -62 -19 -69 -50 1 -42
4955d2j6n1J44j41K1J53r9k2kJ8K2j2j6QJ6J1jK4j2K9l0O3jq9N9j7M6o1NJ34j22
$$ -42 -58 -109 35 -106 -85 68 -31 -53 -55 -37 -15 -27 -43 -35 -19 -8 -9 15 3 32 2 65 64 -25 34 17 63 2 7 141 19
4986A9L8p5RJ1J2l3J22j05O7J2o9J2k2J9Rn0L0J4n2K8k6JRL9l3j4J4m2L8k4M5
$$ 19 57 -18 -9 2 14 -19 103 -2 65 77 8 20 -2 17 26 -24 6 20 -32 -4 -30 -29 -20 19 -14 -28 -14 -56 -18 -42 3
5017Cj7p6R2o9N7o2J6O9Kn9nK9J06m1n2OJ3lRj8M9J0L4n1Kk6lJ4P5p0k1J8L5N4
$$ 3 -14 -90 2 -67 -10 -72 -56 13 15 -44 -49 -20 86 45 -7 -1 12 9 18 0 49 59 93 42 44 18 15 29 104 34 13 31 66 120
5051A20j14M7k0M9q5Kj1N0p9n4J01m1j8PoN7m2l0L5l5P1m7k8KJ9J6QL6L3q2M4
$$ 120 6 53 33 82 -3 -1 -12 38 -41 -95 6 -35 -53 -46 -52 5 -37 -67 -32 -67 4 -43 -71 -69 -50 -34 -26 10 43 -39 5
5082E%m7N0Kl2N2l4l3M2J5Mj4j1N0p5P0m4K2Lj6K9p8O5j7J3J1rj3j9P1q2m6N3
$$ 5 5 -42 8 10 -22 30 -4 -37 5 20 24 10 -1 49 -26 44 0 22 25 9 38 -40 25 8 21 32 23 10 -9 62 -20 -66 -13
5115a3J6l7l4R0M7p4k4L1n8M5j01J10J4m0n6M4lO9l2k7oL8K3j7K2L9j14K1O7p0
$$ -13 3 -34 -68 22 69 -5 -29 2 -56 -11 -112 -2 12 -28 -84 -40 -43 26 -6 -33 -39 -1 22 5 27 66 -48 -27 40 -30
5145c0lL8k2M4n0J26q2K4n9N4oq4Q5n8P8p6O4o9M0Qk3M3p9OJM3Pj23Q4L6k4lj0
$$ -30 -33 5 -17 27 -23 103 21 45 -14 40 34 -50 35 -23 55 -21 43 -26 14 22 -1 42 -37 -31 -30 13 20 -103 -19 17 -7 -10 -20
5178b0k6jM2n4l0K2K7k2M9k2l2J7k8J20o9l4P6m4N5r1J02rk9O7q4K1P9l4M5m8
$$ -20 -46 -47 -5 -59 -89 -67 -40 -62 -13 -35 -67 -50 -78 42 -27 -61 15 -29 26 -65 37 28 -1 66 -18 3 82 48 93 45
5208D5l3N6l2qm0M2j8J7mLJ2n0J03k4n9k1pJ3j6L4n0L0m3K2M8o3j6O9n2K1p0n3
$$ 45 12 68 36 28 -12 30 12 29 25 28 40 -10 93 69 10 -11 -18 -5 -21 13 -37 -7 -50 -28 20 -43 -59 10 -42 -21 -91 -144
5240a44J17L0Lkj6Nm0QJ3M9q0L2Q%Pl4KL0O1o4N4k4oJ2J9k4Q5n0p1K6N7NL6j23
$$ -144 -27 3 6 4 -12 -7 -47 -39 -26 23 -57 -25 -17 -17 -10 -44 -42 -12 49 -15 39 15 9 21 40 16 101 51 -20 6 63 68 104 -19
5274a9M0K5L9j04M2m6O8K4j05j6RJ05j26O7l0j0m8O0M6l3n4nJ5O6j15N8K7m2J7
$$ -19 21 46 85 -19 23 -23 45 69 -36 -52 -43 62 -64 3 -27 -37 -85 -25 21 -12 -66 -71 -56 10 -105 -47 -20 -62 -45
5303d5O9K6m4M0j16O6j2J8K2j1J7K3n0J4O2Nk4n3qj1M9j4K4j5rPRQj3m8M8n1M5
$$ -45 24 50 6 46 -70 -4 -16 2 24 13 30 53 3 17 79 84 60 7 -1 -12 37 23 47 32 23 30 39 47 34 -14 34 -17 28
5336B8j3k4Kj8Rk2O4p8N6l1Jl4p4J25l7m0M2l2J03j04J5K8M9jm8L5k7j9K2P4n1
$$ 28 15 -9 -7 -25 -16 -38 26 -52 4 -27 -26 -60 -134 -9 -46 -86 -44 -76 27 -77 -62 -34 15 14 -34 1 -26 -45 -23 51 0
5367@L7l9k9R4m6jJ8n1P4j1m6K0RK8p1J00r2J13p0m2L4l4k0L8J3ro2N6M8j02j3
$$ 0 37 -2 -31 63 17 16 34 -17 57 46 0 20 29 57 -14 86 -6 107 37 -5 29 -5 -25 13 26 17 -45 11 59 -43 -56
5398e6P3q5k0P9RJ1j02P8J3m5K5m0K7J7l2J5j9J1N4o4R1o8O2Pj28N8N3L3j04P3
$$ -56 17 -68 -88 -9 0 11 -91 -13 0 -45 -20 -60 -33 -16 -48 -33 -52 -41 13 -51 40 -28 34 41 -87 -29 24 57 -47 26
5428B6J8qj4J3l1M6k1M6ol6p3J02m1N0l7Kkp0J04q3O1Mn0P3p4k6J9l0M5q8R1m9
$$ 26 44 36 22 35 4 50 29 75 69 33 -40 62 21 71 34 36 34 -36 68 -15 46 50 0 73 -1 -27 -8 -38 7 -81 10 -39
5460c9J3L1o3M0k2q1K9P6k7n9L0P8j9L9r5J47o8pj7L7m0P8l2k5K9M9j41N1M4l4
$$ -39 -26 5 -58 -18 -40 -121 -92 -16 -43 -102 -72 6 -13 26 -69 78 10 3 -14 23 -17 61 29 4 33 82 -59 -8 36 2
5490Bm3L0J15m8n9L1l7j4L1q0J18m4j0k3O9m0QM3j17O3n8N8mk8L5m8NM1m9J2M9
$$ 2 -41 -11 104 56 -3 28 -9 -23 8 -72 46 2 -8 -31 38 -2 6 49 -68 -5 -63 -5 -9 -37 -2 -50 -45 -4 -53 -41 8
5521Hn5K3j4jj2Rj1N3o5K0L0L3np1O7MJ2n8Q3l9j3k8O5m2N6j26N6J18l3m8L3n1
$$ 8 -47 -24 -38 -39 -51 -42 -53 0 -65 -45 -15 18 13 -58 9 13 25 -33 50 11 -2 -30 35 -7 49 -77 -21 97 64 16 49 -2
5553bN9o3nL8QN6j46R0j6M5o3PJ9k9l8L0M2j00J1j0K3Rm8Q8p0K3J1rJ8k4k7L4
$$ -2 57 -6 -11 27 35 91 -55 35 19 64 1 8 27 -2 -40 -10 32 -68 -57 -67 -44 -35 -83 5 -65 -42 -31 -40 -22 -46 -73 -39
5585c9K4L4p9L5pQlrJ0jL3M5k7nj3j3N4k0M7j7j6m0L7k3JM3n0PN5o4o6J2J04K
$$ -39 -15 19 -60 -25 -32 -24 -27 -36 -26 -27 6 51 24 19 6 -7 47 27 74 57 41 1 38 15 16 59 9 16 71 7 -59 -47 57 59
5619E9n0L2l0%k7j8k5M9QJ0l4%K8j5l5l1JK6l6J8J6N5%NQj1k7m3Q7p9L6P5o7J1
$$ 59 9 41 11 11 -16 -34 -59 -10 -2 8 -26 -26 2 -13 -48 -79 -78 -52 -88 -70 -54 1 1 6 14 3 -24 -67 20 -59 -23 52 -15 -4
5653dk1N4m2j4M2J4k3J8L9J3l2nj5j4L5lj9K0p0J5m4L9nK7oL9l6J2n7P1n7QJ7
$$ -4 -25 29 -13 -27 15 29 6 24 63 76 44 39 24 10 45 42 23 43 -27 -12 -56 -17 -22 5 -1 38 2 14 -43 28 -29 -21 -4
5686dm2N3m0L8j6mj1K2jL2p1M0k0Km1M6N3k5k0L6jj2J0p4O8k4l2P1o4K2O5j1M1
$$ -4 -46 7 -33 5 -11 -15 -26 -4 -5 27 -44 -4 -24 -22 -63 -17 36 11 -9 27 26 14 24 -50 18 -6 -38 33 -31 -9 56 45 86
5719H6q1J8J3M6n5n5MJ21j31M8Jo7J12n5KRm4j0O2Oo5nO0n9K9l8O1n1K6Mp8Q5
$$ 86 5 23 36 82 27 -28 -24 97 -34 14 15 -52 60 5 7 16 -28 -38 24 30 -35 -40 20 -39 -10 -48 13 -38 -12 -8 -86 -1
5751ak0K8n9J2M7n8N9m6L3l5N7l7N6l5k6K8j3%L8o0P3m6j1O4m0M2l6l1O9l5j5
$$ -1 -21 7 -52 -40 7 -51 8 -38 -5 -40 17 -20 36 1 -25 3 -10 -10 28 -32 41 -5 -16 48 8 50 14 -17 52 17 2
5782Bol3k8N6pJ1J9l6MJ6L4j9J0k5lN0m0m1j5J8K1q2Q3L7Qo9M0o1K7J2N6l4J4
$$ 2 -4 -37 -65 -9 -16 -5 14 -22 -18 -2 32 13 23 -2 -5 45 5 -36 -51 -33 -12 -94 -11 26 34 -35 5 -56 -29 -17 39 5 19
5815A9j0k3k2N0q6j4J45j15P3P4r8N9l4j8N7r3O3j5oj0K9K9q9P1l0m2LrR2l6R
$$ 19 9 -14 -36 14 -72 -86 59 -56 17 91 -7 52 18 0 57 -36 27 12 6 -4 25 54 -35 36 6 -36 -33 -42 50 14 23
5846B3PJ5j3j1m6lj3O5m6lK3l1J8MJ7l1k4K4N0m5J6p2Q1jj7PJ5O%J8nn6P3j16
$$ 23 30 45 32 21 -25 -28 -41 24 -22 -25 -2 -33 -15 -11 6 -25 -49 -25 25 -20 -4 -76 5 4 -13 -6 9 15 15 33 28 -28 45 -71
5880g1O5jrN0J1l3LoJ2J3m8L0rK0K1Lp2pJ17r9L7m2Lk2k4O9l9Q4n4o9K5m3O9k
$$ -71 -6 -7 -16 34 45 12 15 9 21 34 -14 16 7 27 48 51 -21 -28 89 -10 27 -15 -12 -34 -58 11 -28 56 2 -67 -42 -85 -16 -18
5914a8pl8j1M9n0O9m8M2Pn8Q5l2L6m1j2J0QK6K9o5LO5p3J23p8K4Rl0l4L2Ml5m5
$$ -18 -25 -63 -74 -25 -75 -6 -54 -12 -5 -63 22 -10 26 -15 -27 -17 -9 17 46 -19 -16 49 -24 99 21 45 54 24 -10 22 26 -9 -54
5947e4O1JN2o2pR9l3l0oJ9J1p4j0K5K4q6R8q1P0m2M5r1JK0K0L0n1M6J3j5%k2M9
$$ -54 7 8 60 -2 -9 90 57 27 21 40 51 -23 -33 -8 16 -70 28 -53 17 -25 20 -71 -70 -50 -30 0 -51 -5 8 -7 -7 -29 20
5980B0n7m1J13o0j3P6r1L9JJ3nN9m5QQ1o2J4j14O7J14n5lLk1l5M9j3p8Q0j1o0
$$ 20 -37 -78 35 -25 -38 38 -53 -14 -13 0 -5 54 9 17 98 36 50 -64 3 117 62 59 62 41 6 55 42 -36 44 33 -27
6011b7L8j3k4L1L7q8K1N5qok0J0m8l0k4M9R0n5J2o7M1J9L1p9N9l1j1N5n8l3R5
$$ -27 11 -2 -26 5 42 -46 -25 30 22 16 -4 6 -42 -72 -96 -47 43 -12 0 -67 -26 -7 24 -55 4 -27 -38 17 -41 -74 21
6042B1l1J2ON9p2K0K2jOj2K7j7MNK3m2k9oP4k2j11N4J5j1M6r0R3k3M0N6r0rm0
$$ 21 -10 2 8 67 -5 15 37 36 42 30 57 40 44 49 72 30 1 -5 69 47 -64 -10 5 -6 40 -50 43 20 60 116 26 17 -23
6075b3l2l2rN4L7qn8M5ql9J2L7l9J06o8Ln0N8k8k4N1M9n2o8P3j7P8j18Q1nRK2
$$ -23 -55 -87 -96 -42 -5 -13 -71 -26 -34 -73 -61 -24 -63 43 -25 -22 -72 -14 -42 -66 -15 34 -18 -86 -13 -30 48 -70 11 6 15 37
6107C7J4n5Q6k5n7J7j5K0m9J8P0m4LpR1r4n6L4L8l3ql4k1R4o7l7M2N3l2K2O8q9
$$ 37 51 -4 82 57 0 17 2 22 -27 -9 61 17 20 13 104 10 -46 -12 26 -7 -15 -49 -70 24 -43 -80 -38 15 -17 5 73 -16
6139a6kkL6k7j8L0n3L3L0Mj6L0m6J7J6%j7l7JK6J7l6L9ol4O1L2m7o6%Q0rL8l8
$$ -16 -18 -20 16 -11 -29 1 -52 -19 11 15 -1 29 -17 0 16 16 -1 -38 -37 -11 6 -30 9 3 -31 30 62 15 -51 -51 29 20 58 20
6173B0j6N6r1P6Lk2o0L5oN4l7k7MK4K0m8J7n3J7M0jK6l8ol7L4J8k1j3j8O6p2L4
$$ 20 4 60 -31 45 48 26 -34 1 -5 49 12 -15 -11 13 33 -15 2 -51 -34 6 5 31 -7 -13 -50 -16 2 -19 -32 -50 16 -56 -22
6206b2J2l7L8rP9o6l9M8j2k0R4k3j2k6j7N1Pp6L2J5K9pOn1J4K7k1J7k9K5l0O3
$$ -22 -10 -47 -9 -18 61 -5 -44 4 -8 -28 66 43 31 5 -12 39 46 -30 2 17 46 39 45 -6 8 35 14 31 2 27 -3 60
6238F0o0J1M8n2l2NJ9k3mQ3p3J0k8L1l2oO1ok2Jp3O1j0N1n5J2n8N1j7L2j0L0k3
$$ 60 0 11 59 7 -25 -20 -1 -24 -28 55 -18 -8 -36 -5 -37 -43 18 12 -10 -9 -82 -21 -31 20 -35 -23 -81 -30 -47 -15 -25 5 -18
6271a8N7l3J5Rj3jmm5N8r0P7J2l2Rj5O0l1JM1ol5k7l1N6k5l4J8J9j8RO5n7lRK4
$$ -18 39 6 21 30 17 16 12 -33 25 -65 12 24 -8 1 -14 46 15 16 57 51 16 -11 -42 14 -11 -45 -27 -8 -26 -17 48 -9 -12 -3 21
6306B1p7J07qp3j6J5L5l1N9r1J7N6Lj05J19m3M9j8l3j0jM2j4M2km8N4n6N2Pq4
$$ 21 -56 51 43 -30 -46 -31 4 -27 32 -59 -42 14 17 -88 31 -12 37 19 -14 -24 -25 17 3 45 43 -5 49 -7 45 52 -32
6337c2P2l6M9j8k1M0m2K7L6m5n3K4m0P5p1K1Rj1M5m7m0K4N5o6k4N8j1Jnj1O2j4
$$ -32 40 4 53 35 14 54 12 39 75 30 -23 1 -39 36 -35 -14 -5 -16 29 -18 -58 -34 21 -45 -69 -11 -22 -21 -26 -37 25 11
6369A1l3m0M4jnM6m8j6N8J7n3oRP5o0J7lM1p5N3nqk4Q6n1j8Kk9M8j9k0L3m4j5
$$ 11 -22 -62 -18 -19 -24 22 -26 -42 16 33 -20 -26 -17 58 -2 15 12 53 -22 31 26 18 -6 80 29 11 13 -16 32 13 -7 26 -18 -33
6403c3N3nJ2o1R9p8j1jmL9j5j2Ojj7MK8K7k5j3K9k9PNK6k0j3K2k4Nj5j8N2L0o5
$$ -33 20 15 27 -34 65 -13 -24 -25 -29 10 -5 -17 -11 -12 -29 -25 3 30 5 -8 21 -8 -1 4 30 10 -3 19 -5 0 -15 -33 19 49 -16
6438a6J4n4N9k1N0J1m6qNM7Mnkl3N8mo7NN5j4m8M1l1J3k2L9m1Lrlj4K6%nk0K8
$$ -16 -2 -56 3 -18 32 43 -3 -11 -6 41 45 40 38 5 63 59 -8 -3 52 38 -10 31 0 13 -9 30 -11 -8 -17 -20 -34 -8 -8 -13 -33 -5
6474eM6K0n6lL3k1qrm9K0%k6J08l8K5n3O3n7M0n5P4j5K4r0K4l8P4L6j7rnj5kl4
$$ -5 41 61 5 2 35 14 6 -3 -52 -32 -32 -58 50 12 37 -16 47 -10 30 -25 49 34 58 -32 -8 -46 28 64 47 38 33 18 16 -18
6508a8N2l9j7O5l8K3pL6n3N5j05K3JJ14j06K6r3N1M6K5n6O3n1oL1m1o0N3J7j4
$$ -18 34 -5 -22 43 5 28 21 57 4 59 -46 -23 -22 92 -14 12 -81 -30 16 41 -15 48 -3 -9 22 -19 -79 -26 -9 -23
6538b3L1k4Rm1K3J0M1l7O9p2nK7kkm2k1J12j9k4o0R3n7J6K8j8j1M0J5o7%L6Ol5
$$ -23 8 -16 -7 -48 -25 -15 26 -11 58 -14 -19 8 6 4 -38 -59 53 34 10 -50 43 -14 2 30 12 1 41 56 -11 -11 25 31 -4
6571dN1q8P1Lj9o2l6N4P3o4j6P8p4M5j9j6L6Kk4jk3J4kq5J53o3K6O1j6p6j5J5
$$ -4 47 -41 30 33 14 -48 -84 -30 43 -21 -37 41 -33 12 -7 -23 13 15 -9 -10 -33 -19 -21 -106 47 -16 10 71 55 -21 -36 -21
6603b1J2MN3k3n8P5J9l5j4J4K2p7N8OROn5L7l2OmrK0j0L7q7R1m5o9N8M7m6N2l6
$$ -21 -9 -5 48 25 -33 42 61 26 12 26 48 -29 29 35 44 50 -5 32 0 6 2 -7 13 3 40 -47 44 -1 -70 -12 35 -11 41 5
6637EQnK0p9K2Q0n1p0R3o2K1L5k9n1K9N7n8L2r6R2Qj2L0K3l5m2M2m5N6K1Ln8J7
$$ 5 13 8 28 -51 -29 51 0 -70 23 -39 -18 17 -12 -63 -34 23 -35 -3 -99 -7 1 -11 19 42 7 -35 7 -38 18 39 42 -16 1
6670AL5k0L2l1pK2o7L9Nj9M3l7P6j27Q0k1k1P5k8p0KM5Jmrlo3NP2l5N6j7n8Q1
$$ 1 36 16 48 17 10 32 -35 4 9 -10 33 -4 72 -55 25 4 -17 58 30 -40 -38 7 8 4 -5 -8 -71 -66 6 -29 27 10 -48 33
6704C3r6K4n1M3M0j0k5J1j5M5M2nk9L0m0o1M9O9r8K9O1l5j4LNN0j3k9k6J9ML9
$$ 33 -63 -39 -90 -47 -7 -17 -42 -31 -46 -1 41 36 7 37 -3 -64 -15 54 -44 -15 46 11 -3 0 5 55 42 13 -13 6 10 49
6736D9k0m5rM4L0Pm8N5p0J3L2m7L5mn8L4M0o8L3M8m3j5J6l6n5P5J9p9K4N4K9m1
$$ 49 29 -16 -25 19 49 56 8 63 -7 6 38 -9 26 22 -36 -2 38 -30 3 51 8 -7 9 -27 -82 -7 12 -67 -43 11 40 -1
6768aL7l3j7k1l0Q9n1oO1k8Nr5J54p8M4m2P4ll9J6k1O5p9L0l5O0m5mj7M5rm7K3
$$ -1 36 3 -14 -35 -65 24 -27 -33 28 0 5 -90 64 -14 30 -12 62 59 20 36 15 80 1 31 -4 56 11 7 -10 35 26 -21 2
6801Bk5P8o0M6l5J0o7j1N4M5k3L2o2k6M4Lm1M4j5J4J0k9l1MJ9J6J2j3K1o8K9O2
$$ 2 -23 55 -5 41 6 16 -51 -62 -8 37 14 46 -16 -42 2 5 -36 8 -7 7 17 -12 -43 -39 -20 -4 8 -5 16 -52 -23 39
6833C9mr7J04ol8M9j9Qp0J04q0J04r0KM1n3j1oK7l3P8o0K9L0K5q6NOnM9o9JLk
$$ 39 35 -62 42 36 -2 47 28 36 -34 70 -10 94 4 6 47 -6 -17 -23 4 -29 49 -11 18 48 73 -13 -8 -2 -7 42 -27 -26 -23 -25
6867b5j1m4qJ02j8j7j9J4J3l1N9kj5n7K0K3L7m4J1N4m9j7l5L6N7o1N7k9L2k7O
$$ -25 -36 -80 -88 14 -4 -21 -40 -26 -13 -44 15 13 -2 -59 -39 -16 21 -23 -12 42 -7 -24 -59 -23 34 -27 30 1 33 6 12
6898A2nRK6pm6L4l1j2L4L9o0Rk5M1O1m6J2n5j3k4L2l3O5M4r0k7M6J1J9M6j01J5
$$ 12 7 16 42 35 -11 23 -8 -20 14 53 -7 2 -23 18 79 33 45 -10 -23 -47 -15 -48 17 61 -29 -56 -10 1 20 66 -35 -20
6930b0L2j9k0pL1j4Kj2Q5j19M0J4K6Jk3kj0l3R3l4Pn7K6l5Q3k3Oj3k7R9j21J8
$$ -20 12 -7 -27 -34 -3 -17 -15 -27 58 -61 -21 -7 19 20 -3 -5 -15 -48 45 11 18 -39 -13 -48 35 12 18 5 -22 77 -44 -26
6962b6m5J07mk7M8q8M3N4j9r9rR5k3Mj8L5o4J3J4k4j1M3J5ok9Q2j13MK0J6L0q2
$$ -26 -71 36 32 5 53 -35 8 62 43 -56 -65 30 7 11 -7 28 -36 -23 -9 -33 -44 -1 14 8 -21 61 -52 -48 -28 -12 18 -64
6994f4N4K6k2Q8r8L7Rn4rO3K5l3O0o4j6lL5n2K5Om6L5k0%j6K2L1p2M6Pk0KRM4
$$ -64 -10 16 -6 82 -16 21 30 -24 -33 30 55 22 82 18 2 -1 34 -18 7 13 -33 2 -18 -18 -34 -12 19 -53 -7 0 -20 -18 -9 35
7028C5l9Qj6kk1J4J6ROK2n7k3M0MJ0j3K3l6K1M9K1j48Q1K0j5%k4J7J5J0n7J8L0
$$ 35 -4 4 -12 -14 -35 -21 -5 4 10 32 -25 -48 -8 -4 6 -7 16 -20 1 50 71 -77 4 24 9 9 -15 2 17 27 -30 -12 18
7061A8K6r6N8ON1n1n2O9L5j3k1m4j2j8L2L5M0r3O2n7M1lpL0q9J21r0O9q4P1Rp1
$$ 18 44 -52 6 12 63 12 -40 29 64 51 30 -14 -26 -44 -12 23 63 -30 32 -25 16 13 6 36 -53 68 -22 47 -37 34 43 -28
7093b8K9J0j6MJ9o1K1L0m9L8k1M9r2O9k8P9j4m3K5lKl3O6p3R3o3J3M7qm2mj5N7
$$ -28 1 11 -5 -1 18 -43 -22 8 -41 -3 -24 25 -67 2 -26 53 39 -4 21 18 20 -13 53 -20 73 10 23 70 62 20 16 1 58
7126E8k8n4j1J8N7j9qj9Q9j16K9K0q9R3m7l0M7K0lk3lJ2k0n8J49o4k4ljN9j0p1
$$ 58 30 -24 -35 -17 40 21 13 -6 83 -33 -4 16 -73 20 -27 -57 -10 10 7 -16 -19 -7 -27 -85 64 0 -24 -27 -28 31 21 -50
7158e0m2J28Qj06j0J43q3M7m1J9PJ3l4m3J03q6M9J0o3Q0k8m9J7K1L6n0nqM0j6
$$ -50 -92 36 44 -62 -72 71 -12 35 -6 13 20 33 -1 -44 59 -27 22 32 -31 49 21 -28 -11 10 46 -4 -9 -17 23 7
7188GmJ8l3K8l3J8m0Q0l4ROj8j7K9j5OPKn3pPJ6kJ7K1o7O6l9J5Qj3k5O1lo5N3
$$ 7 3 21 -12 16 -17 1 -39 41 7 16 22 4 -13 16 1 7 14 16 -37 -44 -37 -21 -23 -6 15 -52 14 -25 -10 -2 -15 -40 21 18 -47 6
7224FM6o4j1Rj0R5n1%l4P3m7p0O9J0M9m1MrrJ6oj3j9LL3k8N3m7O3p9O7l8p1M6
$$ 6 52 -12 -23 -14 -24 71 20 20 -14 59 12 -58 11 21 70 29 33 24 15 31 25 12 -7 -4 29 1 54 7 70 -9 58 20 -51 -5
7258eK3j9j9J7N0q2J6N2Jj21J08o1M2qj8M2J7o2k7O8M2k8m7P7o5l0J5J7O3r4Q1
$$ -5 18 -1 -20 -3 47 -35 -19 33 34 -87 21 -40 2 -6 -24 18 35 -27 -54 14 56 28 -19 58 -7 -37 -22 -5 58 -36 45
7289D5J2m8j8L2k4NM2p1M8m4N5l8L8j2K6Ko0M7l5jj9N9j9M4j27O4Mj00N9P7q3
$$ 45 57 9 -9 23 -1 4 46 -25 23 -21 34 -4 34 22 48 50 -10 37 2 1 -18 41 22 66 -61 3 7 -93 -34 43 -40
7320d0L2l9J7l1K1K1n1Q7mJ6k5Rpn2K1J0J6j3M2m5nm2M5M3n9P4Nn9N4k8L4n7j4
$$ -40 -8 -47 -30 -61 -40 -19 -70 17 13 29 4 13 6 -46 -25 -15 1 -12 30 -15 -20 -62 -17 26 -33 41 46 -13 41 13 47 -10 -24
7353b4N8j5J7J0j2k5L1k4k8L1qK1Nl2o7L7K4j7M4n6LoRl1oO5j8J5o0L0n3P5n3
$$ -24 34 19 36 46 34 9 40 16 -12 19 11 32 37 5 -62 -25 -1 -18 26 -30 -27 -33 -24 -55 -61 4 -14 1 -59 -29 -82 -7 -60
7386f0K5k4n2J45l7m1K1L0jm0K8J2K5J4r1J0Q6q1M6j0N1l2kP0j12jM1L5j4k1j2
$$ -60 -35 -59 -111 34 -3 -44 -23 7 6 -34 -6 6 31 45 -46 -36 50 -31 15 5 56 24 22 92 -20 -21 20 55 41 20 8
7417Hk9J3K8k0m2N4RK0j9l3l2M0J6jr2L8R3p9j6J8MJ5PlJ9K0j5k7llj0j8J7N1
$$ 8 -21 -8 20 0 -42 12 21 41 22 -11 -43 -3 13 12 -80 -42 51 -28 -44 -26 -22 -7 0 -3 16 36 21 -6 -9 -12 -22 -40 -23 28
7451B8p1M4j0M7op0R6p2O1n1l8O3j12J36n4l7O0J0Nk3l7P4L8m1l1M8l9%m3P6m1
$$ 28 -43 1 -9 38 32 -38 58 -14 47 -4 -42 21 -91 45 -9 -46 14 24 29 6 -31 43 81 40 9 57 18 18 -25 51 10
7482A0LK9q3J02j8o9K5K0n5M3n5N7m3J5K5m1%K2Rl8L1j5O9n8%K7p5J11n9N9k6
$$ 10 13 42 -41 61 43 -26 -1 19 -36 7 -48 9 -34 -19 6 -35 -35 -13 -4 -42 -11 -26 43 -15 -15 12 -63 48 -11 48 22
7513B2o5L4P6q3K6m8%J3MK8QJ1K7Lm9m7Q1p7k7J8P2J9%m8J5lM0l4Mm4j2kK7L1
$$ 22 -43 -9 67 -16 10 -38 -38 -25 -21 7 15 26 53 56 7 -40 41 -36 -63 -45 27 46 46 -2 13 10 50 16 20 -24 -36 -38 -11 20
7547B0q9R3k8K7m3N4m6N5p0O2o7K7J2m2L8k9O7m6K8l3L4nj9LJ1jk4M5k7k5j0N7
$$ 20 -69 24 -4 23 -20 34 -12 43 -27 35 -32 -5 7 -35 3 -26 41 -5 23 -10 24 19 0 3 14 13 -11 34 7 -18 -28 29
7579B9L4l6l9n8O9K4K7n8Qn2P2mm9J6O7p6o9M4M0K2n5J06j9n8kMk8N2Rk8M6O5
$$ 29 63 27 -12 -70 -1 23 50 -8 0 -52 20 16 -33 -17 50 -26 -95 -51 -11 11 -44 62 43 -15 -17 -13 -41 11 20 -8 38 103
7611A03o9n8L9j5l4N3l7o0P1L9l4Jl6P2l1N7l1Nj5Qr0J4N9q7R1N1k3L4j06R7o8
$$ 103 34 -24 15 0 -34 19 -18 -78 -7 32 -2 -1 -37 35 4 61 30 35 20 28 -62 -48 11 -76 15 66 43 77 -29 68 0
7642@m0M4K2n9M6LjL2n2k6k0P8ml7m9Q0q3J25m6jm0J4mK7M4k1j4om3RO2j12R4
$$ 0 -40 4 26 -33 13 16 15 47 -5 -31 -51 27 23 -14 -63 17 -66 59 13 12 -28 -14 -18 9 53 32 18 12 -31 -22 40 -72 22
7675B2j0J4K1r4J05j22M1M7j7QJj5M3m3lJ8l5Q3n9j6JM7m9K9j6n9P1j8Q2m7l0
$$ 22 12 26 47 -47 58 -64 -23 24 7 15 16 1 44 1 -2 16 -19 64 5 -11 -10 37 -12 17 1 -58 13 -5 77 30 0
7706@k9N3k3k6l4k9J15q1Q1l7l0M6k8M0L3j49Q7J6j5m1ML9k8R2m4rK7k8K3j9m
$$ 0 -29 24 1 -25 -59 -88 27 -54 27 -10 -40 6 -22 18 51 -98 -11 5 -10 -51 -47 -8 -36 56 12 3 30 2 25 6 2
7737BN1No6l3K9J11q3m1N7O4r0nj7j5O0Om2K5J6l7k7rj2J04p1p3J14m7K8L9q1
$$ 2 53 58 -8 -41 -12 99 16 -25 32 96 6 1 -16 -31 29 35 -7 18 34 -3 -30 -39 -51 53 -18 -91 23 -24 4 43 -38
7768c8J6k6Q1q3M1K2m7N7j2m8jJ03m4M1m3j4pO5K0p8m4K9L1J1%nJ4Ol2k4N6m8
$$ -38 -22 -48 33 -50 -9 13 -34 23 11 -37 -38 65 21 62 19 5 -2 63 83 5 -39 -10 21 32 32 27 41 47 15 -9 47 -1
7800an3J30q6mO3k7K9j8K1p3jQ7k0n8M9o9K2K7p2N5M9l0j4oo1R5m9M1j7m4L7l7
$$ -1 -54 76 -10 -14 49 22 51 33 54 -19 -20 67 47 -11 38 -31 -9 18 -54 1 50 20 6 0 -61 34 -15 26 9 -35 2 -35
7832c5J1mrQK1%K5j9JK2l8Q2o7J2RN0j45J28KOq8M7L0j07J02ok5KL0n6oP8o9J5
$$ -35 -24 -28 -37 -29 -8 -8 17 -2 -1 21 -17 65 -2 10 19 69 -76 52 54 60 -28 19 49 -58 44 38 13 15 45 -11 -17 61 -8 7
7866Gk1j2l3O3J8r1N9k2L9o9N0K1n4K2K8J1j22P7J8m8nO7jk0L7k2Q2j18N1J1l1
$$ 7 -14 -26 -59 4 22 -69 -10 -32 7 -62 -12 9 -45 -23 5 16 -106 -29 -11 -59 -64 3 2 -18 19 -3 79 -39 12 23 -8
7897hJ7j3M4o2O6l8K0j8Lr0J26Lko2N4n9P2n9M4j3L1l0m3L5j1Kj1L1j9P2j18K1
$$ -8 9 -4 40 -22 44 6 26 8 11 -79 47 50 48 -14 40 -19 53 -6 38 25 56 26 -17 18 7 9 -2 29 10 82 -36 -15
7929a5L2l4Lq6K0N2L0k7J0J5j2M1n1M0o5K1J5o4Q8k9rJ4n0L6L4J2J4J5p2L3m0
$$ -15 17 -17 -14 -100 -80 -28 2 -25 -15 0 -12 29 -22 18 -47 -26 -11 -75 13 -16 -25 -11 -61 -25 9 21 35 50 -22 11 -29
7960b9k2R7n6K2l4K5J5k2J6j3P1p1R8n6L8o0K7l1rN5jj4n8P2o2L7L1n7l5j8J9
$$ -29 -51 46 -10 12 -22 3 18 -4 12 -1 70 -1 97 41 79 19 46 15 6 61 60 46 -12 60 -2 35 66 9 -26 -44 -25
7991b5J4mPom7L8pmm1K1O2%k1j8J2J0M8l7K1p8J8j6O8m9O7pm4RJ4j1m2K5K0K0
$$ -25 -11 -15 -8 -14 -61 -23 -30 -34 -75 -54 8 8 -13 -31 -19 -9 39 2 23 -55 -37 -53 15 -34 33 26 -18 -9 5 -6 -48 -23 -3 17
8025A7l0L0L4j9L9m0n1PL8K3o2j0N0J5j6j5lMk4j9L1lL3l2KpO9n1pK0k5q7P1P0
$$ 17 -13 17 51 32 71 31 -20 -13 25 48 -14 -24 26 41 25 10 7 11 -13 -32 -1 -4 29 -3 -1 -8 61 10 3 23 -2 -89 -18 52
8059E2r4L9K8j22J09J5M2q8O7r5l3N9L2K5Jp3J03np2O6r2N4K2Nl2QJ5o4o9Q5m
$$ 52 -42 -3 25 -97 12 27 69 -19 48 -47 -80 -21 11 36 37 -36 67 62 -10 56 -36 18 40 45 13 21 36 -28 -97 -12 -16
8090a6K8j3K5l2K6k0k6LJ8M4l9jJ9l5k4k0P1p7P7k8j3pM9NJ6k1J3lQj02R1J8q0
$$ -16 12 -1 24 -8 18 -2 -28 -25 -7 37 -2 -3 16 -19 -43 -63 8 -69 8 -20 -33 -40 9 14 30 9 22 19 27 -75 16 34 -46
8123d6N9J8p3N0m9O8k6n8K7L0l8L2j6J8M5J3l6j5K6l1l3M3qLK3J9m0k6L4m1L3
$$ -46 13 31 -42 8 -41 27 1 -57 -30 0 -38 -6 -22 -4 41 54 18 3 29 -2 -35 8 0 3 26 45 5 -21 13 -28 5
8154Ek5K1j3O3m8J8K1j8j7Mk9N3k3jl3pQ4n5QN6m5rj2Pj9O3o6L0Kl3K4l0J3K4
$$ 5 -20 1 -12 51 3 21 42 24 7 11 -18 35 12 11 -22 -29 55 0 8 64 19 10 -2 5 -14 49 -17 13 15 -18 6 -24 -11 13
8188A3J5m5M
$$ 13 28 -17 -13
8191a3
$$ Imaginary data points
##PAGE= N=2
##DATA TABLE= (X++(I..I)), XYDATA
0@%%%%%%%%%%%%%%%%%%%%%%%%%%%%%%%%%%%%%%%%%jLmMmMmMmMpJ0j0J0j2J8k5
$$ 0 0 0 0 0 0 0 0 0 0 0 0 0 0 0 0 0 0 0 0 0 0 0 0 0 0 0 0 0 0 0 0 0 0 0 0 0 0 0 0 0 0 -1 2 -2 2 -2 2 -2 2 -2 2 -5 5 -5 5 -7 11 -14
58a4L7o9k71K006j167j206P48J085n57p84P20Q25n64j013O28J148o00j090N02
$$ -14 23 -46 -317 1689 522 -684 64 1149 592 -192 528 1353 789 -224 404 1552 952 -138 364
77C64R86m21j050L33R87n73j090L44J003l13j235J97R97l04j040K0J014j61j212
$$ 364 1350 929 -121 212 1199 626 -464 -120 883 570 -665 -468 529 225 -815 -795 219 58 -1154
96a154J21J038q4j103qJ009N5r47j44R99K38j007r9R68L60q87k50R89L87q03l59
$$ -1154 -1033 5 -79 -1182 -1190 -181 -126 -1073 -1217 -218 20 -987 -1086 -118 242 -645 -895 94 481 -322 -681
117f81R90M98q61l05Q33O70p73n68Q24O30q03n73P88P18q26o77O88O58o75p83
$$ -681 309 807 -54 -359 474 1144 371 -197 627 1257 454 -119 669 1387 561 -116 572 1230 555 -228
137b28O29O17o22q91N38P38o28q36M57P87n71r44M20P50l84r70L31Q52k74r83
$$ -228 401 1018 396 -495 43 781 153 -683 -226 561 -10 -954 -534 216 -168 -1138 -807 45 -229 -1212
157a212K69Q60k28q50K48R13j28q77K24R35k5r42J65J024j9q05N4J005Q4q58n
$$ -1212 -943 -83 -311 -1161 -913 0 -128 -1005 -781 154 129 -813 -648 376 357 -448 -394 611 695 -163 -168
178a68Q97K03p76j46Q43K30q57j51P67K53p65l71Q01K72p21n00P06L85q46m44
$$ -168 729 932 156 10 853 1083 226 75 842 1095 330 -41 760 1032 311 -189 517 902 56 -388
198c88P00L45p47n70O55L72o35o40N78N07o14o41O46M74n33n97M36P06n38n85
$$ -388 312 657 -90 -660 -5 367 -268 -908 -330 177 -437 -1078 -432 42 -491 -1088 -652 54 -484 -1069
218a069M71O61l84o56M09Q53l34p11L93Q26k57o53L30Q14k02p02K30P75r0p49
$$ -1069 -598 63 -321 -977 -568 285 -49 -760 -367 459 202 -451 -121 693 491 -211 19 794 704 -45
238d5J56Q22q4p49J0Q80j35p74l8P61M5q14j27P43N2q40j74P28R1q07k53O87J56
$$ -45 111 933 849 100 110 990 855 81 43 804 849 35 -92 651 703 -137 -311 417 508 -299 -552 135 291
261B91p08l38O37K18p63k75O64L08o87l27N46M54o37l21N81M76n81l32N29N52
$$ 291 -417 -755 -118 100 -663 -938 -274 34 -653 -980 -434 20 -617 -938 -357 119 -462 -794 -265 287
281B87m40m68N47N75m23n84O24N44l55o13N93N66l26n68K87P11l22o27L17O04
$$ 287 -153 -621 -74 501 78 -506 118 662 307 -306 287 853 527 -41 246 957 635 8 325 929
301I29k92o68K56N59j53p17Q2O43j72p06L4O25j01p56K6N99q9o86j7O37q3o54
$$ 929 637 -31 225 784 631 -86 -4 639 467 -239 -205 420 319 -437 -411 188 99 -587 -604 33 -50 -704
323g04k0N82L6o73o7O19J18n62j35N90L05o17j66O12L18n49k18O03M62n61k78
$$ -704 -724 -142 -106 -779 -846 -227 -109 -671 -806 -216 89 -528 -694 -82 236 -313 -531 72 534 -27 -305
344c05N48M18n22k79N72M19n03l75M25M72m45m53M77M74m95n10L66N11l83n56
$$ -305 243 661 139 -140 432 851 348 -27 398 870 425 -28 449 923 428 -82 284 795 412 -144
364a44K75M46l65n10J89M67l16n88K52N38k72o11J50N13k25n75J89N80k10o00
$$ -144 131 577 212 -298 -109 358 42 -546 -294 244 -28 -639 -489 24 -201 -776 -587 -7 -217 -817
384h17J15P10j77n00L2O41Jn42M6O41Qn48k0P10R8n81L4N69J27n59j4N38K11n24
$$ -817 -702 8 -169 -669 -637 4 5 -537 -491 150 158 -390 -410 300 398 -183 -149 420 547 -12 -26 512 723 199
408A99j42N30J67n18k14N28J98n43j94M70K43n38l54M48K77m69m95M31L59m91
$$ 199 57 587 754 236 22 550 748 205 11 481 724 186 -168 280 557 88 -407 24 383 -108
428a08m59M57L08m48m43L49L62l29m63K86M58l63l45K50M84k11n07K65N28j66
$$ -108 -567 -110 198 -250 -693 -344 18 -311 -774 -488 -30 -393 -738 -488 -4 -215 -722 -457 71 -95
448i5m94K44N39j00m63J83N82j52m41J08O45j13m62R4N59o5n54J09M98P5n39n2
$$ -95 -589 -345 194 94 -369 -186 396 244 -197 -89 556 443 -19 75 634 569 15 124 622 697 158 106
470A06N04K1n02j06N09M2o00r9M81J20o25j52M81N1m37k41M11J83n57k55L98K42
$$ 106 610 631 129 23 532 574 -26 -125 356 476 -149 -301 180 231 -206 -447 -36 147 -410 -665 -267 -25
492b5m63k28M05K41m02k58L78M13l81l80M13L78k75l41L90L72k72l47L44M63l11
$$ -25 -488 -716 -311 -70 -472 -730 -352 61 -320 -700 -287 91 -184 -525 -135 237 -35 -382 -38 425 114
513A14l18L50L88j53m25K30M15j84l52K09M15j23n41J89M44j61m67R6M48j86m79
$$ 114 -204 146 534 381 -44 186 601 417 65 274 689 566 25 214 658 497 30 126 574 388 -91
534i1P5M48j24n57JM36m0n68m5M67Qm69j05M62Q3n19j41N21R8m80q7M60J52m44
$$ -91 -16 432 308 -249 -248 188 148 -420 -465 2 10 -459 -564 -102 -19 -538 -679 -158 -60 -540 -627 -167 -15 -459
558d59j27L97L12m54j19M83J66l33k52N33J91k43k66M52L01m14k83M20L58l64
$$ -459 -586 -189 123 -331 -450 33 199 -134 -386 147 338 95 -171 281 582 168 -115 305 663 299
578B99k72M16K28k69l28K04L43k00m51K51L00k18m91K55L46k77m68J73L90j44
$$ 299 27 443 671 402 74 278 621 421 -30 221 521 303 -188 67 413 136 -332 -159 231 87
598H7n29P6M42k58l58J14L89o9m24k7M42l2m65Q6M75om39qM98Q9m25p8M86Q9l26
$$ 87 -442 -366 76 -182 -540 -426 -37 -106 -530 -557 -115 -147 -612 -526 -51 -57 -496 -504 -6 83 -342 -420 66 155 -171
623a71m8M27J31l33l2L43J75l55j73M69J35l36r0K97J81l20k27K60K70l63k78
$$ -171 -219 208 339 6 -26 317 492 137 -36 433 568 232 142 439 620 300 73 333 603 240 -38
644c8K81K24l50k30K53J99l13l46K64L35l70l61K40K78k97k72J50L73k38m21K28
$$ -38 243 467 117 -113 140 339 26 -320 -56 279 -91 -452 -212 66 -231 -503 -353 20 -218 -639 -411
665d11L53j90l60J89L36j38k72J33M24n6m49J56M79o5l76J72L25K6l48R0M14j4
$$ -411 -58 -248 -608 -419 -83 -221 -493 -360 64 8 -441 -285 194 129 -247 -75 250 276 -72 18 432 418
687D18l93KM97j0l10j26L79J07l91r1L20J93n31o0L02R5l83j47L11J26m02j92
$$ 418 25 27 524 514 204 78 457 564 173 82 402 595 64 4 306 401 18 -129 182 308 -94 -286
709b86L01J30l63j79K41J85k32l18K38L02l56k80K76K70k22l11L22K54j58k86
$$ -286 15 145 -218 -397 -156 29 -203 -521 -283 19 -337 -617 -341 -71 -293 -604 -282 -28 -186 -472
729d72K84K25j26l18K13L68j62k84K13M21j04l74J22M26j05l17J32L36m1l57O5
$$ -472 -188 37 -89 -407 -194 174 12 -272 -59 362 258 -116 6 432 327 10 142 478 437 80 145
750A45L89j37l38O2L35n5l42k9L30q0l83k1L42pl84q8K82K2l54o7K77N8k97j82
$$ 145 534 397 59 121 456 401 59 30 360 280 -103 -124 218 211 -173 -261 21 43 -311 -378 -101 -43 -340 -522
774e22M09Q0l91j56M30J19l48j54L66J68l32j51L78J99k84k19M12J47j49k08K50
$$ -522 -113 -33 -424 -580 -150 -31 -379 -533 -167 1 -331 -482 -104 95 -189 -408 4 151 2 -206 44
795D4L05k06k64K73K99k38k53K80K69j43l44J78L25k31k00J04K46j55l04J04K78
$$ 44 349 143 -121 152 451 213 -40 240 509 366 22 200 525 294 94 198 444 289 -15 89 367
816C67k01l00J09K89j58l90N9L61j17l88O9K14P2m08M7L23n9l28L3L10N4k93j77
$$ 367 166 -134 -25 264 106 -284 -225 136 19 -369 -300 -86 -14 -422 -375 -52 -111 -439 -406 -96 -42 -335 -512
839e12M03J18l31o0L97K9k92p4L94J66l32n0K82K36l10j33L13K52l54j22L09J03
$$ -512 -109 9 -322 -382 15 44 -248 -322 72 238 -94 -144 138 374 64 -69 244 496 142 20 329 432
861D32k20j60K69J49k10k57K48J95k81k37K02K22k06l17K11J94k11l07J30K70
$$ 432 212 52 321 470 260 3 251 446 165 -72 130 352 146 -171 40 234 23 -284 -154 116
881A16j94k50P8K36j27k91Q2K90j59k53J31L36j27k98J30K70k2k65L3L06ql35
$$ 116 -78 -328 -250 -14 -141 -432 -350 -60 -219 -472 -341 -5 -132 -430 -300 -30 -52 -317 -284 22 14 -321
903c21O9M53p4k49O1L00J0k76K3K51M5k46j0L55J27l80l9K71R9k72j53K58J50
$$ -321 -252 201 127 -122 -61 239 249 -27 -4 247 292 46 36 391 518 138 99 370 469 197 44 302 452
926D52l11k16L17J21l32k13K08J86l53k22L18J87k51k53J98J74k79j59K05J76
$$ 452 141 -75 242 363 31 -182 26 212 -141 -363 -45 142 -109 -362 -164 10 -269 -428 -223 -47
946d7j64k65K24J76j10j98J32K67j65k39J91K26p8k36K91K52j11k77J37L43j80
$$ -47 -211 -476 -252 -76 -186 -384 -252 15 -150 -389 -198 28 -50 -286 5 257 146 -131 6 349 169
967A69k37J31L39q7k79J19K39j5l05Q6J91N8l52JK45M0k63j28K50P1l84j9K38
$$ 169 -68 63 402 315 36 155 394 379 74 160 351 409 57 58 303 343 80 -48 202 273 -111 -130 108
990A08L9k99q9K58M1l45m6K02J30k41j17J61J50j79k15K38J12j77r5J62K58k10
$$ 108 147 -152 -241 17 58 -287 -333 -131 -1 -242 -359 -198 -48 -227 -442 -204 -92 -269 -364 -202 56 -154
1012a54j34J89K28j74j95K22K14j70j26J21L41j80j34J27K43j26k56J54K34j35
$$ -154 -288 -99 129 -45 -240 -18 196 26 -100 21 362 182 48 175 418 292 36 190 424 289
1032B89j91K9K33n1l04J17K60j21l08Q3K04n6l32R7J65k1l30J5J88j6j89j20K47
$$ 289 98 127 360 309 5 122 382 261 -47 36 240 184 -148 -51 114 93 -237 -222 -34 -50 -239 -359 -112
1055a12Ll02l1K73Q5k72rK38Q7k36p6K67J19k25j9J86J60k67q1L21J06k26r6K43
$$ -112 -109 -411 -442 -169 -84 -356 -365 -127 -40 -276 -352 -85 34 -191 -210 -24 136 -131 -212 109 215 -11 -107 136
1079A36J70j90j57K42K09k10k25K67K01j32k78J74J16j46j49J05K08k18j32J1
$$ 136 306 116 -41 201 410 200 -25 242 443 311 33 207 323 177 28 133 341 123 -9 2
1099BK09q2k43Q0J83j93k02J12J56l7l27L2K06k3k76N5L09j47j35k8K31L0k62
$$ 2 211 129 -114 -34 149 -44 -246 -134 22 -15 -342 -310 -104 -127 -403 -348 -39 -186 -321 -349 -118 -88 -350
1122c50J05K45m6k56N8L42r1j84J07K31J3j42r2K85J08k40j03K89J02k23j03K55
$$ -350 -245 0 -46 -302 -244 98 7 -177 -70 161 174 32 -60 225 333 93 -10 279 381 158 55 310
1144C10M7j66j41K44J41k94j08R7J84k35j76K00J26k10k54J88J72k30k40K43J03
$$ 310 357 191 50 294 435 141 33 130 314 79 -97 103 229 19 -235 -47 125 -105 -345 -102 1
1165Aj57j35L0K36j61k16J58J67j84j58J32K36j7k04N0L04j86k09J19K97j9k32
$$ 1 -156 -291 -261 -25 -186 -402 -244 -77 -261 -419 -287 -51 -68 -272 -222 82 -104 -313 -194 103 84 -148
1187a48Q0K15k2j49N3K27p4j28QK16M2k74M8K29k4k00p0K74N4l05j4J93l1k09
$$ -148 -68 147 125 -24 29 256 182 54 62 278 320 46 94 323 299 99 29 303 357 52 38 231 200 -9
1211ir4K46Q8l05p1K45J7l17p3K10J32k70j24J74J27k25j38J36J53j54j50J42
$$ -9 -103 143 231 -74 -145 100 117 -200 -273 -63 69 -201 -325 -151 -24 -249 -387 -251 -98 -252 -402 -260
1233b60K38j33k49K61J68j30j09K33L6K7k19J35J79k3k27J77K67j39k26R6K94
$$ -260 -22 -155 -404 -143 25 -105 -214 19 55 82 -137 -2 177 154 -73 104 371 232 6 102 396
1254C96j12j72L5K23q8k38J90O8p1k05pK52j01k67N2J91m7k59M0J54m5k30M0J41
$$ 396 284 112 147 370 282 44 234 302 231 26 19 271 170 -97 -45 146 99 -160 -120 34 -11 -241 -201 -60
1278f0N5k59j07K57P9k67n9K73j9j94m0J93P7j35o1K52P8k32p2K77Q8j05j77K25
$$ -60 -5 -264 -371 -114 -35 -302 -361 -88 -107 -301 -341 -148 -71 -206 -267 -15 63 -169 -241 36 124 19 -158 67
1302F7K69k73m9J22J22j08p5Q2J68j71j04J47J68j70q7O0J48r8k50J57J60k30
$$ 67 336 63 14 136 258 150 75 157 325 154 50 197 365 195 108 168 316 218 -32 125 285 55
1324E5j06O4K09j44k39Q5J74j09j95K6J65q1j78N9J63n4k00lJ92M5j98l6K57o3
$$ 55 -51 13 222 78 -161 -76 98 -11 -206 -180 -15 -96 -274 -215 -52 -106 -306 -309 -117 -72 -270 -306 -49 -112
1348a12j27K3J57L4k34J15J95N0k05O6J64O0q2r8J87N2j51J1J02J31j72j25J94
$$ -112 -239 -216 -59 -25 -259 -144 51 101 -104 -38 126 186 104 6 193 245 94 105 207 338 166 41 235
1371B35J02k15RN2Q0j66j02J58L2j14j98J77P3j19j46R8J09j04k39J39J39j47
$$ 235 337 122 131 183 263 97 -5 153 185 71 -127 50 123 4 -142 -44 65 -39 -278 -139 0 -147
1393a47j14J3K22j50r0K4J83j20p1OJ73rj92J25J51k4j37Q6Q1J16k02J3K61n4
$$ -147 -261 -248 -26 -176 -266 -242 -59 -179 -250 -244 -71 -80 -272 -147 4 -20 -157 -71 10 126 -76 -63 198 144
1417A44j59P8J16M0r7n4J71L0k38K8J65J16k71j14L41r4j23j23J58R0j90o4J92
$$ 144 -15 63 179 219 122 68 239 269 31 59 224 340 69 -45 296 202 79 -44 114 204 14 -50 142
1440A42j8k35r7J65N5j68q1R4J07q4k21J99Q1j36r9J88N8j31j05J86P0j30j32
$$ 142 124 -111 -208 -43 12 -156 -237 -143 -36 -120 -341 -142 -61 -197 -296 -108 -50 -181 -286 -100 -30 -160 -292
1463b92J96J09k6j59R6K19p5j40N7J50k1j66J31K42o2j72M4K75j51k41J69O9l3
$$ -292 -96 13 -13 -172 -76 143 68 -72 -15 135 114 -52 79 321 259 87 131 406 255 14 183 252 219
1486B19j97P3J65j29p1q9K07q7j17o5J77m0k45R7J23k8j93NJ19L4k23n8K34pj29
$$ 219 22 95 260 131 60 -29 178 91 -26 -91 86 46 -199 -102 21 -7 -200 -195 -76 -42 -265 -323 -89 -96 -225
1511b25o6J79L6j63KJ38J25j25j02J51R8o8j29J33J90j94k5J55Q8j06m7J55Q1
$$ -225 -291 -112 -76 -239 -237 -99 26 -99 -201 -50 48 -20 -149 -16 174 -20 -45 110 198 92 45 200 281
1534B81j17j59J95O3j12j01J19R5p0j54L9J80j06j32L9M2J8k19L3K08r2j59q1
$$ 281 164 5 200 263 151 50 169 264 194 40 79 259 153 21 60 102 120 -99 -66 142 50 -109 -190
1557a90J62n6p5r7K46p6k08K1J94k6j99J8K82p1n9p6J55P0k36N4J87j8o8q3K41
$$ -190 -28 -84 -159 -256 -10 -86 -294 -273 -79 -105 -304 -286 -4 -75 -134 -210 -55 15 -221 -167 20 2 -66 -149 92
1582I2Q6j77l1J38L1o1p6J79M5j51o3J99Q9j00j51J59Q6j45j94J74J74k26r7R7
$$ 92 178 1 -30 108 139 78 2 181 226 75 12 211 300 200 49 208 294 149 -45 129 303 77 -20 77
1606G7P9j51r4O5M4j18j34J13J72j16j89J13P4j09n1j6K04j45j37R4J12J3j21
$$ 77 156 5 -89 -24 20 -98 -232 -119 53 -63 -252 -139 -65 -174 -225 -241 -37 -182 -319 -225 -113 -100 -221
1629b21O6J20M7k47J22K07j5j40oJ50N7j08PJ63m2j51J0K51n1n9j09J86R0k08
$$ -221 -155 -35 12 -235 -113 94 79 -61 -67 83 140 32 39 202 160 9 19 270 219 160 51 237 327 119
1653A19rJ07M9j58m8J00N1k09MK7O4j02j16J33Q7j40j74J73%p6p9J05R1j59j13
$$ 119 110 217 266 108 60 160 211 2 6 33 97 -5 -121 12 99 -41 -215 -42 -42 -118 -197 -92 -1 -160 -273
1678b73J47O0j19r2R0J54j12p6J06J57o8j44J35J24q3j16Q1J67m2j20R6J12k0
$$ -273 -126 -66 -185 -277 -187 -33 -145 -221 -115 42 -26 -170 -35 89 6 -110 -29 138 96 -24 72 184 164
1701A64j59J50R0%j62L3J26mj19n3J14J7j85l2K11l2j04j44K27p5r4n1R2j8j93
$$ 164 5 155 245 245 83 116 242 238 119 66 180 197 12 -20 191 159 55 -89 138 63 -31 -82 10 -8 -201
1726b01K4R6L3j86j7J43J05j66l5Q2R0j26j6O2R7j07j12J55R1p6p2J54R0j16k2
$$ -201 -177 -81 -48 -234 -251 -108 -3 -169 -204 -122 -32 -158 -174 -112 -15 -122 -234 -79 12 -64 -136 18 108 -8 -30
1751c0L2J56r1q6J02J39r1j73J50J55j35q3N8K34j52j40J11J06j05j70J19J08
$$ -30 2 158 67 -19 83 222 131 -42 108 263 128 45 103 337 185 45 156 262 157 -13 106 214
1773B14r5j49K6P3o4j05P1J35q0j77kJ16Kj41n7J94k5j02m9O5N6j78M4J20J20
$$ 214 119 -30 -4 69 5 -100 -29 106 26 -151 -153 -37 -35 -176 -233 -39 -64 -166 -215 -150 -94 -272 -228 -108 12
1798A2j65lJ13J8p5r5J51P7r0k2J45J29j62j5J09P9j14r8J14J65r4j33J02P1q6
$$ 12 -153 -156 -43 -25 -100 -195 -44 33 -57 -79 66 195 33 18 127 206 92 -6 108 273 179 46 148 219 133
1823A33r1J40J2m7j38P2Q2j00j18P5M6p7j33J00N2o8j24rJ96k1k39N1K00r6j90
$$ 133 42 182 194 147 9 81 163 63 -55 20 66 -11 -144 -44 8 -60 -184 -193 3 -18 -257 -206 -6 -102 -292
1848b92L3J94Qj56Q6J14m3j46N5J91p5r2O0J31K7j61j4J71L1j07k7J61Oo5qJ24
$$ -292 -259 -65 -57 -213 -127 -13 -56 -202 -147 44 -31 -123 -63 68 95 -66 -80 91 122 15 -12 149 155 90 82 206
1874B06J7j46J5J17Q0k19j7J86j08j4j29J16on6j6O0j9j24j05J77K5o9j20O0O8
$$ 206 223 77 92 209 289 70 53 239 131 117 -12 104 98 42 26 86 67 -57 -162 15 40 -29 -149 -89 -21
1899b1j37l3K9J11j29j69J29J70l0j33O5R1n9m1K2J17K7j33P7J60o3j10M4R4o2
$$ -21 -158 -191 -162 -51 -180 -349 -220 -50 -80 -213 -148 -57 -116 -157 -135 -18 9 -124 -47 113 50 -60 -16 78 16
1924A6k8N8O4K9o9l8J79J8j49K9J16k2j29KR4K9j21p0J52k4j14q3J13pj45q6J42
$$ 16 -12 46 110 139 70 32 211 229 80 109 225 203 74 76 170 199 78 8 160 136 22 -61 52 45 -100 -186 -44
1951d4Mj01L5PL8kj34P8K0p2p2J46K0k5q6P3J30r1r3J64Q1j57o9J51J07q6o1J21
$$ -44 -40 -141 -106 -99 -61 -63 -197 -119 -99 -171 -243 -97 -77 -102 -188 -115 15 -76 -169 -5 76 -81 -150 1 108 22 -39 82
1979H2O1j23k6O6J23o8l9J0J38j3j51O8R0j21j2J5Q6l2j26j2J38p9j47P7J05p0
$$ 82 143 20 -6 60 183 115 76 86 224 211 60 128 218 97 85 100 186 154 28 16 154 75 -72 5 110 40
2005D0j54J6J37p2j08o7K57j39p8m5J24O8j59r0J87Lr8l7J25R7j54O1N5O1o3p5
$$ 40 -114 -98 39 -33 -141 -208 49 -90 -168 -213 -89 -21 -180 -270 -83 -80 -178 -215 -90 7 -147 -86 -31 30 -33 -108
2031a08J13J09j14k6Q7J02p5r4R1J02k9j08N1J14q9o8P7M6o4j05K0K28j76j65
$$ -108 5 114 0 -26 61 163 88 -6 85 187 158 50 101 215 126 58 135 181 117 12 32 260 84 -81
2055h1J04R9n7q4J8M3l2j82R6Q8q3j07M9O8pj82Q3J21l2q2l9R5O3m8k8P8j6j02
$$ -81 23 122 65 -19 -1 42 10 -172 -76 12 -71 -178 -129 -61 -68 -250 -167 -46 -78 -160 -199 -104 -41 -89 -117 -39 -55 -157
2083a57O6Q6K9p1k2J52J09k14rJ22N9q4j2J36m1j10rJ17Lo8K7j0P6j03QJ12k9
$$ -157 -91 -5 24 -47 -69 83 192 -22 -31 91 150 66 54 190 149 39 30 147 150 82 109 99 175 72 80 192 163
2110A63p8j25J87p6m2j64J26J03j16j32J07P9j03j10O3J07j33o9J12P4j09r1J10
$$ 163 85 -40 147 71 29 -135 -9 94 -22 -154 -47 32 -71 -181 -118 -11 -144 -213 -101 -27 -136 -227 -117
2133a17O4jj59Q8J80j08j30J00J35Kj65J46Q0k1n6l5J07M2j26O5O9J1j04JQ9K0
$$ -117 -53 -54 -213 -125 55 -53 -183 -83 52 54 -111 35 115 94 38 3 110 152 26 91 160 171 67 68 157 177
2159A77j60P3J08l5p4o2M4K0j16NP6kj3j38M5J74k31m5J71o2r0o0J50K4j49j2
$$ 177 17 90 198 163 89 27 71 91 -25 -20 56 54 41 -97 -52 122 -109 -154 17 -45 -135 -195 -45 -21 -170 -182
2185a82Q5K2o4j5L1R3j00n2J06N3j39PJ56N1p6k4K8J17kj14J29O6j4j42Q7Q5l6
$$ -182 -97 -75 -139 -154 -123 -30 -130 -182 -76 -23 -162 -155 1 52 -24 -48 -20 97 95 -19 110 176 162 20 107 192 156
2212A56q6J4Q6j0j14R7m7L4l7p7M6K6j55K9J16J2j39rR9m9j18K6O7K7j28j2RO9
$$ 156 70 84 170 160 46 143 96 130 93 16 62 88 -67 -38 78 90 -49 -58 41 -8 -126 -100 -33 -6 -134 -146 -137 -68
2240f8j06l4Q9m3N2m7J92j61J6k0R2jqp7J56L6j30j6J56R2q6j34J14P5q7NN8O2
$$ -68 -174 -208 -119 -162 -110 -157 35 -126 -110 -130 -38 -39 -47 -124 32 68 -62 -78 78 170 84 -50 64 139 52 57 115 177
2268A77p7l2L1J33p6j29R3K2j1j22M1L9p3m6ON1Lj11j9J59j02q5L5L0L1r5jN4
$$ 177 100 68 99 232 156 27 120 142 131 9 50 89 16 -30 -24 27 30 -81 -100 59 -43 -128 -93 -63 -32 -127 -128 -74
2296g4J2j19M2N6Rj08j1J86q5m2j5R6Mj9K4R1M7j34mQ9P2j34j2J46L2r1l7J03
$$ -74 -62 -181 -139 -83 -74 -182 -193 -7 -92 -134 -149 -53 -49 -68 -44 47 94 -40 -44 45 117 -17 -29 117 149 58 21 124
2324A24P3j21kN8L9m7j09Q3J05p5j08J7J19j23o6O8M3o2j27M7P1m4j15J4J15o3
$$ 124 197 76 74 132 171 124 15 98 203 128 20 37 156 33 -33 35 78 16 -111 -64 7 -37 -152 -138 -23 -86
2350h6p7N6L1mj43J19J5rj22P2Q6qr5J16K8J0q6RJ67o0o1N2J25j4j06l0J60k5
$$ -86 -163 -107 -76 -80 -223 -104 -89 -98 -220 -148 -62 -70 -165 -49 -21 -11 -97 -88 79 19 -42 10 135 121 15 -15 145 120
2378A20n2L1J18j7j16M6L6J2j59M6Q5Jj15qKJ28j86j4L4P7j25o4J33J2p3j20J38
$$ 120 68 99 217 200 84 130 166 178 19 65 150 151 36 28 30 158 -28 -42 -8 69 -56 -120 13 25 -48 -168 -30
2405c0k1n7n9M0J35j00r3J00O3r2l1K6J24j04k4K7J06l1q8Q7J00o2q3O9J36p3
$$ -30 -51 -108 -167 -127 8 -92 -185 -85 -22 -114 -145 -119 5 -99 -123 -96 10 -21 -109 -22 78 16 -67 2 138 65
2431F5q9Q6Q4o2n0J01P1j11n2L0Q5K1j06M7O0n3l7j15J52n7j37j6M6O9j7j14J02
$$ 65 -24 62 146 84 34 135 206 95 43 73 158 179 73 120 180 127 90 -25 127 70 -67 -83 -37 32 15 -99 3
2458Ck1j25M5j2M1k5PL2l2o3rP9Lq2k4J18j7n0K2N9O7n4k3N0N8r8P5L9rm2m7J33
$$ 3 -18 -143 -98 -110 -69 -94 -87 -55 -87 -150 -159 -80 -77 -159 -183 -65 -82 -132 -110 -51 16 -38 -61 -11 47 -51 24 63 54 12 -35 98
2490I8O4l6n0Q0k1J5n0j0M0k0n1K7J13o5j24K5O8l6r6M4j0J6j16l0O6J0p1J0O0
$$ 98 162 126 76 156 135 150 100 90 130 110 59 86 199 134 10 35 103 67 -29 15 5 21 -95 -125 -59 -49 -120 -110 -50
2519e0J6j19k8J28qq9LJ11m9q7M1O0O9n5qpQ6jk1P7Pp2p1J80J3r4J5Q8nq2K1N0
$$ -50 -34 -153 -181 -53 -61 -150 -147 -36 -85 -172 -131 -71 -2 -57 -65 -72 14 13 -8 69 76 4 -67 113 126 32 47 135 130 48 69 119
2551A19Lj02M4K8R0j04p3J33l7Qj07K1J19j17p9K2M6k3p7M0K6q5Mk7J02n6p5L3
$$ 119 122 20 64 92 182 78 5 138 101 109 2 23 142 25 -54 -32 14 -9 -86 -46 -20 -105 -101 -128 -26 -82 -157 -124
2579a24Q2o9K0N7o3L3k9o7J30Po7oJ11j5o5K1Q8Pk9l4N6J38j15o4J10N8j30O3
$$ -124 -42 -111 -91 -34 -97 -64 -93 -160 -30 -23 -90 -96 15 0 -65 -44 44 51 22 -12 44 182 67 3 113 171 41 104
2607A04K9P9j56j4J38o4n3L0L5l4q2L1K2M7r8j4K6Oj20lO7nq3k0kJ02n8o4J8M8
$$ 104 133 212 56 42 180 116 63 93 128 94 12 43 65 112 14 0 26 32 -88 -91 -24 -29 -112 -132 -134 -32 -90 -154 -136 -88
2637h8J0j14O2R4k9r8O7N4k0o8J01N5j07j9O2R0J1o9O3P1q8n9K4J72n2j35J39
$$ -88 -78 -192 -130 -36 -65 -163 -96 -42 -62 -130 -29 26 -81 -100 -38 52 63 -6 57 128 40 -19 5 177 125 -10 129
2664A29n6L9m6j0O3l4p2K3J60o8j15M1j3p4Ll1P0l0J2q7J05n2o7J3N7nq5M1l9
$$ 129 73 112 66 56 119 85 13 36 196 128 13 54 41 -33 -30 -61 9 -21 -9 -96 9 -43 -110 -97 -40 -45 -130 -89 -128
2693a28J00j25J5P5Po3k5J42j7k8q1J28P7r4nP4L1l0k0M1J5%p5J06Rk1q8R6Pm8
$$ -128 -28 -153 -138 -63 -56 -119 -144 -2 -19 -47 -128 0 77 -17 -22 52 83 53 33 74 89 89 14 120 129 108 20 116 123 75
2723G5Pj5J09j28o0P3Q1j27l4m2J49q4j06P3K3L0j63Q7M4n6n5N1J8K2p3m2Q1J
$$ 75 82 67 176 48 -12 61 142 15 -19 -61 88 4 -102 -29 -6 24 -139 -52 -8 -64 -119 -68 -50 -28 -101 -143 -62 -61
2751f1p4J7M9j3m8l1J34m5k1P3J1M4J0r4J19j0n1J7L4J00o8l2Q6m7o0k2Q6K0m6
$$ -61 -135 -118 -69 -82 -130 -161 -27 -72 -93 -20 -9 35 45 -49 70 60 9 26 60 160 92 60 146 99 39 17 103 123 77
2780G7j1MQ0p5o2O3k1k8l7pQ2q8j6oO8j09l4N7P8l8j35Q3J5l9n8O6N9Nj70J56
$$ 77 66 70 150 75 13 76 55 27 -10 -17 65 -23 -39 -45 23 -86 -120 -63 15 -23 -158 -75 -60 -99 -157 -91 -32 -27 -197 -41
2810d1QLm8JO0J3q2P0R6n2o0M5L5L7q1M5P1pk3n4J07k9j0o9P4o0Q2k1L8N8j52
$$ -41 -33 -30 -78 -77 -17 -4 -86 -16 80 28 -32 13 48 85 4 49 120 113 90 36 143 114 104 35 109 49 131 110 148 206 54
2841E4n5P0j3j1o2N9lj29mM1R3n6j15P8P3j10j8OK3m6K9NrM1o4K4N7J5m4j6Q6
$$ 54 -1 69 56 45 -17 42 39 -90 -94 -53 40 -16 -131 -53 20 -90 -108 -102 -79 -125 -96 -91 -100 -59 -123 -99 -42 -27 -71 -87 -1
2872aom9%P8no2j4J69p6qN0L8kj9rJ5lp0O2O6n8n8M4L5L5j33K1L8lp6l5O5l7m9
$$ -1 -7 -56 -56 22 17 -45 -59 110 34 26 76 114 112 93 84 99 96 26 88 154 96 38 82 117 152 19 40 78 75 -1 -36 29 -8 -57
2906e7jmQl2OJ3Q5j46m1Q4O4p8%K7J3j3K1J3L9o7rJ0O6k1KNM2m0j9k0J47o0qO5
$$ -57 -58 -62 -54 -86 -80 -67 18 -128 -169 -85 -21 -99 -99 -72 -59 -72 -51 -38 1 -66 -75 -65 1 -20 -18 -13 29 -11 -30 -50 97 37 29 94
2940I4k1J0l6K2P7l8o7P9k3O2j16J2L2n4k4K6M6Rj22JJ01p8m5r0J39K6j23j4N5
$$ 94 73 83 47 69 146 108 41 120 97 159 43 55 87 33 9 35 81 90 -32 -31 70 -8 -53 -143 -4 22 -101 -115 -60
2969f0n4L4m5J12o2n9k6J15K5n6j7L0M0o6qJ14N6j07J8O8j6k9J4P9L0j42L5R3
$$ -60 -114 -80 -125 -13 -75 -134 -160 -45 -20 -76 -93 -63 -23 -89 -97 17 73 -34 -16 52 36 7 21 100 130 -12 23 116
2997A16K1p0Kj5N1k4j02K2J02k8n0O2M9r0k3M4J1m1n4kjM5mj19Q3p7k7P4N6q2
$$ 116 137 67 69 54 105 81 -21 1 103 75 25 87 136 46 23 67 78 37 -17 -19 -20 25 21 -98 -15 -92 -119 -45 11 -71
3027g1m5K4L1Qj17N5M6L5r2kJ16j0m8m0J27j2p7nP6L0k0l9Q7J7l5o9J63L2j20
$$ -71 -116 -92 -61 -53 -170 -115 -69 -34 -126 -128 -12 -22 -70 -110 17 5 -72 -77 -1 29 9 -30 57 74 39 -30 133 165 45
3056D5k1J05L4q2n6J14n1n6NQj5n3L4MM2p0j0M8ok8jo5K8j6m4M6N0j16J5J5M0
$$ 45 24 129 163 81 25 139 88 32 37 45 30 -23 11 15 57 -13 -23 25 19 -9 -10 -75 -47 -63 -107 -61 -11 -127 -112 -97 -57
3087e7K1l6o3Q0l2N4l9K2M8o4n3K08p9j05L6R2M1o3J0L8K6p0L5K4m7K6j9O3m3
$$ -57 -36 -72 -135 -55 -87 -33 -72 -50 -2 -66 -119 89 10 -95 -59 33 74 11 21 59 85 15 50 74 27 53 34 97 54
3116E4n9Q0LM9o3n3R3j10J3L2j9J4r9j9R3p3p0O4K0J7p0J5LLk3j3mM4M3m2mM7
$$ 54 -5 75 78 127 64 11 104 -6 7 39 20 34 -65 -84 9 -64 -134 -70 -50 -33 -103 -88 -85 -82 -105 -118 -122 -78 -35 -77 -81 -34
3148c4k3m8M5M3rj04M1J44j06k9J04Rl1QK9J9K2k5K8L7n3n6J16j1n0n4L1O7j9
$$ -34 -57 -105 -60 -17 -26 -130 -89 55 -51 -80 24 33 2 10 39 58 80 55 83 120 67 11 127 116 66 12 43 110 91
3177I1p4L6Lk4oj3N5m7o7OJ5N0p5M2ok7n6J6O9k1l0j02J25O0r2K1j0J3Jn0JO0
$$ 91 17 53 56 32 26 13 68 21 -46 -40 -25 25 -50 -8 -14 -41 -97 -81 -12 -33 -63 -165 -40 20 -72 -51 -61 -48 -47 -97 -96 -36
3209c6l8J7M5J23o6p5M6K3M1q1J19j8p3M4k3J05r7Jj0N2o9j0J4L5J1n7M0k7Jm4
$$ -36 -74 -57 -12 111 45 -30 16 39 80 -1 118 100 27 71 48 153 56 57 47 99 30 20 34 69 80 23 63 36 37 -7
3239gP1j1o9j0J4L5l7p9M5O7l2j26O3K3K5j80L2J41mn2K2l3P2j7pN8l3NJ2k0P1
$$ -7 64 53 -16 -26 -12 23 -14 -93 -48 19 -13 -139 -76 -53 -28 -208 -176 -35 -39 -91 -69 -102 -30 -47 -54 4 -29 -24 -12 -32 39
3270C9m8j4Q3r7P8l4J7R2k2m4LL8k1J2m0N3n6l5J34k9m3j17R0n8Lq%N3o2PoJ0
$$ 39 -9 -23 60 -37 41 7 24 116 94 50 53 91 70 82 42 95 39 4 138 109 66 -51 39 -19 -16 -24 -24 29 -33 -26 -32 -22
3302b2j5p7R3j9l4M5m7N9m4j4n0P7j02N8l8J44q5oJ09o1J4J4j6J0lM7l6J08j01
$$ -22 -37 -114 -21 -40 -74 -29 -76 -17 -61 -75 -125 -48 -150 -92 -130 14 -71 -77 32 -29 -15 -1 -17 -7 -10 37 1 109 8
3331Hj8N2J6J8m8RN4j7J2j7R3q7l5L8k8J8J7r9M4N1j42P1R8r4q1M2QQo3l0Q9o
$$ 8 -10 42 58 76 28 37 91 74 86 69 162 75 40 78 50 68 85 -14 30 81 -61 10 108 14 -67 -25 -17 -9 -72 -102 -13 -19
3363a9K1j93J33J4n6j8J1L5OL3o1P9m9J6J6Rk6K1m5Q4ol5O8J8M2n9o0Q8L5o5K5
$$ -19 2 -191 -58 -44 -100 -118 -107 -72 -66 -33 -94 -15 -64 -48 -32 -23 -49 -28 -73 11 5 -30 38 56 98 39 -21 67 102 37 62
3394F2M9m4ok6N8jK3r8J30l6q2%O2q6m6QP4oq3L5L2J7j03n6O2L5l2J6k9M7j17
$$ 62 111 67 61 35 93 92 115 17 147 111 29 29 91 5 -41 -33 41 35 -48 -13 19 36 -67 -123 -61 -26 -58 -42 -71 -24 -141
3425a41O5J5L9p5K4J12k5j02j8K7M0oj8N9M6%n5L3J5j1L3K3L1r4l5J1J69q4o0
$$ -141 -76 -61 -22 -97 -73 39 14 -88 -106 -79 -39 -45 -63 -4 42 42 -13 20 35 24 57 80 111 17 -18 -7 162 78 18
3454A8J01l8j5j02M1M4l1rN0Mo4pL9O2o9j05O5Nk3o7J1Q8l2qp0M4j3k9j4L9J0
$$ 18 119 81 66 -36 5 49 18 9 59 63 -1 -8 31 93 24 -81 -16 -11 -34 -101 -90 -2 -34 -42 -112 -68 -81 -110 -124 -85 -75
3485g5onP4N2j82L9R5j3m8mJ28Kl6k2N7kl0pn6J04j8N4K7l6l1N9j7K2r0r2J73
$$ -75 -81 -86 -12 40 -142 -103 -8 -21 -69 -73 55 57 21 -1 56 54 24 17 -39 65 47 101 128 92 61 120 103 125 35 -57 116
3516A16J6o7nK1j4nj05O4j8nm2O9q1L8l3m6P7k7j01J9J08jl1l8P6o2J2O8n8K0
$$ 116 132 65 60 81 67 62 -43 21 3 -2 -44 25 -56 -18 -51 -97 -20 -47 -148 -129 -21 -22 -53 -91 -15 -77 -65 3 -55 -35
3546c5p0N2M5Mn0K8O2j8p3J15M1j4o1M9Pln8oJ01mj1l4l4O4k1j2m3M9l7Ok3K7
$$ -35 -105 -53 -8 -4 -54 -26 36 18 -55 60 101 87 26 75 82 79 21 15 116 112 101 67 33 97 76 64 21 70 33 39 16 43
3578D3j4r7N7J2o2N9l1k5k8j8j1R4p6q8J38%qj0l8M0K7r7P3M7lk2NL9O4j11kN3
$$ 43 29 -68 -11 1 -61 -2 -33 -58 -86 -104 -115 -21 -97 -185 -47 -47 -55 -65 -103 -63 -36 -133 -60 -13 -16 -38 -33 6 70 -41 -43 10
3610A0J3LjK8j0Nk1M1M2j26M3J9k1P7n0K0L4m7kK2m4K0l3%J9l5n3O1oq2jK8m0
$$ 10 23 26 25 53 43 48 27 68 110 -16 27 46 25 102 52 72 106 59 57 79 35 55 22 22 41 6 -47 14 8 -74 -75 -47 -87
3643h7K6mo5O4p9R0N3m7Q0r3m1JmKL7K8m1O2L2k3J5m4O1K8l5L0j4L4q4P0M3M2
$$ -87 -61 -65 -130 -66 -145 -55 -2 -49 31 -62 -103 -102 -106 -104 -67 -39 -80 -18 14 -9 6 -38 23 51 16 46 32 66 -18 52 95 137
3675A37o8m5K6N8m8JL8k2j2J0p0R9r6M3j3m4L7j7n6M0K3m7qm6N0OON8p8o1j0Q7
$$ 137 69 24 50 108 60 61 99 77 65 75 5 104 8 51 38 -6 31 14 -42 -2 21 -26 -34 -80 -30 -24 -18 40 -38 -99 -109 -22
3707b2n1r1P1K4Q2l2k7RmkJ8j8M6l3j3P6j1J5LJ2o7N2j5K3N4o3K0m5M6Ok9L4j4
$$ -22 -73 -164 -93 -69 13 -19 -46 -37 -41 -43 -25 -43 3 -30 -43 33 22 37 40 52 -15 37 22 45 99 36 56 11 57 63 34 68 54
3740E4LJ7nk3q0M6k8N5m2k2oL9mm9m0O3n0K4k2j2QJ4K1LlK6q2M2Lo8O6N2j6m8
$$ 54 57 74 69 46 -34 12 -16 39 -3 -25 -31 8 4 -45 -85 -22 -72 -48 -70 -82 -74 -60 -39 -36 -39 -13 -95 -53 -50 -118 -52 0 -16 -64
3774f4M0N5j3%K8m6J3nJ7L1rm4M9K1mkL9m3Mp8k6R4k8M2p0K0pLK9Lk0k4j1p2M3
$$ -64 -24 31 18 18 46 0 13 8 25 56 47 3 52 73 69 67 106 63 67 -11 -37 57 29 71 1 21 14 17 46 49 29 5 -6 -78 -35
3809c5P6j13k9L3M1r5J0N5Mnro0M5MlN4j4l2L9jj5R9p4O8p5J2LJ22r9M8o1J05
$$ -35 41 -72 -101 -68 -27 -122 -112 -57 -53 -58 -67 -127 -82 -78 -81 -27 -41 -73 -34 -35 -50 49 -25 43 -32 -20 -17 105 6 54 -7 98
3841I8k3k3j2J02n4o4M2j9L3j2p4OO1J0r3K4Qj2j6M9oo5j6J11j14l5K2jRj0N8
$$ 98 75 52 40 142 88 24 66 47 80 68 -6 0 61 71 -22 2 10 -2 -18 31 25 -40 -56 55 -59 -94 -72 -73 -64 -74 -16
3872a6j01M7J25j60J27p4j8PJ7O2j3q5Q0k1l1K1j2R2n3l8P6qN8p7P7Kj8k9L7k2
$$ -16 -117 -70 55 -105 22 -52 -70 -63 -46 16 3 -82 -2 -23 -54 -33 -45 47 -6 -44 32 24 82 5 82 84 66 37 74 52
3902E2K9j03P2K9n7k1J6pqO0o1L5lm4K2kK3n6p3O1o9O1k1M8L0q7O0lo0jN3j4j0
$$ 52 81 -22 50 79 22 1 17 10 2 62 1 36 33 -11 11 9 32 -24 -97 -36 -105 -44 -65 -17 13 -74 -14 -17 -77 -78 -25 -39 -49
3935d9jMRp2Q5mJ3j8K3r1J19%Rk2L7o7m8J15mP8q3RK4l1M1l1K4O3r8O3o5K6n1
$$ -49 -50 -46 -37 -109 -24 -28 -15 -33 -10 -101 18 18 27 5 42 -25 -73 42 38 116 33 42 66 35 76 45 69 132 34 97 32 58 7
3968GN5n4O3m8Kl0R2o1p4K6Nl9J5M4J7p9Rp1O5O0q8k9R9n0pRM3n8Q3NlMn4j6J01
$$ 7 62 8 71 23 25 -5 87 26 -48 -22 -17 -56 -41 3 20 -59 -50 -121 -56 4 -84 -113 -14 -64 -71 -62 -19 -77 6 11 8 12 -42 -58 43
4003D3m1q8J49k8K7qPN6p0l5M2k3O9r1P9k7Qp1PmM9l8L6j0K3p4J8j7O9m4m2N6
$$ 43 2 -86 63 35 62 54 61 117 47 12 54 31 100 9 88 61 69 -2 5 1 50 12 48 38 61 -13 5 -12 57 13 -29 27
4035B7n1Pp8M8M9n6L3j5m3k4J5j9P6pl7j7O1k5l1jJ05o0J0N1m7PMO9j0pp8J06
$$ 27 -24 -17 -95 -47 2 -54 -21 -36 -79 -103 -88 -107 -31 -38 -75 -92 -31 -56 -87 -88 17 -43 -33 18 -29 -22 -18 51 41 34 -44 62
4067F2J3J0Qm7m4J16j40K0L1N0N0r0MK7m9K2o2P8n2qj5O7j31K4k5N2rm5NK3j1
$$ 62 75 85 93 46 2 118 -22 -2 29 79 129 39 43 70 21 43 -19 59 7 -1 -16 51 -80 -56 -81 -29 -38 -83 -78 -55 -66
4098f6n4J17m0Pl4O5l2l3J3RQ8o9k3O8n3L2lK5L1j6j1K3P4q0J2q5L4P6m8j8O5
$$ -66 -120 -3 -43 -36 -70 -5 -37 -70 -57 -48 40 -29 -52 16 -37 -5 -8 17 48 32 21 44 118 38 50 -35 -1 75 27 9 74
4129G4Pp5L8nO4pj7k2n0Q%j8L9n9n0Q3k6Ol3KJ3J4q4J17p9j5jK1K2n9j0O6K6n4
$$ 74 81 6 44 39 103 96 79 57 7 15 15 -3 36 -23 -73 10 -16 -10 -43 -41 -28 -14 -98 19 -60 -75 -76 -55 -33 -92 -102 -36 -10 -64
4163f4O8k0j1qM3rP5p8J6k4M1k7K8pm4N3m0J25L6q3j5o7J09pq8M8NJ0l0p2J09
$$ -64 4 -16 -27 -35 8 -1 74 -4 12 -12 29 2 30 23 -21 32 -8 117 153 70 55 -12 97 90 2 50 55 65 35 -37 72
4194G2l8q3N8M2k2k9l8K6Q7j62N1Qp6M9POJ5qk4L1pj5j2QR0j18O3o0P1O0p1O3
$$ 72 34 -49 9 51 29 0 -38 -12 75 -87 -36 -28 -104 -55 -48 -42 -27 -35 -59 -28 -35 -50 -62 -54 36 -82 -19 -79 -8 52 -19 44
4226D4m2j4J9k8J33p6p3R8m0N3r2O1j7j5M4Np0L9N5q7R3j16Q6l8k2j5QJ7L9k5
$$ 44 2 -12 7 -21 112 36 -37 61 21 74 -18 43 26 11 55 60 -10 29 84 -3 90 -26 60 22 0 -15 -7 10 49 24
4256B4j8j5Mp7O0J2%K3r8N2Kp4%J7O4J4l8L5km3J1L1M4n2NK2oK3l1N9k5l9P1q1
$$ 24 6 -9 -5 -82 -22 -10 -10 13 -85 -33 -31 -105 -105 -88 -24 -10 -48 -13 -15 -58 -47 -16 28 -24 -19 3 -3 20 -11 48 23 -16 55 -26
4290b6P8m4MK9N4j8o5Kn2J13n3K7J5l3N0m7l9K8K0r4J19J4o2m5k3M5k7JP8n8r1
$$ -26 52 8 12 41 95 77 12 14 -38 75 22 49 64 31 81 34 -5 23 43 -51 68 82 20 -25 -48 -3 -30 -29 49 -9 -100
4321a00R3ol0j7j8J04o4Jk1L4r0O1M3K4p6L2np9J43j8K1p0R8o8L7m0M3K4J1j1
$$ -100 -7 -13 -43 -60 -78 26 -38 -37 -58 -24 -114 -53 -10 14 -62 -30 -35 -114 29 11 32 -38 60 -8 29 -11 32 56 67 56
4351E6N0j55O5L9J8n1j8l6P0Nk0n4PJ6N4o4K3l2L2J4m2k0L7lKj6J0l3LL3k5o6
$$ 56 106 -49 16 55 73 22 4 -32 38 43 23 -31 -24 -8 46 -18 5 -27 5 19 -23 -43 -6 -9 -7 -23 -13 -46 -43 -10 -35 -101
4383a01L2K0J3j5%P0n1m2P6j7J1j2O1l1J0m5N5j3L9m7JP6j04J00m9K8K9o2L3K1
$$ -101 -69 -49 -36 -51 -51 19 -32 -74 2 -15 -4 -16 45 14 24 -21 34 21 60 13 14 90 -14 86 37 65 94 32 65 86
4413H6q0%Q1j0rm8m9M3l4L7ll0%J3KlK3r9N7O1p7k6M3M0j12qO9K0M9l6l8qK9k9
$$ 86 6 6 87 77 68 20 -29 14 -20 17 14 -16 -16 -3 -1 -4 19 -80 -23 38 -39 -65 -22 18 -94 -102 -33 -13 36 0 -38 -46 -17 -46
4447d6K0O9p9OJ9M2n4ML8jR8o3j0J1j6l0M6k1MO2n9K6M8j36L2K2o4J22n4m7O4
$$ -46 -26 43 -36 -30 -11 31 -23 -19 19 18 116 53 43 54 38 8 54 33 37 99 40 66 114 -22 10 32 -32 90 36 -11 53
4478E3mo7Kj8O3n5qmL7q2ON7J1l1k7K2K2J5J5j07j2N5L3j7oM4j6L6k3KK4J6k3
$$ 53 49 -18 -16 -34 29 -26 -34 -38 -1 -83 -77 -20 -9 -40 -67 -45 -23 -8 7 -100 -112 -57 -24 -41 -47 -3 -19 17 -6 -4 20 36 13
4511A3%m9J18j6l0O9k1j8J6q0P7j7j6j4K0K6j08K7P2l7qOK7K6o1J8o6M6l8o3K5
$$ 13 13 -36 82 66 36 105 84 66 82 2 79 62 46 32 52 78 -30 -3 69 32 24 30 57 83 22 40 -26 20 -18 -81 -56
4542e6O6n5oJ1ljl6M6L5Ol7L0Pl4mj0N5o1j0K7M8M4p1m0N1L8m4N1l3K7o4J0J14
$$ -56 10 -45 -51 -40 -43 -44 -80 -34 1 7 -30 0 7 -27 -31 -41 14 -47 -57 -30 18 62 -9 -49 2 40 -4 47 14 41 -23 -13 101
4575A01k8n1J9K3Qo2O3K2o6pk9oK7l1L6O1q8O0o7P2j5n7Ko5O8m4J7J7J0n6K7j7
$$ 101 73 22 41 64 72 10 73 95 29 22 -7 -13 14 -17 19 80 -8 52 -15 57 42 -15 -13 -78 -10 -54 -37 -20 -10 -66 -39 -56
4607e6J6Qq6N8L2k2%k7R8n2ROl2Q0n1N7r1K5mmJ06j7j8MK4o1P7%j2m8N1o1K8j3
$$ -56 -40 -32 -118 -60 -28 -50 -50 -77 21 -31 -22 -16 -48 32 -19 38 -53 -28 -32 -36 70 53 35 39 63 2 79 79 67 19 70 9 37 24
4641B4M3j5K3l9mn1Q3n2n3Q7k9m6L6o5M0nL0p9L4M2o6N4n0K5o3Q2JJ8m1l8K7O6
$$ 24 67 52 75 36 32 -19 64 12 -41 46 17 -29 7 -58 -18 -23 7 -72 -38 4 -62 -8 -58 -33 -96 -14 -13 5 -36 -74 -47 19
4673A9q9J4R1M5j01kM3m3J2K4K2j1P2o9RnJ2j9J1MK3l9J9l5J1j6J2K1m7L6P3j0
$$ 19 -70 -56 35 80 -21 -23 20 -23 -11 13 35 24 96 27 36 31 43 24 35 39 62 23 42 7 18 2 14 35 -12 24 97 87
4705H7j52J36n5mP1j20PpLn1N8j6Pk6K8op3J21n5N8l0k7L1j8ON9m7j3R0j10J00
$$ 87 -65 71 16 12 83 -37 -30 -37 -34 -85 -27 -43 -36 -62 -34 -40 -113 8 -47 11 -19 -46 -15 -33 -27 32 -15 -28 62 -48 52
4736E2k5m4K5M4Kl8L0%k2PM5l3K4J7q1L2o0L4P4m6J5K0p0J1L8n5m7NK5NJ8J2l8
$$ 52 27 -17 8 52 54 16 46 46 24 31 76 43 67 84 3 35 -25 9 83 37 52 72 2 13 51 -4 -51 -46 -21 -16 2 14 -24
4769b4K3o4M4m2J00n0l5K8n3N5jo1J07Kj24P8J1j1N1m4Q3r3j4J8O0pn0LO3l0J6
$$ -24 -1 -65 -21 -63 37 -13 -48 -20 -73 -18 -19 -80 27 29 -95 -17 -6 -17 34 -10 73 -20 -34 -16 44 37 -13 -10 53 23 39
4800C9m2O1J1o5J5M3M1m8J4r1R2N1o4l6n5N9o6N3jK6Nq2N4m5q7Q9l6Kl9K1R7q7
$$ 39 -3 58 69 4 19 62 103 55 69 -22 70 121 57 21 -34 25 -41 12 11 37 42 -40 14 -31 -118 -29 -65 -63 -102 -81 16 -71
4832g1O1j08J28k2l8k7K0J4J6l7Q2p7K0M0k9RK9N1n1M6p2L4M4k3l2j7O1m3rj0
$$ -71 -10 -118 10 -12 -50 -77 -57 -43 -27 -64 18 -59 -39 1 -28 -19 10 61 10 56 -16 18 62 39 7 -10 51 8 -1 -11
4862a1J29j23J3K1l3p7J22k9j2K1M3m1l6mJ1k5M8K4r3l5P0L3k6oj0p1P2l1O7l4
$$ -11 118 -5 8 29 -4 -81 41 12 0 21 64 23 -13 -17 -6 -31 17 41 -52 -87 -17 16 -10 -16 -26 -97 -25 -56 11 -23
4892b3%M1l4Rl3lO5K8l5J0j3lMm0J08J9j33M4J2R3j27J2R0l2k5k5j1P2l6n9M1
$$ -23 -23 18 -16 -7 -40 -43 22 50 15 25 12 9 13 -27 81 100 -33 11 23 116 -11 1 91 59 34 9 -2 70 34 -25 16
4923A6Ol5N8l5Q0q1o5J24r8j2L2ppK9o9P0l0m2Q0q6N3l5j7L6l9O1J8o8P4J9o0
$$ 16 22 -13 45 10 90 9 -56 68 -30 -42 -10 -17 -24 5 -64 6 -24 -66 14 -72 -19 -54 -71 -35 -74 -13 5 -63 11 30 -30
4954c0n9P2M7k8l9M9P3j14P8k2lk3j2Q8l4p8J24p8P0J1p4K2L9m2m1N8n3M9m8J
$$ -30 -89 -17 30 2 -37 12 85 -29 49 27 24 1 -11 77 43 -35 89 11 81 92 18 40 79 37 -4 54 1 50 2 3
4984CJ2J2j09O4L4J1p6nK1l6L8M5l3ljk3J3Lnl8O8r1R6k9L5m8Q3k4j3Rn1RP4o0
$$ 3 15 27 -82 -18 16 27 -49 -54 -33 -69 -31 14 -19 -22 -23 -46 -33 -30 -35 -73 -5 -96 0 -29 6 -42 41 17 4 13 -38 -29 45 -15
5018a5k8J06o0Q6j10K0L0q5J78q7RMn5KL6K6j16L3L0L1Ko2L7l6L3o4L0O4k0qn7
$$ -15 -43 63 3 89 -21 -1 29 -56 122 35 44 48 -7 -5 31 57 -59 -26 4 35 37 -25 12 -24 9 -55 -25 39 19 11 -46
5049d6M3m2Ql7J4K6K8ljp2M0J9J2L3j18R5N4m6J6o6P2p9%N5%P8q7ML0l1L5k6j4
$$ -46 -3 -45 -37 -74 -60 -34 -6 -9 -10 -82 -42 -23 -11 22 -96 -1 53 7 23 -43 29 -50 -50 5 5 83 -4 0 30 -1 34 8 -6
5082fJ0L1J6QJ4o7oM1J09j41k6N1k0kNPK0J4k7j2l8k3J2J5qM8p4PMQ0q9M4m4j5
$$ -6 4 35 51 59 73 6 0 41 150 9 -17 34 14 12 17 24 44 58 31 19 -19 -42 -30 -15 -23 25 -49 -42 -38 42 -47 -3 -47 -62
5116f2qLL8J7jk8J7m3L4nQ9k3pnRn8Q2k3k9N0L3j00N8j7oL3K1J5o3MO9n9k5Kj4
$$ -62 -70 -67 -29 -12 -13 -41 -24 -67 -33 -38 51 28 21 16 25 -33 49 26 -3 47 80 -20 38 21 15 48 69 84 21 25 94 35 10 12 -2
5151bJ08j26k9N9m2K9l8R9q3N7p8OM5J7n8Q1q2J1%k9M0K5o5nJ0Q2n9L7k6RM2O
$$ -2 106 -20 -49 10 -32 -3 -41 58 -25 32 -46 -40 5 22 -36 45 -37 -26 -26 -55 -15 10 -55 -60 -50 32 -27 10 -16 -7 35 41
5183D1n2rJ4j9Q7j26Q6M2n7M7j5m8Q4q7J22j8n4q7R5J9j6q0M8M5n6OJ1l4O9k2
$$ 41 -11 -20 -6 -25 62 -64 22 64 7 54 39 -9 75 -12 110 92 38 -49 46 65 49 -31 17 62 6 12 23 -11 58 36
5213C6o1K6M4n2Rl3j8kkN0l9K6k1Lj5K9o1O5K4l1J5o4O6j0j2K5%O5p4%L7kK6r4
$$ 36 -25 1 45 -7 2 -31 -49 -51 -53 -3 -42 -16 -37 -34 -49 -20 -81 -16 8 -23 -8 -72 -6 -16 -28 -3 -3 62 -12 -12 25 23 49 -45
5247d5Q9O0p2J1k5L8n2M9Lml6j1l1KO3J2j6J7j39J23k9m9N1nj0l0J0j5j4L5Ok3
$$ -45 44 104 32 43 18 56 4 53 56 52 16 5 -26 -24 39 51 35 52 -87 36 7 -42 9 4 -6 -36 -26 -41 -55 -20 -14 -37
5279c7l5L5k1l6Q4n7rk0N8K4o6M5PK8n0NO8N4j9j38J22j2J2n4j0R8r6K2O7k9K3
$$ -37 -72 -37 -58 -94 -10 -67 -76 -96 -38 -14 -80 -35 -28 0 -50 -45 23 77 58 -80 42 30 42 -12 -22 76 -20 2 69 40 63
5310F3l4m7J06n7oq2J65l6n7n7P7k1Nj0%Ml6l2M5L0j1ll1l1m3O6j4j5N6oJ06j59
$$ 63 29 -18 88 31 25 -57 108 72 15 -42 35 14 19 9 9 13 -23 -55 -10 20 9 6 -25 -56 -99 -33 -47 -62 -6 -12 94 -65
5342f5P1n8j9M3Oj8J2J5K3jq9J07o4MK7J5qM0p8Q1jKk6j2Mn7J01n1Q3r9oQ8o5
$$ -65 6 -52 -71 -28 -22 -40 -28 -13 10 9 -80 27 -37 -33 -6 9 1 41 -37 44 43 45 19 7 11 -46 55 4 87 -12 -18 70 5
5375Ek3O7l5O2j02k0O8J00j51N2J9K2j26jM3Q1l8K0q1k5K7M7M7p7n0K9K6k7l6
$$ 5 -18 49 14 76 -26 -46 22 122 -29 23 42 64 -62 -63 -20 61 23 43 -38 -63 -36 11 58 -19 -69 -40 -14 -41 -77
5404g7L5M3L8j9j4mM8r0L8L1m3K0Nk6QM0j3j5L1kR2p4p0K2n4N7K3jl4l5J19r4
$$ -77 -42 1 39 20 6 2 50 -40 -2 29 -14 6 11 -15 -7 33 20 5 36 34 126 52 -18 4 -50 7 30 29 -5 -40 79 -15
5436a5O3m9j7L1n2M0Q3j64R2k4J1l5k0N1l8M4j03N9m4P7l3J6L7m5RJ0L8o8K0o3
$$ -15 48 -1 -18 13 -39 1 84 -80 12 -12 -1 -36 -56 -5 -43 1 -102 -43 -87 -10 -43 -27 10 -35 -26 -16 22 -46 -26 -89
5466h9J09LJ4l1%L8m2j6J35j06j0m4O9m8N6n6M5L2j22J00n5M7oRj4Ol2k6K4L8
$$ -89 20 23 37 6 6 44 2 -14 121 15 5 -39 30 -18 38 -18 27 59 -63 37 -18 29 23 32 18 24 -8 -34 -10 28
5496B8j6j8l0Pj2nnM4m3L4L0kq1N9l9Q2l9q7P6q1J07kl2L3m6N5j6J6k7jL1l3O6
$$ 28 12 -6 -36 -29 -41 -46 -51 -7 -50 -16 14 12 -69 -10 -49 33 -6 -93 -17 -98 9 7 -25 8 -38 17 1 17 -10 -11 20 -13 53
5529E3n6K5J1qm4L5j4J9m0R3n7m3N7L3l2k7Q6l5o3K5L4k9j9j4n9KP4k1m1P4j2
$$ 53 -3 22 33 25 -19 16 2 21 -19 74 17 -26 31 64 32 5 91 56 -7 18 52 23 4 -10 -69 -67 7 -14 -55 19 7
5560Gj28J16l6l7K6j5J5lJ7l7J1Q7l6mm0N1L4m7P9m3m2O8J7L1q7k9M9J0O9m0k7
$$ 7 -121 -5 -41 -78 -52 -67 -52 -55 -38 -75 -64 23 -13 -17 -57 -6 28 -19 60 17 -25 43 60 91 4 -25 24 34 103 63 36
5591C6J5mo3K5k4lJ02n7L3or5J8M2l2N5j24M7J7jJ1k8O5p5OM0r1L0k9J41p5Ol5
$$ 36 51 47 -16 9 -15 -18 84 27 60 54 -41 -23 19 -13 42 -82 -35 -18 -19 -8 -36 29 -46 -40 0 -91 -61 -90 51 -24 -18 -53
5623e3rQ7J0m4O1n0j9P4n8K5m8pK0P5Ko9j6J9l0J9qL9J0m9L2j2Q4p1J9r3M1O8
$$ -53 -62 25 35 -9 52 2 -17 57 -1 24 -24 -31 -11 64 66 -3 -19 0 -30 -11 -19 20 30 -19 13 1 85 14 33 -60 -19 49
5655D9j4o1K9K4k5K0q7Q9m2j1j0N6n7N2n3o6N2J06j13N6n3K5j7J2oM1m8PO2p1
$$ 49 35 -26 3 27 2 22 -65 24 -18 -29 -39 17 -40 12 -41 -107 -55 51 -62 -6 -59 -34 -51 -39 -45 -4 -52 -45 17 -54
5685e4l8J20n1k1N8K5p8Q0Jmk4lk0L2n1L2j0N8nj8j9K5n5k9P1l0O4l6J5kK8p6
$$ -54 -92 28 -23 -44 14 39 -39 41 42 38 14 11 -9 23 -28 4 -6 52 47 29 10 35 -20 -49 22 -8 56 20 35 33 61 -15
5717a5K1r0L4J9pJL2j9N7m4j6rKOl2J6LM7p6Q0K0k9rK9m2jK6m6Q1K0j12J2J08
$$ -15 6 -84 -50 -31 -38 -37 -5 -24 33 -11 -27 -36 -34 -28 -60 -44 -41 6 -70 10 30 1 -8 21 -21 -22 4 -42 39 59 -53 -41 67
5750F7j0L1r0k5O8qk9jK4N%k8L3j4J0n2lP3j2n8N9L2q5M4J3N7j17l8PM1k6j6J7
$$ 67 57 88 -2 -27 41 33 4 3 27 32 32 4 37 23 33 -19 -22 51 39 -19 40 72 -13 31 44 101 -16 -54 -47 -6 -32 -48 -31
5783c1Jn9pJ12p0J0m3J7J3K9n3J17p9J2L0n5J4K3Rn1N8M2l4PMJ6j08J30m4K7k8
$$ -31 -30 -89 -96 16 -54 -44 -87 -70 -57 -28 -81 36 -43 -31 -1 -56 -42 -19 -10 -61 -3 39 5 12 16 32 -76 54 10 37 9
5814IM2J3j7p6PM7mqM0o1j1OL8QMo4p6J28o4K2mrk1L0M5k9k7jp0O1N5q6N2PL1
$$ 9 51 64 47 -29 -22 25 21 13 53 -8 -19 -13 25 33 37 -27 -103 25 -39 -17 -21 -30 -51 -21 24 -5 -32 -33 -103 -42 13 -73 -21 -14 17
5849A7p9jQJ1k2L7lOJ4l9M3jJ7K1l5Q7q9m8R3mL9p8N3J9Ko9L0J8k7l4Q1Pr5K6
$$ 17 -62 -63 -55 -44 -66 -29 -32 -26 -12 -51 -8 -9 8 29 -6 81 -8 -56 37 33 72 -6 47 66 68 -1 29 47 20 -14 67 74 -21 5
5883EJ3k2Kj1N1J5j02j8M7J3Mp5K7O3l0P4o2n1K0o7L0J5N6j2l8mK3O6o4M8k1M3
$$ 5 18 -4 -2 -13 38 53 -49 -67 -20 -7 -3 -78 -51 12 -18 56 -6 -57 -37 -104 -74 -59 -3 -15 -53 -57 -34 32 -32 16 -5 38
5915C8k8k7K3J3M3j8o0J4J2L0m6L2L6qJLk3l3j5J2O0Jm6J9JNk7n2Q3r7NO1j3K4
$$ 38 10 -17 6 19 62 44 -16 -2 10 40 -6 26 62 54 55 58 35 2 -13 -1 59 60 14 33 34 39 12 -40 43 -54 -49 12 -1 23
5949B3q9K7k3M5J0L6p5l8O1m4l3O8J6lj2K1oM2j9J6k9k8L8J8k8l8L3L4kj2PP2
$$ 23 -66 -39 -62 -17 -7 29 -46 -84 -23 -67 -100 -32 -16 -19 -31 -10 -16 26 7 23 -6 -34 4 22 -6 -44 -11 23 21 9 16 88
5981H8m6N5m5n0N8m0P1l5kn9M4k4K2Ol8l7N7N8j10K5pj5j5m7K8rJ1L4qk3NL5L3
$$ 88 42 97 52 2 60 20 91 56 54 -5 39 15 37 43 5 -32 25 83 -27 -2 -9 -24 -39 -86 -58 -67 -56 -22 -30 -53 -48 -13 20
6014B0pn9J6K7M4jj08O1n0J1Q4o7o9O4p7R8l5kJ18m2m6Q1l9j2M5lj6N3j32M2P1
$$ 20 13 -46 -30 -3 41 40 -68 -7 -57 -46 38 -29 -98 -34 -111 -13 -48 -50 68 26 -20 61 22 10 55 52 36 89 -43 -1 70
6045G0J4p6k7K9mK8o5m0J08n2N2m7J8J3k9ol7L1J8j4Q2o4k7K9kJ4pJ1n8%O5o3
$$ 70 84 8 -19 10 6 34 -31 -71 37 -15 37 -10 8 21 -8 -14 -51 -20 -2 -16 66 2 -25 4 2 16 9 20 -38 -38 27 -36
6077c6OQJ9M9J5n7Rq4J53n4n4j7O3j3N5l1m1J4O6n8O6%j6K0j07N1J6J3m9O4r8
$$ -36 -30 -22 -3 46 61 4 13 -71 82 28 -26 -43 20 7 62 31 -10 4 70 12 78 78 62 82 -25 26 42 55 6 70 -28
6108b8O2mM7p6j9RK0%K3n7K1J8m0K7j7j1k9M2l2N2l2J3N0k7k2Rr3P8j3J2kj3L6
$$ -28 34 30 77 1 -18 -9 11 11 34 -23 -2 16 -24 3 -14 -25 -54 -12 -44 8 -24 -11 39 12 -10 -1 -94 -16 -29 -17 -19 -32 4
6141DK0jn5O5k7kJ4rO5pq9J3j3lj8P0j3L2j3mJ1p5L9j5N4l7kK8J3o4Nj6J0k0M
$$ 4 24 23 -32 33 6 4 18 9 74 67 -22 -9 -22 -25 -43 27 14 46 33 29 40 -35 4 -11 43 6 4 32 45 -19 -14 -30 -20 -40 -36
6176c6j4M4n4Q4K8k5m4K9l0o4N4L3m6O7l8l2Q2k5p7P4L6rl1l9J23j20J02p1l2
$$ -36 -50 -6 -60 24 52 27 -17 12 -18 -82 -28 5 -41 26 -12 -44 38 13 -64 10 46 37 6 -33 90 -30 72 1 -31
6205c1Q0l9N1m4MNl1L3ol5Q2m3j5k0nP7r2O9o1n4J06n2Rk3K4K0J5k8l3O5q1L1
$$ -31 49 10 61 17 21 26 -5 28 22 -13 69 26 11 -9 -14 63 -29 40 -21 -75 31 -21 -12 -35 -11 9 24 -4 -37 28 -53 -22
6237b2L5j5n9K3k3K9K5RJ6l5k3J1L4j0m7P1Ko9R3kl9LpL0k1J0j9M7n3P4n2j0O2
$$ -22 13 -2 -61 -38 -61 -32 -7 2 18 -17 -40 -29 5 -5 -52 19 21 -48 45 43 4 7 0 30 9 19 0 47 -6 68 16 6 68
6270F8m4o0R8n8%J1rQmO0j11M0J6k0NK7k4Nm2L8l5J5lMJ9n4L3j9K9l0J2P2n8J4
$$ 68 24 -36 62 4 4 15 6 14 10 70 -41 -1 15 -5 0 27 3 8 -34 4 -31 -16 -19 -15 4 -50 -17 -36 -7 -37 -25 47 -11 3
6304CJ7k2j0O4r2K8K5j5k5O6j7nk4l5M3j7M2Mm2l2L0L1Kj6J6LQlj6OM2r9k3N4
$$ 3 20 -2 -12 52 -40 -12 13 -2 -27 39 22 17 -7 -42 1 -16 26 30 -12 -44 -14 17 19 3 19 22 30 27 11 17 59 -40 -63 -9
6338iK8k7k5O9l4l8l2N2k9k7j6O1M2p2K5Rj6M8k7l3KN1J0m4K8o6N4M1l8j0K8M4
$$ -9 19 -8 -33 36 2 -36 -68 -16 -45 -72 -88 -27 15 -57 -32 -23 -39 9 -18 -51 -49 2 12 -32 -4 -70 -16 25 -13 -23 5 49
6370D9J3J5l1m3p3P3JJ1p8P5M3r2N0J0L5m7Pj4N8q8M8J1p6L5M4o0J2L7m7K2m1
$$ 49 62 77 46 3 -70 3 4 15 -63 12 55 -37 13 23 58 11 18 4 62 -26 22 33 -43 -8 36 -24 -12 25 -22 0 -41
6401d1NM6L9q5N3j3n8mJ43j35o6J65n2j1NR2m6r4P8L5q9M6m3N0o2O5L4q1Q6k3
$$ -41 -36 10 49 -36 17 4 -54 -58 85 -50 -116 49 -3 -14 -9 83 37 -57 21 56 -33 13 -30 20 -42 23 57 -24 62 39
6431C9k1J5m8M6k2L1J3q0N4j1pk5O5o5N9q1J03n9N7o8L3K0n4l1O3k3lN0r8K3m
$$ 39 18 33 -15 31 9 40 53 -27 27 16 9 -16 49 -16 43 -38 65 6 63 -5 28 48 -6 -37 26 3 0 50 -48 -25 -29
6462b9J6J4M1j5n4kJ2j3kR6j26N1j3L9j4j1j5L6J8p4R0j1n0M3k2L6o3N0Nj8K7
$$ -29 -13 1 42 27 -27 -29 -17 -30 -32 64 -62 -11 -24 15 1 -10 -25 11 29 -45 45 34 -16 27 5 41 -22 28 33 15 42
6493D2j4m8N0k4jOk2M5J7m5j0K4Mm0Mk1J13q5j9k3k2M1J2l4N4j05M8O6K6n0k8
$$ 42 28 -20 30 6 5 11 -11 34 51 6 -4 20 24 -16 -12 -33 80 -5 -24 -47 -69 -28 -16 -50 4 -101 -53 13 39 -11 -39
6524c9l4M0L6l7L8m2K6l9k3J18n3j6M6k1K4p7M9Nj1L0l4M1k0l4J8K3j3pJ0N6k7
$$ -39 -73 -33 3 -34 4 -38 -12 -51 -74 44 -9 -25 21 0 24 -53 -4 1 -10 20 -14 27 7 -27 -9 14 1 -6 4 60 33
6555C3l2J5j0Pk7JN6n8O6j23J00k2n7P7l2PM5j8k8L2j31P2l5P9j8pj1N7n2k6O
$$ 33 1 16 6 13 -14 -13 43 -15 51 -72 28 6 -51 26 -6 1 46 28 0 32 -99 -27 -62 17 -1 -8 -19 38 -14 -40 -34
6586c4l0N4N9l6L1o4K0J7oLqN2Om6m4P0N5j09P8m0l5K1j6L5j3o0J5L9O3j00L7
$$ -34 -64 -10 49 13 44 -20 0 17 11 14 6 58 64 18 -26 44 99 -10 68 28 -7 14 -2 33 20 -40 -25 14 77 -23 14
6617A4o1K9Nm0K1N2O3o4N8jj28M9L6Om5K2K1q7J05j39O7LN1k8r5O6J8JK1l8P8
$$ 14 -47 -18 -13 -53 -32 20 83 19 77 76 -52 -3 33 39 -6 16 37 -50 55 -84 -17 -14 37 9 -86 -20 -2 -1 20 -18 60
6648F0o6k9N5K8p8L8L0j8k7N7r2L8N3rk4l9j2L5J8m2L2K6p5L7rL0J4m6o7J11m5
$$ 60 -6 -35 20 48 -30 8 38 20 -7 50 -42 -4 49 40 16 -23 -35 0 18 -24 8 34 -41 -4 -13 17 31 -15 -82 29 -16
6679a6j0mn2J03oK3j4n1R0K1j35O7Qk0l3k6J3m3R4j0J6N0j5r4L9Rk0o9R0J9k1
$$ -16 -26 -30 -82 21 15 38 24 -27 63 84 -51 16 24 4 -29 -55 -42 -85 9 -1 15 65 50 -44 -5 4 -16 -85 5 24 3
6710CJ4k2M3l6N3M4r7L2k7m3O4k5K8k9mK1M3l4J5j2j2mNRnl8Nk5l2Q6l6Rm8j5
$$ 3 17 -5 38 2 55 99 2 34 7 -36 28 3 31 2 -2 19 62 28 43 31 19 15 20 29 24 -14 -9 -34 -66 20 -16 -7 -55 -70
$$ [...]
8191B0
##END NTUPLES=NMR FID
##END=
