##TITLE=1H_LY-8Dix.3.B
CD3CN, 8 sc,
30.04.2021
##JCAMPDX= 6.0         $$ Bruker NMR JCAMP-DX V2.0
##DATA TYPE= NMR FID
##DATA CLASS= NTUPLES
##ORIGIN= UXNMR, Bruker Analytische Messtechnik GmbH
##OWNER= root
$$ XWIN-NMR		Version 3.5
$$ Fri Apr 30 13:56:59 2021 Russian Standard Time (UT+4h)  she@DPX200
##.OBSERVE FREQUENCY= 200.131506
##.OBSERVE NUCLEUS= ^1H
##.DELAY= (6, 6)
##.ACQUISITION MODE= SIMULTANEOUS
##.ACQUISITION SCHEME= undefined
##.AVERAGES= 8
##.DIGITISER RES= 18
##SPECTROMETER/DATA SYSTEM= spect
##.PULSE SEQUENCE= zg30
##.SOLVENT NAME= CD3CN
##.SHIFT REFERENCE= (INTERNAL, CD3CN, 0, 15.7039)
##AUDIT TRAIL= $$ (NUMBER, WHEN, WHO, WHERE, WHAT)
$$ ##TITLE= Audit trail, XWIN-NMR		Version 3.5
$$ ##JCAMPDX= 5.01
$$ ##ORIGIN= Bruker BioSpin GmbH
$$ ##OWNER= she
$$ F:/spectra/data/she/nmr/1H_Ser DGA-N-1/1/audita.txt
$$ ##AUDIT TRAIL=  $$ (NUMBER, WHEN, WHO, WHERE, WHAT)
(   1,<2021-04-30 13:55:16.10 +0400>,<she>,<DPX200>,
      <created by zg, POWCHK disabled, PULCHK disabled
       configuration hash MD5:
       00 E9 B6 7A A2 85 ED C7 34 08 36 98 17 FE 4E 26
       data hash MD5: 16K
       56 30 B6 E7 2D 60 4F 53 82 B7 BA CA 7A A4 86 AF>)
$$ ##END=
$$ 
$$ hash MD5
$$ F1 A3 4A CB A7 ED A0 A5 C0 56 49 89 A1 17 03 DF
##$RELAX= 
##$RELAX= 
##$RELAX= 
##$RELAX= 
##$RELAX= 
##$RELAX= 
$$ Bruker specific parameters
$$ --------------------------
##$DU= <F:/spectra>
##$EXPNO= 1
##$NAME= <1H_Ser DGA-N-1>
##$PROCNO= 1
##$TYPE= <nmr>
##$USER= <she>
##$AMP= (0..31)
100 100 100 100 100 100 100 100 100 100 100 100 100 100 100 100 100 100 
100 100 100 100 100 100 100 100 100 100 100 100 100 100 
##$AQSEQ= 0
##$AQ_mod= 1
##$AUNM= <au_zg>
##$AUTOPOS= <>
##$BF1= 200.13
##$BF2= 200.13
##$BF3= 200.13
##$BF4= 200.13
##$BF5= 200.13
##$BF6= 200.13
##$BF7= 200.13
##$BF8= 200.13
##$BYTORDA= 1
##$CFDGTYP= 0
##$CFRGTYP= 5
##$CHEMSTR= <none>
##$CNST= (0..31)
1 1 145 1 1 1 1 1 1 1 1 1 1 1 1 1 1 1 1 1 1 1 1 1 1 1 1 1 1 1 1 1 
##$CPDPRG= <>
##$CPDPRG1= <>
##$CPDPRG2= <>
##$CPDPRG3= <>
##$CPDPRG4= <mlev>
##$CPDPRG5= <mlev>
##$CPDPRG6= <mlev>
##$CPDPRG7= <mlev>
##$CPDPRG8= <mlev>
##$CPDPRGB= <>
##$CPDPRGT= <>
##$D= (0..31)
0 1.2 0 0 0 0 0 0 0 0.06 0 0.03 0 0 0 0 0.0002 0 0 0 0 0 0 0 0 0 0 0 0 
0 0 0 
##$DATE= 1619776515
##$DBL= (0..7)
120 120 120 120 120 120 120 120 
##$DBP= (0..7)
150 150 150 150 150 150 150 150 
##$DBP07= 0
##$DBPNAM0= <>
##$DBPNAM1= <>
##$DBPNAM2= <>
##$DBPNAM3= <>
##$DBPNAM4= <>
##$DBPNAM5= <>
##$DBPNAM6= <>
##$DBPNAM7= <>
##$DBPOAL= (0..7)
0.5 0.5 0.5 0.5 0.5 0.5 0.5 0.5 
##$DBPOFFS= (0..7)
0 0 0 0 0 0 0 0 
##$DE= 6
##$DECBNUC= <off>
##$DECIM= 32
##$DECNUC= <off>
##$DECSTAT= 4
##$DIGMOD= 1
##$DIGTYP= 9
##$DL= (0..7)
0 120 120 120 120 120 120 120 
##$DP= (0..7)
150 150 150 150 150 150 150 150 
##$DP07= 0
##$DPNAME0= <>
##$DPNAME1= <>
##$DPNAME2= <>
##$DPNAME3= <>
##$DPNAME4= <>
##$DPNAME5= <>
##$DPNAME6= <>
##$DPNAME7= <>
##$DPOAL= (0..7)
0.5 0.5 0.5 0.5 0.5 0.5 0.5 0.5 
##$DPOFFS= (0..7)
0 0 0 0 0 0 0 0 
##$DQDMODE= 0
##$DR= 18
##$DS= 0
$$ [...]
##$SUBNAM2= <"">
##$SUBNAM3= <"">
##$SUBNAM4= <"">
##$SUBNAM5= <"">
##$SUBNAM6= <"">
##$SUBNAM7= <"">
##$SUBNAM8= <"">
##$SUBNAM9= <"">
##$SW= 16.9725357007746
##$SWIBOX= (0..15)
0 0 2 0 0 0 0 0 0 0 0 0 0 0 0 0 
##$SW_h= 3396.73913043478
##$TD= 16384
##$TD0= 1
##$TE= 0
##$TE2= 300
##$TE3= 300
##$TEG= 300
##$TL= (0..7)
0 120 120 120 120 120 120 120 
##$TP= (0..7)
150 150 150 150 150 150 150 150 
##$TP07= 0
##$TPNAME0= <>
##$TPNAME1= <>
##$TPNAME2= <>
##$TPNAME3= <>
##$TPNAME4= <>
##$TPNAME5= <>
##$TPNAME6= <>
##$TPNAME7= <>
##$TPOAL= (0..7)
0.5 0.5 0.5 0.5 0.5 0.5 0.5 0.5 
##$TPOFFS= (0..7)
0 0 0 0 0 0 0 0 
##$TUNHIN= 0
##$TUNHOUT= 0
##$TUNXOUT= 0
##$USERA1= <user>
##$USERA2= <user>
##$USERA3= <user>
##$USERA4= <user>
##$USERA5= <user>
##$V9= 5
##$VALIST= <valist>
##$VCLIST= <CCCCCCCCCCCCCCC>
##$VD= 0
##$VDLIST= <DDDDDDDDDDDDDDD>
##$VPLIST= <PPPPPPPPPPPPPPP>
##$VTLIST= <TTTTTTTTTTTTTTT>
##$WBST= 1024
##$WBSW= 4
##$XGAIN= (0..3)
0 0 0 0 
##$XL= 0
##$YL= 0
##$YMAX_a= 963528
##$YMIN_a= -927581
##$ZGOPTNS= <>
##$ZL1= 120
##$ZL2= 120
##$ZL3= 120
##$ZL4= 120
##$ABSF1= 10
##$ABSF2= 0
##$ABSG= 5
##$ABSL= 3
##$ALPHA= 0
##$AQORDER= 0
##$ASSFAC= 0
##$ASSFACI= 0
##$ASSFACX= 0
##$ASSWID= 0
##$AUNMP= <proc_1d>
##$AZFE= 0.1
##$AZFW= 0.1
##$BCFW= 1
##$BC_mod= 2
##$BYTORDP= 0
##$COROFFS= 0
##$CY= 11.3945322036743
##$DATMOD= 1
##$DC= 2
##$DFILT= <>
##$DTYPP= 0
##$F1P= 15.9154993809931
##$F2P= -4.1035820241983
##$FCOR= 0.5
##$FTSIZE= 0
##$FT_mod= 4
##$GAMMA= 1
##$GB= 0.15
##$INTBC= 1
##$INTSCL= 1
##$ISEN= 128
##$LB= 0.24
##$LEV0= 0
##$LPBIN= 0
##$MAXI= 10000
##$MC2= 0
##$MEAN= 0
##$ME_mod= 0
##$MI= 1.114404
##$NCOEF= 0
##$NC_proc= 0
##$NLEV= 6
##$NOISF1= 3.799351
##$NOISF2= 2.8
##$NSP= 1
##$NTH_PI= 0
##$NZP= 0
##$OFFSET= 15.70392
##$PC= 1
##$PHC0= -11120.7
##$PHC1= 10.60103
##$PH_mod= 1
##$PKNL= yes
##$PPARMOD= 0
##$PSCAL= 0
##$PSIGN= 0
##$REVERSE= no
##$SF= 200.130013532006
##$SI= 16384
##$SIGF1= 3
##$SIGF2= 2
##$SINO= 400
##$SIOLD= 16384
##$SREGLST= <1H.CDCl3>
##$SSB= 0
##$STSI= 0
##$STSR= 0
##$SW_p= 3612.71676300578
##$SYMM= 0
##$S_DEV= 0
##$TDeff= 0
##$TDoff= 0
##$TI= <>
##$TILT= no
##$TM1= 0
##$TM2= 0
##$TOPLEV= 0
##$USERP1= <user>
##$USERP2= <user>
##$USERP3= <user>
##$USERP4= <user>
##$USERP5= <user>
##$WDW= 1
##$XDIM= 8192
##$YMAX_p= 0
##$YMIN_p= 0
$$ End of Bruker specific parameters
$$ ---------------------------------
##NTUPLES= NMR FID
##VAR_NAME=  TIME,          FID/REAL,        FID/IMAG
##SYMBOL=    X,             R,               I
##VAR_TYPE=  INDEPENDENT,   DEPENDENT,       DEPENDENT
##VAR_FORM=  AFFN,          ASDF,            ASDF
##VAR_DIM=   8192,          8192,            8192
##UNITS=     SECONDS,       ARBITRARY UNITS, ARBITRARY UNITS
##FACTOR=    0.0002944,     1,               1
##FIRST=     0,             0,               0
##LAST=      2.4114304,     0,               0
##MIN=       0,             -927581,         0
##MAX=       2.4114304,     963528,          0
$$ Real data points
##PAGE= N=1
##DATA TABLE= (X++(R..R)), XYDATA
$$ [...]
$$ plain form
2915 -2086 -1283 1875 -662 -2197 1284 1470 -3405 -3546 2791 3406 -4662 -6434 3476 6298 -4243 -7586
2931 -7586 2400 5793 -2293 -5837 632 4488 144 -2841 329 1293 -1137 889 3416 -1251 -3836
2946 -3836 3732 6754 -2608 -6849 2834 9175 -185 -8739 -467 9484 2742 -7468 -2675 5721 2290
2961 2290 -3990 -2532 1207 982 265 214 -2250 -3806 651 5148 -1314 -8361 -1011 8682 1633 -9460
2977 -9460 -3919 7966 5115 -6615 -6594 4190 6787 -1400 -4828 221 3111 1690 153 -2408 -2268
2992 -2268 3113 6028 -653 -7128 -979 8374 4269 -8068 -6301 7518 7843 -5236 -8058 3020
3006 3020 7660 -318 -6487 -2494 3582 3068 -963 -2844 -2142 1270 4625 -280 -7049 -2794 7305
3021 7305 4827 -7174 -7179 5113 8715 -3058 -9609 357 8585 1617 -6429 -2607 4119 3531 -457
$$ packed form
2915b086Q03L158k537j535L481J86m875j41O337O15q068j772R910K822j0541l343
2931g586R986L393q086l544O469L856m344k985L170R64k430K026K527m667k585
2946c836P568L022r362m241R683O341r360q554Q272R951o742j0210M793Q396l431
2961B290o280J458L739k25p17n1k464j556M457M497o462p047P350R693p049j1093
2977i460N541J1885k851j1730K1J0784K597q187l428N049K890j421j537k561J40
2992b268N381K915o681o475O149R353m105j2337J767J3819L25j3079k822J1078
3006C020M640p978o169L993O076n14m031j881P02L412L355m905o769M255J0099
3021G305k478j2001nJ2292L602j1773o551R966Q228o968q046L822O726n88l988
$$ plain form
3036 -457 -3332 -2428 1378 4839 1619 -5453 -4125 5828 6981 -4873 -9181 3090 10494 -1076 -10084
3051 -10084 -1306 8900 3357 -7025 -4751 4002 4162 -1645 -2872 -540 831 2830 1639 -3851
3065 -3851 -5025 3215 7562 -1281 -9165 -764 10077 3120 -10048 -5193 8463 6210 -6529 -6948
3079 -6948 3446 6293 -827 -5151 -1321 1878 1600 460 -2016 -3103 1317 5555 305 -7315 -2376
3094 -2376 7546 4555 -6763 -6092 5918 7377 -3514 -7019 2048 6518 38 -4438 -1066 2362
3108 2362 2080 592 -1094 -2723 -76 4070 1412 -5104 -3398 5586 5021 -5360 -6378 3604 6668
3123 6668 -2572 -6637 558 5155 10 -4210 -809 1693 236 -532 -253 -1667 -1370 2631 3068 -3149
3139 -3149 -4332 3187 5523 -2168 -5927 1928 7048 -259 -5794 254 5714 1091 -3476 -31 3131
$$ packed form
3036d57k875R04L806L461l220p072J328R953J153j1854m308J2271P404j1570r008
3051a0084Q778J0206n543j0382K274Q753J60n807j227K332J371J999j191n490
3065c851j174Q240M347q843p884Q401J0841o957j3168M855J3656k253j2739m19
3079f948J0394K847p120m324L830L199k78j140k476j087M420M238n250p620M939
3094b376R922k991j1318O71J2010J459j0891l505R067M470o480m476L372L428
3108B362k82j488j686j629K647M146k658o516J706Q984n65j0381j018R982L064
3123F668r240m065P195M597n145m220L401K502j457p68K79j414K97M001M37o217
3139c149j183P519K336p691l759P855N120p307n535O048N460m623m567L445L162
$$ plain form
3154 3131 50 -1142 1030 820 -1593 24 2949 -741 -4297 114 4859 -283 -5684 -1181 4571
3169 4571 33 -5685 -1272 4358 387 -5020 -1509 3290 29 -3711 38 2881 -1012 -2838 1633
3184 1633 3085 -1418 -2586 2255 2673 -1818 -1768 3155 2582 -1887 -971 3323 1637 -2725 -449 4094
3200 4094 1190 -3679 -663 4222 1027 -4292 -1199 4087 1099 -4112 -1858 2465 1157 -2388 -1961
3215 -1961 251 -793 -1043 149 -899 -2313 80 2543 -1130 -4834 -371 5028 1000 -5327 -1931
3230 -1931 5237 3148 -3708 -2767 3932 3778 -1203 -1907 1589 2744 1444 867 -219 -1336 1116 4056
3246 4056 469 -4545 -705 5837 2463 -6470 -4441 5363 4850 -4993 -6457 2061 5117 -1941 -5463
3261 -5463 -773 2654 -49 -2144 -2059 -1467 404 2665 545 -5044 -3038 5072 4525 -4705 -5760 4731
$$ packed form
3154C131l081j192K172k10k413J617K925l690l556M411M745n142n401M503N752
3169D571m538n718M413N630l971n407L511M799l261l740L749K843l893j826M471
3184A633J452m503j168M841M18m491N0M923n73m469R16M294j686m362K276M543
3200D094k904m869L016M885l195n319L093N286k988n211K254M323j308l545M27
3215a961K212j044k50J192j048j414K393K463l673l704M463N399m028o327L396
3230a931P168k089o856R41O699j54m981p04L496J155j300n77j086j117K452K940
3246D056l587n014L840O542l374q933K029R804n13r843j464Q518L056p058l522
3261e463M690L427k703k095Q5N92J871K261k120n589K006Q110n47r230j055J0491
$$ plain form
3277 4731 8143 -2212 -7401 1742 8416 1820 -5442 -1393 4997 3458 -779 -1408 -79 1609 2867
3292 2867 936 -3560 -3115 4507 5663 -3850 -8096 1579 8114 -1090 -9522 -2805 7529 2783 -7509
3307 -7509 -5667 3025 4120 -2181 -4723 -1923 1838 2297 20 -3572 -2857 3508 5398 -2119 -6857
3322 -6857 1234 9377 2657 -7046 -2914 7885 6186 -3893 -4945 3355 6530 565 -3719 -1246
3336 -1246 2835 3295 348 -3841 -3364 2606 5186 -1542 -7429 -1202 6990 1832 -8518 -5808 5045
3351 5045 5373 -5059 -7267 974 5047 -500 -4871 -2211 1456 2324 588 -2167 -2758 1386 5505
3366 5505 1395 -5857 -2479 6863 5838 -4486 -5689 5090 8476 -1269 -6657 1030 7472 2068
3380 2068 -4211 -1801 3071 2768 -303 -1831 -2281 -204 2597 887 -4611 -4495 2931 4673 -3965 -8055
$$ packed form
3277D731L412j0355n189R143O674o596p262M049O390j539m237o29J329J688J258
3292B867j931m496M45P622J156r513m246R675O535r204q432O717J0334m746j0292
3307g509J842Q692J095o301k542K800L761M59k277l592P15O365J890p517m738
3322f857Q091Q143o720r703M132J0799j699j0079j052Q300L175n965m284K473
3336a246M081M60k947m189M77N970K580o728n887O227Q192n158j0350K710J0853
3351E045L28j0432k208Q241M073n547m371K660L667Q68j736k755n91M144M119
3366E505m110p252L378R342j025j0324j203J0779L386r745n388P687O442n404
3380B068o279K410M872l03l071j528m50K077K801j710n498J16P426J742q638m090
$$ plain form
3396 -8055 261 6118 -495 -7926 -2519 5412 2337 -4914 -3857 2097 3087 -628 -1645 -361 1132
3411 1132 2462 1975 -1201 -2052 2496 5434 283 -4527 487 6989 2962 -4614 -2731 4925 4260 -2797
3427 -2797 -3205 2145 3071 -615 -2258 -696 358 98 112 -1340 -3005 -988 2350 224 -4637 -2813
3443 -2813 2618 1570 -4192 -3710 2312 3048 -2321 -3376 1098 2273 -722 -1168 892 1082 176 1510
3459 1510 1653 -494 -569 2801 3149 -1506 -1747 3178 4001 -1176 -2754 2513 3206 -1805 -2718 1694 2314
3476 2314 -1850 -2300 1144 888 -3157 -2030 1503 -105 -3740 -1463 2138 -365 -3762 -996 2386
3491 2386 -420 -3569 -291 2698 -574 -2791 1298 3154 -1256 -2553 2428 3862 -1241 -2372 2702
3506 2702 4145 -892 -2687 2092 3844 -392 -2059 1248 2246 -56 -317 823 -91 -1109 865 1361
$$ packed form
3396h055Q316N857o613p431N407P931l075p251J057N954R90l715j017J284J493
3411A132J330m87l176q51M548K938n151m810N014O502m027p576J883P656o65p057
3427b797m08N350R26l686j643J562J054k60J4j452j665K017L338k126m861J824
3443b813N431j048n762M82O022P36n369j055M474J175k995m46K060J90r06J334
3459A510J43k147p5L370L48m655k41M925Q23n177j578N267O93n011r13M412O20
3476B314m164m50L444k56m045J127L533j608l635K277L601k503l397K766L382
3491B386k806l149L278K989l272k217M089J856m410j297M981J434n103j131N074
3506B702J443n037j795M779J752m236j667L307R98k302k61J140r14j018J974M96
$$ plain form
3522 1361 -1877 -2785 1707 2763 -2560 -4959 629 4073 -1713 -5298 -706 3876 254 -4262 -2014
3537 -2014 1996 1210 -1076 -1542 -639 196 2249 1110 -2205 -1902 3005 4339 -1555 -4240 1853 6323
3553 6323 753 -5030 -748 5899 2914 -3449 -2363 2726 3235 -491 -2320 -1043 1193 1800 246
3568 246 -3255 -2762 1981 3891 -2224 -6201 -249 5744 939 -6626 -3280 4987 3929 -4112 -5084 1671
3584 1671 4053 -442 -3152 -1279 1692 2084 939 -2101 -2245 1747 4918 544 -5322 -1399 6296
3599 6296 4581 -5081 -4923 4749 6547 -2512 -6384 740 6190 1200 -4373 -2412 2433 2584 -513
3614 -513 -2653 -2451 955 3376 76 -4864 -3042 4375 4327 -4367 -6599 2061 7041 -719 -7470 -1769
3630 -1769 6199 3095 -4570 -3894 2601 4351 246 -2965 -1603 2014 3891 759 -3780 -2171 3952
$$ packed form
3522A361l238r08M492J056n323k399N588L444n786l585M592M582l622m516K248
3537b014M010p86k286m66R03Q35K053j139l315L03M907J334n894k685O093M470
3553F323n570n783M282O647k985o363J086N089N09l726j829J277K236O07j554
3568B46l501M93M743J910o115l977N952N993m805p565L346Q267j058q041r72O755
3584A671K382m495k710J873K971L92j145l040j44L992L171m374n866L923P695
3599F296j715r662J58R672J798r059l872P124N450m990n573J961M845J51l097
3614e13k140K02L406K421l300m940J822P417m8q694k232Q660M980p760o751N701
3630a769P968l104p665O76O495J750m105l211J362L617J877l132m539J609O123
$$ plain form
3645 3952 4885 -2433 -5806 1467 6957 724 -6324 -2441 5163 3488 -3781 -4128 1570 3745 181
3660 181 -2997 -1854 837 2689 839 -3315 -3225 2562 4782 -1467 -6317 -524 6306 1797 -5883 -3400
3676 -3400 4501 4226 -3054 -4341 1456 3618 -25 -2220 -1073 722 1804 1510 -1388 -2785 830
3691 830 4582 1098 -4946 -2056 5177 3748 -4124 -4492 3365 4795 -1939 -4669 529 3826 357
3706 357 -2498 -1080 685 967 652 -596 -2161 -715 3115 1703 -3330 -3149 2997 4262 -2391 -4921
3722 -4921 1415 4882 -357 -4497 -400 3739 996 -2599 -1242 1482 844 -272 -342 -614 -730 934
3738 934 1659 -1295 -2644 884 3210 -317 -3432 -32 3660 822 -3176 -1214 2332 1328 -1661
3753 -1661 -959 1169 810 -155 130 188 -706 245 1167 1 -1604 111 2181 237 -2093 -701 2111
$$ packed form
3645C952R33p318l373P273N490o233p048L883P604j675p269l47N698K175l564
3660A81l178J143K691J852j850m154R0N787K220o249m850N793O830m509p680K483
3676c400P901k75p280j287N797K162l643k195J147J795J082k94k898j397L615
3691H30L752l484o044K890P233j429p872l68P857J430o734k730N198L297l469
3706C57k855J418J765K82l15j248j565J446L830j412n033J81O146J265o653k530
3722d921O336L467n239m140M097M139k743l595J357K724o38j116p0k72j16J664
3738I34P25k954j349L528K326l527l115L400L692k838l998J962L546j004k989
3753a661P02K128l59r65K85N8q94R51R22j166j605J715K070j944k330J392K812
$$ plain form
3770 2111 600 -2165 -840 1426 230 -1644 -54 1363 -457 -1499 467 1362 -695 -1550 972
3785 972 1551 -1171 -1818 1171 1717 -1036 -1369 998 1266 -1210 -584 1607 973 -1515 -159 2414 677
3802 677 -2091 -98 3069 826 -2646 -727 2861 1157 -2444 -1192 1970 1071 -1573 -1014 591 2
3818 2 -695 207 -63 -1824 -662 1853 455 -2982 -1579 2765 1936 -3256 -2927 2680 3300 -1825 -2968
3835 -2968 1114 3166 104 -1978 -133 1628 1426 292 -455 -638 692 2672 991 -2854 -1495 3674
3851 3674 3082 -2912 -3795 2479 4525 -1182 -4713 -382 4274 1161 -3258 -2407 1260 1888 -353 -2551
3867 -2551 -1928 806 2356 -222 -3595 -2001 3184 3046 -3008 -4762 1605 5005 -454 -4594 -576
3882 -576 4452 2422 -2626 -2190 1827 3107 1101 -1370 -1374 1186 3514 1343 -3120 -2647 3622 4616 -2135
$$ packed form
3770B111j511k765J325K266j196j874J590J417j820j042J966Q95k057q55K522
3785I72N79k722o47K989N46k753l33K367K68k476O26K191o34k488J356K573j737
3802F77k768J993L167k243l472J919L588j704l601J252L162q99k644N59J605n89
3818Bo97R02k70j761J162K515j398l437J403M344q29n192L29N607O20n125j143
3835b968M082K052l062k082J845J761k02j134p47j83J330J980j681l845J359N169
3851C674n92n994q83O274K046n707l531M331M656l113m419Q51L667O28k241k198
3867b551O23K734J550k578l373J594N185j38o054j754O367L400n459m140M018
3882e76N028k030n048M36M017J280k006k471mK560K328k171m463M73O269R94o751
$$ plain form
3899 -2135 -5285 951 5898 687 -6180 -2472 4424 2811 -3776 -4081 919 2625 -309 -2956 -2139
3914 -2139 255 1925 628 -2823 -3279 1332 4221 -562 -5490 -823 5479 2865 -4597 -3531 4095
3929 4095 5340 -1635 -4488 814 4844 1672 -2382 -1493 1813 3306 1075 -2120 -2148 2003 3859 -91
3945 -91 -4397 -1643 4462 3000 -4064 -4750 2045 4394 -1588 -5456 -1153 3756 1491 -3496 -3437 569
3961 569 2388 -12 -2565 -2291 577 3099 340 -3555 -1578 3726 3446 -2056 -3647 1588 5194 782
3977 782 -3682 -659 4049 2654 -1739 -1903 1345 3022 1207 -1599 -1501 672 2241 814 -2493 -2403
3993 -2403 1720 2982 -1882 -4175 24 3277 158 -4198 -2256 2014 1581 -2260 -2742 64 890 -361
4009 -361 -1260 -990 -460 1297 1580 -970 -2047 697 3434 865 -2934 -613 4115 2448 -2497 -1708
$$ packed form
3899b135l150O236M947n211o867L708O896j613o587l05N000J706k934k647Q17
3914b139K394J670j297l451m56M611K889m783m928M667O302k614p462J066P626
3929D095J245o975k853N302M030l172m054Q89L306J493k231l195k8M151J856l950
3945i1m306K754O105j462p064o86O795K349n982l868M303M909k265m987N9M006
3961E69J819k400k553K74K868K522k759l895J977N304k80n502j591N235L606m412
3977G82m464L023M708j395m393j64L248J677j815k806R8K173J569j427l307R0
3993b403M123J262m864k293M199L253l119m356J942M270m33l841m82K806Q26j251
4009c61q99K70N30J757K83k550j077K744K737k569l799K321M728j667m945P89
$$ plain form
4025 -1708 3057 2916 -1101 -1841 1101 2234 171 -690 254 292 -309 186 352 -1610 -1070 1501 1041 -2318
4043 -2318 -2500 960 1709 -1741 -3340 190 2142 -1102 -2776 -139 1229 -441 -1156 -51 571 70
4059 70 60 592 210 -522 523 1806 338 -893 1352 2366 137 -705 1087 1776 338 -453 792
4076 792 1274 -166 -746 878 817 -1394 -894 907 -95 -1562 -944 681 280 -1400 -1233 89 -111
4093 -111 -1364 -617 199 -902 -1236 538 507 -1416 -1014 1190 1051 -1097 -1231 1596 2351 -526 -1472 1243
4111 1243 2035 -277 -733 965 1441 787 294 516 -197 25 1198 1497 -924 -1624 1316 2095 -1584 -2858
4129 -2858 453 2508 -695 -3241 -1066 1894 591 -2529 -1886 590 253 -1079 -1048 -781 -226 970
4145 970 421 -1558 -1683 1042 2722 231 -2726 -276 4137 1608 -2665 -1402 3087 3049 -1231 -2406
$$ packed form
4025a708M765j41m017p40K942J133k063q61R44L8o01M95J66j962N40K571m60l359
4043b318j82L460P49l450j599L530J952l244j674K637J368j670p15J105O22n01
4059G0j0N32l82p32J045J283j468j231K245J014k229q42J792O89j438p91J245
4076G92M82j440n80J624o1k211N00J801j002j467O18J625m01j680J67J322k00
4093a11j253P47Q16j101l34J774l1j923M02K204j39k148j34K827P55k877r46K715
4111A243P92k312m56J698M76o54m93K22p13K22J173K99k421p00K940P79l679j274
4129b858L311K055l203k546K175K960j303l120O43K476l37j332L1K67N55J196
4145I70n49j979j25K725J680k491k957K450M413k529m273J263M489l8m280j175
$$ plain form
4161 -2406 973 3293 1194 -1612 -947 1048 1389 277 -1820 -1613 1259 2665 -946 -3202 -790 2720
4177 2720 1566 -3092 -3535 1554 2895 -1401 -3727 -495 2248 738 -2310 -2496 267 2410 862
4192 862 -2024 -1767 1301 2845 336 -3381 -1255 4184 2774 -2516 -2677 2269 3943 53 -3290 -403
4208 -403 3521 2210 -1614 -1537 1030 2113 840 -1605 -2462 531 2955 332 -3186 -2278 2153 2951
4224 2951 -1980 -4782 145 4345 25 -4392 -1937 2547 2048 -1741 -2881 155 2436 759 -1432
4239 -1432 -1357 470 2542 1528 -2244 -2537 2332 3945 -624 -3661 -112 4295 2027 -3266 -2483 3319
4255 3319 3395 -1686 -3059 587 2747 989 -1514 -2115 162 1742 427 -1776 -2141 610 2879 -193
4271 -193 -3887 -1444 3221 1760 -3030 -2851 1651 3078 -691 -3273 -526 2832 1054 -1579 -1620 635
$$ packed form
4161b406L379K320k099k806O65J995L41j112k097K07K872J406l611k256K412L510
4177B720j154m658m43N089J341m296k326L232K743j510l048j86K763K143j548
4192H62k886K57L068J544k509l717K126N439j410n290j61M946J674l890l343K887
4208d03L924j311l824P7K567J083j273k445q57K993K424k623l518R08M431P98
4224B951m931k802M927M200m320m417K455M484m99l789j140L036K281j677k191
4239a432P5J827K072j014l772k93M869J613m569l037L549M407k268n293P83N802
4255C319P6n081j373L646K160j758k503o01K277J580j315k203l65K751K269l072
4271a93l694K443M665j461m790J79M502J427l769k582K747L358j778k633m1K255
$$ plain form
4287 635 2135 1130 -1080 -1819 1060 2579 344 -2234 -629 2743 2218 -1786 -2223 1571 2683 -329
4303 -329 -2135 -343 1587 1156 -879 -1378 -205 805 398 -802 -1538 -271 1835 846 -2131 -1775 1457
4320 1457 1932 -1383 -2053 606 2265 92 -2065 -231 1729 393 -1109 -112 497 288 378 311 -357
4337 -357 -303 616 1078 -199 -1474 288 2034 324 -1803 -263 1492 455 -1437 -597 1131 567 -945
4354 -945 -637 646 271 -504 -189 214 -551 -624 492 583 -508 -666 487 591 -651 -744 864 888 -722
4373 -722 -597 585 465 -548 -377 647 198 -694 -45 840 240 -1092 -403 942 261 -1076 -452 815
4391 815 331 -455 -230 213 -84 -78 70 51 -452 211 1063 -279 -1107 -84 1466 187 -1277 -778 1146
4410 1146 1165 -680 -982 683 886 -166 -705 -179 240 419 188 -619 -1401 293 1064 -136 -1683 -488
$$ packed form
4287F35J500j005k210p39K879J519k235k578J605L372n25m004m37L794J112l012
4303c29j806J792J930m31k035m99J173J010m07j200p36J267K106r89k977L56L232
4320A457M75l315o70K659J659k173k157J834J960j336j502R97O09k09R0o7o68
4337c57N4R19M62j277j275J762J746j710k127J540J755j037j892Q40J728n64j512
4354i45L08J283l75p75L15M03p65p3J116R1j091j58J153J04j242r3J608K4j610
4373g22J25J182j20j013J71J024m49q92O49Q85o00j332O89J345o81j337O24J267
4391H15m84p86K25M43k97OJ48j9n03O63Q52j342q28J023J550j279j464M99J924
4410A146J9j845l02J665K03j052n39N26M19J79k31q07p82J694P71j200j547J195
$$ plain form
4428 -488 1778 808 -1831 -1369 1381 1546 -1033 -1595 315 1431 -71 -974 -158 496 432 383 -259 -1070
4446 -1070 111 1800 601 -1941 -1181 1935 1847 -1589 -2359 1058 2825 -330 -2706 -162 2311 812
4462 812 -1564 -1437 448 1200 275 -953 -1045 166 1244 220 -1957 -1606 1386 2033 -1091 -2786 182
4479 182 2813 215 -2819 -1229 2156 2182 -1234 -1984 347 2110 869 -1265 -1308 686 1974 754
4495 754 -1515 -1137 1840 2356 -711 -2739 -32 3089 799 -2453 -1804 1637 2125 -889 -2478 -405
4511 -405 1787 747 -1645 -1730 238 1793 542 -2051 -1739 1119 2250 -606 -2757 -458 2704 1324
4527 1324 -2171 -2136 1422 2570 -449 -2392 -160 2112 1280 -738 -1336 374 1896 1071 -1146 -1619
4543 -1619 1106 2587 233 -2475 -1160 2239 1959 -1931 -2428 942 2343 -325 -2587 -850 1865
$$ packed form
4428d88K266r70k639M62K750J65k579n62J910J116j502r03Q16O54o4m9o42q11
4446a070J181J689j199k542P60L116q8l436p70L417J767l155k376K544K473j499
4462H12k376J27J885P52r25j228r2J211J078j024k177L51K992O47l124j695K968
4479A82K631k598l034J590L385K6l416p50K331J763j241k134m3J994J288j220
4495G54k269L78K977N16l067k028K707L121k290l252O49L441M88l014j589K073
4511d05K192j040k392q5J968J555j251k593L12K858J131k856k151K299L162j380
4527A324l495L5L558J148l019j943K232K272q32k018n98J710J522q25k217m73
4543a619K725J481k354k708J315L399k80l890m97L370J401k668k262J737K715
$$ plain form
4558 1865 903 -1119 -1744 -198 1130 555 -1103 -1909 -171 1541 507 -1989 -1592 1539 2309 -792
4574 -792 -2628 111 2818 974 -2153 -1334 2250 1972 -826 -1532 463 1817 896 -778 -863 590 1619
4591 1619 713 -1013 -1264 824 1679 -496 -2130 -359 1889 746 -1937 -1616 777 1170 -856 -1872
4607 -1872 -327 815 271 -1134 -992 -128 942 387 -1010 -1083 420 1363 -21 -1310 -326 1497 899
4624 899 -1068 -586 1252 1271 -276 -716 328 917 246 -151 109 238 356 491 46 -683 -174 867 415
4643 415 -1120 -806 622 523 -1032 -1176 372 529 -862 -967 221 196 -633 -515 338 -189 -616 -11 418
4662 418 -36 -821 370 967 145 -543 387 885 199 -257 644 1050 90 -94 776 727 -297 -203 699 589
4682 589 -514 -692 526 536 -564 -793 324 604 -260 -840 -82 185 -338 -504 -184 -542 -422 2 -79
$$ packed form
4558A865r62k022o25J546J328n75j658q06J738J712j034k496L97L131P70l101
4574g92j836K739K707j844l127Q19L584k78k798p06J995J354r21j674q5J453J029
4591A619r06j726k51K088Q55k175j634J771K248j143k683L21K393L93k026j016
4607a872J545J142n44j405J42Q64J070n55j397p3J503R43j384j289R84J823n98
4624H99j967M82J838J9j547m40J044N89o71l97K60J29J18J35m45p29N09J041m52
4643D15j535L14J428r9j555j44J548J57j391j05J188k5q29J18Q53n27m27O05M29
4662D18m54p85J191N97q22o88R30M98o86m56R01M06r60j84Q70m9j024R4R02j10
4682E89j103j78J218J0j100k29J117K80q64n80P58K67n23j66L20l58J20M24q1
$$ plain form
4701 -79 -795 -385 253 510 -688 -911 245 1026 9 -1022 15 984 584 -498 -571 599 887 357
4719 357 -161 -120 717 1069 472 -625 -218 1183 928 -813 -1211 262 1359 -119 -1432 -729 949 257
4737 257 -1119 -1178 -95 456 -30 -930 -1103 -104 668 61 -1112 -1017 865 1401 -528 -1654 186 1985
4755 1985 644 -1521 -498 1645 1445 -480 -794 445 1464 728 -458 -409 523 1085 502 -611 -909
4772 -909 688 1515 -90 -1778 -501 1516 935 -1746 -1782 693 1367 -800 -2161 -298 1169 451 -1484
4789 -1484 -1368 37 866 347 -979 -1282 520 1391 357 -1430 -654 1804 1672 -956 -1741 1030 2355
4806 2355 467 -1824 -197 1979 1374 -792 -1238 542 1389 519 -1080 -911 489 1468 89 -1670
4822 -1670 -917 1103 1145 -1373 -2031 37 1493 61 -2097 -1185 1012 1247 -954 -1496 -94 1251 567
$$ packed form
4701g9p16M10O38K57j198k23J156P81j017j031J037R69m00j082p3J170K88n30
4719C57n18M1Q37L52n97j097M07J401k55j741l98J473J097j478j313P03J678o92
4737B57j376n9J083N51m86r00j73R99P72o07j173R5J882N36j929j126J840J799
4755A985j341k165J023K143k00j925l14J239J019p36j186M9R32N62n83j113k98
4772i09J597Q27j605j688J277K017n81k681l6K475O74k167j361J863J467p18j935
4789a484J16J405Q29n19j326l03J802Q71j034j787P76K458j32k628p85K771J325
4806B355j888k291J627K176o05k166m46J780Q47q70j599J69J400R79j379j759
4822a670P53K020M2k518o58K068J456j432k158R12K197K35k201n42J402J345o84
$$ plain form
4839 567 -967 -1101 236 1593 524 -1412 -917 1423 1589 -645 -1462 495 2041 530 -1579 -552
4855 -552 1252 1182 -437 -846 90 1123 670 -502 -943 -96 992 612 -964 -1438 546 1467 -131 -2002
4873 -2002 -634 1352 500 -1812 -1608 661 1056 -290 -1556 -139 846 634 -662 -796 144 848 527
4890 527 -520 -757 258 1371 408 -1095 -500 1286 1092 -806 -1094 784 1619 50 -1124 -345 908
4907 908 590 -561 -774 140 585 300 -732 -573 319 582 301 -1026 -716 582 728 -610 -1166 81
4925 81 967 -101 -897 -351 631 437 -297 -464 445 489 102 -260 -62 314 507 77 -234 -16 185 563
4945 563 -267 -332 130 734 -40 -250 -142 447 185 -483 -210 280 -56 -379 -11 215 13 -280 -32 -108 -326
4966 -326 -413 221 -95 -213 0 153 33 -455 85 543 -342 -379 108 506 -193 -387 358 783 86 -493 297
$$ packed form
4839E67j534j34J337J357j069j936M95K340J66k234q17J957J546j511k109J027
4855e52J804p0j619m09R36J033m53j172m41Q47J088l80j576m74J984R21j598j871
4873b002J368J986q52k312K04K269L95j346j266J417R85k12j296j34R40P04l21
4890E27j047k37J015J113r63j503N95J786j94j898k88J878Q35j569j174P79J253
4907I08l18j151k13R14M45k85j032J59Q92K63k81j327L10J298J46j338n56J247
4925H1Q86j068p96N46R82j94p34j67R09M4l87l62J98L76J93m30l11K18K01L78
4945E63q30o5M62O04p74k10J08N89k62o68K73M90l36l23L68K26k02k93K48p6k18
4966c26q7O34l16j18K13J53j20m88N40M58q85l7M87L98o99j94P45M25o97n79P90
$$ plain form
4987 297 646 120 -427 38 635 149 -170 -164 115 -52 -161 170 -268 -442 22 628 -137 -847 -275 812
5007 812 172 -948 -478 646 464 -587 -688 235 560 -45 -454 -41 437 379 22 -394 -450 433 768 -204
5027 -204 -1032 -184 989 361 -750 -694 762 756 -318 -895 106 875 181 -724 -349 206 634 121 -685
5046 -685 -666 605 996 -24 -1097 -194 1055 511 -1052 -769 725 1019 -603 -1207 80 872 392 -862
5064 -862 -600 171 945 79 -592 -583 323 805 -22 -1292 -576 1189 852 -835 -1194 694 1159 -339 -1389
5083 -1389 -288 1104 601 -475 -763 177 767 318 -808 -738 287 819 350 -894 -563 1027 1182 -647
5101 -647 -1471 145 1666 442 -1292 -675 1044 986 -865 -1263 156 974 172 -726 -575 330 700 63
5119 63 -835 -396 695 1009 -250 -1249 7 1267 527 -1130 -955 595 1151 -248 -1171 -62 1127
$$ packed form
4987B97L49n26n47M65N97m86l19OK79j67j09L31m38j74M64O06p65p10N72J087
5007H12o40j120M70J124j82j051j01R23L25o05m09M13M78n8l57m16n6Q83L35r72
5027b04q28Q48J173o28j111N6J456oj074n77J001P69o94r05L75N55M28n13q06
5046f85J9J271L91j020j073R03J249n44j563K83J494K94j622o04J287P92m80j254
5064h62K62P71P74q66o71RR06M82q27j270P16J765l37j687l59J888M65j498j050
5083a389J101J392n03j076k88R40N90m49j126P0J025N32m69j244L31J590J55j829
5101f47q24J616J521j224j734O17J719n8j851l98J419Q18q02q98J51R05L70o37
5119F3q98M39J091L14j259r99J256J260p40j657J75J550N56j399r23J109J189
$$ plain form
5136 1127 541 -724 -927 334 942 122 -777 -534 954 1025 -54 -1046 -69 1000 483 -830 -1010 784
5154 784 865 -271 -1232 -174 743 310 -653 -600 116 539 160 -673 -830 206 702 38 -922 -342 949
5173 949 768 -679 -886 637 930 50 -1129 -134 894 485 -492 -567 179 419 259 -182 -500 34 672
5192 672 431 -665 -624 633 746 -588 -999 197 949 -8 -926 -579 606 403 -586 -533 -78 471 57
5211 57 -320 -353 -207 165 456 -337 -719 237 896 -241 -890 -27 615 484 -822 -434 704 729 -296 -400
5231 -400 432 608 242 -346 12 347 439 324 -81 -260 -11 309 -30 -352 -176 255 121 -537 -275 262
5251 262 71 -362 -380 -31 17 -263 -299 -106 22 -67 -159 -21 -185 79 188 166 -153 152 337 146 43 227
5273 227 469 185 -215 41 444 137 -412 154 413 -1 -296 -13 495 340 -346 -520 156 181 -75 -252
$$ packed form
5136A127n86j265k03J261O08q20q99K43J488P1j079r92R77J069n17j313j80J794
5154G84Q1j136r61J058R17m33r63N3P16M23l79q33j57J036M96o64r60N80J291
5173I49j81j447k07J523K93q80j179R95J028m09r77p5P46K40j60m41l18N34O38
5192F72k41j096M1J257J13j334m11J196P52r57r18L47J185k03r89N3M55N49m14
5211E7l77l3J46L72K91p93l82R56O59j137o49Q63O42j31j306L88J138K5j025j04
5231d00Q32J76l66n88L58L35R2j15m05j79K49L20l39l22J76M31j34o58K62N37
5251B62j91m33j8L49M8k80l6J93J28q9r2J38j64K64J09k2l19L05J85j91j03J84
5273B27K42k84m00K56M03l07n49N66K59m14k95K83N08j55o86j74O76K5k56j77
$$ plain form
5293 -252 -225 57 -156 -48 -199 -364 91 62 -136 -789 -166 575 297 -743 -358 628 527 -385 -742 151
5313 151 858 -21 -369 -124 547 620 -99 -170 80 513 650 66 -546 9 859 558 -481 -470 389 916 -302
5334 -302 -1065 -110 731 199 -833 -670 76 490 -359 -843 -556 239 201 -253 -978 -271 666 252 -553 -793
5354 -793 341 892 -18 -723 -26 862 737 -468 -596 637 857 242 -399 -343 662 878 -72 -759 -21
5373 -21 733 580 -604 -769 366 1013 -214 -1199 -267 927 462 -885 -923 82 465 -88 -1012 -635 235
5392 235 346 69 -865 -508 781 968 -487 -1038 272 1277 319 -898 -345 1021 906 -538 -778 533
5410 533 1267 302 -568 -352 372 828 71 -687 -225 625 954 -460 -892 -196 1074 580 -1246 -1028 407
5429 407 816 -495 -1372 -399 775 179 -1062 -852 470 710 56 -708 -560 499 993 -84 -593 -91
$$ packed form
5293b52K7K82k13J08j51j65M55k9j98o53O23P41k78j040L85R86j01r12l57Q93
5313A51P07q79l48K45O71P3p19p1K50M33J37n84o12N55Q50l01j039J1Q59N27j218
5334c02p63R55Q41n32j032J63P46M14q49m84K87P95l8m54p25P07R37m14q05k40
5354g93J134N51r10p05O97Q88j25j205j28J233K20o15o41N6J005K16r50o87P38
5373b1P54j53j184j65J135O47j227r85R32J194m65j347l8J005L83n53r24L77Q70
5392B35J11k77r34L57J289J87j455n51J310J005r58j217N53J366j15j444k40J311
5410E33P34r65q70K16P24M56p57p58M62Q50L29j414m32O96J270m94j826K18J435
5429D07M09j311q77R73J174n96j241K10J322K40o54p64J48J059M94j077n09N02
$$ plain form
5447 -91 1005 573 -759 -826 765 1183 77 -793 -46 1069 549 -388 -737 254 730 -30 -777 -363 525
5466 525 567 -228 -889 -461 615 371 -953 -904 211 766 -301 -1170 -469 711 251 -532 -526 172 662 149
5486 149 -412 -252 217 404 62 -525 -123 781 474 -153 -514 77 1029 40 -481 -43 718 610 -157 -409
5506 -409 261 457 36 -326 -169 66 9 207 -311 -506 2 330 -52 -582 -426 467 395 -502 -877 329
5526 329 607 -293 -534 161 414 109 -255 -251 323 229 -70 -21 -184 45 279 291 -175 -169 172 535 -47 -324
5548 -324 101 488 -42 -411 -43 340 115 -441 -132 178 -144 -102 -65 -38 -36 -76 -27 -222 -188 -94 -199 -187 -293
5571 -293 136 116 -282 -179 287 56 -151 -20 218 217 -157 -29 307 442 -12 -334 27 343 143 -242 110
5592 110 -74 -45 61 -39 -153 -6 337 -21 -632 -131 433 197 -589 -417 387 449 -297 -864 -61 638 124
$$ packed form
5447i1J096m32j332o7J591M18j106q70P47J115n20r37l49R91M76p60p47M14Q88
5466E25M2p95o61M28J076k44j324M9J115N55j067q69P01J180m60p83OO98M90n13
5486A49n61J60M69J87l42n87M02R04l07o27l61N91R52r89n21M38P61j08p67k52
5506d09O70J96m21l62J57K35n7J98n18j95N08L28l82n30J56Q93p2q97l75J206
5526C29K78r00k41O95K53l05l64MN74r4k99M9j63K29K34J2m66OL41L63n82k77
5548c24M25L87n30l69L68L83k25n56L09L10l22M2L7K7Km0M9j95L4R4j05J2j06
5571b93M29k0l98J03M66k31k07J31K38jl74J28L36J35m54l22L61L16k00l85L52
5592A10j84K9J06j00j14J47L43l58o11N01N64k36p86J72Q04O2p46n67Q03O99n14
$$ plain form
5613 124 -772 -429 406 348 -173 -184 -130 146 57 -505 -640 -159 166 135 -342 -798 541 1136 -96 -247 140
5634 140 1106 100 -906 109 914 734 67 -522 -165 235 337 -244 -444 -92 525 379 -571 -583 64
5653 64 722 85 -913 -486 698 815 -707 -922 179 896 37 -735 -377 778 538 -262 -621 -188 850
5672 850 742 -205 -880 394 785 359 -1003 -247 812 832 -450 -866 39 936 403 -663 -585 472 857
5691 857 -127 -732 -430 832 592 -520 -619 125 951 185 -1037 -596 751 1055 -593 -959 -60 1074
5709 1074 412 -847 -484 706 855 -206 -790 -166 569 486 -365 -795 -184 971 596 -900 -792 398
5727 398 1202 -234 -1244 -303 1157 472 -629 -780 465 805 -109 -690 -319 524 613 -251 -531 -117 673
5746 673 707 -358 -887 53 1264 190 -1022 -357 1030 925 -564 -895 440 551 19 -705 -564 385
$$ packed form
5613A24q96L43Q35n8n21j1N4K76q9n62j35M81L25l1m77m56J339N95j232j51L87
5634A40R66j006j006J015Q05j80o67n89L57M00J02n81k00L52O17j46r50j2O47
5653F4O58o37r98M27J184J17j522k15J101P17q59p72L58J155k40q00l59M33J038
5672H50j08r47o75J274L91m26j362P56J059K0j282m16R05Q97n33j066P8J057L85
5691H57r84o05L02J262k40j112r9P44Q26p66j222M41J347L04j648l66Q99J134
5709A074o62j259L63J190J49j061n84O24P35q3q51m30O11J155l75j496J08J190
5727C98Q04j436j010R41J460o85j101j51J245L40r14n81L71Q43Q9q64k80M14P90
5746F73L4j065n29R40J211j074j212O65J387j05j489l31J335J11n32p24J41R49
$$ plain form
5764 385 693 -77 -774 -165 481 482 -218 -774 64 930 86 -882 -560 926 852 -390 -948 147 830 209
5784 209 -859 -361 471 608 296 -378 -73 565 391 -350 -634 258 639 48 -633 -382 592 632 -362 -746
5804 -746 170 314 91 -598 -308 78 39 -124 -342 -314 68 525 94 -483 -382 541 369 -250 -553 406 407
5825 407 -184 -504 -239 725 22 -415 13 479 69 -65 -117 -102 -28 295 344 173 -417 -43 209 97 -517
5846 -517 -8 569 -73 -405 -284 210 -101 -479 -154 242 359 -227 -155 298 131 239 -226 38 -313 295
5866 295 60 344 260 353 93 1145 -91 493 -197 129 -1 295 -57 542 420 -314 511 497 173 88 427
5887 427 165 -79 -325 -432 374 -133 369 -568 -101 39 396 -465 -215 90 177 -285 -569 -437 654 172
5907 172 -227 -534 645 781 -613 236 377 1151 315 -285 -478 788 559 134 -746 -138 727 643 -220
$$ packed form
5764C85L08p70o97O09O46Jp00n56Q38Q66q44r68L22J486p4j242n58J095O83o21
5784B09j068M98Q32J37l12o74L05O38j74p41k84Q92L81n91o81K51R74M0r94l84
5804g46R16J44k23o89K90L86l9j63k18K8L82M57m31n77J01R23j72o19l03R59J
5825D07n91l20K65R64p03m37M28M66m10j34n2J5P4L23M9j71n90L74K52j12o14
5846e17N09N77o42l32J21M94l11l78L25L96J17n86P2M53j67J08m65K64l51O08
5866B95k35K84q4R3k60J052j236N84o90L26j30K96l52N99j22p34Q25j4l24q5L39
5887D27k62k44k46j07Q06n07N02r37M67J40L57q61K50L05Q7m62k84J32J091m82
5907A72l99l07J179J36j394Q49J41P74q36o00j93J266k29m25q80O08Q65q4q63
$$ plain form
5926 -220 -768 273 674 124 -808 -531 1042 785 -667 -722 130 807 -257 -771 -454 436 344 -472 -614
5945 -614 -537 169 520 -426 -907 -28 1003 184 -812 -880 719 978 -384 -1164 254 1327 219 -794
5963 -794 -480 980 919 -196 -547 111 833 731 -424 -727 211 848 543 -924 -718 506 961 -300
5981 -300 -1377 -247 806 291 -974 -987 390 861 -324 -1133 -554 604 721 -503 -1129 -288 927
5998 927 298 -736 -880 681 1055 -201 -1117 -173 1367 811 -445 -769 652 1336 212 -791 -377
6015 -377 706 800 -239 -866 1 981 555 -717 -1071 301 845 152 -1411 -532 761 524 -840 -1201
6033 -1201 101 716 50 -1075 -668 557 612 -212 -978 -486 524 747 -261 -897 173 1290 621 -821
6051 -821 -354 951 996 -328 -648 414 1166 528 -670 -319 689 729 -7 -572 -93 463 441 -461 -736
$$ packed form
5926b20n48J041M01n50r32K77J573k57j452n5Q52O77j064n14L17Q90r2q16j42
5945f14P7P06L51r46m81Q79J031q19r96o8J599K59j362p80J418J073j108j013
5963g94L14J460o1j115l51O58P22j02j155l03R38O37l05j467K06J224M55j261
5981c00j077J130J053n15j265j3J377M71j185q09N79J158J17j224o26Q41J215
5998I27o29j034j44J561L74j256r16R44J540n56j256l24J421O84j124j003M14
6015c77J083R4j039o27Q67R80m26j272l54J372N44o93j563Q79J293k37j364l61
6033a201J302O15o66j125M07J225N5q24p66M92J010K23j008o36J070J117o69j442
6051h21M67J305M5j324l20J062P52o38j198L51J008M0p36n65M79N56k2r02k75
$$ plain form
6070 -736 -227 545 492 -897 -1065 335 757 -300 -1202 -397 577 403 -788 -1044 322 767 -238 -811
6088 -811 -258 475 469 -217 -494 34 743 516 -166 -240 385 986 315 -679 -67 814 757 -271 -493 227 725
6109 725 77 -534 -310 414 250 -13 -423 -262 239 67 -290 -448 33 357 -58 -635 -81 238 115 -399
6129 -399 -314 142 253 -73 -92 59 116 215 61 304 -52 12 328 229 -376 -48 328 393 133 -106 314 371 37
6152 37 86 185 -7 -198 -195 129 -67 -156 107 237 -13 -548 -269 288 -57 -433 -128 3 -97 -493 -255 -1
6174 -1 -179 -81 -65 -61 -242 204 369 297 -335 -152 522 541 -190 -138 454 545 200 -316 232 545 95 38 -19 164
6198 164 135 106 -71 -382 -248 312 38 -598 -377 212 407 -295 -766 -110 329 168 -562 -282 224 319 -54
6219 -54 -446 -297 413 451 -254 -586 11 685 285 -387 -428 480 720 -164 -596 0 896 571 -498 -666 507
$$ packed form
6070g36N09P72n3j389j68J400M22j057r02Q05R74j74j191k56J366M45j005n73
6088h11N53P33oo86k77N28P09k27o82p4O25O01o71r94O12Q81n7j028k22P20M98
6109G25o48o11K24P24j64k63m10J61N01j72l57j58M81L24m15n77N54L19j23n14
6129c99Q5M56J11l26j9J51N7R9j54K43l56O4L16r9o05L28L76O5k60k39M20N7l34
6152C7M9R9j92j91LL24j96q9K63J30k50n35K79N57l45l76L05J31j00l96K38K54
6174aj78R8J6Mj81M46J65p2o32J83O74J9p31N2N92R1l45n16N48L13m50n7n7J83
6198A64k9k9j77l11J34N60k74o36K21N89J95p02m71O56M39j61p30K80N06R5l73
6219e4l92J49P10L8p05l32N97O74m00o72m1R08K40q84m32N96Q96l25j069j68J173
$$ plain form
6240 507 769 21 -387 -497 501 373 58 -873 -189 768 515 -703 -1073 186 959 -161 -1294 -328 923
6259 923 418 -805 -1066 282 1101 -92 -975 -411 652 761 -332 -671 -156 824 486 -461 -806 395
6277 395 1155 338 -1089 -771 1201 1096 -336 -1036 337 1359 134 -1158 -637 645 832 -501 -914
6294 -914 -260 632 595 -621 -958 112 1145 184 -1260 -907 847 1112 -282 -1498 -100 1072 560
6311 560 -1085 -807 806 953 -338 -1033 -288 952 749 -376 -944 264 950 558 -1016 -812 704
6328 704 1174 -78 -1260 -152 1159 618 -745 -780 448 948 112 -787 -479 765 780 -142 -1081 -247
6346 -247 873 713 -695 -750 408 1236 -279 -1099 -119 1097 612 -781 -743 505 968 79 -730 -503
6364 -503 426 594 -34 -673 -128 630 754 -471 -913 -9 1067 283 -944 -564 870 911 -385 -907 228
$$ packed form
6240E07K62p48m08j10R98j28l15r31O84R57k53j218l70J259P73j120j133R66J251
6259I23n05j223k61J348Q19j193q83N64J063J09j093l39N15R80l38r47l45J201
6277C95P60q17j427L18J972j05j432p00J373J022j225j292N21J282J87j333m13
6294i14O54Q92l7j216l37J070J033r61j444L53J754K65j394j216J398J172n12
6311E60j645K78J613J47j291o95P45J240k03j125n68J208O86l92j574K04J516
6328G04M70j252j182J108J311n41j363l5J228N00q36q99L08J244J5r22r39Q34
6346b47J120j60j408n5J158Q28j515q20R80J216m85j393L8J248M63q89q09K27
6364e03R29J68o28o39N45P58J24j225m42R04J076p84j227L80J434M1j296n22J135
$$ plain form
6383 228 875 254 -722 -417 399 646 -36 -595 -291 281 585 -366 -605 -171 697 361 -803 -710 521 655
6403 655 -108 -751 27 722 223 -430 -455 239 267 -64 -523 -172 445 354 42 -506 -120 435 237 -337 -355
6424 -355 277 407 -79 -610 83 522 145 -524 -307 210 322 -17 -220 252 226 146 30 -193 123 79 142
6445 142 -164 -109 71 172 -67 134 2 40 -123 -109 66 135 -191 -510 160 -116 -219 -423 83 260 -143
6466 -143 -296 -153 0 47 -17 69 77 279 53 62 -76 -143 377 192 -24 -141 464 406 154 -526 -3 823 161
6489 161 -310 -253 572 378 -475 -286 127 298 10 -542 -244 101 213 -263 -342 -469 -73 414 -30 -715 -359
6510 -359 563 245 -475 -396 227 595 -169 -759 136 608 298 -347 -423 134 492 417 -204 -379 346 741 342
6531 342 -761 -226 492 729 -493 -850 51 771 293 -845 -678 381 578 -465 -955 -410 540 527 -532
$$ packed form
6383B28O47o21r76L05Q16K47o82n59L04N72L04r51k39M34Q68l36j164R3J231J34
6403F55p63o43P78O95m99o53k5O94K8l31m59L51O17r1l12n48L86N55j98n74j8
6424c55O32J30m86n31O93M39l77o69K17N17J12l39k03M72k6q0j16k23L16m4O3
6445A42l06N5J80J01k39K01j32L8j63J4J75O9l26l19O70k76j03k04N06J77m03
6466a43j53J43J53M7o4Q6QK02k26Rj38o7N20j85k16j17O05n8k52o80N23Q26o62
6489A61m71N7Q25j94q53J89M13J71k88n52K98L45J12m76p9j27L96M87m44o85L56
6510c59R22l18p20P9O23L68p64n90Q95M72l10o45p6N57L58p5o21j75P25L95l99
6531C42j103N35P18K37j222l57R01P20m78j138J67J059J97j043m90N45R50j3j059
$$ plain form
6550 -532 -1124 13 918 229 -971 -672 514 990 -340 -1106 285 889 430 -673 -428 632 984 74
6568 74 -501 -11 816 840 3 -799 205 1283 461 -874 -878 371 1240 -319 -1380 -278 1202 417 -1030
6587 -1030 -857 402 749 -408 -1192 -549 449 515 -438 -999 -183 826 610 -716 -1045 351 1449 29
6605 29 -1198 -297 1087 894 -751 -916 298 1162 357 -899 -220 1086 1111 -104 -707 47 1130 767
6623 767 -606 -772 212 1013 71 -1054 -693 705 802 -580 -1197 -3 969 220 -1141 -904 439 818
6641 818 -266 -972 -497 813 563 -772 -916 202 1106 358 -914 -444 697 930 -195 -925 31 1089
6659 1089 356 -447 -477 600 1051 227 -526 -482 693 784 -214 -732 -91 768 539 -866 -702 389 838
6678 838 -271 -985 -401 594 195 -683 -654 10 527 -287 -709 -372 241 465 -40 -531 -213 586 326 -339
$$ packed form
6550e32n92J137R05o89j200K99J186M76j330p66J391O04m59j103K45J060L52r10
6568G4n75M90Q27K4q37q02J004J078q22j335mJ249Q69j559j061J102J480p85j447
6587a030J73J259L47j157p84O43R98O6r53n61Q16J009k16j326l29J396J098j420
6605B9j227R01J384j93j645j65J214Q64q05j256O79J306K5j215o03P54J083l63
6623G67j373j66R84Q01r42j125L61J398R7j382o17J194R72p49j361K37J343L79
6641H18j084p06M75J310k50j335j44J118R04p48j272M70J141K33j125p30R56J058
6659A089p33q03l0J077M51q24p53M4J175R1r98n18O41Q59k29j405J64J091M49
6678H38j109p14N84R95l99q78K9O64N17q14m22L37O13K24n05m91L18P99k60o65
$$ plain form
6698 -339 -401 302 948 250 -561 -169 764 618 10 -381 248 609 104 -354 160 376 110 -92 -206 -85
6718 -85 30 200 -197 -461 -184 432 123 -623 -454 174 202 -314 -562 145 271 139 -334 -230 115 382 -265
6739 -265 35 96 234 231 77 -73 217 317 119 166 96 245 -23 105 409 236 148 -91 -131 159 158 -140 -263
6762 -263 126 102 5 -358 -35 -24 -108 -309 -188 -82 -10 -338 -414 -411 201 277 -404 -552 -27 513 51 -613 154
6785 154 544 294 -420 -323 633 729 230 -300 -20 707 506 41 2 62 348 395 -162 -388 155 269 291 -489
6807 -489 -316 310 646 -395 -802 30 535 2 -1025 -648 327 598 -503 -670 -107 320 52 -465 -452
6826 -452 -1 568 298 -625 -504 599 625 -124 -639 -28 895 479 -447 -402 541 823 135 -368 -87 705
6846 705 709 -212 -455 78 499 120 -665 -812 14 665 -74 -879 -355 366 304 -376 -1118 -158 831 -35 -989
$$ packed form
6698c39o2P03O46o98q11L92R33j46o08l91O29L61n05m58N14K16k66k02j14J21
6718h5J15J70l97k64K77O16l09p46J69O28K8n16k48P07J26j32m73J04L45K67o47
6739b65L00O1J38lj54j50K90J00j98M7p0J49k68J28L04j73q8k39m0K90jk98j23
6762b63L89k4r7l63L23J1q4k01J21J06P2l28p6LO12P6o81j48N25N40m62o64P67
6785A54L90k50p14R7R56R6m99n30K80P27k01m65l9O0K86M7n57k26N43J14K2p80
6807d89J73O26L36j041m07Q32N05n33j027L77R75K71j101j67N63M27k68n17J3
6826d52M51N69k70r23J21J103K6p49n15O11R23m16r26M5R43K82o88n03K81P92
6846G05Mr21k43N33M21l79p85j47Q26O51p39q05N24P21o2o80p42R60R89q66r54
$$ plain form
6867 -989 -650 598 622 -166 -803 -211 911 571 -662 -727 420 1207 170 -676 -435 882 853 -203 -556
6886 -556 231 881 530 -617 -531 359 836 -79 -625 -538 657 778 -446 -980 -1 784 217 -910 -810
6905 -810 648 911 -197 -1240 -68 1061 317 -740 -821 438 889 -54 -742 -232 714 563 -242 -673
6923 -673 122 985 750 -567 -756 638 1211 121 -825 -255 812 754 -697 -913 321 929 -176 -895
6941 -895 -273 582 816 -160 -985 -201 859 161 -569 -888 42 674 -43 -997 -403 631 450 -391 -739
6960 -739 53 847 418 -818 -431 566 616 -228 -556 -207 622 599 -395 -532 232 774 45 -774 -342 488
6980 488 731 -348 -679 243 588 122 -434 -397 217 599 -73 -625 -323 305 225 -254 -515 -100 496 308
7000 308 -472 -276 327 360 -140 -605 -38 397 74 -423 -162 215 244 113 -258 -273 66 492 -83 -276 -118
$$ packed form
6867i89L39J248K4p88o37N92J122l40j233o5J147P87j037q46K41J317k9j056l53
6886e56P87O50l51j147Q6Q90M77r15n46Q7J195J21j224n34R79P85n67j127J00
6905h10J458K63j108j043J172J129p44j057q1J259M51r43o88N10R46j51q05m31
6923f73P95Q63k35j317j89J394N73j090r46N70J067n8j451k16J234O08j105p19
6941h95O22Q55K34r76q25P84J060o98p30l19R30O32p17r54N94J034j81q41l48
6960g39P92P94m29j236L87R97N0q44l28L49Q29k3r94j37P64N42p29q19M32Q30
6980D88K43j079l31R22L45m66n56L7O14L82o72n52L02O28q0m79k61M15N96j88
7000C08p80J96O03L3n00m65N67M35l23m97K61L77K9j31l71j5L39M26n75j93J58
$$ plain form
7021 -118 238 149 -499 -408 146 536 20 -386 50 29 -38 -186 41 92 283 -220 -294 161 -22 -80 26 -86
7043 -86 -149 58 181 62 -78 96 -13 122 -88 -355 187 -9 -32 -169 242 200 -448 101 32 38 95 -43 -81
7066 -81 27 -205 -146 111 256 -8 -49 -224 156 212 -146 -293 -1 344 145 -231 -390 181 552 11 -314
7087 -314 168 461 185 -275 -216 143 251 -120 -319 -165 200 359 -375 -551 -154 368 427 -389 -517 174 467
7108 467 -78 -598 -160 636 93 -586 -533 263 525 -110 -492 -152 358 433 -223 -508 236 693 194 -334 -682
7129 -682 420 750 61 -732 -266 761 401 -517 -677 441 771 36 -828 -277 606 426 -88 -636 53
7148 53 526 267 -705 -533 254 414 -95 -766 -380 648 809 -224 -849 -102 742 204 -730 -560 650
7167 650 868 -219 -622 -131 783 524 -343 -423 35 642 217 -607 -330 500 598 -200 -673 -367 844 520
$$ packed form
7021a18L56q9o48R1N54L90n16m06M36k1o7j48K27N1J91n03p4M55j83n8J06j12
7043h6o3K07J23j19j40J74j09J35k10k67N42j96k3j37M11m2o48N49o9ON7j38l8
7066h1J08k32N9K57J45k64m1j75L80N6l58j47K92L45j99l76j59N71L71n41l25
7087c14M82K93k76m60N9L59J08l71j99J54L65J59p34j76L97N22N9q16j28O91K93
7108D67n45n20M38P96n43o79N3P96K62o35l82L40N10P5o56k85P44M57m99n28l48
7129f82J102L30o89p93M66J027l60r18j60J118L30p35q64N51Q83j80n14n48O89
7148E3M73k59r72J72P87J60n09o71L86J028J61j033o25P47Q44n38r34J70J210
7167F50K18j087m03M91R14k59q67q0M58O07m25q24K77Q30R8p98m73L06J211l24
$$ plain form
7187 520 -545 -944 158 442 -101 -673 -489 430 393 -333 -746 -134 631 288 -829 -723 404 720 -91
7206 -91 -933 -142 704 397 -421 -422 436 639 -60 -558 -218 423 607 -75 -757 -8 866 435 -355 -531 221
7227 221 844 299 -751 -417 673 371 -529 -635 166 587 112 -771 -691 300 425 -247 -715 -282 577 418
7247 418 -400 -729 65 811 97 -834 -474 442 670 -267 -797 145 845 331 -349 -221 472 650 39 -508
7267 -508 -249 410 371 -169 -351 -8 684 343 -587 -433 390 514 -261 -839 -273 408 96 -438 -884 -15
7287 -15 367 -205 -624 -216 214 170 -211 -424 -35 484 313 -303 -441 293 539 94 -387 220 499 544 -197
7308 -197 -307 166 517 246 -111 31 271 555 106 146 -161 251 113 -15 -201 6 50 2 -221 -279 180
7329 180 -33 -368 -372 18 -104 -434 -71 -30 -187 -75 71 -41 -136 -120 -55 195 82 25 211 188 136 70 -2 398
$$ packed form
7187E20j065l99J102K84n43n72J84R19l7p26m13O12P65l43j117J06J127L16q11
7206i1q42P91Q46l07q18jQ58K03o99m98L40O41J84o82o82P49Q74m31p90j76P52
7227B21O23n45j050L34J090l02r00j06Q01M21m75q83Q0R91J25o72m68M33Q59j59
7247D18q18l29P94P46p14r31L60R16K28r37n30R42P00n14o80J28O93J78o11n47
7267e08K59O59l9n40j82L43O92l41r30J54Q23J24p75n78N66O81l12n34m46Q69
7287a5L82n72m19M08M30m4l81k13L89N19j71o16j38P34K46m45m81O07K79M5p41
7308a97j10M73L51k71l57J42K40K84m49M0l07M12j38j28j86K07M4m8k23n8M59
7329A80k13l35mL90j22l30L63M1j57J12J46j12r5J6O5K50j13n7J86k3n2o6p2M00
$$ plain form
7353 398 -20 172 114 202 91 216 6 250 -79 -31 93 65 -24 -236 45 156 -291 -96 -137 -124 -27 -175 -214
7376 -214 -235 -113 -65 -250 -398 -72 109 -46 -469 -280 160 375 -121 -301 197 442 290 -215 -237 286 483
7397 483 -74 -131 -16 451 244 -296 -285 237 396 -167 -449 -169 303 283 -424 -413 -60 360 17 -740 -567
7418 -567 49 406 -306 -626 -262 269 270 -560 -702 132 556 214 -638 -467 623 339 -292 -574 52 726
7438 726 274 -511 -253 494 748 162 -600 40 520 500 -134 -252 68 699 413 -462 -478 377 593 -283 -1070
7459 -1070 -183 777 255 -721 -562 145 542 -237 -816 -387 458 376 -379 -633 49 450 26 -309 -560 294
7479 294 529 119 -499 -157 682 510 -325 -551 344 861 280 -693 -280 432 402 -232 -456 -63 610 461
7499 461 -471 -769 417 724 3 -722 -610 470 364 -485 -793 50 313 121 -507 -701 101 589 -205
$$ packed form
7353C98m18J92n8Q8j11J25k10K44l29M8J24k8q9k12K81J11m47J95m1J3R7j48l9
7376b14k1J22M8j85j48L26J81j55m23J89M40K15m96j80M98K45j52n05k2N23J97
7397D83n57n7J15M67k07n40J1N22J59n63k82K80M72k0p07J1L53M20l43p57J73
7418e67O16L57p12l20L64N31Jq30j42Q34M24l42q52J71J090k84o31k82O26O74
7438G26m52p85K58P47K54n86p62O40M80k0o34j18L20O31k86q75j6Q55K16q76p87
7459a070Q87R60n22r76J59P07L97p79n79M29Q45q2p55k54O82M01m24l35k51Q54
7479B94K35m10o18L42Q39j72q35k26Q95N17n81r73M13P12l0o34k24L93O73j49
7499D61r32k98J186L07p21p25J12J080j06q49l08Q43K63j92o28j94Q02M88p94
$$ plain form
7518 -205 -688 -320 631 493 -451 -698 156 739 144 -525 -229 573 581 -246 -515 70 907 420 -238 -531 373
7539 373 564 -230 -622 -253 301 312 -141 -725 -99 490 104 -612 -740 222 547 -242 -820 -103 638 301
7559 301 -504 -578 235 320 -38 -512 -314 442 638 -110 -368 -45 380 483 -329 -297 315 718 136 -421 -143
7580 -143 413 453 -1 -559 101 640 188 -471 -156 80 539 -74 -438 -210 216 123 -340 -243 120 195 223 -275
7602 -275 -190 239 227 -11 -333 11 271 224 -248 -140 225 351 75 108 96 200 278 48 -44 -128 275 155 -165
7625 -165 62 137 124 -142 -145 60 240 3 -100 14 33 3 0 52 23 -4 -230 302 -25 -331 -60 -34 -41 52 2
7650 2 195 -2 95 224 335 93 -156 122 51 -48 -88 217 59 -79 -164 140 87 47 -130 -5 147 80 -217
7673 -217 109 -112 59 47 79 -270 -165 203 51 -178 -285 264 271 -61 -276 81 443 78 -246 -227 94 492
$$ packed form
7518b05m83L68R51j38r44k47Q54N83n95o69K96Q02Qq27k69N85Q37m87o58k93R04
7539C73J91p94l92L69N54J1m53n84O26N89l86p16j28R62L25p89n78P17P41l37
7559C01q05p4Q13Q5l58m74J98P56J96p48k58L23M25J03q12L2O12M03n82n57K78
7580a43N56M0m54n58O60N39m52o59L15K36M59o13l64K28M26r3m63R7L63P5K8m98
7602b75Q5M29j2k38l22L44K60m7m72J08L65J26k76L3j2J04P8k30r2q4M03j20l20
7625a65K27P5j3k66lK05J80k37j03J14J9l0lN2k9k7k26N32l27l06K71K6pR3n0
7650BJ93j97R7J29J11k42k49K78p1r9m0L05j58j38q5L04n3m0j77J25J52o7k97
7673b17L26k21J71j2L2l49J05L68j52k29j07N49Pl32k15L57L62l65l24J9L21L98
$$ plain form
7695 492 -119 -256 -132 295 339 -95 -291 152 270 31 -390 -260 306 310 -121 -507 -25 250 374 -353 -324
7716 -324 144 310 -141 -428 -224 406 218 -13 -424 -124 508 91 -525 -486 569 623 -100 -543 46 685
7736 685 391 -475 -384 232 674 -239 -613 -284 406 545 -246 -464 -28 449 393 -717 -708 292 579 -204 -619
7757 -619 -283 885 490 -501 -580 353 768 13 -751 -274 600 656 -404 -540 -14 605 295 -442 -456 227
7777 227 653 109 -644 -213 668 521 -439 -642 156 813 247 -689 -546 546 722 -448 -766 -34 439
7796 439 328 -395 -652 350 616 252 -593 -334 518 669 -433 -611 -239 487 370 -547 -501 497 671 -138
7816 -138 -573 -366 549 384 -356 -307 42 603 383 -329 -455 327 630 -100 -599 -140 778 520 -364 -418 135
7837 135 434 11 -509 -480 255 478 -167 -578 -219 428 403 -450 -360 307 559 -17 -551 -188 608 349 -343
$$ packed form
7695D92o11j37J24M27M4m34j96M43J18k39m21J30N66Mm31l86M82K75J24p27K9
7716c24M68J66m51k87K04O30j88k31m11L00O32m17o16L9J055N4p23m43N89O39
7736F85k94q66R1O16M42r13l74L29O90J39p91k18M36M77n6j110RJ000K87p83m15
7757f19L36J168l95r91p9R33M15p55p64M77Q74N6j060j36N26O19l10p37j4O83
7777B27M26n44p53M31Q81j47r60k03P98O57n66r36J43J092J76j170l18P32M73
7796D39j11p23k57J002K66l64q45K59Q52J51j102j78L72P26j17r17M6R98J74q09
7816a38m35K07R15j65p40M9L49N61k20p12j26P82L03p30m99M59R18k58q84n4N53
7837A35K99m23n20K9P35K23o45m11L59O47k5q53R0O67K52n76n34L63P96k59o92
$$ plain form
7858 -343 -410 107 817 198 -455 -186 323 554 44 -401 -285 398 613 28 -447 112 453 320 -300 -359 315
7879 315 619 -272 -617 77 588 45 -537 -412 136 223 -245 -606 -178 158 -15 -319 -456 37 149 83 -399
7900 -399 -183 124 443 -178 -331 -93 342 404 -10 54 289 243 166 -85 -80 274 285 52 -85 -137 246 86 -139
7923 -139 -70 5 26 -109 -139 -369 120 -196 -120 80 -172 97 -248 -296 -222 -174 78 -155 -104 -63 128 184 -205 -5
7947 -5 177 192 -84 257 166 170 -113 204 153 222 88 162 362 -27 -58 98 252 263 -26 -321 -15 131 -52 -232
7971 -232 -102 -50 -34 -11 -155 -393 -113 107 29 -426 -426 121 450 -141 -345 -165 467 -50 -243 -171 291 291 -1
7994 -1 -233 230 452 198 -112 -18 166 158 300 -161 -106 376 409 119 -364 -470 354 297 -199 -637 -227 227 -16
8017 -16 -594 -228 85 289 -329 -556 -144 108 183 -446 -628 75 310 -216 -506 -70 393 481 -254 -693 138
$$ packed form
7858c43o7N17P10o19o53K69N09K31n10m45J16O83K15n85m75N59L41j33o20n9O74
7879C15L04q91l45O94N11n43n82J25N48Q7m68l61M28L36j73l04j37M93J12o6m82
7900c99K16L07L19o21j53K38M35O2m14O4K35m6p7k51NL54J1k33j37n2L83j60k25
7923a39O9P5K1j35l0k30M89l16P6K00k52K69l45m8P4M8K52k33N1M1J91N6l89K00
7947eJ82J5k76L41r1Mk83L17n1O9j34P4K00l89l1J56J54J1k89k95L06J46j83j80
7971b32J30N2J6K3j44k38K80K20p8m55%N47L29n91k04J80O32n17j93P2M62%k92
7994ak32M63K22k54l10R4J84qJ42m61N5M82L3k90m83j06Q24n7m96m38M10M54k43
8017a6n78L66L13K04o18k27M12K52P5o29j82P03K35n26k90M36M63Q8p35m39Q31
$$ plain form
8038 138 780 484 -299 -415 509 768 23 -245 -8 729 415 -288 -515 368 637 191 -613 -547 626 498
8058 498 -396 -700 -102 776 148 -805 -833 149 619 -274 -918 -428 329 504 -422 -740 -51 669 238 -735
8078 -735 -504 680 926 -79 -708 -20 829 699 -440 -231 502 828 72 -544 -236 677 424 -247 -658
8097 -658 -244 628 379 -575 -538 458 567 -134 -895 -254 596 413 -838 -466 21 503 -309 -841 -464 367
8117 367 577 -429 -569 -142 629 276 -340 -434 286 589 -36 -630 -31 458 514 -88 -372 86 939 244
8137 244 -666 -259 507 536 -339 -709 -136 702 370 -486 -481 55 633 -94 -793 -352 8 275 -552 -514 -54
8158 -54 305 200 -469 -481 125 408 -151 -370 45 83 356 -126 -353 175 575 306 -445 -335 426 371 -7
8179 -7 -301 -9 592 255 -165 -181 141 115 12 -141 21 458
$$ packed form
8038A38O42k96p83j16R24K59p45k68K37P37l14p03k27Q83K69m46q04O6J173j28
8058D98q94l04N98Q78o28r53k8R82M70q93o44M90P57J75r26l18O89P20m31r73
8078g35K31J184K46j005o29O88Q49j30j139K09P33L26p56o16L08R13k53o71m11
8097f58M14Q72k49r54L7R96J09p01p61O41Q50j83j251L72M87M82q12n32L77Q31
8117C67K10j006j40M27P71l53o16r4P20L03o25n94N99M89N6o02k84M58Q53o95
8137B44r10M07P66K9q75l70N73Q38l32q56NN36N78p27o99M41L60K67q27L8M60
8158e4L59j05o69j2O06K83n59k19M15L8K73m82k27N28M00k69p51J10P61n5l78
8179gk94K92O01l37m20j6L22k6j03j53J62M37
8191D58
$$ Imaginary data points
##PAGE= N=2
##DATA TABLE= (X++(I..I)), XYDATA
$$ plain form
0 0 0 0 0 0 0 0 0 8 -8 8 -8 16 -16 22 -25 38 -46 54 -64 80 -96 117 -134 162 -191 222 -257 300 -347 397
30 397 -452 520 -593 669 -756 853 -962 1074 -1202 1342 -1497 1662 -1845 2044 -2263 2501
46 2501 -2759 3041 -3355 3696 -4070 4483 -4944 5452 -6021 6660 -7388 8219 -9180 10309
60 10309 -11658 13297 -15342 17978 -21519 26545 -34280 47799 -78032 290208 -514838 -917311
72 -917311 609626 779962 -408459 -708987 362647 531600 -300664 -408600 288766 133729
82 133729 -407762 -42961 437440 -222751 -635391 232320 671350 -349383 -823377 233137
92 233137 812812 -258105 -904415 153186 861095 -119271 -753056 109912 627191 -101210
102 -101210 -443471 170273 349493 -173257 -152104 348384 147450 -399490 -27598 603359
$$ packed form
0@%%%%%%%Qj6J6j6K4l2L8m7O3q4J00j18J44j76K13k51K96l53M13m79N57o47P44
30C97q49R72j113J262j425J609j815K036k276K544k839L159l507L889m307M764
46B501n260N800o396P051p766Q553r427J0396j1473J2681j4048J5607j7399J9489
60A0309k1967K4955k8639L3320l9497M8064o0825Q2079j25831L68240q05046m02473
72i17311J526937J70336j188421l00528J071634J68953q32264j07936O97366j55037
82A33729n41491L64801M80401o60191m12640Q67711M39030j020733m73994J056514
92B33137N79675j070917o46310J057601P07909r80366o33785Q62968N17279p28401
102a01210l42261O13744J79220n22750K1153N00488k00934n46940L71892O30957
$$ plain form
112 603359 72179 -653598 -15208 757957 86653 -701503 -79213 685957 116688 -640454
122 -640454 -142826 546321 89125 -483019 -40613 361217 -118642 -353093 168782 231757
132 231757 -342947 -274605 360526 226824 -477850 -312009 482662 303580 -553397 -353781
142 -353781 521123 329053 -477578 -275645 448373 250136 -366781 -154163 360232 116464
152 116464 -290571 38050 367886 -71229 -332366 220875 408082 -243329 -382647 316309
162 316309 432923 -293481 -426237 304261 442268 -297429 -440982 262484 360319 -297022
172 -297022 -324670 271431 209302 -327129 -187566 281272 67224 -358677 -66602 357960
182 357960 -8997 -436104 17854 446949 -65681 -469491 76494 454198 -85238 -418722
$$ packed form
112F03359n31180p25777O38390P73165o71304p88156O22290P65170n69269p57142
122f40454M97628O89147m57196n72144M42406M01830m79859k34451N21875O2975
132B31757n74704O8342O35131j33702p04674J65841P94671j79082q56977J99616
142c53781Q74904j92070q06631K01933P24018j98237o16917K12618N14395k43768
152A16464m07035L28621L29836m39115k61137N53241J87207o51411j39318O98956
162C16309J16614p26404j32756P30498J38007p39697j43553P03466R7835o57341
172b97022k7648N96101o2129n36431J39563M68838k14048m25901K92075M24562
182C57960l66957m27107M53958M29095n12630m03810N45985L77704n39436l33484
$$ plain form
192 -418722 118656 424383 -95564 -361710 148362 361876 -149842 -287294 240136 295602
202 295602 -234508 -211406 298996 205474 -294145 -160821 330441 159103 -336643 -132215
212 -132215 350198 96409 -366789 -72077 342268 -3344 -370007 10410 328265 -71814
222 -71814 -349499 63623 306046 -136085 -347893 132660 313561 -182747 -308675 187007
232 187007 259719 -211988 -224276 229155 194114 -235240 -142455 280228 135580 -278853 -66366
243 -66366 347148 62672 -348331 -5222 396257 21354 -364164 16285 382315 -2753
253 -2753 -358748 18440 341197 -35090 -306111 64976 254959 -123594 -230253 150890
263 150890 170127 -223584 -170861 242702 134021 -312464 -158694 331236 144481 -379364
$$ packed form
192d18722N37378L05727n19947k66146N10072K13514n11718j37452N27430N5466
202B95602n30110K3102N10402r3522m99619J33324M91262j71338m95746K04428
212a32215M82413k53789m63198K94712M14345l45612l66663L80417L17855m00079
222g1814k77685M13122K42423m42131k11808M80553J80901m96308j25928M95682
232A87007P2712m71707j2288M53431l5041m29354R2785M22683j44648m14433K12487
243f6366M13514k84476m11003L43109M01479l74903l85518L80449L66030l85068
253b753l55995L77188L22757l76287k71021L71087J89983l78553j06659L81143
263A50890J9237l93711N2723M13563j08681m46485J53770M89930j86755n23845
$$ plain form
273 -379364 -172351 362812 156079 -351501 -146398 321262 126586 -284566 -92796 254910
283 254910 57398 -211338 22475 213180 -77252 -189744 169093 215828 -207673 -213159
293 -213159 263178 254483 -263098 -262530 281103 294343 -260046 -292652 236041 269234 -210770
304 -210770 -228863 181083 162961 -174379 -111255 152009 23906 -185160 21902 202442
314 202442 -89967 -262146 109929 287850 -141460 -330837 128145 335640 -118980 -337011
324 -337011 96760 322876 -66989 -278446 59558 227957 -58402 -150914 98025 100638
334 100638 -122498 -31456 181833 1991 -225564 25758 286012 -16992 -322218 7061
344 7061 351327 19240 -350589 -42794 320503 47974 -282604 -51039 224639 29419
$$ packed form
273c79364K07013N35163k06733n07580K05103M67660j94676m11152J91770L47706
283B54910j97512k68736K33813J90705k90432j12492L58837M6735m23501n486
293b13159M76337q695n17581N68N43633J3240n54389l2606N28693L3193m80004
304b10770j8093M09946j8122l37340O3124K63264j28103k09066K07062J80540
314B02442k92409j72179L72075J77921m29310j89377M58982K07495m54620k18031
324c37011M33771K26116l89865k11457L38004J68399k86359r2512K48939K613
334A00638k23136R1042K13289j79842k27555K51322K60254l03004l05226L29279
344G061L44266l32087l69829L07795L63297k72529l30578K31565K75678j95220
$$ plain form
354 29419 -171698 3517 114159 -70782 -87723 132618 65796 -204841 -69042 260231
364 260231 80798 -306796 -112568 323878 142959 -322795 -170978 302036 188136 -259143
374 -259143 -176371 215124 145786 -168917 -94852 133670 36921 -102165 41719 103463 -111004
385 -111004 -120178 173866 156438 -214083 -193242 239073 233069 -238164 -260188 218626 270622
396 270622 -188432 -266211 149380 237310 -115375 -187071 96159 123942 -95966 -60658 106257
407 106257 -3361 -132121 59335 172524 -94181 -214512 110642 253170 -111798 -281080
417 -281080 101334 293789 -83208 -288183 62276 261738 -50760 -228680 40259 173886
427 173886 -54780 -125984 76763 77968 -115799 -48119 150697 18836 -194049 -6955 229430
$$ packed form
354B9419k01117J75215J10642j84941j6941K20341o6822k70637J35799L29273
364B60231j79433l87594J94228M36446j80919m65754J51817M73014j13900m47279
374b59143Q2772L91495o9338l14703P4065K28522r6749j39086J43884O1744k14467
385a11004r174K94044j7428l70521K0841M32315o004m71233k2024M78814N1996
396B70622m59054p7779M15591Q7930l52685p1696K83230K7783k19908L5308J66915
407A06257j09618j28760J91456J13189k66705j20331L25154J42528l64968j69282
417b81080L82414J92455l76997k04975L50459J99462l12498j77920K68939J33627
427A73886k28666p1204K02747J205j93767O7680J98816j31861k12885J87094K36385
$$ plain form
438 229430 8280 -250602 -13952 263082 28306 -253283 -28766 241450 33575 -206515
448 -206515 -11814 184818 -2826 -148341 38644 125723 -73425 -103741 116239 98716
458 98716 -149017 -97076 176054 96306 -201260 -105909 205534 102623 -211464 -107119 195337
469 195337 87765 -191820 -78070 168310 42215 -165389 -18102 153117 -19601 -154120
479 -154120 48924 152345 -82053 -159414 105697 169216 -116545 -166967 133963 173940 -131237
490 -131237 -157902 144671 158220 -133385 -128464 148843 120093 -139807 -84536 155577 69311
501 69311 -156377 -42950 168252 26500 -174389 -10357 174185 -12037 -185075 14315
511 14315 170178 -41197 -178420 40648 153911 -72879 -160088 73251 135525 -102459
$$ packed form
438B29430k21150k58882K36650K77034k34776k81589K24517K70216k07875k40090
448b06515J94701J96632j87644j45515J86985Q7079j99148l0316K19980j7523
458I8716k47733N1941K73130p9748k97566R5351L11443j02911l14087J04345L02456
469A95337j07572k79585J13750K46380j26095k07604J47287J71219j72718j34519
479a54120K03044J03421k34398p7361K65111O3519k85761n0422L00930L9977l05177
490a31237k6665L02573J3549k91605M921K77307k8750k59900N5271K40113q6266
501F9311k25688J13427K11202j41752k00889J64032J84542j86222j73038J99390
511A4315J55863k11375j37223K19068J13263k26790q7209K33339O2274k37984
$$ plain form
521 -102459 -138289 107404 120881 -126700 -116060 135108 108877 -138239 -94697 146670 91113
532 91113 -134221 -60426 146593 55142 -128813 -15946 144511 7428 -130696 33042
542 33042 149667 -42689 -145393 69629 160853 -75918 -164430 82821 164733 -87629 -166337
553 -166337 77459 145566 -85722 -140481 69312 98555 -90291 -86599 81348 38306 -114397
564 -114397 -28516 118700 -8804 -155183 12548 168710 -24952 -190162 22012 201966
574 201966 -11065 -194731 13768 196232 6314 -157956 13386 149279 -3164 -97304
584 -97304 45083 88438 -53219 -44764 104741 44685 -127311 -28549 168567 37530 -192593
595 -192593 -48906 203897 57171 -214875 -83189 189166 73410 -186876 -90876 138525
$$ packed form
521a02459l5830K45693J3477k47581J0640K51168k6231k47116M3542K41367n5557
532I1113k25334P3795K07019r1451j83955J12867J60457j37083j38124J63738
542C3042J16625j92356j02704K15022R1224k36771q8512K47251Q1912k52362p8708
553a66337K43796O8107k31288n4759K09793K9243j88846L692J67947m3042j52703
564a14397Q5881J47216j27504j46379J67731J56162j93662j65210K12174J79954
574B01966k13031j83666K08499J82464j89918j64270J71342J35893j52443r4140
584i7304J42387M3355j41657Q455J49505o0056j71996R8762J97116j31037k30123
595a92593J43687K52803j46726k72046J31686K72355j15756k60286R6000K29401
$$ plain form
605 138525 55537 -130291 -50527 83932 -5956 -85056 31955 63793 -85947 -76440 118029
616 118029 87588 -146374 -106448 166555 136238 -157559 -140386 161069 164726 -121062 -139152
627 -139152 117457 141259 -73758 -89667 77236 69292 -52320 -8927 71982 -22238 -80754
638 -80754 62633 107173 -87384 -137149 92095 153269 -101885 -185415 72744 172490 -75460
649 -75460 -187095 33748 142754 -43023 -131959 17526 72429 -42952 -47926 46863 598
660 598 -82453 21153 114687 -33889 -144455 42869 182932 -20729 -183602 23018 207332
671 207332 17222 -173045 -8189 172852 37413 -118562 -12418 101062 11056 -53145
681 -53145 30287 35570 -61385 -16567 98970 7503 -141642 -23358 158313 25546 -191567
$$ packed form
605A38525q2988j85828P9764J34459q9888p9100J17011L1838j49740R507J94469
616A18029l0441k33962L9926K73003l0317k93797J7173L01455L657k85788j8090
627a39152K56609K3802k15017j5909J66903p944j21612M3393Q0909r4220n8516
638h0754J43387M4540j94557m9765K29244O1174k55154q3530K58159R9746k47950
649g5460j11635K20843J09006j85777q8936J49485N4903j15381m974R4789m6265
660E98q3051J03606R3534j48576j10566J87324J40063k03661j62873K06620J84314
671B07332j90110j90267J64856J81041j35439j55975J06144J13480r0006o4201
681e3145Q3432N283r6955M4818J15537r1467j49145J18284J81671j32767k17113
$$ plain form
692 -191567 -64678 174342 62286 -185390 -96012 142156 76904 -132952 -84244 86744
702 86744 47741 -72378 -25722 46084 -18241 -39759 61609 49935 -90606 -54027 130347
713 130347 87598 -130212 -90580 153804 130702 -123262 -119906 127927 141295 -87916 -112534
724 -112534 84386 104942 -57137 -65060 56048 35571 -54698 -4031 57413 -35084 -85432
735 -85432 43754 90889 -73552 -128841 56989 120725 -78123 -152025 48566 131932 -56093
746 -56093 -139414 31184 109334 -36425 -94334 33322 67355 -41424 -39700 62499 29736
757 29736 -65583 1082 98232 5472 -96649 16867 128558 4687 -113430 13849 131288
768 131288 2077 -112721 11080 111974 -8438 -93053 20426 79625 -35358 -73418
$$ packed form
692a91567J26889K39020j12056k47676Q9378K38168o5252k09856M8708J70988
702H6744l9003j20119M6656P1806o4325k1518J01368j1674j40541L6579J84374
713A30347m2749k17810L9632K44384k3102k53964L356K47833J3368k29211k4618
724a12534J96920K0556j62079p923J21108k0477r0269N0667O1444r2497n0348
735h5432J29186M7135j64441n5289J85830O3736j98848p3902K00591Q3366j88025
746e6093q3321J70598P8150j45759n7909J27656L4033j08779J724J02199l2763
757B9736r5319O6665R7150r2760j02121J13516J11691j23871j18117J27279J17439
768A31288j29211j14798J23801J00894j20412q4615J13479N9199j14983l8060
$$ plain form
778 -73418 42291 53833 -70730 -62791 68921 41400 -98171 -54949 90102 34125 -114496
789 -114496 -50845 97856 31832 -107990 -33934 97770 17799 -100753 -9230 97974 -601
800 -601 -90290 21773 98300 -20727 -81544 47962 97791 -38810 -78594 62530 92214
811 92214 -50705 -67198 74266 74397 -67733 -55981 79546 50154 -83660 -39677 89556
822 89556 28624 -101856 -30949 94283 11130 -111955 -22176 94668 -447 -107222 -9034
833 -9034 85753 -12927 -92009 8071 69888 -31964 -69525 43376 63468 -56966 -58022 73419
845 73419 61274 -78175 -52826 96847 67938 -85310 -54173 98418 68558 -77779 -49821
856 -49821 81571 50158 -61974 -23756 65441 15201 -54164 8210 53410 -30851 -61465 44204
$$ packed form
778g3418J15709J1542j24563P939J31712k7521j39571M3222J45051n5977j48621
789a14496O3651J48701o6024j39822P4056J31704p9971j18552R1523J07204r8575
800f01q9689J12063P6527j19027o0817J29506M9829j36601l9784J41124K9684
811I2214j42919j6493J41464J31j42130J1752J35527k9392j33814M3983J29233
822H9556o0932j30480P0907J25232q3153j23085Q9779J16844r5115j06775R8188
833i034R4787r8680p9082J00080O1817j01852l7561J12901K0092j20434j056J31441
845G3419j2145j39449K5349J49673k8909j53248L1137J52591k9860j46337K7958
856d9821J31392l1413j12132L8218Q9197n0240o9365O2374M5200q4261l0614J05669
$$ plain form
868 44204 64517 -62662 -81270 60843 78317 -75998 -98233 57101 84756 -62524 -92531
879 -92531 41186 70424 -42394 -61390 30089 30735 -38791 -11653 44527 -7754 -51989 32341
891 32341 75027 -37903 -86710 49684 112508 -33340 -108658 38726 125069 -15236 -107493
902 -107493 16892 103891 -2371 -77871 6953 59937 -8488 -32514 24322 9481 -50669
913 -50669 -3448 65166 -11512 -94800 3201 105656 -5796 -129480 -18348 121152 20853
924 20853 -125131 -39762 104956 39473 -89532 -39971 64978 27045 -44815 -8696 28612
935 28612 -12812 -12972 48312 20334 -66059 -20473 90900 37799 -95633 -43031 109975 66330
947 66330 -96808 -70138 88876 76487 -67966 -67593 52158 53664 -36968 -31828 27741 5026
$$ packed form
868D4204K0313j27179j8608J42113J7474j54315k2235J55334K7655j47280l0007
879i2531J33717K9238j12818j8996R1479O46o9526K7138N6180n2281m4235Q4330
891C2341M2686j12930m8807J36394O2824j45848p5318J47384Q6343j40305r2257
902a07493J24385Q6999j06262p5500Q4824N2984o8425k4026N6836j4841o0150
913e0669M7221O8614p6678q3288R8001J02455j11452j23684J11132J39500j00299
924B0853j45984Q5369J44718o5483j29005M9561J04949l7933p1860L6119L7308
935B8612m1424j60O1284k7978q6393M5586J11373n3101j33432N2602J53006m3645
947F6330j63138K6670J59014j2389j44453L73J19751J506r0632N140N9569k2715
$$ plain form
959 5026 -29303 14277 25986 -45748 -44344 58118 54450 -73724 -77636 66208 81794 -68794
971 -68794 -96512 52189 92452 -40796 -85663 27022 68597 -18234 -45637 18393 23560 -20235
983 -20235 4982 38708 -16377 -47265 35988 71171 -37108 -84854 38994 103320 -24288
994 -24288 -102522 16728 100723 -6415 -90820 -1110 73094 1814 -53915 1006 30155 -14918
1006 -14918 -13728 29369 -5292 -56018 7682 72915 -9650 -91195 3085 101415 2889 -110670
1018 -110670 -16515 106490 25871 -96014 -29669 81654 28620 -64279 -20491 47610 7156
1029 7156 -31851 13252 24731 -31317 -18140 54732 22993 -70086 -28930 81699 39184 -83998
1041 -83998 -44445 86405 52464 -80413 -56288 68907 52689 -56792 -43612 45928 28966
$$ packed form
959E026l4329M3580J1709p1734J404J02462l668j28174l912J43844J5586j50588
971f8794k7718J48701M0263j33248m4867J12685M1575q6831k7403O4030N167m3795
983b0235K5217L3726n5085l0888Q3253L5183j08279m7746J23848O4326j27608
994b4288p8234J19250Q3995j07138q4405Q9710P4204p1280n5729N4921K9149m5073
1006a4918J190M3097l4661n0726O3700O5233q2565q1545R4280R8330r8526j13559
1018a10670R4155J23005q0619j21885O6345J11323n3034r2899M3788O8101m0454
1029G156l9007M5103J1479n6048J3177P2872l1739r3079M1156J10629m2515j23182
1041h3998L9553J30850l3941j32877K4125J25195j6218j09481J3180Q9540j6962
$$ plain form
1052 28966 -39992 -14369 34745 -3606 -35994 17176 36800 -32382 -42949 43716 50142 -49676
1064 -49676 -57460 49323 59426 -47267 -58209 46063 55967 -42317 -49927 38612 39377 -37868
1076 -37868 -28367 39156 16557 -42940 -7135 46248 -1913 -51740 6865 53746 -13585 -58048
1088 -58048 17044 60450 -18076 -58299 20372 53839 -23536 -48252 30124 47161 -30841 -40045
1100 -40045 36673 36752 -39003 -29313 46325 27477 -48448 -22365 51445 19865 -50233 -14527 48816
1113 48816 6600 -50821 -1797 50001 -6085 -51817 10648 48054 -22460 -52917 25434 52186
1125 52186 -30940 -55095 30242 51845 -33447 -51924 32429 47274 -33005 -40365 34468 32717
1137 32717 -34162 -20197 39956 12965 -43472 -2973 53602 2083 -55090 7223 66517 -6023
$$ packed form
1052B8966o8958K5623M9114l8351l2388N3170J9624o9182j0567Q6665O426r9818
1064d9676p784J06783J0103j06693j0942J04272R904r8284p610Q8539P65p7245
1076c7868R501O7523k2599n9497L5805N3383m8161m9827N8605M6881o7331m4463
1088e8048P5092M3406p8526m0223P8671L3467p7375k4716P8376J7037p8002r204
1100d0045P6718P9p5755R690P5638j8848p5925K6083P3810l1580p0098L5706O3343
1113D8816m2216n7421M9024N1798n6086m5732O2465L7406p0514l0457P8351K6752
1125E2186q3126k4155Q5337K1603q5292j8477Q4353J4845q0279p360P4833j751
1137C2717o6879J3965O0153k6991n6437M0499N6575n1519n7173O2313N9294p2540
$$ plain form
1149 -6023 -69344 8210 74790 -1117 -68403 957 63307 857 -54936 63 44059 -7181
1161 -7181 -36616 11463 22402 -26037 -17759 33871 6761 -53319 -14088 56644 12416 -67453
1173 -67453 -21491 66828 23250 -69179 -29938 60777 30149 -49234 -23899 40318 20118 -24839
1185 -24839 -3795 22315 -4787 -12196 27718 19081 -36857 -15627 57863 29514 -60783 -35061
1197 -35061 64557 44934 -58169 -48200 51967 50453 -43924 -50411 28605 35112 -24459 -24192 12721
1210 12721 -989 -17702 12965 15737 -34951 -32527 38627 37907 -51007 -55439 50050 65001 -46868
1223 -46868 -72388 36119 70858 -23410 -61518 16755 55712 -2441 -33813 7196 22689 -4146
1235 -4146 3566 21988 -12247 -27191 32101 49571 -29280 -57808 30886 71862 -22748 -79856
$$ packed form
1149f023o3321P7554O6580p5907o7286O9360O2350o2450n5793N4999M3996n1240
1161g181k9435M8079J0939m8439Q278N1630k7110o0080L9231P0732m4228p9869
1173f7453M5962Q8319m3578r2429L9241R0715l0628p9383K5335O4217k0200m4957
1185b4839K1044K6110k7102p409L9914q637n5938K1230P3490k8349r0297K5722
1197c5061R9618j9623j03103R969J00167j514r4377o487P9016O507n9571K67L6913
1210A2721j3710j6713L0667K772n0688K424P1154p20q8914m432J05489J4951j11869
1223d6868k5520J08507L4739r4268l8108P8273L8957n8153l1372M1009J5493k6835
1235d146P712J8422l4235j4944N9292J7470p8851k8528Q8694M0976r4610n7108
$$ plain form
1247 -79856 12273 81616 -2819 -78914 -10321 58644 5596 -50582 -14039 24480 417 -17242
1259 -17242 2061 -2790 -25593 1760 36296 -9869 -59087 2672 68925 4647 -71816 -11627
1271 -11627 72842 23858 -62804 -26348 60055 37671 -38518 -23650 34753 21549 -14710 188
1283 188 13205 -8408 -2190 29060 9427 -37016 -13526 48122 22955 -55683 -35441 51817
1295 51817 37205 -50571 -43664 35235 33960 -33583 -38337 13226 19504 -15789 -14080 7844 -8599
1308 -8599 -18477 17395 19483 -33438 -29809 37817 37863 -36540 -41958 38127 54664 -26235 -51359
1321 -51359 26152 56642 -11170 -36882 18721 35103 -6563 -13089 14951 7888 -12753 7722
1333 7722 26678 -10308 -35850 15579 46229 -19756 -58898 12120 55330 -15331 -62537 936
$$ packed form
1247g9856R2129O9343q4435p6095O8593O8965n3048n6178L6543L8519k4063j7659
1259a7242J9303m851k2803K7353L4536m6165m9218O1759O6253o4278p6463O0189
1271a1627Q4469m8984q6662L6456Q6403k2384p6189J4868N8403j3204l6259J4898
1283A88J3017k1613O218L1250j9633m6443K3490O1648k5167p8638K0242Q7258
1295E1817j4612q7776O907P8899j275o7543m754N1563O278l5293J709K1924j6443
1308h599r878L5872K088n2921L629O7626M6p4403n418Q0085J6537q0899k5124
1321e1359P7511L0490o7812k5712N5603J6382m1666o526K8040p063k0641K0475
1333G722J8956l6986k5542N1429L0650o5985l9142P1018M3210p0661m7206O3473
$$ plain form
1345 936 50655 -3776 -54631 -9943 35952 -2094 -35353 1009 20146 -13979 -14810 19055 5376
1358 5376 -27908 -1978 37774 6845 -40468 -4462 53249 15884 -47172 -8907 54542 16368
1370 16368 -41726 -5920 45166 14146 -30247 -4264 31034 3080 -25772 6788 26334 -14978
1382 -14978 -25307 20255 20104 -30302 -24943 25551 17030 -34924 -26714 25964 18190 -35871 -25594
1395 -25594 28376 12164 -38106 -15067 31395 5163 -32231 -3139 30324 725 -29660 3379
1407 3379 34632 -644 -27433 12474 34121 -7730 -20446 21489 25517 -15174 -13289 26060
1419 26060 19635 -21403 -12176 31615 15604 -35044 -14375 37486 10847 -39649 -11880 32546
1431 32546 5200 -35606 -12464 23538 915 -30242 -4980 20192 -11281 -26659 12893 18843
$$ packed form
1345I36M9719n4431n0855M4688M5895l8046l3259L6362J9137l4125q31L3865j3679
1358E376l3284K5930L9752l0929m7313L6006N7711l7365o3056L8265O3449l8174
1370A6368n8094L5806N1086l1020m4393K5983L5298k7954k8852L2560J9546m1312
1382a4978j0329M5562j51n0406N359N0494q521n1954Q210N2678p774n4061J0277
1395b5594N3970j6212n0270K3039M6462k6232l7394K9092L3463k9599l0385L3039
1407C379L1253l5276k6789L9907K1647m1851j2716M1935M028m0691J885L9349
1419B6060o425m1038R227M3791j6011n0648K0669N1861k6639n0496K7769M4426
1431C2546k7346m0806K3142L6002k2623l1157K5262K5172l1473j5378L9552N950
$$ plain form
1443 18843 -26687 -23694 27579 22276 -31535 -25468 33879 32664 -30326 -31754 33606 36759 -24350
1456 -24350 -24775 28243 26836 -14640 -10361 19111 10594 -11110 4107 20883 -6646 -22441 18125
1469 18125 32605 -22028 -38235 22179 38718 -23451 -45328 12598 40092 -12784 -45746 -660
1481 -660 31373 -6037 -30772 -1227 11726 -8986 -6231 8590 -7721 -19136 9830 25961
1493 25961 -11305 -35303 10993 47436 -2708 -47156 3663 52951 8098 -40443 -5512 39784
1505 39784 16945 -22052 -9998 18667 10397 -5631 3484 2625 -13627 3652 26015 -5458 -37393
1518 -37393 -159 40498 2646 -48729 -17205 42817 19623 -45056 -30421 30940 22946 -27777
1530 -27777 -24447 11545 11711 -6016 -4879 -2268 -8916 745 21115 4828 -31088 -9588 43076
$$ packed form
1443A8843m5530K993N1273n303n3811O067N9347j215o2990j428O5360L153o1109
1456b4350m25N3018j407m1476M279K9472q517k1704J5217J6776k7529j5795M0566
1469A8125J4480n4633j6207O0414J6539o2169k1877N7926K7494n2876l2962M5086
1481f60L2033l7410k4735K9545J2953k0712K755J4821j6311j1415K8966J6131
1493B5961l7266k3998M6296L6443n0144m4448N0819M9288m4853m8541L4931M5296
1505C9784k2839l8997J2054K8665q270j6028R115q59j6252J7279K2363l1473l1935
1518c7393L7234M0657l7852n1375L1524O0022k3194o4679J4635O1361p994n0723
1530b7777L330L5992J66j7727J137K611o648R661K0370j6287l5916K1500N2664
$$ plain form
1543 43076 21903 -42019 -24199 45943 36239 -33351 -34520 30027 41444 -14917 -31610 12390
1555 12390 27205 -4149 -11900 4089 -694 -4138 13929 7856 -25462 -18631 27240 24885 -33417
1568 -33417 -40540 26052 42993 -27352 -52039 15009 45129 -11739 -43810 -269 30935 2274
1580 2274 -22502 -3427 11268 -1054 58 10571 -6729 -17249 16146 30461 -13063 -33472
1592 -33472 14978 43653 -4297 -42045 1934 45424 7142 -38035 -7045 32860 8977 -21651
1604 -21651 -5878 11559 611 -5070 4629 -1654 -15739 186 21862 -2520 -33673 -3917
1616 -3917 34830 3805 -39496 -11317 33656 11869 -31598 -15753 23415 13439 -18753 -9677
1628 -9677 13564 2960 -8662 6944 8550 -13205 -6074 22626 11281 -23788 -11796 29738
$$ packed form
1543D3076k1173o3922J7820P0142r704o9590j169O4547J1417n6361j6693M4000
1555A2390J4815l1354p751J5989m783l444J8067o073l3318O831M5871k355n8302
1568c3417p123O6592J6941p0345k4687O7048L0120n6868l2071M3541L1204k8661
1580B274k4776J9075J4695j2322J112J0513j7300j0520L3395J4315m3524k0409
1592c3472M8450K8675m7950l7748M3979M3490l8282m5177L0990L9905k3883l0628
1604b1651J5773J7437j0948n681R699o283j4085J5925K1676k4382l1153K9756
1616c917L8747l1025m3301K8179M4973k1787m3467J5845L9168r976l2192R076
1628i677K3241j0604j1622J5606J606k1755P131K8700j1345l5069J1992M1534
$$ plain form
1640 29738 20024 -26952 -20824 28320 24772 -22769 -21484 20085 19240 -14806 -13590 11049 7087
1653 7087 -10511 -1996 9907 -6834 -15167 10396 16264 -17257 -22118 17318 22902 -19561 -27302
1666 -27302 16057 27014 -14708 -27752 12034 24750 -11071 -20558 11442 16187 -11101 -9876
1678 -9876 13816 6501 -14036 -1900 18417 985 -20258 1725 24392 -1640 -25116 3487
1690 3487 26193 -3066 -24940 3465 23549 -4060 -21946 4909 20199 -6960 -19333 8716
1702 8716 17221 -11427 -16367 12117 13540 -13717 -12260 13437 10295 -14488 -9261 14113 6008
1715 6008 -15149 -3244 15878 -677 -17013 3685 18285 -5573 -19433 7066 21370 -7060
1727 -7060 -21504 7645 22075 -6749 -20877 6168 18556 -6136 -14244 6726 9898 -7747
$$ packed form
1640B9738r714m6976O128M9144l548m7541J285M1569q45l4046J216K4639l962
1653G087j7598Q515J1903j6741q333K5563N868l3521m861L9436N584m2463p741
1666b7302M3359J0957m1722j3044L9786J2716l5821r487L2000M745k7288J225
1678i876K3692p315k0537J2136K0317j7432k1243K1983K2667k6032k3476K8603
1690C487K2706k9259k1874K8405K0084k7609j7886K6855J5290k7159j2373K8049
1702H716Q505k8648m940K8484J423k7257J457K5697l142k4783N227K3374q105
1715F008k1157J1905J9122j6555j6336K0698J4600k3858j3860K6499J4304k8430
1727g060j4444K9149J4430k8824j4128K7045J2388k4692q108K0970L172j7645
$$ plain form
1739 -7747 -5701 10135 1538 -14088 1207 18427 -3063 -22557 4008 26688 -2826 -28447
1751 -28447 1004 29253 1725 -26883 -2608 24810 4870 -19139 -3555 13996 -52 -8949
1763 -8949 4665 4553 -10446 -2542 16118 1423 -23033 -4039 26541 5740 -30759 -11043 29895
1776 29895 13610 -28585 -16513 23080 15564 -18613 -14081 12957 10828 -7188 -3849 4628 -3343
1789 -3343 -2823 12356 5727 -18254 -7681 24941 14299 -25533 -18127 26771 24233 -22633 -26142
1802 -26142 18326 27383 -11603 -23740 6500 17823 -3087 -11181 -234 1751 -1355 5570 3638
1815 3638 -14424 -11732 16546 15799 -20079 -24527 16329 27294 -14674 -31336 8176 29620 -3318
1828 -3318 -27213 -2538 20917 6007 -11405 -4337 4467 3401 5203 3927 -8753 -8117 15250
$$ packed form
1739g747K046J5836q597j5626J5295J7220k1490j9494K6565K2680k9514k5621
1751b8447K9451K8249k7528k8608K4275K7418j9940k4009J5584J7551j4048q897
1763h949J3614j12j4999P904J8660j4695k4456J8994L0580k0801l6499J9716M0938
1776B9895j6285m2195J2072L9593p516l4177M532K7038k129j8016L339Q477p971
1789c343N20J5179o629k3981J0573L2622j0642l9832P406M4898k538m6866l509
1802b6142M4468R057l8986j2137L0240J1323k0910q094J0947J985l106O925j932
1815C638j8062K692K8278p47l5878m448M0856J0965m1968j6662L9512K1444l2938
1828c318k3895K4675K3455j4910j7412P068Q804j066J802j276j2680O36K3367
$$ plain form
1841 15250 19062 -12379 -23014 12671 30581 -5824 -31323 1537 31363 4539 -26798 -8346
1853 -8346 19601 8686 -13597 -9637 3160 2201 531 2087 -7748 -12822 5722 17321 -7969
1866 -7969 -27603 1207 29978 2674 -32979 -9531 30525 14382 -26039 -16657 20824 17713
1878 17713 -12177 -12830 8707 11096 -273 -1121 323 -4525 2956 15636 3358 -18685 -5050
1891 -5050 24883 12325 -24398 -16568 23535 20593 -20133 -23254 13763 21319 -10504 -20432 3028
1904 3028 11655 -3637 -8781 -810 -1647 -3972 4186 3566 -13121 -11575 12793 14151 -14904 -18957
1918 -18957 13164 21979 -10090 -21691 8767 23275 -3061 -17344 3749 16739 1392 -7020
1930 -7020 4051 6092 -2765 1663 9783 -809 -10218 5154 16059 -4446 -18630 2758 19438
$$ packed form
1841A5250L812l1441j0635L5685J7910l6405k5499L2860K9826k6824l1337J8452
1853h346K7947j0915k2283L960J2797r59j670J556r835n074J8544J1599k5290
1866g969j9634K8810K8771k7304l5653K3448M0056j6143m0421R382L7481l111
1878A7713k9890o53K1537K389j1369q48J444m848P481J2680j2278k2043J3635
1891e050K9933j2558l6723P830M0103k942m0726l121L7017P556l1823r928K3460
1904C028Q627j5292n144P971q37k325Q158o20j6687J546K4368J358k9055m053
1918a8957L2121Q815l2069j1601L0458J4508k6336j4283K1093J2990j5347q412
1930g020J1071K041q857M428Q120j0592r409J5372J0905k0505j4184K1388J6680
$$ plain form
1943 19438 -1792 -20934 -1954 16658 -264 -17578 -3530 10212 -2092 -11152 146 3976
1955 3976 -7070 -5112 7486 1180 -13790 -3879 14511 3148 -16589 -3455 18808 5922 -16604
1968 -16604 -4301 17598 7309 -12038 -1888 14883 3999 -8965 3085 12306 -1557 -7880
1980 -7880 7965 10583 -7907 -8923 11895 10916 -12902 -12383 11373 10375 -13728 -12200 10866 8048
1994 8048 -14955 -11311 9588 4476 -14414 -7308 10160 1078 -14327 -2819 12003 -476 -14473
2007 -14473 -45 13528 -859 -11709 3855 13666 -1883 -8791 6291 11059 -3969 -5355 11069
2020 11069 9997 -7771 -4973 13490 7978 -11839 -5550 14607 7608 -13392 -7698 12165 6815
2033 6815 -11392 -7725 6374 1867 -8958 -2813 3846 -3854 -7606 3088 2733 -11552 -8510 10182
$$ packed form
1943A9438k1230j9142J8980J8612j6922j7314J4048J3742j2304r060J1298L830
1955C976j1046J958J2598o306j4970R911J8390j1363j9737J3134K2263j2886k2526
1968a6604J2303K1899j0289j9347J0150J6771j0884j2964J2050R221j3863o323
1980g880J5845K618j8490j016K0818r79k3818N19K3756r98k4103J528K3066k818
1994H048k3003L644K0899n112j8890P106J7468r082j5405J1508J4822j2479j3997
2007a4473J4428J3573j4387j0850J5564R811j5549o908J5082M768j5028j386J6424
2020A1069j072j7768K798J8463n512j9817O289K0157o999k1000N694J9863n350
2033F815j8207L667J4099m507j0825O145O659p700l752J0694l55j4285L042J8692
$$ plain form
2047 10182 7527 -14184 -12049 12539 12632 -12312 -14071 10606 14813 -6427 -11204 6881 12035 -465
2061 -465 -3623 3949 3085 -534 5730 6850 -4781 -5011 12108 12411 -10914 -14334 11509 18578 -8443
2076 -8443 -19735 4880 18513 -3387 -18798 -1935 11424 -872 -11271 -3954 1299 -1847 4
2089 4 1818 -7891 -11216 5169 12850 -8192 -18977 5544 22471 -2259 -23730 -596 24573
2102 24573 6433 -19046 -6063 18501 11321 -8629 -5447 7760 6309 485 1960 -639 -4743
2115 -4743 5022 13992 -1297 -17519 -1509 20417 4678 -22941 -10158 20748 12499 -19923 -17998
2128 -17998 11342 13882 -9668 -15927 204 7500 -200 -4802 -4265 -4548 821 7943 -1482 -15217
2142 -15217 -3504 18553 9572 -17978 -12619 17766 17956 -11972 -16879 10896 20412 -2067 -13094
$$ packed form
2047A0182k655k1711K135K4588R3k4944j759K4677M207k1240m777J8085N154j2500
2061d65l158P572q64l619O264J120j1631k30J7119L03k3325l420K5843P069k7021
2076h443j1292K4615J3633k1900j5411J6863J3359j2296j0399P317N253l146J851
2089DJ814r709l325J6385P681k1042j0785K4521J6927k4730k1471K3134K5169
2102B4573j8140k5479J2983K4564p180j9950L182J3207j451n824J475k599m104
2115d743R765Q970j5289j6222J6010K1926j5739k7619J2783L0906q249l2422J925
2128a7998K9340K540k3550o259J6131P296p700m602N37k83N369P122r425j3735
2142a5217J1713K2057q981k7550N359L0385J90k9928m907K7775R516k2479j1027
$$ plain form
2155 -13094 2230 12315 4116 -2872 -2114 -1500 2473 9265 3123 -11982 -7390 13881 11275 -16314
2169 -16314 -18660 11689 19327 -10042 -23081 2452 18229 -2165 -18636 -4794 10207 2815
2181 2815 -7123 -4275 -535 4 4792 3428 -8974 -9371 10406 15581 -7222 -17030 7612 22309
2195 22309 -1905 -21172 458 22725 6162 -15787 -4574 14237 7793 -6462 -4080 3470
2207 3470 1936 1195 3008 -2833 -7778 3186 11928 -3415 -18217 -1732 17537 2100 -20474
2220 -20474 -7442 16726 7033 -17353 -11781 10646 8392 -9158 -8431 4546 3865 -3115 -588 1863
2234 1863 -2952 -1593 7158 4071 -8066 -3417 12770 8678 -10614 -8103 11880 11273 -7893 -8395
2248 -8395 9003 10144 -5198 -7102 4490 5160 -3681 -2583 3350 -752 -5292 2018 4788 -5265
$$ packed form
2155a3094J5324J0085q199o988P58O14L973O792o142j5105M592K1271k606k7589
2169a6314k346L0349P638k9369j3039K5533J5777k0394j6471J3842J5001p392
2181B815r938K848L740N39M788j364j2402l97J9777N175k2803r808K4642J4697
2195B2309k4214j9267K1630K2267j6563k1949J1213J8811o444j4255K382P550
2207C470j534p41J813n841m945J0964Q742j5343j4802J6485J9269j5437k2574
2220b0474J3032K4168r693k4386N572K2427k254j7550P27J2977o81o980K527K451
2234A863m815J359Q751l087j2137M649J6187m092j9292K511J9983o07j9166n02
2248h395J7398J141j5342j904J1592O70q841J098N933m102m540P310K770j0053
$$ plain form
2262 -5265 -8567 3549 7063 -6531 -9939 4262 8689 -5560 -9839 3064 6600 -4978 -6432
2275 -6432 5060 4967 -5397 -3103 6392 2479 -7022 -499 9298 1470 -8747 471 11286 1537
2289 1537 -9005 557 9925 42 -8315 2054 9382 -1624 -7595 3356 7330 -5213 -7389 5739
2303 5739 6906 -7047 -7818 6599 6341 -8139 -7709 6382 5250 -7860 -5751 6273 3171 -7331
2317 -7331 -2305 6729 -639 -8225 1411 9146 -2240 -9726 3633 11465 -3230 -11342 3428 12527
2331 12527 -1542 -10474 2384 10263 -711 -7035 1750 5354 -2425 -2855 4186 993 -5766 970
2345 970 8359 -1720 -11683 554 12929 229 -14026 -2153 13627 3045 -13179 -4893 10481
2358 10481 4879 -7776 -4653 4250 2751 -1436 21 -823 -3866 1346 7195 -1239 -10376 449
$$ packed form
2262e265l302J2116L514j3594l408J4201M427j4249m279J2903L536j1578j454
2275f432J1492r3j0364K294R495l913r501O523R797p828j0217R218J0815r749
2289A537j0542R562R368r883q357J0369P328j1006n971J0951L974j2543k176J3128
2303E739J167j3953p71J4417k58j4480M30J4091j132j3110K109J2024l102j0502
2317g331N026R034p368p586R636P735j1386p486J3359P832j4695q112J4770R099
2331A2527j4069q932J2858P879j0974o324Q785L604p779m30P041l193o759O736
2345I70P389j0079r963J2237J2375j2700j4255J1873J5780j0582j6224Q286J5374
2358A0481n602j2655L123Q903j499m187J457q44l043N212N849q434r137J0825
$$ plain form
2372 449 13406 2295 -14385 -4770 14125 7126 -11888 -7913 9940 8710 -6374 -7760 3153
2385 3153 5290 -322 -1180 -1306 -3015 1734 8054 -215 -11544 -2597 13245 5336 -14700 -8629 14297
2400 14297 11953 -11816 -13564 8132 13322 -4485 -11237 1628 8142 570 -3897 -1449 -839 489
2414 489 5347 1663 -9148 -5444 10993 9452 -11338 -13303 9238 15419 -7321 -17291 3386 16803
2428 16803 360 -14718 -3402 10327 4678 -6020 -4484 1005 2884 3498 1054 -6031 -4680 8099
2442 8099 9988 -6858 -13553 5490 17374 -949 -16956 -1673 16699 5188 -13673 -7346 10195
2455 10195 8442 -5494 -7288 500 3857 2051 -581 -4745 -4998 4337 8321 -4138 -12942 394
2469 394 14107 1541 -15866 -6315 13936 8548 -11505 -10051 7947 9471 -4118 -8072 794
$$ packed form
2372D49J2957j1111j6680R615J8895o999j9014L975J7853j230j5084j386J0913
2385C153K137n612q58j26j709M749O320q269j1329Q947J5842p909k0036O071K2926
2400A4297k344k3769j748K1696N190j7807o752J2865O514p572m467K448O10J328
2414D89M858l684j0811L704J6437j541k0790j965K2541O181k2740r970K0677J3417
2428A6803j6443j5078J1316J3729n649j0698J536N489J879O14k444p085J351J2779
2442H099J889j6846o695J9043J1884j8323j6007J5283J8372j1511j8861O327J7541
2455A0195j753j3936j794P788L357j806k632m164k53R335L984j2459q804J3336
2469C94J3713j2566j7407R551K0251n388k0053J454J7998J524j3589l954Q866
$$ plain form
2482 794 5541 2615 -13 -2522 -3340 2998 8469 150 -10501 -1738 13640 6482 -12088 -7976 11927
2497 11927 10743 -8878 -11533 5756 10854 -2876 -8720 -54 4737 -138 -1966 -1715 -3573 -1186
2511 -1186 5351 1895 -9626 -6561 8776 8135 -10333 -11995 7977 13012 -6471 -13257 4248 12904
2525 12904 -1534 -10026 720 8458 1301 -3467 1129 2427 -765 1978 5006 -2061 -5784 4925
2539 4925 9447 -3369 -10298 3193 11938 -1373 -12538 -494 11008 150 -10578 -2004 7417
2552 7417 164 -6707 -1390 2774 -1948 -3575 1533 741 -4899 -1951 5086 546 -7249 -1257 7810
2567 7810 1381 -7575 -1001 7871 2265 -5822 -536 6987 1482 -4906 1660 6790 -389 -4000 3713
2582 3713 5807 -2358 -3862 4427 5174 -3290 -4092 4137 3705 -4653 -3814 4202 1444 -5946 -1934 4128
$$ packed form
2482G94M747k926k628k509q18O338N471q319j0651Q763J5378p158j8570M112J9903
2497A1927j184j9621k655J7289N098j3730n844Q666M791m875j828K51j858K387
2511a186O537l456j1521L065J5337o41j8468j662J9972N035j9483o786J7505Q656
2525A2904j4438q492J0746P738p157m768M596J298l192K743L028p067l723J0709
2539D925M522j2816o929J3491Q745j3311j1165J2044J1502j0858j0728Q574R421
2552G417p253o871N317M164m722j627N108p92n640K948P037m540p795N992R067
2567G810o429q956O574Q872n606q087N286P523n505o388O566N130p179l611P713
2582C713K094q165j504Q289P47q464q02Q229m32q358Q39Q016k758p390M012O062
$$ plain form
2598 4128 -1222 -6801 -837 4659 -2141 -8688 -468 6533 -1761 -8415 357 6462 -1189 -6588 973
2613 973 5169 -571 -3028 2469 3614 -1652 -756 5881 2823 -5138 439 9098 2253 -7371 -538
2628 -538 9681 3741 -7913 -3384 8032 4455 -6709 -3996 4978 1947 -4618 -1403 1506 -2630
2642 -2630 -2922 2167 882 -6425 -4564 5298 3660 -8997 -8093 7146 7389 -7890 -9418 5353 8793
2657 8793 -3270 -8010 1521 7409 874 -3658 493 2789 1169 3043 2367 -3330 -1507 7739 6557
2672 6557 -5342 -6494 6725 10896 -3445 -10855 2177 11867 -159 -10500 -2211 6705 2168
2685 2168 -5323 -4783 -657 1469 847 -2008 -5741 -4059 4241 5240 -7079 -10503 4176 11146 -3404
2700 -3404 -12850 342 12197 2906 -10248 -4127 9470 6780 -3936 -3516 2928 4027 3471 1799
$$ packed form
2598D128n350n579N964N496o800o547Q220P001q294o654Q772O105p651n399P561
2613I73M196n740k457N497J145n266Q96O637l058p961N577Q659o845r624O833
2628e38J0219n940j1654M529J1416l577j1164K713Q974l031o565L215K909m136
2642b630k92N089j285p307J861R862j638j2657R04J5239K43j5279j528J4771L440
2657H793j2063m740R531N888o535m532M151K296j620J874o76n697J823R246j182
2672F557j1899j152J3219M171j4341p410J3032R690j2026j0341Q289Q916m537
2685B168p491N40M126K126o22k855l733J682Q300R99j2319l424J4679O970j4550
2700c404r446J3192J1855r291j3154O121J3597k690j0716M20O444J099n56j672
$$ plain form
2714 1799 -2742 -2589 5926 8347 -2581 -9393 2160 13204 1901 -13636 -4373 13227 6047 -11506
2728 -11506 -8601 6433 6873 -4741 -8716 -857 3599 129 -2762 -3506 -4290 1045 6081 -1982 -11114
2743 -11114 -1843 11443 3868 -11847 -7296 10971 10752 -7807 -10940 6636 12706 -1422 -7568
2756 -7568 1076 7185 3814 -945 -1915 -121 3375 5774 932 -6708 -3269 9236 7370 -9412 -10182
2771 -10182 7207 10668 -6084 -13136 509 10316 -53 -11423 -4565 5812 2234 -4767 -4359
2784 -4359 -1436 886 2823 -428 -6046 -3162 6244 6066 -5044 -8500 4026 11422 -588 -10529
2798 -10529 921 11343 3430 -6552 -2287 6126 5492 -1116 -2830 455 2802 2919 1942 -3061 -4309
2813 -4309 3741 7209 -3532 -9591 1145 9083 -223 -10648 -4047 7932 3409 -9116 -6220 4645
$$ packed form
2714A799m541J53Q515K421j0928o812J1553J1044j1303j5537R263J7600p180j7553
2728a1506K905J5034M40j1614l975P859M456l470k891p44p84N335N036q063r132
2743a1114R271J3286p575j5715M551J8267k19j8559l133J7576O070j4128o146
2756g568Q644O109l371m759r70J794L496K399m842p640L439J2505j866j6782p70
2771a0182J7389L461j6752p052J3645R807j0369j1370O858J0377l578p001M08
2784d359K923K322J937l251n618K884R406j78j1110l456J2526P396j2010r941
2798a0529J1450J0422p913r982M265Q413o34o608j714L285K347J17r77n003j248
2813d309Q050L468j0741o059J0736P938r306j0425O601J1979m523j2525K896J0865
$$ plain form
2827 4645 3157 -4471 -3753 630 275 -300 315 -1121 -3119 -31 5411 1860 -6201 -2233 9086 5027
2843 5027 -7464 -3954 8416 6806 -4438 -4908 5080 7019 -1876 -4207 2830 3955 -1812 -1055 2251
2858 2251 -712 -2055 1867 1766 -3633 -4095 2509 3830 -3987 -6332 2548 5097 -4494 -6662 2664
2873 2664 4162 -4013 -4909 1944 3246 -2435 -3531 2387 2921 -3218 -2149 4229 2203 -3359 35
2888 35 4985 1018 -2706 961 4230 466 -2288 1805 4497 -1294 -3143 3439 4477 -3486 -4064 3934
2904 3934 3834 -3744 -4279 2705 3721 -3180 -5357 1140 2821 -2945 -2903 908 -522 -2623 383 1194
2920 1194 -3087 -2846 2683 3329 -3787 -4789 4212 6564 -3597 -6685 3713 7249 -1755 -5041 2285
2935 2285 5697 524 -3291 464 2621 -246 260 2725 -666 -3571 2780 5483 -3302 -7056 2640
$$ packed form
2827D645j488p628P18M383l55n75O15j436j998L088N442l551q061L968J1319m059
2843E027j2491L510J2370j610j1244m70R988J939q895k331P037J125n767P57L306
2858B251k963j343L922j01n399m62O604J321p817k345Q880K549r591k168R326
2873B664J498q175q96O853J302n681j096N918N34o139J069O378k026n562L394
2888C5M950l967l724L667L269l764k754M093K692n791j849O582J038p963n78P998
2904C934j00p578n35O984J016o901k177O497J681n766M2L811j430k101L006Q11
2920A194m281K41N529O46p116j002R001K352j0161l088J0398L536r004l286P326
2935B285L412n173l815L755K157k867N06K465l391k905O351K703q785l754R696
$$ plain form
2950 2640 7643 -1719 -9366 -665 8674 1419 -8894 -3225 5994 1880 -5419 -2828 2153 1480 -744
2965 -744 -805 -1688 -2343 1245 4258 -977 -6928 180 8957 1628 -8889 -2670 8907 4780 -6778
2980 -6778 -5496 5623 7505 -2381 -5548 1300 4411 1251 -1284 -1991 -1073 3005 4312 -1697 -6591
2995 -6591 -325 7506 2399 -8590 -5405 7605 6923 -6690 -8343 4024 7573 -1962 -7395 -1363
3009 -1363 5006 2804 -2427 -3186 -789 2249 3387 -666 -5747 -1088 7559 3952 -7364 -6056 6470
3024 6470 8292 -4219 -9283 1894 9575 921 -7493 -2126 5256 3290 -2352 -3700 -1038 2535
3038 2535 3848 28 -5416 -2642 5674 5314 -5737 -8339 4303 10024 -2115 -10351 -57 9634
3052 9634 2428 -7920 -4252 5517 4429 -2872 -3662 387 1906 1583 426 -3442 -3307 3488 6472
$$ packed form
2950B640N003r362p647Q701R339p255j0313N669R219m114p299K591M981o73k224
2965g44o1q83o55L588L013n235n951P108Q777p329j0517O219J1577m127j1558
2980f778J282J1119J882r886l167O848L111l160k535p07R18M078J307o009m894
2995f591O266P831n107j0989L185J3010o82j3613j653J2367L549r535n433O032
3009a363O369k202n231p59K397L038J138m053n081M659Q647l607j1316J308J2526
3024F470J822j2511n064J1177P681q654q414N367P382j966n642j348K662L573
3038B535J313l820n444K774Q316l60j1051k602J2642N721j2139q236J0294R691
3052I634p206j0348L668R769j088p301p90M049J519l23j157l868J35O795K984
$$ plain form
3067 6472 -2361 -8480 238 9760 1972 -10127 -4093 9251 5840 -7557 -6678 5047 6784 -2407
3081 -2407 -5844 -214 3504 1632 -837 -1953 -1478 1510 4664 -474 -6742 -1080 7771 3532 -7090
3096 -7090 -4939 6308 6760 -4465 -7195 2972 6918 -992 -5369 -570 3494 1623 -846 -1893
3110 -1893 -1874 216 3176 487 -4742 -2687 5025 3780 -6008 -5884 4505 6524 -3305 -6729 1508
3125 1508 5934 -245 -4579 -361 3140 657 -989 -143 -419 -115 2598 2557 -2966 -3570 3264 5399
3141 5399 -2380 -5352 2276 6693 -868 -6423 249 5943 196 -4640 -641 3082 94 -2430 164
3156 164 629 -1655 -705 1883 -617 -3902 -2 4275 -495 -5605 -834 4887 307 -5321 -930 4943
3172 4943 879 -4592 -687 4363 924 -3021 361 3692 6 -2388 1810 3396 -1046 -2135 2305
$$ packed form
3067F472q833o119Q718R522p788j2099O034J3344l411j3397Q79J1725J737r191
3081b407l437N630L718j872k469j116M75K988L154n138o268N662Q851m239j0622
3096g090K151J1247M52j1225k730J0167L946p910m377M799M064j871k469j047
3110a893J9K090K960k689n229K055P712j245r788J24J0389K019r829l424Q237
3125A508M426o179m334M218L501k483j646Q46k76L04K713m1n523o04O834K135
3141E399p779k972P628M417p561n555O672N694n747m836L999L723k988k524K594
3156A64M65k284R50K588k500l285L900M277m770n110M771N721m580n628M391N873
3172D943m064n471L905N050l439l945L382L331l686k394M198J586m442j089M440
$$ plain form
3187 2305 2803 -1537 -1832 2645 2480 -2461 -1909 2520 1387 -3283 -1467 3038 434 -4326 -1282 3299
3203 3299 57 -4720 -1574 3510 538 -4532 -1851 2857 1212 -2637 -1728 1038 580 -511 583
3218 583 249 -835 1060 2868 -72 -3341 806 5728 1456 -4598 -1063 5875 3181 -3946 -2608
3233 -2608 4261 3585 -2343 -2759 1490 2342 125 -1260 -1184 -1357 378 2320 -1073 -4837 -1171 4763
3249 4763 1037 -6991 -4302 5152 4000 -5873 -6273 3160 5520 -2325 -5700 542 3956 565 -2148
3264 -2148 -932 674 1851 2871 619 -3336 -845 5851 4580 -4273 -4589 5536 7767 -2823 -7363
3279 -7363 2396 8459 345 -7012 -1793 4981 2468 -3226 -3071 -384 962 807 -1020 -4237 -2901
3294 -2901 3460 3645 -4983 -7716 2064 7512 -1875 -9381 -1237 8512 2606 -7696 -4395 5421 5626
$$ packed form
3187B305M98m340k95M477j65m941N52M429j133m670J816M505k604m760L044M581
3203C299l242m777L146N084k972n070K681M708j645l849R09K766m58j091J094
3218E83l34j084J895J808k940l269M147M922m272o054L535O938k694p127J338
3233b608O869o76n928m16M249Q52k217j385P6j73J735J942l393l764L666N934
3249D763l726q028K689R454j152r873m00R433K360p845l375O242L414l391k713
3264b148J216J606J177J020k252l955K491O696j271q853l16J0125K231j0590m540
3279g363R759O063q114p357N219O774k513n694J55K687J346j55j827l217J336
3294b901O361J85q628k733R780N448r387p506Q144R749n906j0302L301R816K05
$$ plain form
3309 5626 -2258 -4367 853 4091 2835 -214 -2281 -771 4491 4831 -2298 -5354 2458 8635 1401
3324 1401 -7834 -2486 7887 4751 -5792 -5694 3627 5652 -1784 -5674 -1555 2609 1644 -2011 -4619
3339 -4619 -2829 2379 3597 -2856 -7217 -355 6544 1138 -8353 -4156 6573 5705 -4901 -6040 3178
3354 3178 6547 -135 -4398 -414 4006 3069 537 -1420 -837 2869 5115 712 -4977 -1414 7067
3369 7067 4890 -5318 -5715 4806 7063 -3462 -8087 784 6540 -6 -6569 -2822 2788 1660
3383 1660 -2602 -3334 -2016 172 1661 -156 -4141 -3306 3255 4283 -3641 -6825 1950 7522 6
3398 6 -6921 -709 7117 3132 -4593 -2562 4437 4349 -379 -1827 640 2309 2475 1111 -1241 -1732 2388
3415 2388 4327 -865 -4718 29 5635 1119 -6027 -3463 4380 2724 -4566 -4589 1409 2447 -2317
$$ packed form
3309E626p884k109N220L238j256l049k067J510N262L40p129l056P812O177p234
3324A401r235N348J0373l136j0543R8R321K025p436l890M119M164r65l655k608
3339d619J790N208J218o453m361O862O899n406r491M197J0729q68j0606j139R218
3354C178L369o682m263L984M420r37k532j957N83L706K246m403n689L563Q481
3369G067k177j0208l97J0521K257j0525m625Q871N756o546o563L747N610j128
3383A660m262p32J318K188J489j817l985Q35O561J028p924l184Q775N572p516
3398Fo927O212P826l985p725K031O999q8m728j448K467J669J66j364k352m91M120
3415B388J939n192l853M747N606m516p146K564P843j656p290k3N998J038m764
$$ plain form
3430 -2317 -3621 -640 529 -291 -722 -1237 -1699 77 2790 429 -3558 -1343 3906 2592 -3019 -2072
3446 -2072 3968 4241 -1432 -2573 2619 3833 37 -1052 1564 1830 65 764 1323 -678 -1036 1680
3462 1680 2054 -2325 -2607 2107 2776 -2670 -3618 1356 2472 -2819 -3784 728 2165 -2453 -2987 942
3478 942 900 -2676 -2032 1794 447 -2900 -784 2896 572 -2772 151 3371 583 -2500 599 3898
3494 3898 638 -1924 1700 3459 -400 -2044 2422 3720 -1088 -2649 2356 3576 -1611 -3264 1538
3509 1538 3191 -1741 -3078 386 1642 -1127 -1835 -503 -514 -1714 -204 568 -2010 -2518 1348 2332
3525 2332 -2750 -4170 1607 4287 -1274 -4665 631 4908 841 -3597 -679 3639 2106 -833 -944
3540 -944 811 1715 2126 1116 -1637 -1123 3199 3518 -2144 -4123 2122 5458 -485 -5880 -734 5360
$$ packed form
3430b317j304K981J169q20m31n15m62J776K713k361l987K215N249j314n611R47
3446b072O040K73n673j141N192J214l796j089K616K66j765O99N59k001l58K716
3462A680L74m379k82M714O69n446r48M974J116n291r65M512J437m618n34L929
3478I42m2l576O44L826j347l347K116L680k324l344K923L220k788l083L099L299
3494C898l260k562L624J759l859j644M466J298m808j561N005J220n187j653M802
3509A538J653m932j337L464J256k769p08J332j1j200J510P72k578n08L866R84
3525B332n082j420N777K680n561l391N296M277m067m438K918M318j533k939j11
3540i44J755R04M11j010k753N14M322L19n662j979O245L336n943n395N146O094
$$ plain form
3556 5360 1594 -4875 -3110 2546 2616 -2016 -3203 -701 1223 669 -940 -3252 -2016 2230 3081 -2456
3572 -2456 -5353 646 5896 412 -6227 -2223 6146 4087 -4480 -3938 3491 4942 -647 -3091 38
3587 38 2850 2263 64 -1898 -1239 2305 4057 -558 -5262 -976 6155 2802 -5922 -4959 4743 5676
3603 5676 -3821 -7104 1134 6206 -183 -5961 -2266 2932 2182 -1711 -3290 -1224 1796 2802 -544
3618 -544 -4357 -1424 4708 3707 -4369 -5512 3533 7243 -1099 -7139 -229 7021 2877 -4933 -3235
3633 -3235 3947 4723 -574 -3514 -660 2617 3171 -579 -3860 -1491 4163 3537 -3287 -5425 1966 6396
3649 6396 -520 -6892 -1690 5739 2829 -4893 -4332 2404 3729 -979 -3444 -1353 1705 2480 -76
3664 -76 -3004 -2103 2973 4268 -1886 -5460 522 6340 1408 -5823 -2692 5490 4104 -3742 -4078 2242
$$ packed form
3556E360l766o469J765N656P0m632j187K502J924n54j609k312J236M246Q51n537
3572b456k897N999N250n484o639M004Q369k059q567N42P429J451n589k444L129
3587C8K812n87k199j962O59L544J752m615m704M286P131l353q724R63R702R33
3603E676r497l283Q238N072o389n778L695N198p50l893j579K066L020J006l346
3618e44l813K933O132j001q076j143R045L710q342o040O910P250m144p810J698
3633c235P182P76n297k940K854L277N54l750l281K369N654o26o824k138P391M430
3649F396o916o372N202P429k910p722N61O736J325m708k465K091L058P75k556
3664g6k928R01N076J295o154l574N982N818m932p231L131Q182j386p846l36O320
$$ plain form
3680 2242 4003 -287 -3088 -760 1593 1676 509 -1606 -2433 1016 3677 137 -4975 -1622 4834 2689
3696 2689 -4826 -4460 3546 4380 -2704 -4821 1152 4177 -212 -3204 -923 1668 902 71 -812 -1504
3712 -1504 -8 2637 1261 -3465 -2598 3106 3572 -2967 -4474 2092 4830 -635 -4630 -163 4356
3727 4356 915 -3095 -1018 2158 1051 -876 -648 -108 -73 778 1034 -1080 -2200 1045 2892 -601
3743 -601 -3363 201 3562 523 -3176 -1210 2797 1479 -1912 -1293 1193 767 -678 -351 62 -297
3759 -297 94 921 -239 -1623 -103 1850 -84 -2401 -712 2044 440 -2132 -852 1742 273 -1678
3775 -1678 -418 1212 -149 -1440 434 1443 -465 -1172 1156 1782 -1052 -1510 1327 2147 -718 -1283
3791 -1283 1277 1302 -977 -765 1242 834 -1641 -616 1631 317 -2290 -326 2502 203 -3109 -1030
$$ packed form
3680B242J761m290k801K328K353Q3j167k115q27L449K661l540n112L353O456k145
3696B689p515L66Q006Q34p084k117N973L025m389k992K281K591p66q31q83o92
3712a504J496K645j376m726Q67N704M66o539j507O566K738n465l995M467M519
3727D356l441m010K077L176j107j927K28N40L5Q51K56k114j120L245J847l493
3743f01k762L564L361l039l699J966M007j318l391O19K486m26j445L27M13l59
3759b97L91Q27j160j384J520J953j934k317J689K756j604k572J280K594j469j951
3775a678J260J630j361j291J874J009j908p07K328O26k834m58K837Q20k865n65
3791a283K560K5k279K12K007m08k475J025K247j314k607J964K828k299l312K079
$$ plain form
3807 -1030 2581 674 -2962 -1353 1701 841 -1901 -1224 732 233 -751 157 171 -1030 -43 2009 637
3824 637 -2510 -795 3090 1856 -2846 -2153 3297 3380 -2082 -2963 1751 3444 -286 -2174 304 2022
3840 2022 902 -444 -520 -707 491 1722 -84 -2660 -1349 3098 2337 -3561 -3770 2284 3750 -2098
3856 -2098 -4960 72 4195 286 -4061 -2219 1993 1940 -1073 -2377 -944 1791 2199 -157 -2778 -533
3872 -533 3847 2803 -2777 -3467 2837 5423 -711 -4410 338 4895 1919 -3347 -1994 2478 3140 -334
$$ packed form
3807a030L611j907l636J609L054q60k742O77J956m99r84R08J4j201R87K052j372
3824F37l147J715L885j234m702O93N450Q3n462q81M714J693l730j888K478J718
3840B022j120j346p6j87J198J231j806k576J311M447p61n898k09O054J466n848
3856b098k862N032M123l909m347J842M212n3l013j304J433K735M08k356k621K245
3872e33M380j044n580o90O304K586o134l699M748M557k976n266J353M472O62l474
$$ [...]
8191b1
##END NTUPLES=NMR FID
##END=
