##TITLE=1H_CA-8883-2
 CDCl3, 8 sc, 
 2.07.2021
##JCAMPDX= 6.0         $$ Bruker NMR JCAMP-DX V2.0
##DATA TYPE= NMR SPECTRUM
##DATA CLASS= NTUPLES
##ORIGIN= UXNMR, Bruker Analytische Messtechnik GmbH
##OWNER= root
$$ XWIN-NMR		Version 3.5
$$ Fri Jul  2 13:32:15 2021 Russian Standard Time (UT+4h)  she@DPX200
##.OBSERVE FREQUENCY= 200.131506
##.OBSERVE NUCLEUS= ^1H
##.ACQUISITION MODE= SIMULTANEOUS
##.ACQUISITION SCHEME= undefined
##.AVERAGES= 8
##.DIGITISER RES= 18
##SPECTROMETER/DATA SYSTEM= spect
##.PULSE SEQUENCE= zg30
##.SOLVENT NAME= CDCl3
##.SHIFT REFERENCE= (INTERNAL, CDCl3, 0, 17.4983)
##AUDIT TRAIL= $$ (NUMBER, WHEN, WHO, WHERE, WHAT)
$$ ##TITLE= Audit trail, XWIN-NMR		Version 3.5
$$ ##JCAMPDX= 5.01
$$ ##ORIGIN= Bruker BioSpin GmbH
$$ ##OWNER= she
$$ F:/spectra/data/she/nmr/H-F/1/pdata/1/auditp.txt
$$ ##AUDIT TRAIL=  $$ (NUMBER, WHEN, WHO, WHERE, WHAT)
(   1,<2021-07-02 13:30:39.67 +0400>,<she>,<DPX200>,
      <created by zg, POWCHK disabled, PULCHK disabled
       configuration hash MD5:
       00 E9 B6 7A A2 85 ED C7 34 08 36 98 17 FE 4E 26
       data hash MD5: 16K
       70 BF C4 89 D6 B6 50 F4 AC A1 F9 EA 30 83 7D 65>)
(   2,<2021-07-02 13:30:42.29 +0400>,<she>,<DPX200>,
      <Start of raw data processing
       efp BC_mod = 2 LB = 0.24 FT_mod = 6 PKNL = 1 PHC0 = -12070.98 PHC1 = 10.40099 SI = 16K 
       data hash MD5: 16K
       A3 DA 24 3A 53 07 A4 CE 55 8E B2 DD 17 C6 43 B7>)
(   3,<2021-07-02 13:31:03.92 +0400>,<she>,<DPX200>,
      <pk PHC0 = -1.631643 PHC1 = 3.600001 
       data hash MD5: 16K
       A9 5A 1E 4B AC 8E E7 FE 5A 36 F9 D4 A3 AD C8 28>)
(   4,<2021-07-02 13:31:08.67 +0400>,<she>,<DPX200>,
      <abs ABSG = 5 
       data hash MD5: 16K
       CE CD 38 91 0B 70 98 F6 8D 98 F2 CB 7A 5F CD 92>)
$$ ##END=
$$ 
$$ hash MD5
$$ B8 F4 42 53 22 29 60 0A 8A 70 45 57 D6 71 91 32
##$RELAX= 
##$RELAX= 
##$RELAX= 
##$RELAX= 
##$RELAX= 
##$RELAX= 
$$ Bruker specific parameters
$$ --------------------------
##$DU= <F:/spectra>
##$EXPNO= 1
##$NAME= <H-F>
##$PROCNO= 1
##$TYPE= <nmr>
##$USER= <she>
##$AMP= (0..31)
100 100 100 100 100 100 100 100 100 100 100 100 100 100 100 100 100 100 
100 100 100 100 100 100 100 100 100 100 100 100 100 100 
##$AQSEQ= 0
##$AQ_mod= 1
##$AUNM= <au_zg>
##$AUTOPOS= <>
##$BF1= 200.13
##$BF2= 200.13
##$BF3= 200.13
##$BF4= 200.13
##$BF5= 200.13
##$BF6= 200.13
##$BF7= 200.13
##$BF8= 200.13
##$BYTORDA= 1
##$CFDGTYP= 0
##$CFRGTYP= 5
##$CHEMSTR= <none>
##$CNST= (0..31)
1 1 145 1 1 1 1 1 1 1 1 1 1 1 1 1 1 1 1 1 1 1 1 1 1 1 1 1 1 1 1 1 
##$CPDPRG= <>
##$CPDPRG1= <>
##$CPDPRG2= <>
##$CPDPRG3= <>
##$CPDPRG4= <mlev>
##$CPDPRG5= <mlev>
##$CPDPRG6= <mlev>
##$CPDPRG7= <mlev>
##$CPDPRG8= <mlev>
##$CPDPRGB= <>
##$CPDPRGT= <>
##$D= (0..31)
0 1.2 0 0 0 0 0 0 0 0.06 0 0.03 0 0 0 0 0.0002 0 0 0 0 0 0 0 0 0 0 0 0 
0 0 0 
##$DATE= 1625218239
##$DBL= (0..7)
120 120 120 120 120 120 120 120 
##$DBP= (0..7)
150 150 150 150 150 150 150 150 
##$DBP07= 0
##$DBPNAM0= <>
##$DBPNAM1= <>
##$DBPNAM2= <>
##$DBPNAM3= <>
##$DBPNAM4= <>
$$ [...]
##$SUBNAM3= <"">
##$SUBNAM4= <"">
##$SUBNAM5= <"">
##$SUBNAM6= <"">
##$SUBNAM7= <"">
##$SUBNAM8= <"">
##$SUBNAM9= <"">
##$SW= 20.0188882624521
##$SWIBOX= (0..15)
0 0 2 0 0 0 0 0 0 0 0 0 0 0 0 0 
##$SW_h= 4006.41025641026
##$TD= 16384
##$TD0= 1
##$TE= 0
##$TE2= 300
##$TE3= 300
##$TEG= 300
##$TL= (0..7)
0 120 120 120 120 120 120 120 
##$TP= (0..7)
150 150 150 150 150 150 150 150 
##$TP07= 0
##$TPNAME0= <>
##$TPNAME1= <>
##$TPNAME2= <>
##$TPNAME3= <>
##$TPNAME4= <>
##$TPNAME5= <>
##$TPNAME6= <>
##$TPNAME7= <>
##$TPOAL= (0..7)
0.5 0.5 0.5 0.5 0.5 0.5 0.5 0.5 
##$TPOFFS= (0..7)
0 0 0 0 0 0 0 0 
##$TUNHIN= 0
##$TUNHOUT= 0
##$TUNXOUT= 0
##$USERA1= <user>
##$USERA2= <user>
##$USERA3= <user>
##$USERA4= <user>
##$USERA5= <user>
##$V9= 5
##$VALIST= <valist>
##$VCLIST= <CCCCCCCCCCCCCCC>
##$VD= 0
##$VDLIST= <DDDDDDDDDDDDDDD>
##$VPLIST= <PPPPPPPPPPPPPPP>
##$VTLIST= <TTTTTTTTTTTTTTT>
##$WBST= 1024
##$WBSW= 4
##$XGAIN= (0..3)
0 0 0 0 
##$XL= 0
##$YL= 0
##$YMAX_a= 428545
##$YMIN_a= -244316
##$ZGOPTNS= <>
##$ZL1= 120
##$ZL2= 120
##$ZL3= 120
##$ZL4= 120
##$ABSF1= 17.5301
##$ABSF2= -2.488939
##$ABSG= 5
##$ABSL= 3
##$ALPHA= 0
##$AQORDER= 0
##$ASSFAC= 0
##$ASSFACI= 0
##$ASSFACX= 0
##$ASSWID= 0
##$AUNMP= <proc_1d>
##$AZFE= 0.1
##$AZFW= 0.1
##$BCFW= 0
##$BC_mod= 2
##$BYTORDP= 0
##$COROFFS= 0
##$CY= -3
##$DATMOD= 1
##$DC= 0
##$DFILT= <>
##$DTYPP= 0
##$F1P= 0
##$F2P= 0
##$FCOR= 1
##$FTSIZE= 16384
##$FT_mod= 6
##$GAMMA= 0
##$GB= 0
##$INTBC= 1
##$INTSCL= 1.334414e-10
##$ISEN= 128
##$LB= 0.24
##$LEV0= 0
##$LPBIN= 0
##$MAXI= 10000
##$MC2= 0
##$MEAN= 0
##$ME_mod= 0
##$MI= 1.114404
##$NCOEF= 0
##$NC_proc= -7
##$NLEV= 6
##$NOISF1= 3.799351
##$NOISF2= 2.8
##$NSP= 0
##$NTH_PI= 0
##$NZP= 0
##$OFFSET= 17.49833
##$PC= 1
##$PHC0= -12072.61
##$PHC1= 14.00099
##$PH_mod= 1
##$PKNL= yes
##$PPARMOD= 0
##$PSCAL= 0
##$PSIGN= 0
##$REVERSE= no
##$SF= 200.130007264801
##$SI= 16384
##$SIGF1= 3
##$SIGF2= 2
##$SINO= 5.538805
##$SIOLD= 16384
##$SREGLST= <1H.CDCl3>
##$SSB= 0
##$STSI= 16384
##$STSR= 0
##$SW_p= 4006.41025641026
##$SYMM= 0
##$S_DEV= 0
##$TDeff= 16384
##$TDoff= 0
##$TI= <>
##$TILT= no
##$TM1= 0
##$TM2= 0
##$TOPLEV= 0
##$USERP1= <user>
##$USERP2= <user>
##$USERP3= <user>
##$USERP4= <user>
##$USERP5= <user>
##$WDW= 1
##$XDIM= 16384
##$YMAX_p= 493505779
##$YMIN_p= -485724
$$ End of Bruker specific parameters
$$ ---------------------------------
##NTUPLES= NMR SPECTRUM
##VAR_NAME=  FREQUENCY,     SPECTRUM/REAL,   SPECTRUM/IMAG
##SYMBOL=    X,             R,               I
##VAR_TYPE=  INDEPENDENT,   DEPENDENT,       DEPENDENT
##VAR_FORM=  AFFN,          ASDF,            ASDF
##VAR_DIM=   16384,         16384,           16384
##UNITS=     HZ,            ARBITRARY UNITS, ARBITRARY UNITS
##FACTOR=    0.24454680195387, 1,            1
##FIRST=     3501.94074243255, 0,            0
##LAST=      -504.469513977712, 0,           0
##MIN=       -504.469513977712, -485724,     0
##MAX=       3501.94074243255, 493505779,    0
$$ Real data points
##PAGE= N=1
##DATA TABLE= (X++(R..R)), XYDATA
$$ [...]
5421F863728K07693K64180K76514L59349K24998K70542L85202K91236L54743L80664
5411I878849L13858M22184L48578L14400L73976L20381K19584J16138K6510q0026
5401A2254432j82699k07361k86818k74601l77218k81454l46498k70347l96277
5392I631159k66730j90046j55524j25713k28097j11344j19857j58031j01698k12363
5382G961756j61944j65412k07734j24496j67997r0260j37898j84904j12416p8695
5372F530000r6998L253j07976p8585l4449q7188q5446j05144j4888k2144o5582
5361E834853n7618l3769q2350j22919k2037n2304Q999m8263q2335j01066J4192
5350E255383P7460r1643J2416o5711l0715l6008l8165P4808o2413n8755J3889
$$ y = [6863728, 7071421, 7335601, 7612115, 7971464, 8196462, 8467004, 8852206, 9143442, 9498185, 9878849, 10192707, 10614891, 10963469, 11277869, 11651845, 11972226, 12191810, 12307948, 12334458, 12254432, 12071733, 11864372, 11577554, 11302953, 10925735, 10644281, 10297783, 10027436, 9631159, 9364429, 9174383, 9018859, 8893146, 8665049, 8553705, 8433848, 8275817, 8174119, 7961756, 7799812, 7634400, 7426666, 7302170, 7134173, 7043913, 6906015, 6721111, 6608695, 6530000, 6433002, 6436255, 6328279, 6249694, 6215245, 6128057, 6042611, 5937467, 5922579, 5900435, 5834853, 5777235, 5743466, 5661116, 5538197, 5516160, 5463856, 5472855, 5424592, 5342257, 5241191, 5255383, 5332843, 5241200, 5253616, 5187905, 5157190, 5121182, 5083017, 5157825, 5095412, 5036657, 5050546]
5339E050546L4597l2461N3818p5698J8710m9500P9676J6677K8832o845j9247K7405
5327E126510p2794P385L6611M8637O866M1283o957R853m70M5821K8803M6173q094
5314E309627K5603n8063j1915O1320j9031M2465M0918l1171J23016q2333q037
5303E392399R3065j3546M7607L1982k2672J3697J4549O1443R6172L0905j8930
5292E726671J8125L1368j1876Q6746m313N6474J10549k0511j1892k8368R4924
5281F047897P9038k515k1810J04033J2967l5317m2019m4538P1013Q1383k5862
5270F224270j25325L6583k9828o5363j4125j1448j57347o0021j4574N120p6467
5259E711475l3282K8490n1541j0763Q7506o0558k0495j6838r9978R42K2126o9954
$$ y = [5050546, 5085143, 5052682, 5106500, 5030802, 5049512, 5000012, 5079688, 5096365, 5125197, 5118352, 5099105, 5126510, 5053716, 5061101, 5097712, 5146349, 5153215, 5194498, 5187541, 5197394, 5196924, 5242745, 5271548, 5317721, 5309627, 5335230, 5277167, 5265252, 5326572, 5307541, 5350006, 5390924, 5359753, 5482769, 5400436, 5392399, 5485464, 5471918, 5519525, 5551507, 5528835, 5542532, 5557081, 5618524, 5714696, 5745601, 5726671, 5744796, 5776164, 5764288, 5851034, 5846721, 5903195, 6013744, 5993233, 5981341, 5952973, 6047897, 6126935, 6124420, 6102610, 6206643, 6219610, 6184293, 6142274, 6097736, 6168749, 6250132, 6224270, 6098945, 6135528, 6105700, 6040337, 6026212, 6014764, 5857417, 5797396, 5782822, 5787942, 5711475, 5678193, 5706683, 5655142, 5644379, 5731885, 5671327, 5650832, 5633994, 5534016, 5534958, 5557084, 5487130]
5247E487130k5376O3167J3304m3571R466q335n0399P214L4576Q4156N9009M0728
5235E671069O019M6457O4819N177j1253M182N1898N2115M0681J20753M9873J42457
5223F244247J2030L0778J14542N6332L959R5513L4928L1396Q2217j4839o955N3650
5211F737798O9964k7820l817l915j631L4904q2620K1400L6352r5163J9053Q7061
5199F791566O8639Q185P3181P6170Q1907k8240l2072M3935Q7959M3088Q8341M5940
5187G348599O4529R9893J11434M128M5069Q5817M5339Q0444O2810J14060O0305
5176H122427M2482J30213L8568K400K09373J21814J13195J27999O8909R8528J26978
5165I202886J29786J36692P2934L8128R5408J52098J11310J30031J19633N7205
$$ y = [5487130, 5461754, 5524921, 5538225, 5494654, 5504120, 5495785, 5445386, 5452600, 5487176, 5571332, 5630341, 5671069, 5677088, 5723545, 5788364, 5793541, 5782288, 5786470, 5838368, 5890483, 5931164, 6051917, 6101790, 6244247, 6256277, 6287055, 6401597, 6457929, 6461888, 6557401, 6592329, 6623725, 6705942, 6691103, 6684148, 6737798, 6807762, 6779942, 6776125, 6772210, 6770579, 6805483, 6722863, 6744263, 6780615, 6685452, 6704505, 6791566, 6860205, 6868390, 6941571, 7017741, 7099648, 7071408, 7039336, 7083271, 7171230, 7214318, 7302659, 7348599, 7413128, 7513021, 7624455, 7628583, 7673652, 7759469, 7804808, 7885252, 7948062, 8062122, 8122427, 8164909, 8295122, 8333690, 8336090, 8545463, 8667277, 8780472, 8908471, 8977380, 9075908, 9202886, 9332672, 9469364, 9542298, 9580426, 9675834, 9827932, 9939242, 10069273, 10188906, 10246111]
5155A0246111J42395J07212J28207P6105J13611J58920K6552J05148J41594O2807
5145A1308662J16525M3637J13162J16934J12594K3995M8191J87784Q8491J51923
5135A2311898N7639J26471J07205J15437N8231n675R3355J59699R8685J7834J10830
5124A3251609K3163Q694K8128J08347P0519L1444k6521P8834P7045J1746N3673
5113A3716681l2698Q6664N3715L4879J27687L5295P0003N9119K6377M6953l5848
5102A4188827L4755N347J3879k8359L2497P092k0569N1205R5968R3093m3140O3903
5090A4494498P1160J39810R9053N2032N0944Q0730J12217J51399Q7158J46703
5080A5485704J58700J31369J30236K58995K08380J87211K98048K29925K97332
$$ y = [10246111, 10388506, 10495718, 10623925, 10700030, 10813641, 10972561, 10999113, 11104261, 11245855, 11308662, 11425187, 11468824, 11581986, 11698920, 11811514, 11835509, 11883700, 12071484, 12159975, 12311898, 12369537, 12496008, 12603213, 12718650, 12776881, 12771206, 12864561, 13024260, 13122945, 13140779, 13251609, 13274772, 13283466, 13311594, 13419941, 13490460, 13521904, 13495383, 13574217, 13651262, 13663008, 13716681, 13683983, 13770647, 13824362, 13859241, 13986928, 14022223, 14092226, 14151345, 14177722, 14224675, 14188827, 14223582, 14228929, 14242808, 14214449, 14246946, 14254038, 14233469, 14284674, 14380642, 14473735, 14430595, 14494498, 14565658, 14705468, 14804521, 14856553, 14907497, 14988227, 15100444, 15251843, 15339001, 15485704, 15644404, 15775773, 15906009, 16165004, 16373384, 16560595, 16858643, 17088568, 17385900]
5071A7385900J96364L74329K92724L67596L90782L45122L86824M89406M35438
5062B0664485N61157O06956O18128O82581P19726P75681R01760R60921J031647
5053B7523042J052641J243250J393550J517786J734887J884991K113852K365250
5045D0829249K449002K771690K981878L253295L401726L671530L745163L875934
5037F6979467L751002L509494L180047K600483J892110J014192J25335r32105
5029H2120025j755607k572353l142569l563287l692246l810335l739335l656151
5021E6188142l446525l145502k874262k815856k559293k308560k011209j824551
5013C5202384j683318j609657j421932j243450j072831j101224r79161q66017
$$ y = [17385900, 17582264, 17956593, 18249317, 18616913, 19007695, 19352817, 19739641, 20229047, 20664485, 21225642, 21832598, 22450726, 23133307, 23853033, 24628714, 25530474, 26491395, 27523042, 28575683, 29818933, 31212483, 32730269, 34465156, 36350147, 38463999, 40829249, 43278251, 46049941, 49031819, 52285114, 55686840, 59358370, 63103533, 66979467, 70730469, 74239963, 77420010, 80020493, 81912603, 82926795, 83052130, 82120025, 80364418, 77792065, 74649496, 71086209, 67393963, 63583628, 59844293, 56188142, 52741617, 49596115, 46721853, 43905997, 41346704, 39038144, 37026935, 35202384, 33519066, 31909409, 30487477, 29244027, 28171196, 27069972, 26090811, 25224794]
5005B5224794q40837q19832o26945n60851o70068n60294n41567m99086l85827
4996A9719487m91479m11914m39717m03563m04266l01765l16329j98374k25959
4987A6526121l78581k00199j02811k00003j51760j72162k23991j65805j37707
4978A4793102j40760j58235j61650j60451j70072j59018j68095j20406k15458
4969A3338957j2739j67052k34972j57643j55326j54493k20830j31477k81174j8894
4959A1804357j64511j32403j07619j43934j14312r6349r2825l3903m2205j39998
4949A0736298l9042k0671K8166m4560p3952Q8678N6382l0281O7050O4638N5968
4938A0888674J48167O4277K11422J62350J70446J62985K50411K03125K13891K15228
$$ y = [25224794, 24383957, 23564125, 22937180, 22376329, 21706261, 21145967, 20604400, 20105314, 19719487, 19228008, 18816094, 18376377, 17972814, 17568548, 17266783, 16950454, 16752080, 16526121, 16147540, 15947341, 15844530, 15644527, 15492767, 15320605, 15096614, 14930809, 14793102, 14652342, 14494107, 14332457, 14172006, 14001934, 13842916, 13674821, 13554415, 13338957, 13326218, 13159166, 12924194, 12766551, 12611225, 12456732, 12235902, 12104425, 11823251, 11804357, 11639846, 11507443, 11399824, 11255890, 11141578, 11045229, 10952404, 10918501, 10876296, 10736298, 10697256, 10676585, 10704751, 10660191, 10586239, 10674917, 10731299, 10701018, 10768068, 10832706, 10888674, 11036841, 11101118, 11312540, 11474890, 11645336, 11808321, 12058732, 12261857, 12475748, 12690976]
4928A2690976J45981J52941P6136J00178J55366P1583J51359O6491M2171R6444
4918A3749626N3049R5178L6617O2331J51480J11514J45053J04188r019Q5032N9341
4907A4644390k1834R6548K7225n1221p9519k4084k8909l5492j16108j41895R1114
4896A4360215M7876n1421N1571R6921N9087R6963J13031M3758N5025N0693M4151
4885A4967870o6867l9531j53894j86672j22098j85828k76205j97278j25627o3338
4875A3550532m8040j28229o265j28712p728K6553Q0611P4213R1888R6238L4031
4864A3635092Q583k8716j35782N1178n5950j65983j18559j00444p5689j22986
4854A2890744l1608N7703o1661L2470P2010m891J72104J09021P4206J05540J46868
$$ y = [12690976, 12836957, 12989898, 13066034, 13166212, 13321578, 13393161, 13544520, 13611011, 13653182, 13749626, 13802675, 13897853, 13934470, 13996801, 14148281, 14259795, 14404848, 14509036, 14500017, 14585049, 14644390, 14622556, 14719104, 14746329, 14695108, 14615589, 14591505, 14562596, 14527104, 14410996, 14269101, 14360215, 14408091, 14356670, 14408241, 14505162, 14564249, 14661212, 14774243, 14818001, 14873026, 14923719, 14967870, 14901003, 14861472, 14707578, 14520906, 14398808, 14212980, 13936775, 13739497, 13613870, 13550532, 13502492, 13374263, 13367998, 13239286, 13231558, 13258111, 13338722, 13412935, 13504823, 13601061, 13635092, 13643675, 13614959, 13479177, 13530355, 13474405, 13308422, 13189863, 13089419, 13013730, 12890744, 12859136, 12916839, 12855178, 12887648, 12959658, 12954767, 13126871, 13235892, 13310098, 13415638, 13562506]
4843A3562506K18591L00507J43507J75415K91934K62590K84412L46709L86287
4834A5972458L66747N06917N36148N54839O03713P31488Q40749R32327J043571
4825B2088957J067674J229755J237766J305810J384862J410580J400366J248248
4817C2374018J068537R46013O71975L50989L56733J42115P4562J04182L7417n0348
4807C6076193K977O5204J46309K94671M49476O11848Q14541R36924J220901J520841
4797D2139885J648359J826891J960650K085364J979907J744370J563047J325769
4789E6274242R94865O65940L75615L6255k31224n28333r09022j243800j626476
4780E3808062j767349j887247j848411j690143j628688j420938j146837r47357
$$ y = [13562506, 13781097, 14081604, 14225111, 14400526, 14692460, 14955050, 15239462, 15586171, 15972458, 16339205, 16846122, 17382270, 17937109, 18540822, 19272310, 20113059, 21045386, 22088957, 23156631, 24386386, 25624152, 26929962, 28314824, 29725404, 31125770, 32374018, 33442555, 34388568, 35060543, 35411532, 35768265, 35910380, 35984942, 36089124, 36126541, 36076193, 36079170, 36144374, 36290683, 36585354, 37034830, 37646678, 38461219, 39398143, 40619044, 42139885, 43788244, 45615135, 47575785, 49661149, 51641056, 53385426, 54948473, 56274242, 57269107, 57935047, 58310662, 58346917, 58115693, 57587360, 56678338, 55434538, 53808062, 52040713, 50153466, 48305055, 46614912, 44986224, 43565286, 42418449, 41471092]
4772D1471092o75707m69094k87567j13988k5340P4836J47194O4913J46385J4358
4762D0347082j19424k25374l15725n57069q03613j039769j246911j409239j604126
4753C3025832j789008j744644j575573j536559j460622j302330j287626j163803
4745B1165667r84132q96563q43105q18661p21582o38534o07349n93615m89787
4736A4572339n37367n19353l53696l32334l18840l17824l62012l16004l28420
4727A1186489k72123k12975k17095k64723r3799j76387j37127k58315j40225j36981
4717I276739j01787j35219r3307n3154j10869o8846r6842j06042n4385n5501o5561
4706H335226m338O164o6395j15573o7598O195k1906j01028l2886q971M8234k6684
$$ y = [41471092, 40795385, 40326291, 40038724, 39924736, 39899396, 39974232, 40121426, 40186339, 40332724, 40347082, 40227658, 40002284, 39686559, 39129490, 38325877, 37286108, 36039197, 34629958, 33025832, 31236824, 29492180, 27916607, 26380048, 24919426, 23617096, 22329470, 21165667, 20181535, 19284972, 18441867, 17623206, 16901624, 16263090, 15655741, 15062126, 14572339, 14034972, 13515619, 13161923, 12829589, 12510749, 12192925, 11830913, 11514909, 11186489, 10914366, 10701391, 10484296, 10219573, 10125774, 9949387, 9812260, 9553945, 9413720, 9276739, 9174952, 9039733, 8946426, 8893272, 8782403, 8713557, 8616715, 8510673, 8456288, 8400787, 8335226, 8330888, 8337052, 8270657, 8155084, 8087486, 8093681, 8071775, 7970747, 7937861, 7928890, 7977124, 7950440]
4694G950440K6567K8505K9873o8640Q9782R8230J7705M2523J4076L9165R3090
4683H361316p766l5330R1439Q1264P3601J01402O9577Q4520J36395J22439N6453
4672I135310L1395J62530K11432J11673J13242P4329R9876J36493J39679J04801
4662A0320760J21292J39031J68304J33388J80375K36408J16741J78789L13053
4653A1908141L18378J68727K46643K74593K82120L30320K95089K36715L73655
4644A4434381L52709L66245M33195M84517M89792N27425N46087O64330O93243
4635A8991924O30045P18282Q81003R57129R96353J146538J166655J281457J451581
4626B8220967J470190J558944J780924J759220J695684J737089J669635J411415
$$ y = [7950440, 7977007, 8005512, 8035385, 7966745, 8056527, 8154757, 8172462, 8214985, 8229061, 8268226, 8361316, 8353550, 8318220, 8409659, 8490923, 8564524, 8665926, 8735503, 8820023, 8956418, 9078857, 9135310, 9166705, 9329235, 9540667, 9652340, 9765582, 9839911, 9939787, 10076280, 10215959, 10320760, 10442052, 10581083, 10749387, 10882775, 11063150, 11299558, 11416299, 11595088, 11908141, 12226519, 12395246, 12641889, 12916482, 13198602, 13528922, 13824011, 14060726, 14434381, 14787090, 15153335, 15586530, 16071047, 16560839, 17088264, 17634351, 18298681, 18991924, 19621969, 20340251, 21221254, 22178383, 23174736, 24321274, 25487929, 26769386, 28220967, 29691157, 31250101, 33031025, 34790245, 36485929, 38223018, 39892653, 41304068]
4618D1304068J207069R12739O58650L34584J55303Q4836o1768k08384j04933l9199
4608D4242965j10951K9904J18808K47045N45019P42649Q64597R62403J215401
4599D8857840J470417J588344J625760J596750J468634J321774J006638P99017
4591E9735174L86529M6438j33397l85858o61426q53623j049294j424122j573915
4582E4086506j688442j770163j732083j696393j490076j332039j123808r50412
4574D2303090q66934n29189l96637k81127j88681j72657j07248p4581j14874j44523
4564C9426639j10037k60101l68979o61512q28724j055702j213368j413296j374428
4555C2140492j342921j415800j425795j267479j167894j090710r46163r37672
$$ y = [41304068, 42511137, 43423876, 44082526, 44417110, 44572413, 44657249, 44595481, 44387097, 44282164, 44242965, 44132014, 44161918, 44280726, 44527771, 45072790, 45815439, 46680036, 47642439, 48857840, 50328257, 51916601, 53542361, 55139111, 56607745, 57929519, 58936157, 59735174, 60121703, 60168141, 60034744, 59648886, 58987460, 58133837, 57084543, 55660421, 54086506, 52398064, 50627901, 48895818, 47199425, 45709349, 44377310, 43253502, 42303090, 41436156, 40906967, 40510330, 40229203, 40040522, 39867865, 39760617, 39686036, 39571162, 39426639, 39316602, 39056501, 38687522, 38026010, 37197286, 36141584, 34928216, 33514920, 32140492, 30797571, 29381771, 27955976, 26688497, 25520603, 24429893, 23483730, 22546058]
4547B2546058p95314q36530o68269o03373n06936o17836m51348n53384l54729
4538A7158339l36945m47905l07526l75519k43151k76164k46562k15939k23505
4529A4485123j92509j82391k30273j71756j36912j81318j34331r1787j17592j15592
4519A2930662j09336j37102j13247j44966j47270r5923q5353j54706l2029j15227
4509A1795503n2607j09503q5404K0463o0729p2404k2136j55602l8930l4470k7783
4498A1156398O5872j0892K8407n0821l8906P6974j1053m932J2250M8880P147o0378
4486A1218946P8557O0941n976j1767Q7351M4241R949R0490N9147l4576J23810
4475A1721113P162Q3611J12848J7224K8049L8062J64015Q6907J69118M7941P4106
$$ y = [22546058, 21750744, 20914214, 20245945, 19642572, 19135636, 18517800, 18066452, 17513068, 17158339, 16821394, 16373489, 16065963, 15690444, 15447293, 15171129, 14924567, 14708628, 14485123, 14292614, 14110223, 13879950, 13708194, 13571282, 13389964, 13255633, 13163846, 13046254, 12930662, 12821326, 12684224, 12570977, 12426011, 12278741, 12182818, 12097465, 11942759, 11910730, 11795503, 11742896, 11633393, 11547989, 11568452, 11507723, 11435319, 11413183, 11257581, 11218651, 11184181, 11156398, 11222270, 11211378, 11239785, 11188964, 11150058, 11227032, 11215979, 11211047, 11223297, 11272177, 11279324, 11218946, 11297503, 11358444, 11352468, 11340701, 11428052, 11472293, 11482242, 11572732, 11631879, 11597303, 11721113, 11728275, 11811886, 11924734, 11941958, 11970007, 12008069, 12172084, 12258991, 12428109, 12476050, 12550156]
4464A2550156J86392K09266J12341N6700J48133J59863J95693K03884K00033J81542
4454A4204003K19525J19786K05129K67196J72371K00315K67604K24433K79852
4445A6160214L91520L65611M34139N13156N25168O45110P15084P93519Q97991
4436B1441512R95453J118712J359751J538355J838166K163299K503575K725372
4428C5684195K819437K333986J470280J21050j327899k043446k361635k356994
4420C4338974j913382j548005j216824r29779p30644o91791m18183k75618k75881
4411B6338867j23466m4728N2556J23155J22376K74294L02334M19441M95057M92349
4401B8452235O99186P30321Q58122R84645J124178J334576J531263J810484K221531
$$ y = [12550156, 12736548, 12945814, 13058155, 13114855, 13262988, 13422851, 13618544, 13822428, 14022461, 14204003, 14423528, 14543314, 14748443, 15015639, 15188010, 15388325, 15655929, 15880362, 16160214, 16551734, 16917345, 17351484, 17864640, 18389808, 19034918, 19750002, 20543521, 21441512, 22436965, 23555677, 24915428, 26453783, 28291949, 30455248, 32958823, 35684195, 38503632, 40837618, 42307898, 42428948, 41101049, 39057603, 36695968, 34338974, 32425592, 30877587, 29660763, 28730984, 28000340, 27308549, 26890366, 26614748, 26338867, 26215401, 26170673, 26223229, 26346384, 26468760, 26743054, 27045388, 27464829, 27959886, 28452235, 29151421, 29881742, 30739864, 31724509, 32848687, 34183263, 35714526, 37525010, 39746541]
4392C9746541K484580K765768K798420K385647J529895M37138q17299j600723
4384D9729967k046700k169225j842714j580578j140081q69663p05407m40730k63712
4375C8671157r4390q2997Q1323J39794K06687K59014K67953M32177K52749L79075
4365D0512542N16128M74667N99032N12368N34029N72271O03554Q09029P59382
4356D5893002P46097Q14678Q74332Q65068P51412O65176P03657N87026N03467
4347E2403915M41022M98990L96392M18750N49109N17986M60820O84196P75238
4338E7146418P46587Q33828Q90571R08064J082010J224064J241189J391201J447807
4329F6911739J749724J864730K063131K194117K461270K703305K996063L118363
$$ y = [39746541, 42231121, 44996889, 47795309, 50180956, 51710851, 52147989, 51330690, 49729967, 47683267, 45514042, 43671328, 42090750, 40950669, 40081006, 39375599, 38934869, 38671157, 38576767, 38493770, 38575093, 38714887, 38921574, 39180588, 39448541, 39880718, 40133467, 40512542, 41028670, 41503337, 42102369, 42614737, 43148766, 43721037, 44324591, 45133620, 45893002, 46639099, 47453777, 48328109, 49193177, 49944589, 50609765, 51313422, 51900448, 52403915, 52844937, 53343927, 53740319, 54159069, 54708178, 55226164, 55686984, 56371180, 57146418, 57893005, 58726833, 59617404, 60525468, 61607478, 62831542, 64072731, 65463932, 66911739, 68661463, 70526193, 72589324, 74783441, 77244711, 79948016, 82944079, 86062442]
4321H6062442L493541L873238M288875M563866N025303N408780N749219O072711
4313A24537975O223621O244088N995320N478627M755588L854051K952850J679541
4305A61721661K84223r94316k242778l356417m303029m892632n442999n727593
4297A35046120n777552n752593n705614n438099n244710n062040m692347m351912
4289I3021253m161013l837908l567395l325387l143565k963352k669940k425785
4281F6926908k374837k128434k019154j843996j687876j717122j604686j392365
4273E2158438j248639j196742j134702j134998j048667q53118r48191j005587
4265D3587794q30214p91413p18958o86748p31193o37095o03019n45036n92376
$$ y = [86062442, 89555983, 93429221, 97718096, 102281962, 107307265, 112716045, 118465264, 124537975, 130761596, 137005684, 143001004, 148479631, 153235219, 157089270, 160042120, 161721661, 162005884, 161011568, 158768790, 155412373, 151109344, 146216712, 140773713, 135046120, 129268568, 123515975, 117810361, 112372262, 107127552, 102065512, 97373165, 93021253, 88860240, 85022332, 81454937, 78129550, 74985985, 72022633, 69352693, 66926908, 64552071, 62423637, 60404483, 58560487, 56872611, 55155489, 53550803, 52158438, 50909799, 49713057, 48578355, 47443357, 46394690, 45541572, 44593381, 43587794, 42757580, 41966167, 41247209, 40560461, 39829268, 39192173, 38589154, 38044118, 37451742]
4256C7451742n23762m35022m89752m87062m96817l51126m05227m24689m22031
4247C3416254l94911l02207l69365l62300k36035k67516k69262l08642k68529
4238C0637487k62342k09402j42160j90237k61441k36977j86111j61749j11123
4229B8875945j93370j58388j06459j52131j00414n6623r4062m1137k7616j05822
4219B7839923r5309j22984j78145q7093q6925j65382j21449j71058j38374o3256
4209B6609948p6872m5230k5744j01830j25275j07129J2788p826j06459N0860J3805
4198B6091036k4534r1831l8693p352J748N8559K8280j6728N1922N6228J16420
4187B6225055J09900J46154P0973Q1762J29686J96649K36639Q9900P8253J35111
$$ y = [37451742, 36927980, 36492958, 36003206, 35516144, 35019327, 34668201, 34262974, 33838285, 33416254, 33021343, 32719136, 32349771, 31987471, 31751436, 31483920, 31214658, 30906016, 30637487, 30375145, 30165743, 30023583, 29833346, 29571905, 29334928, 29148817, 28987068, 28875945, 28682575, 28524187, 28417728, 28265597, 28165183, 28108560, 28014498, 27973361, 27945745, 27839923, 27744614, 27621630, 27443485, 27356392, 27269467, 27104085, 26982636, 26811578, 26673204, 26609948, 26533076, 26487846, 26462102, 26360272, 26234997, 26127868, 26140656, 26132830, 26026371, 26077231, 26091036, 26066502, 25974671, 25935978, 25928626, 25930374, 25988933, 26017213, 26000485, 26052407, 26108635, 26225055, 26334955, 26481109, 26552082, 26633844, 26763530, 26960179, 27196818, 27286718, 27364971, 27500082]
4177B7500082J58057J28516J72750J41963J79237J85585J33064J34192K96753
4168B9030199K88135K43469J73974L02803L37001K84367M07007K97177M01675
4159C1765807M47778M52470L21314M67337N67672N80804O03351O76900P72668
4150C6656101O84971P71488Q75468R41316R20109Q30914J047929J050666J115473
4141D4894435J102351J263573J248266J286649J619264J638313J748804J993494
4133E6795149K273876K551617K928359L271055L724018M210789M765219N342655
4125H5862737N889655O544412P350533Q287020R016750R574094R788710R408027
4117A51721938P796742N239744J712276k391999n649928p883082r095532r294294
$$ y = [27500082, 27658139, 27786655, 27959405, 28101368, 28280605, 28466190, 28599254, 28733446, 29030199, 29318334, 29561803, 29735777, 30038580, 30375581, 30659948, 31066955, 31364132, 31765807, 32213585, 32666055, 32987369, 33454706, 34022378, 34603182, 35206533, 35883433, 36656101, 37341072, 38112560, 38988028, 39929344, 40849453, 41680367, 42728296, 43778962, 44894435, 45996786, 47260359, 48508625, 49795274, 51414538, 53052851, 54801655, 56795149, 59069025, 61620642, 64549001, 67820056, 71544074, 75754863, 80520082, 85862737, 91752392, 98296804, 105647337, 113934357, 122951107, 132525201, 142313911, 151721938, 159518680, 164758424, 166470700, 164078701, 158428773, 150545691, 141450159, 132155865]
4109A32155865q860154q171569p277590o415361n520110m795439m103960l634102
4101H3377580l045951k666613k222157j949749j678103j490990j404335j454058
4093F7465624j582948j695645k023150k243870k209888k198030k076650j884541
4085E1550902j786956j557614j406120j277336j136618j140999j039339q93557
4077D1312363q12339p70503p39440p25546o70134o62677n62681o07330n41359
4068C5220354m81268n30969n42785m46250m79082m11767m98894n05834n11295
4059C0812210n83754m31659m17716m95033m77789l81529l56909l93861l75726
4050B6898234l64538k35924k78997l63536k83522l41841k82008j38749l04657
$$ y = [132155865, 123295711, 115124142, 107846552, 101431191, 95911081, 91115642, 87011682, 83377580, 80331629, 77665016, 75442859, 73493110, 71815007, 70324017, 68919682, 67465624, 65882676, 64187031, 62163881, 59920011, 57710123, 55512093, 53435443, 51550902, 49763946, 48206332, 46800212, 45522876, 44386258, 43245259, 42205920, 41312363, 40500024, 39729521, 38990081, 38264535, 37594401, 36931724, 36369043, 35761713, 35220354, 34739086, 34208117, 33665332, 33219082, 32740000, 32328233, 31829339, 31323505, 30812210, 30228456, 29796797, 29379081, 28884048, 28406259, 28024730, 27667821, 27273960, 26898234, 26533696, 26297772, 26018775, 25655239, 25371717, 25029876, 24747868, 24609119, 24304462]
4041B4304462k40018j68901k73474j96412j37643j96826j56394j95651k63748
4032B2475395o7644p7342q6499j57118j12317j52228J5444p6123k1618o8546k1595
4021B1649809j32248j10676r9929o9206n1568j15141q8522q4551m5591o1084p3842
4010B0717451l8883j9407k7732m0914n4079o5286q6956J114R510O6908j08359
3999B0353367q6719k09204k34355j72101j58646j84751r2004K2157j07767m8317
3989A9081660n5849O9235K8326P1631K1757P4710r65K2231q4018l527j4216p8794
3977A9132181K2360q474K3263O3699L8724M3359O8218M4349J17754J23876N8012
3966A9727321Q3028J08089R7434J22928P8292P9875N7378O8040J05046J82853
$$ y = [24304462, 24064444, 23895543, 23622069, 23425657, 23288014, 23091188, 22934794, 22739143, 22475395, 22407751, 22330409, 22243910, 22086792, 21974475, 21822247, 21837691, 21761568, 21739950, 21671404, 21649809, 21517561, 21406885, 21306956, 21237750, 21186182, 21071041, 20982519, 20897968, 20852377, 20791293, 20717451, 20678568, 20659161, 20631429, 20590515, 20536436, 20471150, 20384194, 20385308, 20394818, 20461726, 20353367, 20266648, 20057444, 19823089, 19650988, 19492342, 19307591, 19215587, 19237744, 19129977, 19081660, 19025811, 19095046, 19123372, 19195003, 19216760, 19291470, 19290505, 19312736, 19228718, 19225191, 19210975, 19132181, 19154541, 19146067, 19169330, 19233029, 19271753, 19315112, 19383330, 19427679, 19545433, 19669309, 19727321, 19810349, 19918438, 20015872, 20138800, 20217092, 20296967, 20354345, 20422385, 20527431, 20710284]
3956B0710284J22378J11345J43849J79421J89721K53273K49084K33660J88466
3947B2381481L30838J98086K72812O7646P6946J99010J2046n7792O8741k7829
3937B3521985j29981k6216J9981J14722m9331M3314Q0051P3339P4048J25373J90207
3926B4037492J72734J64455J94017J87188J59827J30136K07840K74612K73819
3917B5802120K63748L69686M12274M88414L40037L87127L38166J30538J11148
3908B8643258Q1725L2576j86266j16911k37290k48141k03938k46927k93430k39635
3898B6985021j50418j29402k53027k67205k75258k48970k22746k74073j76443
3889B4987479j49788j29706j78621p3395j14149l4963j8222M3951J4286N2271
$$ y = [20710284, 20832662, 20944007, 21087856, 21267277, 21456998, 21710271, 21959355, 22193015, 22381481, 22712319, 22910405, 23183217, 23250863, 23327809, 23526819, 23538865, 23481073, 23549814, 23521985, 23392004, 23365788, 23385769, 23500491, 23451160, 23494474, 23574525, 23647864, 23721912, 23847285, 24037492, 24210226, 24374681, 24568698, 24755886, 24915713, 25045849, 25253689, 25528301, 25802120, 26065868, 26435554, 26847828, 27336242, 27676279, 28063406, 28401572, 28532110, 28643258, 28724983, 28757559, 28571293, 28454382, 28217092, 27968951, 27765013, 27518086, 27224656, 26985021, 26834603, 26705201, 26452174, 26184969, 25909711, 25660741, 25437995, 25163922, 24987479, 24837691, 24707985, 24529364, 24455969, 24341820, 24306857, 24288635, 24332586, 24346872, 24399143]
3879B4399143J62916L9019J37454J03369Q2993K20268J69731J85158J90498J84265
3869B5874814J91515J46625K18012Q4792R7348O2066R0775n8585j19099J0904
3859B6599167M7909j6978j03398l9700k0641o5323N2179J55611J95856K86079
3849B7090761K29028L38601M27486M11458M82423O17580O04463O14814O13023
3840C1429637N92479N72011M59306L02531N1481j13724k20893l39792m72038m68190
3830C1792808l23006m10755k68364j00006n4292O3001P3964J52989J94455K99870
3820C1420664K85758M29783L89431N37912N94406N99590O89827P39143O72994
3811C6359508Q00479P18328P01607Q24740Q01704Q60666J007260J022020J002613
$$ y = [24399143, 24562059, 24601078, 24738532, 24841901, 24924894, 25145162, 25314893, 25500051, 25690549, 25874814, 26066329, 26212954, 26430966, 26515758, 26613106, 26675172, 26765947, 26707362, 26588263, 26599167, 26647076, 26630098, 26526700, 26487000, 26466359, 26401036, 26453215, 26608826, 26804682, 27090761, 27319789, 27658390, 28085876, 28497334, 28979757, 29597337, 30201800, 30816614, 31429637, 32022116, 32594127, 33053433, 33355964, 33407445, 33293721, 33072828, 32733036, 32260998, 31792808, 31469802, 31059047, 30790683, 30690677, 30636385, 30699386, 30773350, 30926339, 31120794, 31420664, 31706422, 32136205, 32525636, 33063548, 33657954, 34257544, 34947371, 35686514, 36359508, 37159987, 37878315, 38579922, 39404662, 40206366, 41067032, 42074292, 43096312, 44098925]
3802D4098925J079926J079434J052094Q79221R76787Q72492P63810O27597N63562
3793E1993848N88729N83343N28267N16859N68022M94919K43486K10715J25277
3784E5853465j25728k50337l43440n15748n45013o05890n70346m97456n23264
3775E1876243o00493p40032q85780q74103r79575j094646j254139j275356j257471
3766D2914648j233674j280505j270778j225392j122190j114767j152401j085812
3758C3429129j200172j174205j039682j028396j015760r07823r76963r14905q69371
3749B4301852p83632p94290p28784o91351o17095n93526o07944n86228o04479
3740A8294523m35055n61909n33828n21750m75477k49979m15383m33005k69861
$$ y = [44098925, 45178851, 46258285, 47310379, 48189600, 49166387, 50038879, 50802689, 51430286, 51993848, 52582577, 53165920, 53694187, 54211046, 54779068, 55273987, 55517473, 55728188, 55853465, 55727737, 55477400, 55133960, 54618212, 54073199, 53467309, 52896963, 52399507, 51876243, 51275750, 50535718, 49649938, 48775835, 47796260, 46701614, 45447475, 44172119, 42914648, 41680974, 40400469, 39129691, 37904299, 36782109, 35667342, 34514941, 33429129, 32228957, 31054752, 30015070, 28986674, 27970914, 27063091, 26086128, 25171223, 24301852, 23518220, 22723930, 21995146, 21303795, 20686700, 20093174, 19485230, 18899002, 18294523, 17859468, 17297559, 16763731, 16241981, 15766504, 15516525, 15101142, 14668137, 14398276]
3731A4398276l88340l46191l29211k78546l19869k20463l05058l63936k95462
3722A1551200k08662l13341k54973j85121k45134k89409k41323r8541k19585k39040
3712I256071j34715j93733j94749k39367j40004j32453j88086j32360j37974j34387
3702G628243k59624q7665q1379j06208j56636j18226r6079q7195p4958q5604j44284
3691F330385k7420j69676j21801j20576o4792p3120q3676r3510o8538p5017r2164
3680E340095r9733j14936k4620L780J2873l8272j12263q1654o2028p7529p8014
3669D667699o0051j32106k0558O4419K766j27521j10463j0005j00747p4334K967
3658D102066k9310j38167j2454L0611q585j02095n2877M2754q2917j47267J4494
$$ y = [14398276, 14009936, 13663745, 13334534, 13055988, 12736119, 12515656, 12210598, 11846662, 11551200, 11342538, 11029197, 10774224, 10589103, 10343969, 10054560, 9813237, 9714696, 9495111, 9256071, 9121356, 8927623, 8732874, 8493507, 8353503, 8221050, 8032964, 7900604, 7762630, 7628243, 7368619, 7280954, 7199575, 7093367, 6936731, 6818505, 6722426, 6635231, 6560273, 6474669, 6330385, 6302965, 6133289, 6011488, 5890912, 5826120, 5753000, 5669324, 5575814, 5507276, 5432259, 5340095, 5240362, 5125426, 5100806, 5104586, 5117459, 5079187, 4966924, 4885270, 4823242, 4745713, 4667699, 4607648, 4475542, 4454984, 4519403, 4522169, 4394648, 4284185, 4274180, 4173433, 4099099, 4102066, 4072756, 3934589, 3922135, 3952746, 3944161, 3842066, 3789189, 3831943, 3749026, 3601759, 3616253]
3647C616253M7142O409m0707r2753n0488K2128o8521J3050J855m5747k0892l8217
3635C349512n7119n7419N2169m0317n8984K4438o9855p3000k5735K6981K9985
3624C100656m3227n6291m7448K2914J8178n489j28012P0770l0879o7978q653J4805
3612B839346n0891j5886j6188p2185P6822o7782M1262N5050q2876P7402L9148
3601B823222j10629j0085k327Q591j4273M7285j7705o4694J7889O4800n3234K6899
3589B715739j9977L5882r0752m1498M3801O3446j7179m8569q4920j5344Q2915
3578B623544n3320P0779J9475k9148j00627J2210M0629l3220Q067J3552M7762
3567B619703j925k8945N0030r545p2227J120k1811L1091K8190p2995J565K5551
$$ y = [3616253, 3663395, 3669804, 3629097, 3536344, 3485856, 3507984, 3439463, 3452513, 3454368, 3408621, 3387729, 3349512, 3292393, 3234974, 3287143, 3246826, 3187842, 3212280, 3142425, 3069425, 3043690, 3070671, 3100656, 3057429, 3001138, 2953690, 2976604, 2994782, 2989293, 2861281, 2932051, 2901172, 2833194, 2824541, 2839346, 2788455, 2772569, 2756381, 2684196, 2761018, 2693236, 2734498, 2789548, 2706672, 2784074, 2823222, 2712593, 2702508, 2700181, 2708772, 2694499, 2741784, 2724079, 2659385, 2677274, 2742074, 2688840, 2715739, 2695762, 2731644, 2640892, 2599394, 2643195, 2706641, 2689462, 2640893, 2555973, 2540629, 2623544, 2570224, 2641003, 2660478, 2631330, 2530703, 2542913, 2583542, 2550322, 2558389, 2571941, 2619703, 2617778, 2588833, 2638863, 2629318, 2557091, 2558211, 2536400, 2567491, 2595681, 2522686, 2524251, 2549802]
3555B549802q166J484J3805q6805J16895J3799o6744J0158K4579o496o2187K7704
3543B527828N4148M0466k5107m0915m799j86q8536O6972P1598P9762q8992l7955
3531B554284L0170j026J04470L0230j00015j5138k9095K6960K9249P300k1541
3520B615848q8928N3626l4070L415J9639j6300J7818N7513L2919L2769q5182O1793
3508B670860j2964j05702k297R6104M6568k9188K3287p3020L6371j599k3031P2915
3496B698304L4860J5008m3439J5583J0558k4696j650M4329N8009q1006O8816k9877
3484B764799M3721k9237n9210M8599l0451N5192n8476J15433O9648p4939j7945
3473B827134O349k796N7545l2589J5325M0629l372P518O6360j2051o8094j026
$$ y = [2549802, 2541636, 2543120, 2556925, 2470120, 2587015, 2600814, 2534070, 2544228, 2568807, 2562311, 2500124, 2527828, 2581976, 2622442, 2597335, 2556420, 2551621, 2551435, 2462899, 2529871, 2601469, 2681231, 2592239, 2554284, 2584454, 2583428, 2687898, 2718128, 2618113, 2602975, 2573880, 2600840, 2630089, 2637389, 2615848, 2526920, 2580546, 2546476, 2549891, 2569530, 2553230, 2571048, 2628561, 2661480, 2694249, 2609067, 2670860, 2657896, 2552194, 2549897, 2646001, 2692569, 2663381, 2686668, 2613648, 2650019, 2648420, 2625389, 2698304, 2733164, 2748172, 2704733, 2720316, 2730874, 2706178, 2704528, 2748857, 2806866, 2725860, 2794676, 2764799, 2808520, 2779283, 2720073, 2768672, 2738221, 2793413, 2734937, 2850370, 2920018, 2845079, 2827134, 2833483, 2830687, 2888232, 2855643, 2870968, 2911597, 2908225, 2915743, 2982103, 2970052, 2901958, 2900932]
3461B900932K6886j887J0695M1240m4173l3736N8931N8537N2745L211N6121J1177
3449C140679j1402J7812N6587O6230K6380N4519j2425N479L9281R0709O414K753
3437C483016R6883j9065M5835J1114Q4117N611J09925L1872M1443R7254r124J23658
3425D102539Q4668Q7529J8142P0584J76290P9884L6595M9952M0570P7494P3373
3414D897620R8293L2609J73735o2484M2540J26852Q2040p0009P9723N5706P7456
3403E534081J7594R287O8880k0729J6661M6942j5719n4681L8826M0904k5051n532
3391E651463j9379j0419J6920P0361K6718L8070P0287q219o630Q7556Q2645P4732
3379F074105K0008J6439O3713j0419J32580J05210L2475J0209K18387N6568Q2831
$$ y = [2900932, 2927818, 2925931, 2936626, 2977866, 2933693, 2899957, 2958888, 3017425, 3070170, 3073381, 3129502, 3140679, 3129277, 3147089, 3203676, 3269906, 3296286, 3350805, 3338380, 3343859, 3383140, 3473849, 3480263, 3483016, 3579899, 3560834, 3606669, 3617783, 3701900, 3707511, 3817436, 3849308, 3890751, 3988005, 3978881, 4102539, 4187207, 4274736, 4292878, 4363462, 4539752, 4619636, 4656231, 4706183, 4746753, 4824247, 4897620, 4995913, 5028522, 5202257, 5139773, 5182313, 5309165, 5391205, 5321196, 5400919, 5456625, 5534081, 5551675, 5560962, 5629842, 5609113, 5625774, 5672716, 5656997, 5602316, 5641142, 5682046, 5656995, 5651463, 5632084, 5621665, 5638585, 5708946, 5735664, 5773734, 5844021, 5835802, 5829172, 5916728, 5999373, 6074105, 6094113, 6110552, 6174265, 6163846, 6296426, 6401636, 6434111, 6444320, 6662707, 6719275, 6802106]
3368F802106J23200M1963n726M9901J03271J41025J82518O2627J0439K9899J61110
3357G702333N6736R5123P6964P0421J07396J61553J01147M9191J25020K14998
3347H760882J57006P5331J36972M2392K14274J50997J6561J82948J33399N3594
3337I924356J24758J20991J14375J06706J81836J20015J83768J00678Q6608J30602
3327A1194693J01370J39613J23215J10963J38775L7892J87117J47264J04014J37662
3317A2422578K01968J67276J24349J38696J63206J27504K17574J80260J48785
3308A3892196K39027K42492J67901J76270K10871J47404K29045J58232J64495
3299A5627933K67924J48117J77685K51032Q9070J68881J94419J70399K04479J75451
$$ y = [6802106, 6925306, 6967269, 6961543, 7011444, 7114715, 7255740, 7438258, 7500885, 7511324, 7541223, 7702333, 7759069, 7854192, 7931156, 8001577, 8108973, 8270526, 8371673, 8420864, 8545884, 8760882, 8917888, 8993219, 9130191, 9172583, 9386857, 9537854, 9554415, 9737363, 9870762, 9924356, 10049114, 10170105, 10284480, 10391186, 10573022, 10693037, 10876805, 10977483, 11064091, 11194693, 11296063, 11435676, 11558891, 11669854, 11808629, 11846521, 12033638, 12180902, 12284916, 12422578, 12624546, 12791822, 12916171, 13054867, 13218073, 13345577, 13563151, 13743411, 13892196, 14131223, 14373715, 14541616, 14717886, 14928757, 15076161, 15305206, 15463438, 15627933, 15895857, 16043974, 16221659, 16472691, 16561761, 16730642, 16925061, 17095460, 17299939, 17475390]
3289A7475390R1208K18388J75685J61975J94744J62814K28578J88938K40979J25372
3279A9264071K31073L07976K58849K00110K28768L44993L03357M01869L40642
3270B1881708L11075L00326L51940M42308N16035M49682M75489N08005M34185
3261B5670753M39978N47171N15360M92064N09062M88674M29265N12105L72580
3252B9977012N32000N10592M52885M59898K99829L08420L21451L12509J99408
3243C3374004J77497J93505J39466P1788O4859O9292j19929p6857p1053j40974
3233C3681598j52007j15308k03209k11277j99832k67560k09299k18363k20217
3224C1884526k10303j87830k12573j91565j15721j44351q5292j32551n4873l7856
$$ y = [17475390, 17566598, 17784986, 17960671, 18122646, 18317390, 18480204, 18708782, 18897720, 19138699, 19264071, 19495144, 19803120, 20061969, 20262079, 20490847, 20835840, 21139197, 21541066, 21881708, 22192783, 22493109, 22845049, 23287357, 23803392, 24253074, 24728563, 25236568, 25670753, 26110731, 26657902, 27173262, 27665326, 28174388, 28663062, 29092327, 29604432, 29977012, 30509012, 31019604, 31472489, 31932387, 32232216, 32540636, 32862087, 33174596, 33374004, 33551501, 33745006, 33884472, 33956260, 34021119, 34090411, 33970482, 33893625, 33822572, 33681598, 33529591, 33414283, 33211074, 32999797, 32799965, 32532405, 32323106, 32104743, 31884526, 31674223, 31486393, 31273820, 31082255, 30966534, 30822183, 30736891, 30604340, 30549467, 30511611]
3214C0511611l0431P8474l6804N9527R5964O5306J21569J64249K29557J50343
3204C1409365R0176K07500J96443K32636K39327M10557K81081L03141L47920L07538
3194C4025684L86022M10929M03443M30336L93824M81114M88630O19661N67292
3185C8206935N96195P15647O68651R02971Q32061Q17640R97495J027966J070476
3176D5836037J156763J210699J314178J452957J579509J781691J860105J903137
3168E8095076K175307K418353K455047K627038K984200L119343L245232L346203
3160H0465799L502881L631179L612996L521502L358820L220277K862295K451344
3152A06627093K085029J611425J338673J162109R98475Q24947P32761O59285O52530
$$ y = [30511611, 30481180, 30559654, 30522850, 30582377, 30678341, 30743647, 30865216, 31029465, 31259022, 31409365, 31499541, 31707041, 31903484, 32136120, 32375447, 32786004, 33067085, 33370226, 33718146, 34025684, 34411706, 34822635, 35226078, 35656414, 36050238, 36531352, 37019982, 37639643, 38206935, 38803130, 39518777, 40187428, 41090399, 41922460, 42740100, 43737595, 44765561, 45836037, 46992800, 48203499, 49517677, 50970634, 52550143, 54331834, 56191939, 58095076, 60270383, 62688736, 65143783, 67770821, 70755021, 73874364, 77119596, 80465799, 83968680, 87599859, 91212855, 94734357, 98093177, 101313454, 104175749, 106627093, 108712122, 110323547, 111662220, 112824329, 113822804, 114647751, 115380512, 116039797, 116692327]
3143A16692327L09514J05817q9434n93606q89482j258996j507379j704859j947334
3134A09116568j955640j976424j837252j643042j597183j307363j068950p94214
3126I6936500o08344m34386k39298P1666L55847N10668N78464Q14498R71319J236022
3116A00192956J393130J512952J714285J914959K118267K409644K580509K805492
3108A16642194K988603L201680L320023L411193L633958L741691L783174L921019
3100A44643535M141398M202206M319889M378758M684979M827456N081383N320390
3092A81599994N510148N813603O037764O312726O575533O711827O778960O803867
3084B32144422O528038O078981N539777M630721L700836K698277J665501P08772
$$ y = [116692327, 117001841, 117107658, 117018224, 116424618, 115535136, 114276140, 112768761, 111063902, 109116568, 107160928, 105184504, 103347252, 101704210, 100107027, 98799664, 97730714, 96936500, 96328156, 95893770, 95654472, 95726138, 96081985, 96592653, 97171117, 97985615, 98956934, 100192956, 101586086, 103099038, 104813323, 106728282, 108846549, 111256193, 113836702, 116642194, 119630797, 122832477, 126152500, 129563693, 133197651, 136939342, 140722516, 144643535, 148784933, 152987139, 157307028, 161685786, 166370765, 171198221, 176279604, 181599994, 187110142, 192923745, 198961509, 205274235, 211849768, 218561595, 225340555, 232144422, 238672460, 244751441, 250291218, 254921939, 258622775, 261321052, 262986553, 263695325]
3076B63695325j13713p21416j084231j523823j936230k267480k727825l451487
3068B49869120m079234m903523n818873o610347p267786p843428q131600q278262
3060A96936067q130485p856247p581153p186092o685665o111599n738026n260574
3052A42386226m919493m326345m087240l807400l444472l204050k991966k704519
3044A12900741k551067k258799k028637j914104j758887j721667j473615j243766
3036I7950199j057189j001747r43277q06647p60992o65615o78858o64572o19294
3027I0752008o35190o52375q21136q10475r16185r02084q93290q62993q18475
3018H3439805p50013o48816n41008m47006l14107l06486j65753l8750O5825J81920
$$ y = [263695325, 263581612, 262860196, 261775965, 260252142, 258315912, 256048432, 253320607, 249869120, 245789886, 240886363, 235067490, 228457143, 221189357, 213345929, 205214329, 196936067, 188805582, 180949335, 173368182, 166182090, 159496425, 153384826, 147646800, 142386226, 137466733, 133140388, 129053148, 125245748, 121801276, 118597226, 115605260, 112900741, 110349674, 108090875, 106062238, 104148134, 102389247, 100667580, 99193965, 97950199, 96893010, 95891263, 94947986, 94141339, 93380347, 92714732, 92035874, 91371302, 90752008, 90116818, 89464443, 88643307, 87832832, 86916647, 86014563, 85121273, 84258280, 83439805, 82689792, 82040976, 81499968, 81052962, 80738855, 80432369, 80266616, 80227866, 80293691, 80475611]
3008H0475611K98090M24849N40649O37185P99543R40682J064687J328657J428415
2999H7938368J735597K031383K291010K553815K859162L191137L527961M037088
2991A10165521M343282M779963N165700N394908N635607N793805N889715N847098
2983A53015599N583583N302801N069934M505537L939479L293281K551837J979935
2975A85241986J306927O43041N3968n03965j043377j521084j962997k457615k974361
2966A76782523l293226l585371l973201m252500m236616m409703m260733m013344
2958A44757829l867135l387353l156138k737231k400325j989134j603252j242534
2950A24374727r18092m87528j76723J43559L81591M75938O09683P83978Q07153
$$ y = [80475611, 80773701, 81198550, 81739199, 82376384, 83175927, 84116609, 85181296, 86509953, 87938368, 89673965, 91705348, 93996358, 96550173, 99409335, 102600472, 106128433, 110165521, 114508803, 119288766, 124454466, 129849374, 135484981, 141278786, 147168501, 153015599, 158599182, 163901983, 168971917, 173477454, 177416933, 180710214, 183262051, 185241986, 186548913, 187191954, 187245922, 186741957, 185698580, 184177496, 182214499, 179756884, 176782523, 173489297, 169903926, 165930725, 161678225, 157441609, 153031906, 148771173, 144757829, 140890694, 137503341, 134347203, 131609972, 129209647, 127220513, 125617261, 124374727, 123456635, 122969107, 122792384, 122935943, 123317534, 123793472, 124403155, 125187133, 125994286]
2941A25994286O59159M07127K28060n6743l36268p03450r78185j210820j582269
2932A22420897j657965j705773j705350j605536j312962j296036j051977q36253
2924A11249045o98375n39423n14927n48238p87438j003284j157390j453651j963020
2915A02583299k212634k541249k708225k898278l003743l241429l281892l123126
2907G9572723l130098k902027k831159k734975k511378k350189k165235k129215
2899E8818447j828103j707635j568497j503710j469062j257746j118772j114827
2891D7250095j073320r51770r32062q60626q62777p69978o78653o20977o34463
2882C9865469n01036m68587m12234m13047l28749m01789k30929k48856j26992
$$ y = [125994286, 126653445, 127060572, 127288632, 127231889, 126895621, 126192171, 125213986, 124003166, 122420897, 120762932, 119057159, 117351809, 115746273, 114433311, 113137275, 112085298, 111249045, 110550670, 110011247, 109496320, 108948082, 108160644, 107157360, 105999970, 104546319, 102583299, 100370665, 97829416, 95121191, 92222913, 89219170, 85977741, 82695849, 79572723, 76442625, 73540598, 70709439, 67974464, 65463086, 63112897, 60947662, 58818447, 56990344, 55282709, 53714212, 52210502, 50741440, 49483694, 48364922, 47250095, 46176775, 45225005, 44292943, 43432317, 42569540, 41799562, 41120909, 40499932, 39865469, 39364433, 38895846, 38483612, 38070565, 37741816, 37340027, 37109098, 36860242, 36733250]
2873C6733250j04549j81254j19469j37134o8125j51863j59203j95368l14366l58194
2863C4943725m81076n26294n10818o71845n90662n65826o25169m80477n28752
2854B9962806n82943m45471l86674m47359l92793k28162k59828j85875j12802
2845B6920899j43949j74295j06646j6967q1871n7297l0793j100L6449p9263N8492
2834B6323659J56737R3027k2663N8592J51345P8247P5885J20568J93239J90813
2824B7419449J88785J23542L01752K89480L45288L31219M02466L46533L37829
2815C0086343N31791M69690N30699M71811M53199N27164N54286M95539N01642
2806C4622164N47032O48175N97723O35459P32354O87810P05421O39009P01221
$$ y = [36733250, 36628701, 36447447, 36327978, 36190844, 36122719, 35970856, 35811653, 35616285, 35301919, 34943725, 34462649, 33936355, 33425537, 32753692, 32163030, 31597204, 30972035, 30491558, 29962806, 29379863, 28934392, 28547718, 28100359, 27707566, 27479404, 27219576, 27033701, 26920899, 26776950, 26602655, 26496009, 26479042, 26397171, 26339874, 26309081, 26307981, 26344430, 26265167, 26323659, 26480396, 26573423, 26550760, 26609352, 26760697, 26838944, 26914829, 27035397, 27228636, 27419449, 27608234, 27731776, 28033528, 28323008, 28668296, 28999515, 29401981, 29748514, 30086343, 30618134, 31087824, 31618523, 32090334, 32543533, 33070697, 33624983, 34120522, 34622164, 35169196, 35817371, 36415094, 37050553, 37782907, 38470717, 39176138, 39815147, 40516368]
2797D0516368Q17757P63422P08754P40992R06102R11591R54625J144989J125893
2788D8590493J367318J435654J357159J522097J502586J397118J191896J154207
2780E9518528J053195J101311J070660J182077J325014J388637J574694J592865
2772F9806981J766479J945881K085430K186208K234623K603584K758120K860278
2764H8247584L168776L456625L676294L866640M135032M466526M894334N251455
2756A21163266N736954O260973O615436P110761P663248Q445526R219369J0211217
2748A82426750J1525541J2844341J4409227J5944325J7783812J9644547K1646916
2741B96225459K3640118K5739871K7427378K8550590K8332810K6038088K1127594
$$ y = [40516368, 41334125, 42097547, 42806301, 43547293, 44453395, 45364986, 46319611, 47464600, 48590493, 49957811, 51393465, 52750624, 54272721, 55775307, 57172425, 58364321, 59518528, 60571723, 61673034, 62743694, 63925771, 65250785, 66639422, 68214116, 69806981, 71573460, 73519341, 75604771, 77790979, 80025602, 82629186, 85387306, 88247584, 91416360, 94872985, 98549279, 102415919, 106550951, 111017477, 115911811, 121163266, 126900220, 133161193, 139776629, 146887390, 154550638, 162996164, 172215533, 182426750, 193952291, 206796632, 221205859, 237150184, 254933996, 274578543, 296225459, 319865577, 345605448, 373032826, 401583416, 429916226, 455954314, 477081908]
2734D77081908J3146737L277134p228765j6303906k2668238k6165898k7115635
2727C94023337k6870756k5387839k3462670k1431963j9306979j7389244j5655509
2720B44518377j4115643j2728162j1641137j0782371r945502r090387q514754
2713A67700421p897496p300879o784922o348838n803314n327408n095886m715654
2705A18426024m421490m090164l823202l581185l333225l253851l168340l090320
2697H9664247k907686k808412k709413k549055k455025k467249k348665k318048
2689F9100694k123559k023714k068693j968326j846678j846858j665219j600070
2681E3957577j586903j532706j552249j515024j424145j347338j340561j243639
$$ y = [477081908, 490228645, 493505779, 486277014, 469973108, 447304870, 421138972, 394023337, 367152581, 341764742, 318302072, 296870109, 277563130, 260173886, 244518377, 230402734, 217674572, 206033435, 195251064, 185305562, 176215175, 167700421, 159802925, 152502046, 145717124, 139368286, 133564972, 128237564, 123141678, 118426024, 114004534, 109914370, 106091168, 102509983, 99176758, 95922907, 92754567, 89664247, 86756561, 83948149, 81238736, 78689681, 76234656, 73767407, 71418742, 69100694, 66977135, 64953421, 62884728, 60916402, 59069724, 57222866, 55557647, 53957577, 52370674, 50837968, 49285719, 47770695, 46346550, 44999212, 43658651, 42415012]
2673D2415012j095026j202870j063757r79454r34388r37172q04896q02308q41005
2664C3754136p50914p43583p80109p62931p82698p56245p02202o69593p11218
2655B7094643o46136n60227o23780n81737n81432m46909m88713n53293m61064
2646B2151352m14124m33577m56722m83419l71107m93573l41585k87047l58510
2637A8511688k87655l11933k39947k52932l24230k78504j77523k50637k41731
2628A6146596k98138l02975k21730j96165j93807k34071k38868j97704j38713
2619A4124425j73757l06275k23059j18735j72825j92386j91988k57138j36635
2610A2351627j16013k37329j15258k07305j19043j33811j55622k03638j74128
$$ y = [42415012, 41319986, 40117116, 39053359, 38073905, 37139517, 36202345, 35397449, 34595141, 33754136, 33003222, 32259639, 31479530, 30716599, 29933901, 29177656, 28475454, 27805861, 27094643, 26448507, 25888280, 25264500, 24682763, 24101331, 23654422, 23165709, 22612416, 22151352, 21737228, 21303651, 20846929, 20363510, 19992403, 19498830, 19157245, 18870198, 18511688, 18224033, 17912100, 17672153, 17419221, 17094991, 16816487, 16638964, 16388327, 16146596, 15848458, 15545483, 15323753, 15127588, 14933781, 14699710, 14460842, 14263138, 14124425, 13950668, 13644393, 13421334, 13302599, 13129774, 12937388, 12745400, 12488262, 12351627, 12235614, 11998285, 11883027, 11675722, 11556679, 11422868, 11267246, 11063608, 10889480]
2601A0889480j15616j76389j32643j20965r1191j11029j08166p1792k18313j26582
2591I616794m2182j01859o3301j37055q1875n1721j13317k1547o1815q3735j06164
2580H752223r0446p3922j24499p0055l5433j25251o8606j32409j24940l5349o7695
2569G803618j70603n3202M1071o5916j65570o6783l2603q2040m8481j34428m9143
2558F975920l3000k9653r2616r3027l3583q9884o8483n1343j3436n6062r018j05465
2546F300350r5962m9272r081j8895n5636k2001r5069r097p6879p6976j0301r3863
2534E687318p9954m8577p2763j43425o6767j7394j01649l8791J5485J975k7005
2523E108453j12092M3003N7089j05878O973L7995j28102o5903M8369n994L0067
$$ y = [10889480, 10773864, 10597475, 10464832, 10343867, 10252676, 10141647, 10033481, 9961689, 9743376, 9616794, 9574612, 9472753, 9409452, 9272397, 9190522, 9138801, 9025484, 9003937, 8942122, 8858387, 8752223, 8661777, 8587855, 8463356, 8393301, 8357868, 8232617, 8164011, 8031602, 7906662, 7871313, 7803618, 7633015, 7579813, 7620884, 7554968, 7389398, 7322615, 7290012, 7207972, 7159491, 7025063, 6975920, 6942920, 6913267, 6820651, 6727624, 6694041, 6604157, 6535674, 6484331, 6470895, 6414833, 6405815, 6300350, 6204388, 6155116, 6146035, 6127140, 6071504, 6049503, 5954434, 5945337, 5868458, 5791482, 5781181, 5687318, 5607364, 5558787, 5486024, 5342599, 5275832, 5258438, 5156789, 5117998, 5133483, 5135458, 5108453, 4996361, 5039364, 5096453, 4990575, 4997548, 5035543, 4907441, 4841538, 4889907, 4883913, 4913980]
2512D913980l3633k1415L6885l3372k7305R0814O8940l0634l5593K9062M6535
2501E004264Q422m0817o1233n3623J16504L4494M2658L643k5737N5516K6682j4952
2489E095821N3530J4815K2349P1820J33681Q968R3063R3446J44969L6996o9815
2478E699643m5747m08p7074j35233j78376j62014j31634j14321j68011j64874
2468D521951r2231j53421j45977j02298o5840n0393o0118p7586r9194j05215O0234
2457C629912m2742j04381l1068K7844j6960n2151o6215N857j9076j16025m2852
2446C172143J4017p0899j19188J9957J4622m9923k3643o3265k8505Q915L9069
2435B913300o6088o2811j1054j469J500j8430l0047m1592J9482k2149j1871k5129
$$ y = [4913980, 4880347, 4858932, 4895817, 4862445, 4835140, 4925954, 4994894, 4964260, 4928667, 4957729, 5004264, 5012686, 4971869, 4910636, 4857013, 4973517, 5008011, 5050669, 5054312, 5028575, 5084091, 5110773, 5095821, 5149351, 5164166, 5186515, 5258335, 5392016, 5400984, 5494047, 5587493, 5732462, 5769458, 5699643, 5653896, 5653488, 5576414, 5441181, 5262805, 5100791, 4969157, 4854836, 4686825, 4521951, 4429720, 4276299, 4130322, 4028024, 3962184, 3911791, 3851673, 3774087, 3674893, 3569678, 3629912, 3587170, 3482789, 3451721, 3479565, 3462605, 3410454, 3344239, 3350096, 3331020, 3214995, 3172143, 3186160, 3115261, 2996073, 3016030, 3030652, 2980729, 2957086, 2893821, 2865316, 2874231, 2913300, 2847212, 2784401, 2773347, 2771878, 2773378, 2754948, 2724901, 2683309, 2702791, 2680642, 2668771, 2643642]
2423B643642k07p2741l7682L3272r7074M6987j3790R8251n5730o1l2159M441J3284
2410B530433o1462q8296l3562J9178l0688K3751M9237m6765j4102O2960n5893
2399B354791r2288J05360O3917o671m9118Q325M0702n8420j2105l5507J7614r9441
2387B237159o651m7556J3453O3383o2165K1986l2768r5092k1444O7787m5100J5398
2375B108390K714p8628O0752L2250J3829n6244j5532n8914L7968j845r3499p438
2363A943803l8189K0103k97k5363L0377j8020m3057m318k3326P7726J5974m3343
2351A892070j08614j6845R5188j03977J6988k1337l7629J9564M9740l934K5506
2340A806720l1790r6164J2017K2224P086j05325k6811M444J1822k3654n4191K6681
$$ y = [2643642, 2643435, 2570694, 2533012, 2566284, 2469210, 2516197, 2502407, 2600658, 2544928, 2544867, 2512708, 2517149, 2530433, 2468971, 2380675, 2347113, 2366291, 2335603, 2359354, 2408591, 2361826, 2347724, 2410684, 2354791, 2262503, 2367863, 2431780, 2425109, 2375991, 2384316, 2425018, 2366598, 2354493, 2318986, 2336600, 2237159, 2230508, 2182952, 2196405, 2259788, 2197623, 2219609, 2186841, 2091749, 2070305, 2138092, 2092992, 2108390, 2111104, 2032476, 2093228, 2125478, 2139307, 2083063, 2067531, 2008617, 2046585, 2044740, 1951241, 1943803, 1905614, 1925717, 1925420, 1900057, 1930434, 1912414, 1869357, 1865039, 1841713, 1919439, 1935413, 1892070, 1783456, 1766611, 1861799, 1757822, 1774810, 1753473, 1715844, 1735408, 1785148, 1781214, 1806720, 1774930, 1678766, 1690783, 1713007, 1720093, 1614768, 1587957, 1592401, 1604223, 1580569, 1526378, 1553059]
2328A553059M2851J0086M3685l7649n0540J0456j4674m5921Q762L9770p6895J4965
2316A497955M2653K5245j8543l0253p2856j07038N9602L6574k384k5668k7423
2305A377864l5853M626M6571o842L4742J0036p3140k0420M4169k3762L1063p9616
2293A309438L1928L0948o4644k0390k5963M8197m9711M5402O998j0556k8520Q854
2281A281981K2426l8072L2467n9645j110k353O5558p7842p624L5762L2451j0227
2269A273772j00463N486O5333n480n3131l3427P3186M939J4449j3371n6536M5431
2257A220188l9580K7363p2569J0519R3110n117k7659q996O8164r7527r711J06823
2245A265008P2104m6795r2763n4538l3615J3280k9131L129J7293p3529J560L7891
$$ y = [1553059, 1595910, 1605996, 1649681, 1612032, 1561492, 1571948, 1557274, 1511353, 1520115, 1559885, 1482990, 1497955, 1540608, 1565853, 1547310, 1517057, 1444201, 1337163, 1396765, 1433339, 1430955, 1405287, 1377864, 1342011, 1346637, 1393208, 1386366, 1421108, 1431144, 1358004, 1337584, 1381753, 1357991, 1389054, 1309438, 1341366, 1372314, 1307670, 1287280, 1261317, 1309514, 1259803, 1305205, 1312203, 1301647, 1273127, 1281981, 1304407, 1266335, 1298802, 1239157, 1238047, 1235694, 1301252, 1223410, 1215786, 1251548, 1283999, 1273772, 1173309, 1178795, 1244128, 1238648, 1185517, 1152090, 1225276, 1230215, 1244664, 1231293, 1174757, 1220188, 1180608, 1207971, 1135402, 1145921, 1239031, 1233914, 1206255, 1197259, 1265423, 1167896, 1158185, 1265008, 1337112, 1290317, 1197554, 1143016, 1109401, 1122681, 1093550, 1096679, 1113972, 1040443, 1042003, 1079894]
2233A079894L2541J9301R534L1134o3697k3635k5490O2738P594n0253m6583O170
2221A039248K264J6074p047r755j155P966Q301M2663n3931P0789K7572j04590
2209A038399k0540N3163n0286p7831j9468Q9518j5620k924n0041J3095l2697j4661
2197I10107J01976N0932J136m4251o0130J9955K8909k508L1535L485j0777m016
2185A026353n926J9304l8180l9807n288N3640P0102j4264m1615o8319j7507M504
2173I42997J3089M658L6052J36468p990j21397K0958o3452N6625l0216P6111k1384
2161A042519J1192M5335j7914k0605l0517J6673n509j8836N791m4423K6301L6704
2149A046711J5231P38K3705p4020k8501P6480K13n3053M1835J9047K6541k5827
$$ y = [1079894, 1112435, 1131736, 1141270, 1172404, 1108707, 1085072, 1059582, 1122320, 1129914, 1079661, 1033078, 1039248, 1041512, 1057586, 1050539, 1040784, 1039629, 1047595, 1055896, 1098559, 1044628, 1115417, 1142989, 1038399, 1017859, 1071022, 1020736, 942905, 923437, 1012955, 997335, 994411, 944370, 957465, 924768, 910107, 1012083, 1063015, 1064151, 1019900, 959770, 979725, 1008634, 1006126, 1037661, 1041146, 1030369, 1026353, 1020427, 1039731, 1001551, 961744, 956456, 1010096, 1080198, 1065934, 1024319, 956000, 938493, 942997, 956086, 960744, 996796, 1133264, 1125274, 1003877, 1024835, 961383, 1018008, 987792, 1063903, 1042519, 1053711, 1099046, 1081132, 1060527, 1030010, 1046683, 1041174, 1022338, 1028129, 983706, 1010007, 1046711, 1061942, 1062680, 1086385, 1012365, 983864, 1060344, 1060557, 1007504, 1049339, 1068386, 1094927, 1069100]
2137A069100K1472J2364r0672M4504M8254m415m4244k3423J80813j8926n5995
2126A138832O1020L8090p1361p1005N9264O0529l368m7758N8620k9521L7881L9720
2114A270943j4711l9330O5968O2515k6928J1900N1748k2731k3229O6571P7898
2103A480614m0158L5601l333l3024L3127R7644O3460K4927O9138J04257J1077
2092A843330O2280M7048N1985K4603P179P0627M5671R6785J20243J01707J16864
2081B588322L21684J60405L1645K10102K68372L06638K22822L42513L81858L75532
2071E209893N92116O49397R22217J102830J270087J486795J421539J116933L93405
2062A4165212n13067j437145j443843j277362j204472j048685q15557o44457n02425
$$ y = [1069100, 1090572, 1102936, 1012264, 1056768, 1105022, 1100607, 1056363, 1032940, 1213753, 1194827, 1138832, 1199852, 1237942, 1166581, 1095576, 1154840, 1215369, 1212001, 1164243, 1222863, 1193342, 1231223, 1270943, 1256232, 1216902, 1282870, 1345385, 1318457, 1330357, 1382105, 1359374, 1336145, 1402716, 1480614, 1440456, 1476057, 1472724, 1439700, 1472827, 1570471, 1633931, 1658858, 1727996, 1832253, 1843330, 1905610, 1952658, 2004643, 2029246, 2036425, 2107052, 2152723, 2249508, 2369751, 2471458, 2588322, 2910006, 3070411, 3102056, 3312158, 3580530, 3887168, 4109990, 4452503, 4834361, 5209893, 5802009, 6451406, 7373623, 8476453, 9746540, 11233335, 12654874, 13771807, 14165212, 13652145, 12215000, 10771157, 9493795, 8289323, 7240638, 6425081, 5780624, 5278199]
2053E278199l62396l81943k87698k08445k24325k03951k01299k59167j95991k20813
2043B732171o1830j74139j64750o9883o3450j57709n7173p846o2342j43171n0601
2032A719277O6203j00082n4878n9947P7110l9445n2746n4807l9000k4481l7059
2021A400145q1592J0385m8988m7405J5029L1455q335N142j20990o0384P6268K9060
2009A199790m1243j4405q3879q6303J391n5036P1462N361p5587K0818N4375m2923
1997I53821K6499l5231m5864l3413M5823m6075J3779m4383N1014n9239O45n9693
1985G67683m9420o4036P663M3717j3293P513N9780o810m4679l9347R21n6057j1037
1972F02598K9484k7629L207L1238j0520j2692o701J0043Q6720q4293K0784J3636
$$ y = [5278199, 4915803, 4533860, 4246162, 4037717, 3813392, 3609441, 3408142, 3148975, 2952984, 2732171, 2670341, 2496202, 2331452, 2261569, 2198119, 2040410, 1983237, 1975391, 1913049, 1769878, 1719277, 1785480, 1685398, 1630520, 1570573, 1647683, 1608238, 1555492, 1500685, 1461685, 1437204, 1400145, 1318553, 1328938, 1279950, 1232545, 1247574, 1279029, 1270694, 1275836, 1154846, 1094462, 1170730, 1199790, 1158547, 1144142, 1060263, 973960, 975351, 920315, 991777, 997138, 921551, 942369, 996744, 953821, 980320, 945089, 899225, 865812, 911635, 865560, 879339, 834956, 885970, 826731, 827376, 767683, 718263, 654227, 661890, 705607, 692314, 699827, 759607, 752797, 708118, 668771, 669692, 613635, 602598, 632082, 604453, 607660, 638898, 628378, 615686, 608985, 619028, 705748, 621455, 642239, 655875]
1960F55875m8502J5646J05507o305r1518k5345J0528p046J1547P9846m7689Q193
1948F60737l9275K4981N4359l8976k9558o7797M4629J8274k9029q312r6975K9421
1936E22479Q0679j3848L1478l7093l9603M3174n4390p0817R1632K4835K437J4666
1924E95629k6116m0733K1345k2735Q5556j4262r6422M9718L9566m2319Q333m2445
1912E15115J4308o1226O1868l0337k3202j2852M0402n4968K0599j5987M1599L2869
1900E28188J2577r017o9512l3011K4170k8681L2474O8591p0119L6144l6579R171
1888D64396p836K0150J3639J1017J5558L0080l7398J3116J7370n5523p5531m313
1876D04725K8439J1382l7729K9654J7939q0213m567O2906J02600l1350q0503m340
$$ y = [655875, 607373, 623019, 728526, 722221, 630703, 605358, 615886, 608840, 620387, 700233, 652544, 660737, 621462, 646443, 700802, 661826, 632268, 564471, 609100, 627374, 598345, 590033, 493058, 522479, 603158, 589310, 620788, 583695, 544092, 587266, 532876, 462059, 553691, 578526, 580963, 595629, 569513, 528780, 550125, 527390, 612946, 598684, 502262, 551980, 591546, 549227, 557560, 515115, 529423, 468197, 530065, 499728, 476526, 463674, 504076, 449108, 469707, 453720, 495319, 528188, 540765, 531748, 462236, 429225, 453395, 424714, 457188, 525779, 455660, 491804, 455225, 464396, 456560, 476710, 490349, 501366, 516924, 547004, 509606, 522722, 540092, 484569, 409038, 404725, 433164, 444546, 406817, 436471, 454410, 374197, 369630, 432536, 535136, 503786, 423283, 418943]
1864D18943P5921l7372n14J5227j2166K1417m2198j3052n0677K8300l0176L6929
1852D10582n675o2624M8139Q932mJ7805N3149n7661q2275P4601n4603L3475N7961
1839D41802J2623p5860J3578K354k8339R2039m8734p4694N6335J16345l3013l7995
1827D36441K1777o9895K7316M472m0002L2779O1051J3113l496k8091L857p0505
1815C88817P1836j2419n373n7722r360J1584n2394N9290o4749p25L1767J5827
1803C76379k7848p7480L0149L2767n6194j7183O623P2975N0410n8018r630M9345
1791C72295J6240J0500m6670K09q0497L3799J12397l1371P1793p5404o0606k2445
1779C00240L9986m2653m1032Q480L7527N0520m666P493n7108Q2928m9751k8463
$$ y = [418943, 494864, 457492, 456978, 472205, 460039, 481456, 439258, 426206, 375529, 403829, 373653, 410582, 404907, 342283, 390422, 399354, 399350, 417155, 470304, 412643, 330368, 404969, 350366, 383841, 441802, 454425, 378565, 392143, 394497, 366158, 458197, 409463, 334769, 391104, 507449, 474436, 436441, 458218, 388323, 415639, 420111, 380109, 412888, 473939, 487052, 483556, 455465, 459322, 388817, 460653, 448234, 442861, 385139, 375779, 387363, 334969, 394259, 329510, 328785, 360552, 376379, 348531, 271051, 301200, 333967, 277773, 260590, 267213, 340188, 390598, 332580, 322950, 372295, 388535, 399035, 352365, 352574, 272077, 305876, 418273, 386902, 458695, 383291, 322685, 300240, 340226, 297573, 256541, 265021, 302548, 353068, 348402, 355895, 298787, 381715, 331964, 303501]
1767C03501J609O6904k3822O025J9257r4773O6171l9748J649J9864K6260n9282
1755B93615l2204J9478M8551K727j8106O4236n6355j2063N6480l6879j7544L012
1743C14948O679K3298l9619M6211o8418j4583N0908n41m3196P0351m701j463q9801
1730B50073J5907R8615k2794o4658k9960q604p547M4770J5405n4194m086l8089
1718A94838J12940K2135l9776M7362m5261l7493L5174k964R543q142q12q474r040
1705B70030L3804j3810o4435r091N4639L7708m1890m1820J1221M2098j769O5444
1693C42129K7823r4315J7441M8548k1065o4293m3757L1255R818L528P8579o4924
1681B70767o279L0686J4653M5023k5080m1299N8187m5650l3788L2836p376j1476
$$ y = [303501, 305110, 372014, 348192, 354217, 373474, 278701, 344872, 305124, 306773, 326637, 352897, 293615, 261411, 280889, 329440, 332167, 314061, 378297, 321942, 309879, 366359, 329480, 311936, 314948, 321627, 344925, 305306, 351517, 283099, 268516, 319424, 318883, 275687, 346038, 341337, 339874, 250073, 265980, 364595, 341801, 277143, 247183, 238579, 231032, 275802, 291207, 237013, 232927, 194838, 307778, 329913, 290137, 337499, 292238, 254745, 289919, 286955, 296498, 288356, 287544, 279070, 270030, 303834, 290024, 225589, 216498, 271137, 308845, 266955, 225135, 236356, 278454, 276685, 342129, 369952, 275637, 293078, 341626, 320561, 256268, 212511, 243766, 253584, 257112, 335691, 270767, 264488, 295174, 309827, 354850, 329770, 288471, 346658, 301008, 267220, 300056, 292680, 281204]
1669B81204j7879n2805N1665Q149L0160R409l3912J422k8407k0332P1962n9633
1657B41003N912m2087N8352N3678n8119o5538N3642P559j3096N5284l8754n4712
1645B03124L275j2133q8349Q5135M3434n267n7709K5215N6467k6904n6014k5765
1633A44509K3486J30001q632L8406K3214j41690J3141k2589N9887n7028Q277L3034
1621B44016j7493J4019j7705o6667j6683L5764J5058J1129m8977J2205N6341R08
1609B21915r0612r710Q3666L8640J1751q8326m1268L8222n5781m7236P4251J3172
1597A48684L2165l114o6093J7523M9327k3245M6798O3189l536n5369n3561J8765
1585A71533k7586N1907M771P7068k8952J104l8752n7868J3529J3928N092J9598
$$ y = [281204, 263325, 210520, 262185, 270334, 300494, 309903, 275991, 277413, 249006, 228674, 300636, 241003, 246915, 204828, 263180, 316858, 258739, 193201, 246843, 254402, 241306, 296590, 257836, 203124, 206399, 194266, 105917, 191052, 234486, 229219, 171510, 196725, 253192, 226288, 170274, 144509, 167995, 297996, 289364, 327770, 350984, 209294, 222435, 199846, 259733, 202705, 210982, 244016, 226523, 240542, 222837, 156170, 139487, 175251, 190309, 201438, 152461, 164666, 221007, 221915, 131303, 121593, 205259, 243899, 255650, 167324, 126056, 164278, 108497, 61261, 135512, 148684, 180849, 177735, 111642, 129165, 178492, 155247, 202045, 265234, 261698, 206329, 152768, 171533, 143947, 195854, 200625, 277693, 248741, 249845, 211093, 153225, 166754, 180682, 185774, 205372]
1573B05372j3946k8637J5462P64o2225P7298j3259J6505k8648r816N8285m784
1561B12371l6320L0812R659l3809R3477m6977o5832J1300N6835m6239o1905J8220
1549A41592J775N3805J6367n2570k4795P9448P967l3428P559M680K9127p0027
1537A61500k2580n8129N2398L1674o4649N5844N3232k6157k7389q913o6337O6756
1525A47250K1087j2804J6803K7972K6118m5895J0450j4789r4473N2799R6412o6861
1513A64069J6305L3761M400J0400q5311k7598J25072l2974J439J638o0811j632
1501A48758J905o8565L4351R542M8469J9321o8022k620M7585P495m6405L3667
1489A65481k3304L7582k7112m1267N9993J904l0491M524O8420n0070m9264j8857
$$ y = [205372, 191426, 162789, 178251, 179015, 116790, 194088, 180829, 197334, 168686, 158870, 217155, 212371, 176051, 206863, 216522, 182713, 276190, 229213, 163381, 174681, 231516, 185277, 123372, 141592, 143367, 197172, 213539, 160969, 136174, 215622, 223589, 190161, 197720, 202400, 231527, 161500, 138920, 80791, 133189, 164863, 100214, 156058, 209290, 183133, 155744, 146831, 80494, 147250, 168337, 155533, 172336, 200308, 226426, 180531, 190981, 176192, 81719, 134518, 230930, 164069, 180374, 214135, 218535, 228935, 143624, 116026, 241098, 208124, 209563, 211201, 150390, 148758, 150663, 82098, 116449, 125991, 174460, 193781, 125759, 123139, 170724, 178219, 131814, 165481, 142177, 179759, 152647, 111380, 171373, 173277, 142786, 147310, 215730, 165660, 116396, 97539]
1477I7539J1133L1116L7063K5760q5073L5644K7485o5121l6202M2861q823M1184
1465A54566K447M486m50p6402m2947l8495M6506J25611J7631l8965m9112j8438
1453H6438k5981N4861j8758r621m0848J0454M3574p3883Q7250k3151O279J0685
1441A07299M8510L308p509j4117M5087l6153K8234n1104l5646l0588R758J7116
1429H4195k9675K8538K4230L381P291K2555m7737k6646l4545N5605L9771l28N04
1416A27139K1370j04611J1965K7525j9785J5204K8373n9693j659Q7935K0394l3086
1404A21071j683n0766O8697K4215l8219m2960j2714o592Q815N8895J284j2434
1392A17609Q46n9960O4673O1252m4494k7462l8152L6404k0769K7180k355l0920
$$ y = [97539, 108672, 139788, 176851, 202611, 117538, 153182, 180667, 115546, 79344, 122205, 113382, 154566, 157013, 161499, 161049, 84647, 41700, 3205, 49711, 175322, 192953, 153988, 104876, 86438, 60457, 115318, 96560, 86939, 46091, 56545, 100119, 26236, 113486, 90335, 96614, 107299, 155809, 159117, 151608, 137491, 182578, 146425, 174659, 123555, 87909, 57321, 67079, 84195, 54520, 83058, 107288, 110669, 117960, 140515, 92778, 66132, 31587, 87192, 126963, 126635, 127139, 148509, 43898, 55863, 83388, 63603, 78807, 107180, 47487, 45828, 133763, 154157, 121071, 119388, 68622, 137319, 161534, 123315, 80355, 67641, 61049, 69864, 128759, 130043, 117609, 118455, 58495, 123168, 184420, 139926, 112464, 74312, 110716, 89947, 117127, 114772, 83852]
1380H3852K9230r066k6156K1489J9886j9706r7630j2959R0518N2539o8877k5160
1368C7960J3347N0118N2375P4256K2815l5791j74p8421K1274J346n6124P994k6307
1355H4668L9015k1357q6041L4962M1848m5798l707M8174L3087N4209p139N1232
1343B23153j06387m5391J7002Q3743o5950l3385M2836l1457M485n5750K0850k1800
1331C1949N461K6774N28o9507M2184M8141K1183K1753P284k3712j2715k2251o903
1318G0169J5582m3162L101K1183j5369R5261n5739n818J3395J3422o8778J0295
1306E3542J05626L7927l5922q4849p5988n7150J53205M4466p5565k3300J2869
1295E4861J00908p5227J099o4955n2035j3865Q268J48512M3158q2095J9800L216
$$ y = [83852, 113082, 104016, 77860, 99349, 119235, 99529, 1899, -11060, 79458, 131997, 63120, 37960, 51307, 101425, 153800, 228056, 250871, 215080, 214906, 136485, 157759, 159105, 102981, 110975, 84668, 123683, 102326, 16285, 51247, 93095, 47297, 43590, 91764, 124851, 179060, 171921, 223153, 116766, 71375, 88377, 172120, 106170, 72785, 115621, 84164, 88649, 32899, 53749, 31949, 37410, 64184, 64712, -4795, 37389, 85530, 106713, 128466, 135750, 112038, 99323, 77072, 70169, 85751, 42589, 45690, 66873, 51504, 146765, 91026, 85208, 98603, 112025, 43247, 53542, 159168, 197095, 161173, 76324, 336, -56814, 96391, 140857, 65292, 41992, 54861, 155769, 80542, 81641, 16686, -35349, -49214, -40946, 107566, 150724, 68629, 88429, 91645]
1283I1645r955J8622m2091L2623j9562l902p3144O072M4467K746l1154M2390K9686
1270H8443l7198k4265K8254K0453n4810l5523N3065P5075n3629j14463L3702Q1364
1258F0468j2090r2778l6373J16332N4025q986k3154o5219N0590r3211N7448K6557
1246C3609L066M9519l7159n3520P618L4682K6747K2342j936l4699k0342M3633
1234G3560j6112L7661J6725j01517o5861L5571L9038M4093l4847L0254n18o7719
1222i672O9211J2803R0836j27793k1828j4893j9647O8355l1742J865k174j4905
1210D16l1956O2973J5939k7790n058P3500L697l1505n6050l2198R498k2233N042
1197c5725j2297Q4832j8571n0897M5565L345j1695k015J0733j4292n5906O6453
$$ y = [91645, 81690, 100312, 58221, 90844, 71282, 67380, -5764, 308, 44775, 47521, 16367, 58757, 88443, 51245, 26980, 55234, 75687, 20877, -14646, 38419, 113494, 59865, -54598, -20896, 60468, 48378, -44400, -80773, 35559, 89584, 80598, 57444, -7775, 42815, -50396, 7052, 33609, 36675, 86194, 49035, -4485, 3133, 37815, 64562, 86904, 84968, 50269, 29927, 73560, 57448, 95109, 111834, 10317, -55544, -19973, 19065, 63158, 28311, 58565, 58047, -9672, 59539, 72342, 163178, 35385, 13557, -1336, -20983, 47372, 15630, 17495, 15321, 416, -31540, 31433, 47372, 19582, 14524, 88024, 91721, 60216, 4166, -28032, -18534, -40767, -35725, -48022, 36810, 18239, -32658, 12907, 16252, 4557, 2542, 13275, -1017, -56923, 9530]
1185I530K8603J0376J1016k7072k8942K0026M9941j1010n0074n6850P3030O6552
1173I5126k6744m1897N0159o8903L860M9304j1419n2619N0996l4907n4628K0082
1161b1590K2596O763N6608n9146l0453J3438P5081J4566j18428N2249r910l132
1149a358J3843O079M7478k3678j3427K3885k3549N1119m7003r1511M5000K1556
1137H434Q617n1274k0300K9009K5280j1008K2601n6626K5854l152j0877l76P9597
1124D5779J5250K1270j39046K9659k8472K2372M8357P156n8636k4084R3968M3697
1112G7270J1518k0929l1698o4916N3485k6477j6581l2023M2723k9303n4002l7961
1100a28894R1232J538k748j6447O920K9586l6769k7028P7186o6865M257K4275
$$ y = [9530, 38133, 48509, 59525, 32453, 3511, 23537, 73478, 62468, 12394, -44456, 28574, 95126, 68382, 26485, 76644, 7741, 11601, 60905, 49486, -3133, 47863, 12956, -41672, -21590, 1006, 7769, 64377, 5231, -25222, -11784, 63297, 77863, -40565, 11684, 1774, -1358, 12485, 18564, 66042, 42364, 28937, 52822, 29273, 80392, 33389, -58122, -13122, 8434, 17051, -34223, -54523, -25514, -234, -11242, 11359, -45267, -19413, -22565, -33442, -33818, 45779, 61029, 82299, -56747, -27088, -55560, -33188, 15169, 22325, -36311, -60395, 33573, 77270, 88788, 67859, 36161, -28755, 24730, -1747, -18328, -50351, -7628, -36931, -90933, -128894, -37662, -36124, -38872, -55319, -48399, -18813, -55582, -82610, -5424, -72289, -68032, -43757]
1088d3757O2554l7593O9982k7031j7875L0927l8354M6478r1476o7868P9633k8091
1076f2471M6j1891l3061P3754J0060J3286m9722N0238L9396n3402Q4920k8621
1064C2532j6062m778k4876j2043J118P8986n544n5237l8640L3402p42J0578k3378
1051b4684q723r865K8967O4866o1490k1606N0584J0447m2772K0012n7356j6782
1039f8402l0612J24784K3341j8926q0331M7255O936m1756J2215M026M9295l4161
1027f336J5250n3410K4608O826n9900p961K9560l2003O7497M2833k6848Q64L1539
1014C2519j9997k5001m0538J333r582L3284K077M010L5836j1681L1085M1232l9535
1001C5042K0871j1813r0731m5028N3655j856K718j3148m4048k4186L1980m1284
$$ y = [-43757, 18797, -18796, 51186, 24155, 6280, 37207, -1147, 45331, -46145, -114013, -34380, -62471, -62425, -74316, -107377, -33623, -23563, -10277, -59999, -9761, 29635, -23767, 61153, 32532, 16470, 11692, -13184, -25227, -24109, 54877, 49333, -5904, -44544, -11142, -11884, -1306, -24684, -33407, -43272, -14305, 50561, -10929, -32535, 18049, 28496, -14276, 5736, -51620, -68402, -99014, 25770, 49111, 30185, -50146, -2891, 4045, -37711, -25496, -21470, 27825, -6336, 8914, -44496, -19888, -13062, -72962, -80923, -51363, -83366, -15869, 26964, 116, 980, 32519, 12522, -12479, -53017, -51684, -61266, -27982, -25905, -21895, 13941, 2260, 33345, 74577, 35042, 55913, 44100, -46631, -91659, -38004, -39860, -37142, -50290, -94338, -118524, -86544, -127828]
989a27828L2345L6739M9078k9185K7969L8150q420o4678K0127L2728k5950o2943
977h1868j2380J04507k2653L4666j935k8534j7374L7818n0875q0769L0999o603
965i5001k0815O908m4794O851Q1323O6048J5303q8491K8973l3724L9561J526Q765
952b7567M6723l2400l458l2419j9387k7883L830J624L1407o9244M7981R8108m7054
939b9739M2053j1584l5578J2873J4565l2821l5682l541J0454N06P5814J10673
927A17993j25245q5376k3430M4636k1744O8094L6658j9639n289L8463k09K2304
915D7216k4102J1566k018j9586j3312N6972o4689m6811k0727o2332O3595j2718
903h6946R4499J0339j1156j2109m8456j8011L2610R017k4728O3481J9292l2469
$$ y = [-127828, -95483, -58744, -9666, -38851, -10882, 27268, 18848, -45830, -25703, 7025, -18925, -81868, -94248, 10259, -12394, 22272, 20337, -8197, -25571, 12247, -38628, -119397, -88398, -95001, -115816, -108908, -153702, -146851, -65528, 520, 15823, -72668, -43695, -77419, -37858, -36332, -27567, 19156, -13244, -16702, -49121, -68508, -96391, -92561, -90937, -59530, -128774, -80793, 17315, -29739, 12314, 730, -34848, -21975, -7410, -40231, -75913, -79454, -69000, -68494, 7320, 117993, -7252, -92628, -116058, -71422, -93166, -25072, 11586, -8053, -13342, 25121, 24912, 47216, 23114, 34680, 32662, 13076, -236, 56736, -7953, -54764, -75491, -137823, -74228, -86946, 7553, 17892, 6736, -5373, -53829, -71840, -39230, -30213, -54941, 8540, 27832, -4637]
891d637l0384j189l245K3741J2614J0773L9586m1364k458n8627L3671O0980o9938
878c0477o2476k4762K8703J5500L450j5959p6948O6589m481l471O4465J11280
866G1413l4284r3081L0371O5829p1130J941l533J4888j6158m5105J0558m5468
854a13759N1917M5926K9802J8345j5466J7231k1896O4716r0212l8801r928l3546
842i5671l2376j2703R2756m185j0161q4036k4623L3206J62131j22448K6R6520
830a564L758o966Q65l9870J6305j19308L7707J7987L3969L3053M9922n3647l7135
817f4924N5920n7388N682K322m2226n739P3976O535l3759j5760n2788l1099L9461
804a19787k964k6908j241K8754L5259K1886N861k1849k2225N4149n2250J1637
$$ y = [-4637, -35021, -36210, -39455, -15714, -3100, 7673, 47259, 5895, 3437, -55190, -21519, 39461, -30477, -92953, -117715, -89012, -73512, -70062, -86021, -162969, -96380, -100861, -104332, -39867, 71413, 37129, -55952, -25581, 40248, -30882, -28941, -32474, -17586, -33744, -78849, -68291, -113759, -61842, -15916, 13886, 32231, 16765, 33996, 12100, 76816, -13396, -52197, -62125, -95671, -128047, -140750, -47994, -52179, -62340, -146376, -170999, -137793, 24338, -98110, -98084, -1564, 2194, -4772, -3907, -43777, -27472, -146780, -109073, -91086, -57117, -24064, 25858, -27789, -64924, -9004, -66392, -60710, -58388, -100614, -106353, -32377, -25842, -59601, -75361, -128149, -159248, -119787, -122751, -149659, -150900, -122146, -86887, -65001, -59140, -80989, -103214, -49065, -101315, -89678]
792h9678K5057j8675L8726k0491q934n151n8393n799M0007J1380J03297j091j12065
779a01810m6162J0547L4581O0001m0260k4571j2920n0490J07377j9097K027L2459
767d8318M8774j853j09822m5161K4816l29M1709L1422J6397m1634o507n9373O6430
754h3449O0905J05927q4601n5504o9061o9595J4788P6460L3866M4467k7128q664
742f1589P528R083l7386L503P7146m8030l3459O733L0041o3559l5917Q3477M7978
729a4451n9992j6428k7616M0161j130o4094K8648L7801n7553J2478K9927J6561
717g5688J0804M5182j9316j5035k2037n8763P9770M8515m0792J9894o954l1322
705f5742m5865M0104n181L0759l5405L932p011n7841P6594p5156L3220r246N665
$$ y = [-89678, -64621, -83296, -44570, -65061, -73995, -79146, -137539, -143338, -103331, -91951, 11346, 10255, -101810, -147972, -137425, -102844, -42843, -83103, -107674, -120594, -171084, -63707, -82804, -80777, -48318, 456, -1397, -111219, -156380, -131564, -131893, -90184, -58762, -42365, -83999, -90506, -149879, -83449, -22544, 83383, -1218, -56722, -125783, -195378, -180590, -104130, -70264, -25797, -52925, -61589, -54061, -44978, -82364, -78861, -1715, -49745, -83204, -76471, -46430, -109989, -145906, -62429, -14451, -74443, -90871, -118487, -78326, -79456, -143550, -114902, -77101, -134654, -122176, -92249, -75688, -64884, -19702, -39018, -54053, -76090, -134853, -55083, -6568, -47360, -27466, -34420, -65742, -111607, -71503, -76684, -45925, -81330, -77398, -84409, -142250, -65656, -140812, -107592, -116838, -111173]
692a11173J24054l7695k9111J0025K9905n7848O339o3180l2684Q378j5905O8609
680a00286L8095o372O750j3971j7199M7891J8348m5455l0949p8855k4490O5685
668a40808N6893L2793m1723K9015p592J7531k8503K4793N0384p2680m3100j1113
656a34110j8318m6334J25848J2304o7622K3795K2854k2093m3102L4423j5644L1443
644i6556K0305O518L4977q0026n921m3269R960J09678L695n1114Q426k0621Q0037
631b3911r802l6952M0123k2598k8289M643L6855l7075K1156J02982j4195p5553
619d2616m9164l6734L4677Q7172q1009K89L9662j7982L9869l3540j9656o8735
607a47767M7463J35372p6415j246k7404k6829l4687K2412L3445k0212Q234K1827
$$ y = [-111173, 12881, -24814, -53925, -43900, -13995, -71843, -65504, -128684, -161368, -152990, -168895, -100286, -62191, -68563, -61813, -75784, -92983, -45092, -26744, -72199, -103148, -182003, -206493, -140808, -83915, -51122, -92845, -63830, -71422, -53891, -82394, -57601, -7217, -79897, -122997, -134110, -152428, -198762, -72914, -60610, -128232, -104437, -81583, -103676, -146778, -112355, -127999, -96556, -76251, -69733, -34756, -114782, -120703, -163972, -154012, -44334, -40639, -91753, -83327, -103948, -23911, -33713, -70665, -30542, -53140, -81429, -76786, -39931, -77006, -55850, 47132, 32937, -42616, -91780, -128514, -93837, -6665, -87674, -87385, -47723, -65705, -25836, -59376, -79032, -147767, -100304, 35068, -41347, -42593, -69997, -96826, -131513, -109101, -75656, -95868, -87634, -65807]
595f5807K3574p7116m2149L2395Q6505m6215l8889k7250j8528O0086N3113k5893
583h6174n5622P2786O355m0888L3370q3444n421n5662J22576m4590o5522N9591
571a42645L5783o9066k9997P9124R753L3979J1582k0995l1140L313O4688L8533
559a7088o1071j2616k7589m7771k7017M4669J01211r295j11181k3234J8186K5035
547a47761p7044m813O4490J2852N3160Q5378o2850l1421k233m9584Q6202r7050
535a70674l0461K0231L5300L1527p7110J6282J6583P1922k2728j7236M4449m7043
523a28958J608j9369M39m1693P6084k0930R2407n9301q7727K3464l922L7590l7278
510a67586K5722R8741l8661n1791O542q7361L082L1461M2930o1968L5743N0112
$$ y = [-65807, -42233, -119349, -161498, -129103, -42598, -88813, -127702, -154952, -173480, -113394, -60281, -86174, -141796, -69010, -62655, -103543, -70173, -153617, -159038, -214700, -92124, -136714, -202236, -142645, -106862, -175928, -205925, -126801, -117048, -83069, -71487, -92482, -123622, -120309, -55621, -17088, -78159, -90775, -118364, -166135, -193152, -148483, -47272, -56567, -167748, -190982, -172796, -147761, -224805, -229618, -165128, -152276, -99116, -13738, -76588, -108009, -110242, -159826, -73624, -170674, -201135, -180904, -145604, -114077, -191187, -174905, -158322, -86400, -109128, -126364, -81915, -128958, -127350, -146719, -146280, -187973, -111889, -132819, -40412, -99713, -187440, -163976, -167898, -130308, -167586, -141864, -43123, -81784, -133575, -127033, -214394, -211312, -179851, -136921, -198889, -163146, -113034]
498a13034j6235l7642j7816O9598l4880J0789M9002r704m4226o6908N0741p134
486a67449J5035K5584L5416J7221M420q2309N8252n999p0792N5809L5247P210
474g2355n4043M1669L5435k9043p1730L0146l489J2332j5357M2777n5252o2651
462b01561J43330o1818j6708N3854J5602p6444j5917J9111m104R55N0687K6872
450f6141p581k561m025n0043l5129q601N2159P3564p8764o9482N0862m9791N9354
437a36179N0160j0610l661j2766K5064m2819O3491m4918j063K9727m3584n1648
425a78806J29J18386q1349k8293L4849M5520R67R49J4718k6667j6561n5958J8608
412a53508K7686M3206p0360o8728O3080L3312m8440M1306N967p7173O0935k1011
$$ y = [-113034, -129269, -166911, -184727, -115129, -150009, -139220, -90218, -99922, -144148, -211056, -160315, -167449, -152414, -126830, -91414, -74193, -69773, -152082, -93830, -99829, -170621, -114812, -79565, -72355, -126398, -84729, -49294, -78337, -150067, -119921, -123410, -111078, -126435, -83658, -138910, -201561, -58231, -120049, -136757, -82903, -67301, -143745, -159662, -140551, -144655, -143700, -93013, -66141, -73722, -76283, -80308, -130351, -165480, -174081, -121922, -48358, -127122, -196604, -145742, -195533, -136179, -86019, -96629, -100290, -113056, -87992, -130811, -67320, -112238, -113301, -83574, -127158, -178806, -178677, -60291, -141640, -169933, -135084, -89564, -88597, -87648, -72930, -99597, -116158, -172116, -153508, -125822, -82616, -152976, -221704, -158624, -125312, -173752, -132446, -126479, -203652, -142717, -163728]
400a63728n1585R2733M8454j18592O547N5230l7587j9440j463J02806O484p8667
388a58808M513k7528J1706O028R9301j5201k6483K1912n0712j5484m2431k413
376a95600K2026k377o9512k4509J32650k0395j27129J15926L7686n4051j6810
365b02095K8647L3024Q889o0011L2210P1341l0587K8050R1381p8150j00155M7063
353a30393L5667o7055J8231j4632j7130k9497L5098K674P0717q0974P6393o678
341a07579m177N226m5528K841m628L1372n4875m4831N3124o572j992k0652L8552
328a59719K5076r3252J5782M8895Q1708m6978K1153q6432o3240J0872R3570M7393
316a05172k3652j17635K4739N9316L795k5862j0138L9872n2741j2508k4618J11304
$$ y = [-163728, -215313, -122580, -74126, -192718, -186171, -130941, -168528, -187968, -189431, -86625, -80141, -158808, -154295, -181823, -170117, -164089, -64788, -79989, -106472, -84560, -135272, -150756, -193187, -195600, -173574, -175951, -245463, -269972, -137322, -157717, -284846, -168920, -131234, -185285, -202095, -173448, -140424, -131535, -191546, -159336, -87995, -118582, -90532, 849, -77301, -177456, -130393, -94726, -161781, -143550, -158182, -175312, -204809, -169711, -167037, -96320, -177294, -100901, -107579, -111756, -106530, -152058, -149217, -153845, -122473, -177348, -222179, -169055, -175627, -177619, -198271, -159719, -134643, -227895, -212113, -163218, -81510, -128488, -107335, -193767, -257007, -246135, -152565, -105172, -128824, -246459, -221720, -162404, -158609, -184471, -194609, -154737, -207478, -219986, -244604, -133300]
304a33300p379K1990k7383n6620M4972m4707J10485m4626K6109q7589q025K2065
292a84008K8698j6431J9002j979L1648k4031o2839R8119J9318m5917r5877K6209
280b08088Q6733m4781p9631j2430L7430l3838j4123Q1921M3545j6276k4614M3025
268a41127m1973l29J4913n3659M2070m7508n741K0606l3531j7468M7919O0742
256a55086l0829Q2718q1991O7373K35R15Q571n8068k4567m5681L9878O1764J2467
243a22301n9595R525k911m570p3622M7976L2948k4420p0375M001O7655P4825M3746
230g7118j5150q434j27092O4065n955n876P7515p4234J9379O1333r965j2695n4085
217a68312R829K7190j2126o6117M098M4900N298j07820J7086J446P0631M6927
$$ y = [-133300, -140679, -118689, -146072, -202692, -157720, -202427, -91942, -136568, -110459, -198048, -206073, -184008, -155310, -171741, -152739, -154718, -123070, -147101, -209940, -111821, -92503, -138420, -234297, -208088, -121355, -166136, -245767, -258197, -220767, -254605, -268728, -186807, -143262, -159538, -184152, -141127, -183100, -183429, -168516, -222175, -180105, -227613, -233354, -212748, -246279, -263747, -215828, -155086, -185915, -103197, -185188, -117815, -117580, -116665, -108094, -166162, -190729, -236410, -196532, -134768, -122301, -181896, -172371, -175282, -179852, -253474, -205498, -172550, -196970, -267345, -263344, -195689, -120864, -77118, -92268, -100702, -227794, -163729, -169684, -175560, -98045, -172279, -152900, -91567, -101532, -114227, -168312, -158483, -131293, -143419, -209536, -205438, -160538, -155240, -263060, -245974, -244528, -173897, -126970]
205a26970r871o2203Q49J01662j6437l7001q869K7116o8080k4036n3302o188M3877
192b39453l609M3725M2505n0646L9104r250j08929N0870Q1712L7602k8417m9518
180a94304K7214M1290k8334q6648M6371N0210l1922O290K0609o2809k0502K3058
168b09477K3491K9067J0933k0825n1818M2146N0107p014o9082o536J6934n2980
156b45054N8329o7376O6462O5672k326J4141q7805J9350K0731Q108q613o0819
144b19200M249j3979k6943M677M4171j8519J2118L2899L5723n8577k0684j3916
132b37981k3111J14330k3203k3899K6817J6088j6063p4521k8513M593P6411L8331
120a50721n40m7512l5183L3930l0479L0107k9234N3080j7257j3871N8185k0138
$$ y = [-126970, -136841, -199044, -198195, -96533, -112970, -149971, -158840, -131724, -199804, -223840, -277142, -283330, -239453, -243062, -199337, -156832, -207478, -168374, -177624, -286553, -235683, -153971, -116369, -144786, -194304, -167090, -125800, -154134, -240782, -194411, -144201, -176123, -169833, -149224, -212033, -232535, -209477, -185986, -156919, -145986, -166811, -218629, -176483, -126376, -133390, -202472, -209008, -192074, -245054, -186725, -254101, -187639, -121967, -124293, -110152, -197957, -178607, -157876, -149768, -158381, -219200, -214951, -228930, -255873, -251196, -207025, -225544, -213426, -180527, -144804, -203381, -224065, -237981, -261092, -146762, -169965, -193864, -167047, -150959, -167022, -241543, -270056, -265463, -189052, -150721, -151261, -198773, -233956, -200026, -230505, -200398, -229632, -176552, -193809, -207680, -149495, -169633]
108a69633Q283K1487n3273q135J4739M4673L1582o0717l6745K8692m7348n993
96b32388Q2020q9398j5900K3186J4177M2261P663m4904n2538L4557M3915N327
84a82022J3781m2783j9400L9738K9607n0302M541K2321n1649r861l4998J1947
72b69080N8499M77o0650K8793L2541m0344K3985J1415m8442P3028j2484o5997
60b68259M4246N1882O0724m1573m8895l0338P090j817M1406j1101K0425Q103J6019
47a52088j0725l7516j1903j8666M7191k0538R53K1805O593j7542o455l2477Q685
34b22683l6317O4468M818n9668J5849O0415j9014lQ782q528j3420j8446O226J9042
20a98479M5975J1809l0229m1880N4913L245m7528m968k919k1449L878q83q777
$$ y = [-169633, -161350, -139863, -193136, -201271, -186532, -141859, -110277, -170994, -207739, -179047, -226395, -232388, -150368, -239766, -255666, -232480, -218303, -176042, -168379, -213283, -265821, -231264, -187349, -182022, -168241, -211024, -230424, -190686, -161079, -211381, -206840, -184519, -236168, -246029, -281027, -269080, -210581, -210104, -270754, -241961, -209420, -249764, -225779, -214364, -262806, -189778, -202262, -268259, -224013, -172131, -111407, -152980, -201875, -232213, -225123, -226940, -185534, -196635, -176210, -168107, -152088, -162813, -200329, -212232, -230898, -183707, -204245, -203292, -181487, -174894, -192436, -198891, -231368, -222683, -259000, -194532, -189714, -249382, -233533, -173118, -192132, -192135, -183353, -191881, -205301, -223747, -217521, -198479, -152504, -140695, -170924, -212804, -157891, -154646, -202174, -207142, -210061, -231510, -227632, -228515, -237292]
7b37292M7060k5339n21l4484k8825m926O7250
0b17077
$$ y = [-237292, -190232, -215571, -216092, -250576, -279401, -284327, -217077]
$$ Imaginary data points
##PAGE= N=2
##DATA TABLE= (X++(I..I)), XYDATA
16383c718514N3860N6866J05649J0880J1752O8432J00110K3974O144N4231K9161
16372c197455L4202Q5080N9568N6097K3480K6050Q4085M7789J20566O4916M9902
16361b545720p724J7310M9748N5625M5981P699P1373L7840M2661L0061J25696
16350b069450P1821L5117N3558M4422J2102N4094O8301L7821O9205J2125Q7492
16339a523392L0833M2918M0109M418P0946O4608N108K9485J09081N4513J3947
16328a057426Q4609N8423j0584K0052N2462J25911P980k16M9806O1388N4684Q6111
16316d66800K3622K4411N2847J9278Q2542J08373q895M1284L2869j2789o808K7805
16304h2261J2515J00187Q1594l3498Q2260N4995O1555L7958Q451N2809L4920O5914
$$ y = [-3718514, -3664654, -3607788, -3502139, -3491259, -3479507, -3411075, -3310965, -3286991, -3280847, -3226616, -3197455, -3163253, -3078173, -3018605, -2962508, -2939028, -2912978, -2828893, -2781104, -2660538, -2595622, -2545720, -2553444, -2536134, -2486386, -2430761, -2384780, -2377081, -2305708, -2267868, -2225207, -2195146, -2069450, -1997629, -1962512, -1908954, -1864532, -1852430, -1798336, -1730035, -1692214, -1623009, -1610884, -1523392, -1492559, -1449641, -1409532, -1405114, -1334168, -1269560, -1264452, -1234967, -1125886, -1071373, -1057426, -972817, -914394, -924978, -904926, -852464, -726553, -718573, -718789, -668983, -607595, -552911, -466800, -443178, -418767, -365920, -346642, -264100, -155727, -164622, -123338, -90469, -103258, -110066, -82261, -69746, 30441, 112035, 78537, 160797, 215792, 277347, 315305, 323756, 376565, 411485, 477399]
16292D77399L0832K9600M0440J4429P383K0543P3448M8769M1123j1112Q7106r583
16280H50377J9673Q8938L9938J8300J8576J3252L3502J26347O9865M8627m2775
16269A284620K1529N4543p281L9803M0037N6178M4251M8137k5219M3557L6818
16258A636973J4694J1673K9512M0730Q5637M05p886P6844M1421P436m278J5303
16246A948464L0766K2570L4877O2077N3469k7591L4112K1960J16424O7266q2693
16235B281701k751P1119J2418N7206K3235R737K4047P192O1297J2294j4481J0529
16223B553543P2771N6230J607j1861m6761Q1344O7609K9672p4105P3151K8275
16212B831475l2277J01163k516l4486Q5893K8345o5521O8215L3812N1669L2174
$$ y = [477399, 508231, 537831, 578271, 592700, 600083, 620626, 694074, 742843, 783966, 772854, 859960, 850377, 870050, 958988, 998926, 1017226, 1035802, 1049054, 1082556, 1208903, 1278768, 1327395, 1284620, 1306149, 1360692, 1353411, 1393214, 1433251, 1489429, 1533680, 1581817, 1556598, 1600155, 1636973, 1651667, 1663340, 1692852, 1733582, 1819219, 1819624, 1811738, 1888582, 1930003, 1937439, 1933161, 1948464, 1979230, 2001800, 2036677, 2098754, 2152223, 2124632, 2158744, 2180704, 2297128, 2364394, 2281701, 2278950, 2350069, 2362487, 2419693, 2442928, 2452665, 2476712, 2483904, 2545201, 2557495, 2543014, 2553543, 2626314, 2682544, 2684151, 2672290, 2625529, 2706873, 2774482, 2804154, 2730049, 2803200, 2831475, 2799198, 2900361, 2897845, 2863359, 2949252, 2977597, 2912076, 2980291, 3014103, 3065772, 3097946]
16201C097946j9449L77L4695J7289n020L749J0566M5027M8900M8757J8157j01422
16189C199572K2489M7965l5364N1382m4864q1322N7365M7052P8426K9538J3516
16178C385755k2524M603M5611J30017q4109j1750Q68j3310K3944Q126J0243P555
16166C485029J09819K0242K2783o5734O7311K788J5053L3303l8808K3377r175
16155C665988j5380K2453N8053p815j2245k014L2054n7613K383K973Q694M0428
16143C737959K6488j4003Q979M537K6540k1138J4658l3475K1502j8306O7270j9875
16131C801136p72J9496Q1965j4295j441O9573J0175o907p2463J6833O7653M0230
16119D011183K327j9884r6265o494k313L4217P0182p723m0986l7921N2356K6755
$$ y = [3097946, 3078497, 3078874, 3113569, 3130858, 3125838, 3129587, 3140153, 3185180, 3234080, 3282837, 3300994, 3199572, 3222061, 3270026, 3234662, 3286044, 3241180, 3159858, 3217223, 3264275, 3342701, 3372239, 3385755, 3363231, 3367834, 3413445, 3543462, 3459353, 3447603, 3448471, 3435161, 3459105, 3467231, 3477474, 3485029, 3594848, 3615090, 3637873, 3572139, 3639450, 3642238, 3657291, 3690594, 3651786, 3675163, 3665988, 3650608, 3673061, 3731114, 3723299, 3711054, 3709040, 3741094, 3683481, 3685864, 3688837, 3697531, 3737959, 3764447, 3750444, 3759423, 3763960, 3790500, 3769362, 3784020, 3750545, 3772047, 3753741, 3821011, 3801136, 3800364, 3819860, 3901825, 3887530, 3886089, 3955662, 3965837, 3958930, 3886467, 3903300, 3970953, 4011183, 4013510, 3993626, 3897361, 3890867, 3888554, 3922771, 3992953, 3985230, 3944244, 3906323, 3958679, 3985434]
16107C985434J1199P3317n7401J4192K5252J3581M011L5977r9054M5595j7530
16096D034573k7486N9355K6143n1872m5548L3206j1171M8829J0879k1905j9689
16085D035314j4596R1238J0991k0406N013K7558o1625l7130J1810l0717J7545
16074D034995M443L4780m60J5616P2282k368l8951j475N5231m4926m0895m934
16062D083338K0811K3765j7966L1632M0479o2579o6877O9806N6303R894K3936
16051D212542j6767k2971J1723N9906l4176j05571J5310j5335n1486K6488K9534
16040D109197m8190J2701L2981l0253N796Q9783L8378r6899o9559N0306N1199
16029D145440L6641m1110J9734o0294j7809J2269M8905M1641n2403N929K371Q9133
$$ y = [3985434, 3996633, 4069950, 4012549, 4026741, 4051993, 4065574, 4069585, 4105562, 4006508, 4052103, 4034573, 4007087, 4066442, 4092585, 4040713, 3995165, 4028371, 4017200, 4066029, 4076908, 4055003, 4035314, 4020718, 4111956, 4122947, 4102541, 4107554, 4135112, 4073487, 4036357, 4048167, 4017450, 4034995, 4039438, 4074218, 4073758, 4089374, 4161656, 4159288, 4120337, 4118862, 4174093, 4129167, 4088272, 4083338, 4104149, 4127914, 4109948, 4141580, 4182059, 4119480, 4052603, 4122409, 4178712, 4188606, 4212542, 4195775, 4172804, 4184527, 4244433, 4210257, 4104686, 4119996, 4104661, 4053175, 4079663, 4109197, 4061007, 4073708, 4106689, 4076436, 4082232, 4172015, 4210393, 4113494, 4043935, 4094241, 4145440, 4182081, 4140971, 4160705, 4100411, 4082602, 4094871, 4143776, 4185417, 4133014, 4138943, 4141314, 4230447]
16017D230447m3730K3853k4927q2060N468K8879N357J2039k0142K2816K1770M8805
16005D228575l1348p0496M9112N0195l6353m553p4169J4811m4540K5874M3663
15994D150771j5278M1408J5474L0L4059l4118J1376n3290M0690K8746n8035J9118
15982D180951o314K5799k9262p9454N3019O4153m1189M9381l6954K8480o5002
15971D143608N028N9926m1826J8439N4408m1636J9556M871J7226N7457r4064q3044
15959D119949L8771L795K2578j9040J3101k2686k1404J5277l5468m358Q5629K6010
15947D222154K3722p3674J0532K1893P9250l1407k2629N886p4141k465N0190K2323
15935D231634L067l5891k8743P0091l9775o3983P1949k7344O5181l4250l5938
$$ y = [4230447, 4186717, 4210570, 4185643, 4103583, 4109051, 4137930, 4143287, 4155326, 4135184, 4158000, 4179770, 4228575, 4197227, 4126731, 4175843, 4226038, 4189685, 4185132, 4110963, 4125774, 4081234, 4107108, 4150771, 4135493, 4176901, 4192375, 4192405, 4226464, 4192346, 4203722, 4150432, 4191122, 4219868, 4161833, 4180951, 4174637, 4200436, 4171174, 4091720, 4144739, 4208892, 4167703, 4217084, 4180130, 4208610, 4143608, 4148636, 4208562, 4166736, 4185175, 4239583, 4197947, 4217503, 4222374, 4239600, 4297057, 4202993, 4119949, 4158720, 4162515, 4185093, 4166053, 4179154, 4156468, 4135064, 4150341, 4114873, 4110515, 4196144, 4222154, 4245876, 4172202, 4182734, 4204627, 4283877, 4252470, 4229841, 4235727, 4161586, 4159121, 4209311, 4231634, 4234701, 4198810, 4170067, 4240158, 4200383, 4136400, 4208349, 4181005, 4246186, 4211936, 4175998]
15924D175998J5061J1655k4207J4541O7045l5552O472J5796k7851p8660l5851
15913D104447K518J05080M473l2986L1534L8907n4854r3J737L3367O8910l6766
15901D266274j9493j3348k079j1614k7941M1849k0593l27J7482j4962J09221l5066
15889D289403n2492m328j6748P0314m7733l8809P4139k1333q208R332j4787m3374
15877D195376K310N9497M0436J0015j9424l958kq9165p376m7002J8554l0878M8443
$$ y = [4175998, 4191059, 4202714, 4178507, 4193048, 4260093, 4224541, 4231013, 4246809, 4218958, 4140298, 4104447, 4106965, 4212045, 4216518, 4183532, 4215066, 4253973, 4199119, 4199026, 4200763, 4234130, 4303040, 4266274, 4246781, 4233433, 4231354, 4219740, 4191799, 4233648, 4213055, 4212728, 4230210, 4215248, 4324469, 4289403, 4236911, 4232583, 4215835, 4286149, 4238416, 4199607, 4273746, 4252413, 4244205, 4253537, 4238750, 4195376, 4197686, 4257183, 4297619, 4307634, 4288210, 4284252, 4284250, 4195085, 4187709, 4140707, 4159261, 4128383, 4176826]
$$ [...]
##END NTUPLES=NMR SPECTRUM
##END=
