##TITLE=abcd
##JCAMPDX= 6.0         $$ Bruker NMR JCAMP-DX V2.0
##DATA TYPE= NMR SPECTRUM
##DATA CLASS= NTUPLES
##ORIGIN= UXNMR, Bruker Analytische Messtechnik GmbH
##OWNER= root
$$ XWIN-NMR		Version 3.5
$$ Wed Nov 13 09:39:44 2019 Russian Standard Time (UT+4h)  servis@DPX200
##.OBSERVE FREQUENCY= 200.131235884673
##.OBSERVE NUCLEUS= ^1H
##.ACQUISITION MODE= SIMULTANEOUS
##.ACQUISITION SCHEME= undefined
##.AVERAGES= 17
##.DIGITISER RES= 18
##SPECTROMETER/DATA SYSTEM= spect
##.PULSE SEQUENCE= zg
##.SOLVENT NAME= CDCl3
##.SHIFT REFERENCE= (INTERNAL, CDCl3, 0, 16.4784)
##AUDIT TRAIL= $$ (NUMBER, WHEN, WHO, WHERE, WHAT)
$$ ##TITLE= Audit trail, XWIN-NMR		Version 3.5
$$ ##JCAMPDX= 5.01
$$ ##ORIGIN= Bruker BioSpin GmbH
$$ ##OWNER= servis
$$ F:\spectra/data/av/nmr/H1/1/pdata/1/auditp.txt
$$ ##AUDIT TRAIL=  $$ (NUMBER, WHEN, WHO, WHERE, WHAT)
(   1,<2019-11-13 09:39:15.18 +0400>,<servis>,<DPX200>,
      <created by zg, POWCHK disabled, PULCHK disabled
       terminated by command 'halt'
       configuration hash MD5:
       00 E9 B6 7A A2 85 ED C7 34 08 36 98 17 FE 4E 26
       data hash MD5: 32K
       2D 9E CC 59 C6 3A AE 73 33 9F 84 7D B4 6E 00 B1>)
(   2,<2019-11-13 09:39:16.98 +0400>,<servis>,<DPX200>,
      <Start of raw data processing
       efp BC_mod = 2 LB = 0 FT_mod = 6 PKNL = 1 PHC0 = -429.447 PHC1 = 8.397725 SI = 16K 
       data hash MD5: 16K
       C0 8A 4E 8E A4 0B 50 CE 49 3D 69 94 21 0D EA 36>)
$$ ##END=
$$ 
$$ hash MD5
$$ 33 F9 B9 19 C7 E9 6E A3 CD F0 C7 99 A1 80 05 9F
##$RELAX= 
##$RELAX= 
##$RELAX= 
##$RELAX= 
##$RELAX= 
##$RELAX= 
##$RELAX= 
##$RELAX= 
$$ Bruker specific parameters
$$ --------------------------
##$DU= <F:\spectra>
##$EXPNO= 1
##$NAME= <H1>
##$PROCNO= 1
##$TYPE= <nmr>
##$USER= <av>
##$AMP= (0..31)
100 100 100 100 100 100 100 100 100 100 100 100 100 100 100 100 100 100 
100 100 100 100 100 100 100 100 100 100 100 100 100 100 
##$AQSEQ= 0
##$AQ_mod= 1
##$AUNM= <au_zg>
##$AUTOPOS= <>
##$BF1= 200.13
##$BF2= 200.13
##$BF3= 200.13
##$BF4= 200.13
##$BF5= 500.13
##$BF6= 500.13
##$BF7= 500.13
##$BF8= 500.13
##$BYTORDA= 1
##$CFDGTYP= 0
##$CFRGTYP= 5
##$CHEMSTR= <none>
##$CNST= (0..31)
1 1 145 1 1 1 1 1 1 1 1 1 1 1 1 1 1 1 1 1 1 1 1 1 1 1 1 1 1 1 1 1 
##$CPDPRG= <>
##$CPDPRG1= <>
##$CPDPRG2= <>
##$CPDPRG3= <>
##$CPDPRG4= <mlev>
##$CPDPRG5= <mlev>
##$CPDPRG6= <mlev>
##$CPDPRG7= <mlev>
##$CPDPRG8= <mlev>
##$CPDPRGB= <>
##$CPDPRGT= <>
##$D= (0..31)
0 2 0 0 0 0 0 0 0 0.06 0 0 0 0 0 0 0.0002 0 0 0 0 0 0 0 0 0 0 0 0 0 0 
0 
##$DATE= 1573623554
##$DBL= (0..7)
120 120 120 120 120 120 120 120 
##$DBP= (0..7)
150 150 150 150 150 150 150 150 
##$DBP07= 0
##$DBPNAM0= <>
##$DBPNAM1= <>
##$DBPNAM2= <>
##$DBPNAM3= <>
##$DBPNAM4= <>
##$DBPNAM5= <>
##$DBPNAM6= <>
##$DBPNAM7= <>
##$DBPOAL= (0..7)
0.5 0.5 0.5 0.5 0.5 0.5 0.5 0.5 
##$DBPOFFS= (0..7)
0 0 0 0 0 0 0 0 
##$DE= 6
##$DECBNUC= <off>
##$DECIM= 32
##$DECNUC= <off>
##$DECSTAT= 4
##$DIGMOD= 1
##$DIGTYP= 9
##$DL= (0..7)
0 120 120 120 120 120 120 120 
##$DP= (0..7)
$$ [...]
##$SUBNAM3= <"">
##$SUBNAM4= <"">
##$SUBNAM5= <"">
##$SUBNAM6= <"">
##$SUBNAM7= <"">
##$SUBNAM8= <"">
##$SUBNAM9= <"">
##$SW= 20.6817932712277
##$SWIBOX= (0..15)
0 0 3 0 0 0 0 0 0 0 0 0 0 0 0 0 
##$SW_h= 4139.07284768212
##$TD= 32768
##$TD0= 1
##$TE= 0
##$TE2= 300
##$TE3= 300
##$TEG= 300
##$TL= (0..7)
0 120 120 120 120 120 120 120 
##$TP= (0..7)
150 150 150 150 150 150 150 150 
##$TP07= 0
##$TPNAME0= <>
##$TPNAME1= <>
##$TPNAME2= <>
##$TPNAME3= <>
##$TPNAME4= <>
##$TPNAME5= <>
##$TPNAME6= <>
##$TPNAME7= <>
##$TPOAL= (0..7)
0.5 0.5 0.5 0.5 0.5 0.5 0.5 0.5 
##$TPOFFS= (0..7)
0 0 0 0 0 0 0 0 
##$TUNHIN= 0
##$TUNHOUT= 0
##$TUNXOUT= 0
##$USERA1= <user>
##$USERA2= <user>
##$USERA3= <user>
##$USERA4= <user>
##$USERA5= <user>
##$V9= 5
##$VALIST= <valist>
##$VCLIST= <CCCCCCCCCCCCCCC>
##$VD= 0
##$VDLIST= <DDDDDDDDDDDDDDD>
##$VPLIST= <PPPPPPPPPPPPPPP>
##$VTLIST= <TTTTTTTTTTTTTTT>
##$WBST= 1024
##$WBSW= 30
##$XGAIN= (0..3)
0 0 0 0 
##$XL= 0
##$YL= 0
##$YMAX_a= 128130
##$YMIN_a= -205566
##$ZGOPTNS= <>
##$ZL1= 120
##$ZL2= 120
##$ZL3= 120
##$ZL4= 120
##$ABSF1= 0
##$ABSF2= 0
##$ABSG= 0
##$ABSL= 0
##$ALPHA= 0
##$AQORDER= 0
##$ASSFAC= 0
##$ASSFACI= 0
##$ASSFACX= 0
##$ASSWID= 0
##$AUNMP= <proc_1d>
##$AZFE= 0.1
##$AZFW= 0.1
##$BCFW= 0
##$BC_mod= 2
##$BYTORDP= 0
##$COROFFS= 0
##$CY= 18.4799938201904
##$DATMOD= 1
##$DC= 0
##$DFILT= <>
##$DTYPP= 0
##$F1P= 9.9274215381318
##$F2P= -0.165520771350173
##$FCOR= 1
##$FTSIZE= 16384
##$FT_mod= 6
##$GAMMA= 0
##$GB= 0
##$INTBC= 1
##$INTSCL= 0
##$ISEN= 128
##$LB= 0
##$LEV0= 0
##$LPBIN= 0
##$MAXI= 10000
##$MC2= 0
##$MEAN= 0
##$ME_mod= 0
##$MI= 50
##$NCOEF= 0
##$NC_proc= -7
##$NLEV= 6
##$NOISF1= 3.799351
##$NOISF2= 2.8
##$NSP= 0
##$NTH_PI= 0
##$NZP= 0
##$OFFSET= 16.47838
##$PC= 4
##$PHC0= -429.447
##$PHC1= 8.397725
##$PH_mod= 1
##$PKNL= yes
##$PPARMOD= 0
##$PSCAL= 4
##$PSIGN= 0
##$REVERSE= no
##$SF= 200.130007602825
##$SI= 16384
##$SIGF1= 3
##$SIGF2= 2
##$SINO= 400
##$SIOLD= 16384
##$SREGLST= <1H.CDCl3>
##$SSB= 0
##$STSI= 16384
##$STSR= 0
##$SW_p= 4139.07284768211
##$SYMM= 0
##$S_DEV= 0
##$TDeff= 32768
##$TDoff= 0
##$TI= <>
##$TILT= no
##$TM1= 0
##$TM2= 0
##$TOPLEV= 0
##$USERP1= <user>
##$USERP2= <user>
##$USERP3= <user>
##$USERP4= <user>
##$USERP5= <user>
##$WDW= 1
##$XDIM= 16384
##$YMAX_p= 379563103
##$YMIN_p= -7218526
$$ End of Bruker specific parameters
$$ ---------------------------------
##NTUPLES= NMR SPECTRUM
##VAR_NAME=  FREQUENCY,     SPECTRUM/REAL,   SPECTRUM/IMAG
##SYMBOL=    X,             R,               I
##VAR_TYPE=  INDEPENDENT,   DEPENDENT,       DEPENDENT
##VAR_FORM=  AFFN,          ASDF,            ASDF
##VAR_DIM=   16384,         16384,           16384
##UNITS=     HZ,            ARBITRARY UNITS, ARBITRARY UNITS
##FACTOR=    0.252644378177508, 1,           1
##FIRST=     3297.81835535808, 0,            0
##LAST=      -841.254492324033, 0,           0
##MIN=       -841.254492324033, -7218526,    0
##MAX=       3297.81835535808, 379563103,    0
$$ Real data points
##PAGE= N=1
##DATA TABLE= (X++(R..R)), XYDATA
$$ [...]
$$ plain form
8139 260290 -3231 106418 340248 114030 429975 57949 151013 181019 16085 512180
8129 512180 39182 375063 482116 601559 199581 10049 -65005 323934 438794 327980
8119 327980 41339 279985 360004 580915 407595 83907 187855 277814 431600 40545
8109 40545 323143 586783 380754 212853 373966 480254 221241 140785 366550 132721
8099 132721 169171 767014 345876 168167 400946 324024 182616 623394 174395 228281
8089 228281 303511 345973 235094 359460 41879 380477 553054 181859 833115 140241
8079 140241 340934 347883 68519 380262 534819 188093 301143 157271 304810 157220
8069 157220 205063 297201 344472 424662 371863 883903 699136 360683 112443 528423 639713
$$ packed form
8139B60290k63521J09649K33830k26218L15945l72026R3064L0006j64934M96095
8129E12180m72998L35881J07053J19443m01978j89532p5054L88939J14860j10814
8119C27980k86641K38646Q0019K20911j73320l23688J03948Q9959J53786l91055
8109D0545K82598K63640k06029j67901J61113J06288k59013q0456K25765k33829
8099A32721L6450N97843m21138j77709K32779p6922j41408M40778m48999N3886
8089B28281P5230M2462j10879J24366l17581L38598J72577l71195O51256o92874
8079A40241K00693O949k79364L11743J54557l46726J13050j43872J47539j47590
8069A57220M7843R2138M7271Q0190n2799N12040j84767l38453k48240M15980J11290
$$ plain form
8058 639713 325408 260805 360345 373167 402547 255620 278382 127438 450397 435060 337578
8047 337578 568356 372898 347003 578636 723381 306620 59183 317435 415546 142765
8037 142765 542335 176045 534968 454073 578629 418054 415098 415425 456772 553303 296754
8026 296754 129776 624404 780996 565643 24489 743905 552139 729064 604144 260018
8016 260018 244341 443023 922670 934762 780478 593884 552687 1092626 1206098 1148625
8006 1148625 795027 707525 655722 850124 578730 101797 576523 529421 390633 877574
7996 877574 496541 274378 837555 534408 846064 402400 362812 761926 495102 443521
7986 443521 209215 380940 505905 549768 807471 477370 459438 322212 427587 452966
$$ packed form
8058F39713l14305o4603R9540J2822K9380j46927K2762j50944L22959j5337r7482
8047C37578K30778j95458k5895K31633J44745m16761k47437K58252R8111k72781
8037A42765L99570l66290L58923q0895J24556j60575k956L27M1347R6531k56549
8026B96754j66978M94628J56592k15353n41154P19416j91766J76925j24920l44126
8016B60018j5677J98682M79647J2092j54284j86594m1197N39939J13472n7473
8006A148625l53598q7502n1803J94402k71394m76933M74726m7102j38788M86941
7996H77574l81033k22163N63177l03147L11656m43664l9588L99114k66824n1581
7986D43521k34306J71725J24965M3863K57703l30101j7932j37226J05375K5379
$$ plain form
7976 452966 531761 330061 657413 443551 801816 703879 678798 152745 34685 515785
7966 515785 310623 448277 478532 493911 763403 399031 622072 461808 606893 393189
7956 393189 372583 773331 852297 538374 517951 782867 437781 628770 642703 481255
7946 481255 663851 850040 506861 909814 655154 760948 810444 783025 744422 440492
7936 440492 921744 649283 486112 1321726 751673 373851 791447 522631 797733 506491
7926 506491 616076 919561 489565 757365 920853 346591 200419 703101 741161 642341
7916 642341 584062 682693 757060 944750 863064 776654 1162072 1142902 794671 306597 499815
7905 499815 633238 812889 853822 885980 480254 764278 436029 482793 529598 880817
$$ packed form
7976D52966P8795k01700L27352k13862L58265r7937k5081n26053j18060M81100
7966E15785k05162J37654L0255J5379K69492l64372K23041j60264J45085k13704
7956C93189k0606M00748P8966l13923k0423K64916l45086J90989J3933j61448
7946D81255J82596J86189l43179M02953k54660J05794M9496k7419l8603l03930
7936D40492M81252k72461j63171Q35614n70053l77822M17596k68816K75102k91242
7926E06491J09585L03485m29996K67800J63488n74262j46172N02682L8060r8820
7916F42341n8279R8631P4367J87690q1686q6410L85418j9170l48231m88074J93218
7905D99815J33423J79651M0933L2158m05726K84024l28249M6764M6805L51219
$$ plain form
7895 880817 612023 419962 697252 349734 624095 427841 162188 447767 392665 865388
7885 865388 336346 432278 842396 551800 -68668 311890 506392 475671 652786 370418
7875 370418 706604 329446 820049 465013 534420 669166 505496 239874 487172 577434
7865 577434 236017 268843 443491 124169 568751 190445 -266655 -689205 582550 544977
7855 544977 652299 510721 625708 672855 372399 368346 713287 615865 526157 438386 443838
7844 443838 338192 772646 422515 440138 579153 366205 380951 429495 280583 705093
7834 705093 352322 655776 580952 361336 708940 436757 566857 464645 459925 640332
7824 640332 566243 631960 870585 800862 785057 804174 573057 818719 837508 503828 823687
$$ packed form
7895H80817k68794j92061K77290l47518K74361j96254k65653K85579n5102M72723
7885H65388n29042R5932M10118k90596o20468L80558J94502l0721J77115k82368
7875C70418L36186l77158M90603l55036O9407J34746j63670k65622K47298R0262
7865E77434l41417L2826J74648l19322M44582l78306m57100m22550J271755l7573
7855E44977J07322j41578J14987M7147l00456m053L44941r7422q9708q7771N452
7844D43838j05646M34454l50131J7623J39015k12948J4746M8544j48912M24510
7834G05093l52771L03454p4824k19616L47604k72183J30100j02212m720J80407
7824F40332p4089O5717K38625o9723j5805J9117k31117K45662J8789l33680L19859
$$ plain form
7813 823687 720530 718426 561329 543332 645555 777478 672350 917089 619635 672756
7803 672756 386611 966273 876568 879718 1130147 965796 594705 1107997 1355595 1327632
7793 1327632 897535 1020655 1007332 1008341 1211897 1020654 1131878 1082814 1340440 1077581
7783 1077581 917286 1034604 903986 1282731 1067721 787151 1027279 1068724 980861 1270643
7773 1270643 1103448 957402 902666 1210648 1347970 1181845 1203447 1328310 1298096 1092776
7763 1092776 1295062 1520611 1520285 1810594 1587335 1702336 2159582 2357043 2696476 3066908
7753 3066908 4432733 5452964 5816859 6173476 5524515 4513591 3689130 3179259 3025627
7744 3025627 2538324 2675681 2843978 2553798 2544199 2571947 2656014 2306480 2833288 2394298
$$ packed form
7813H23687j03157k104j57097j7997J02223J31923j05128K44739k97454N3121
7803F72756k86145N79662q9705L150K50429j64351l71091N13292K47598k7963
7793A327632m30097J23120j3323J009K03556j91243J11224m9064K57626k62859
7783A077581j60295J17318j30618L78745k15010k80570K40128M1445q7863K89782
7773A270643j67195j46046n4736L07982J37322j66125K1602J24863l0214k05320
7763A092776K02286K25549l26K90309k23259J15001M57246J97461L39433L70432
7753C066908J365825J020231L63895L56617o48961j010924q24461n09871j53632
7744C025627m87303J37357J68297k90180r599K7748Q4067l49534N26808m38990
$$ plain form
7734 2394298 2501063 2590486 2653256 2473163 2879720 3469334 3756537 4388819 5514457 6295966
7724 6295966 5796042 4684626 3577121 3169796 2619637 2266927 2288574 2129061 2181539 2380977
7714 2380977 1897273 2446346 2428811 2118868 1944813 1644444 1871704 1873880 1571042 1249209
7704 1249209 1422120 1315701 1434717 1233628 1379652 1155044 1193982 1417310 1392856 1072036
7694 1072036 1187383 1230908 1254521 1280496 965297 948001 1292572 1373211 1291902 1487740 943181
7683 943181 1047256 1192189 1682808 1288137 978092 1045221 995581 1047389 1214800 1233364
7673 1233364 1375247 1273809 1772900 1934117 1503343 1275440 1473916 1717882 1309659 1253969
7663 1253969 1396636 1361074 1138344 839063 1350276 1155095 1075955 1067084 1505561 1345305
$$ packed form
7734B394298J06765Q9423O2770j80093M06557N89614K87203O32282J125638P81509
7724F295966m99924j111416j107505m07325n50159l52710K1647j59513N2478J99438
7714B380977m83704N49073j7535l09943j74055l00369K27260K176l02838l21833
7704A249209J72911j06419J19016k01089J46024k24608L8938K23328k4454l20820
7694A072036J15347M3525K3613K5975l15199j7296L44571Q0639q1309J95838n44559
7683I43181J04075J44933M90619l94671l10045O7129m9640N1808J67411J8564
7673A233364J41883j01438M99091J61217m30774k27903J98476K43966m08223n5690
7663A253969J42667l5562k22730k99281N11213j95181p9140q871M38477j60256
$$ plain form
7653 1345305 1244353 1461070 808801 1095923 1108769 1362488 1437663 1266668 1026537 1000927
7643 1000927 1267167 1608640 1223645 1056098 1620251 1371887 1341407 1121697 1706989 1277723
7633 1277723 1649061 1317669 1222155 1690354 1345360 1464408 1241769 1369771 1280501 1538487
7623 1538487 1540854 1788925 1731552 1739485 1435364 1188001 1561054 1309906 1205811 1454572
7613 1454572 1696246 1200722 1046515 1481003 1005641 1208358 1255846 1416633 1267001 1377197
7603 1377197 1190829 1166559 1382920 1127255 1235304 1512482 1163889 974858 970162 1239547
7593 1239547 738310 1311206 1081929 820053 1023077 1009167 1037553 1169684 1216881 696913
7583 696913 881313 1179383 1249468 1036873 1184080 1017959 1205052 1340713 1472456 1251703
$$ packed form
7653A345305j00952K16717o52269K87122J2846K53719P5175j70995k40131k5610
7643A000927K66240L41473l84995j67547N64153k48364l0480k19710N85292m29266
7633A277723L71338l31392r5514M68199l44994J19048k22639J28002q9270K57986
7623A538487K367K48071n7373P933l04121k47363L73053k51148j04095K48761
7613A454572K41674m95524j54207M34488m75362K02717M7488J60787j49632J10196
7603A377197j86368k4270K16361k55665J08049K77178l48593j89031m696K69385
7593A239547n01237N72896k29277k61876K03024j3910K8386J32131M7197n19968
7583F96913J84400K98070P0085k12595J47207j66121J87093J35661J31743k20753
$$ plain form
7573 1251703 1000059 1138178 1585586 1061732 1743139 1553524 1300330 1267335 1537302 1582161
7563 1582161 1593767 1826379 1979811 1497628 1973727 1961349 2887772 2904370 2998953 3016019
7553 3016019 3696862 4173495 4992642 5727663 6466445 6427850 6415338 5702830 4894709 4364830
7543 4364830 3835611 3632707 3106841 2908341 2712654 2206303 2045998 1974149 2253378 1660034
7533 1660034 1947429 1912926 1650023 1746781 1733192 1579696 1690945 1716731 1647022 1704151 1360228
7522 1360228 1552271 1540218 1146447 1255529 1520457 1050091 1194156 1380473 1222925 963776
7512 963776 1376978 1349511 1231716 1607710 1298574 1528418 1366784 1369096 1217982 1349164
7502 1349164 1435335 1476615 844043 821423 1301953 1042204 1367859 1272289 1169706 899392
$$ packed form
7573A251703k51644J38119M47408n23854O81407j89615k53194l2995K69967M4859
7563A582161J1606K32612J53432m82183M76099j2378R26423J6598R4583J7066
7553C016019O80843M76633Q19147P35021P38782l8595j2512p12508q08121n29879
7543D364830n29219k02904n25866j98500j95687n06351j60305p1849K79229n93344
7533A660034K87395l4503k62903R6758j3589j53496J11249K5786o9709N7129l43923
7522A360228J92043j2053l93771J09082K64928m70366J44065J86317j57548k59149
7512I63776M13202k7467j17795L75994l09136K29844j61634K312j51114J31182
7502A349164Q6171M1280o32572k2620M80530k59749L25655r5570j02583k70314
$$ plain form
7492 899392 1310927 944256 1113926 729175 919028 1092434 927708 1150085 878944 1072455
7482 1072455 1137656 911810 1273942 827125 1319554 1222343 977691 792476 1104995 1029642
7472 1029642 899216 973152 866350 603199 872736 746050 1067571 663807 1089372 809195
7462 809195 1146465 1026385 781086 994843 1269315 662175 1269584 1125875 680255 657707
7452 657707 755949 897429 678787 841364 1108361 667618 1083822 843298 741220 1116593
7442 1116593 1353014 1217679 820412 736617 1153648 1110335 847482 995712 1101460 1249705
7432 1249705 998946 1184105 1175749 883139 954138 1228525 890921 827147 1250584 856858
7422 856858 930605 791348 1109194 1322914 748195 897439 994969 1096514 907142 838628
$$ packed form
7492H99392M11535l66671J69670l84751J89853J73406j64726K22377k71141J93511
7482A072455O5201k25846L62132m46817M92429r7211k44652j85215L12519p5353
7472A029642j30426P3936j06802k63151K69537j26686L21521m03764M25565k80177
7462H09195L37270j20080k45299K13757K74472o07140O07409j43709m45620k2548
7452F57707R8242J41480k18642J62577K66997m40743M16204k40524j02078L75373
7442A116593K36421j35335l97267q3795M17031m3313k62853J48230J05748J48245
7432A249705k50759J85159q356k92610P0999K74387l37604o3774M23437l93726
7422H56858P3747j39257L17846K13720n74719J49244R7530J01545j89372o8514
$$ plain form
7412 838628 1062292 1042168 1046315 1402375 1136735 949640 991221 1054675 988555 1178295 1071276
7401 1071276 780346 1039178 959516 913971 1136385 968730 1268443 1163855 688524 917709
7391 917709 883365 745525 662136 1128387 979909 953245 925670 1034147 962622 1244599 913826
7380 913826 959727 1087138 1344886 1184999 1095633 1064219 1110125 955131 1115204 1217367
7370 1217367 996895 1458095 1793753 1544296 1259087 1349490 1228144 1255182 1689379 1154666
7360 1154666 1050363 1472079 1671903 1557414 1249452 1579644 1378185 1277076 1499928 1295522
7350 1295522 1474787 1111480 1053040 1159628 1153409 1005104 1010524 1082339 1080122 1052292 985380
7339 985380 1210760 943040 1435869 821355 986186 752023 839990 1325401 1348853 1036459
$$ packed form
7412H38628K23664k0124M147L56060k65640j87095M1581O3454o6120J89740j07019
7401A071276k90930K58832p9662m5545K22414j67655K99713j04588m75331K29185
7391I17709l4344j37840q3389M66251j48478k6664k7575J08477p1525K81977l30773
7380I13826M5901J27411K57748j59887q9366l1414M5906j54994J60073J02163
7370A217367k20472M61200L35658k49457k85209R0403j21346K7038M34197n34713
7360A154666j04303M21716J99824j14489l07962L30192k01459j01109K22852k04406
7350A295522J79265l63307n8440J06588o219j48305N420P1815k217k7830o6912
7339I85380K25380k67720M92829o14514J64831k34163Q7967M85411K3452l12394
$$ plain form
7329 1036459 1315660 1397246 1327526 1413089 1107961 1321670 1090289 1201967 1109425 1098741
7319 1098741 950069 1030838 1147075 914450 1251044 1249578 903520 1386115 1297282 1066692
7309 1066692 1183422 1380267 1344899 1132990 1406384 1369013 1350436 1136317 1106844 1006788
7299 1006788 1085254 1040561 1068265 1036090 1326924 1254685 1453053 1174133 1327371 1491898
7289 1491898 1423186 1389421 1681836 1301144 1449254 1231101 1299962 931461 1462658 1322389
7279 1322389 1272998 1316744 1132962 1624667 1408136 1325239 1260131 1319445 1319478 1381137 1402808
7268 1402808 1402043 1255993 1901986 1289609 1292919 1540758 1362791 1664257 1408153 1715070
7258 1715070 1391525 1530188 1691616 1269967 1711082 1377569 1465020 1483386 1584510 1929075
$$ packed form
7329A036459K79201Q1586o9720Q5563l05128K13709k31381J11678r2542j0684
7319A098741j48672Q0769J16237k32625L36594j466l46058M82595q8833k30590
7309A066692J16730J96845l5368k11909K73394l7371j8577k14119k9473j00056
7299A006788P8466m4693K7704l2175K90834p2239J98368k78920J53238J64527
7289A491898o8712l3765K92415l80692J48110k18153O8861l68501N31197j40269
7279A322389m9391M3746j83782M91705k16531q2897o5108N9314L3O1659K1671
7268A402808p65j46050O45993o12377L310K47839j77967L01466k56104L06917
7258A715070l23545J38663J61428m21649M41115l33513Q7451J8366J01124L44565
$$ plain form
7248 1929075 2007908 2008055 1949364 1813261 1751879 1922237 2169231 1691995 1771432 1678773 1780748
7237 1780748 1825122 1873885 1992101 1906685 2224172 2438708 2242032 2041396 2149386 2318635
7227 2318635 2229367 2237154 1926045 2349474 2573650 2575097 2418303 2534982 2599288 2522914 2217510
7216 2217510 2466182 2598915 2932418 2730092 2390990 2682893 3232656 2861767 3636538 3076789
7206 3076789 3536548 3120479 3413177 3502456 3959175 3803500 3483779 4262404 4144106 4117046
7196 4117046 4705938 5004378 4923149 5371818 5177444 4963039 4674966 4871807 5078727 5247514
7186 5247514 5437090 5842355 5734895 6154564 6181109 5578074 5528938 5717527 5555008 5867490
7176 5867490 5670535 5987474 6108690 6128488 6634720 7088186 7424301 8145769 8178752 8964181
$$ packed form
7248A929075P8833J47n8691j36103o1382J70358K46994m77236P9437r2659J01975
7237A780748M4374M8763J18216q5416L17487K14536j96676k00636J07990J69249
7227B318635q9268P787l11109M23429K24176J447j56794J16679O4306p6374l05404
7216B217510K48672J32733L33503k02326l39102K91903N49763l70889P74771n59749
7206C076789M59759m16069K92698Q9279M56719j55675l19721P78625j18298k7060
7196D117046N88892K98440q1229M48669j94374k14405k88073J96841K06920J68787
7186E247514J89576M05265j07460M19669K6545o03035m9136J88589j62519L12482
7176E867490j96955L16939J21216J9798N06232M53466L36115P21468L2983P85429
$$ plain form
7166 8964181 9963001 11068269 11660345 11546025 11341306 10597164 10180183 10679856 10862539
7157 10862539 11309802 12226539 12934071 13311796 12981225 12728419 11984813 11563965 11482170 11537312
7147 11537312 11330099 11641490 10806567 10632068 10478367 10070215 9893893 9649963 9892236
7138 9892236 10484033 10736270 10278888 10014561 9861337 8877981 8723789 8217598 8096083 8082205
7128 8082205 8274575 7904659 8015233 8163820 7945700 7799862 7762088 8125245 8050179 8398385
7118 8398385 8420146 8526009 8717550 9210416 8978879 9362505 9783024 10013945 10968785 10908022
7108 10908022 11841859 12289113 13125019 13655266 14744559 15771279 16531341 17867657 19562919
7099 19562919 21344682 23354228 26136694 29043559 33250878 37800218 43502089 51547924
$$ packed form
7166H964181R98820J105268N92076j14320k04719p44142m16981M99673J82683
7157A0862539M47263R16737P07532L77725l30571k52806p43606m20848q1795N5142
7147A1537312k07213L11391q34923j74499j53701m08152j76322k43930K42273
7138I892236N91797K52237m57382k64327j53224r83356j54192n06191j21515j3878
7128H082205J92370l69916J10574J48587k18120j45838l7774L63157p5066L48206
7118H398385K1761J05863J91541M92866k31537L83626M20519K30921R54840o0763
7108A0908022R33837M47254Q35906N30247J089293J026720P60062J336316J695262
7099A9562919J781763K009546K782466K906865M207319M549340N701871Q045835
$$ plain form
7091 51547924 63364051 80036955 102276522 122750690 124787012 105797462 86199604
7084 86199604 75940282 71549532 73194297 80223323 92666311 110854739 126922834 122045326
7076 122045326 97501080 73584154 58679638 49623172 43202519 38772034 35135040 31787651
7068 31787651 28242441 25722099 24116002 22497220 21473487 20626860 20031645 19494409 18728377
7059 18728377 17582432 16124857 15318849 14867408 14060136 13614899 13518095 13176156 12861824
7050 12861824 13189410 13316610 13757227 14288142 15109976 16782210 18662011 21367685 25006739
7041 25006739 27918561 28336786 26203885 22375705 18505078 15567558 13789007 12248394
7033 12248394 11295361 10210189 10077751 9464639 9378336 9034920 8800830 8959912 9205059
$$ packed form
7091E1547924J1816127J6672904K2239567K0474168K036322j8989550j9597858
7084H6199604j0259322m390750J644765P029026J2442988J8188428J6068095m877508
7076A22045326k4544246k3916926j4904516r056466o420653m430485l636994l347389
7068C1787651l545210k520342j606097j618782j023733q46627n95215n37236p66032
7059A8728377j145945j457575q06008m51441q07272m45237r6804l41939l14332
7050A2861824L27586J27200M40617N30915Q21834J672234J879801K705674L639054
7041B5006739K911822M18225k132901l828180l870627k937520j778551j540613
7033A2248394r53033j085172j32438o13112q6303l43416k34090J59082K45147
$$ plain form
7024 9205059 9460259 9532050 10532342 10779591 12393573 13539410 14490948 15292683 15599116
7015 15599116 14358238 13336471 11647587 10790057 9776417 9149229 8480942 7886315 7094743
7006 7094743 6497222 6331327 6151981 5779028 5324740 5415645 5264015 4743195 4719543 4373024
6996 4373024 4509837 4109405 4232183 3811486 3967026 3604951 3314575 3250726 3046336 3259092
6986 3259092 2899346 2734061 2834628 3008014 2814872 2738061 2716643 2892280 2454682 2588423
6976 2588423 2549867 2553429 2195129 2722488 2565866 2392587 2208626 2416492 2480011 2270381
6966 2270381 2173526 2172037 2364427 1932372 2038812 2040301 2341821 1866841 2072952 2069506 2192985
6955 2192985 2022274 1924425 1818761 1873274 1650376 2037135 1945022 1833972 2145349 1812729
$$ packed form
7024I205059K55200P1791J000292K47249J613982J145837R51538Q01735L06433
7015A5599116j240878j021767j688884q57530j013640o27188o68287n94627p91572
7006G094743n97521j65895j79346l72953m54288R0905j51630n20820k3652l46519
6996D373024J36813m00432J22778m20697J55540l62075k90376o3849k04390K12756
6986C259092l59746j65285J00567J73386j93142p6811k1418J75637m37598J33741
6976B588423l8556L562l58300N27359j56622j73279j83961K07866O3519k09630
6966B270381r6855j489J92390m32055J06440J489L01520m74980K06111l446J23479
6955B192985j70711r7849j05664N4513k22898L86759r2113j11050L11377l32620
$$ plain form
6945 1812729 1686224 1854998 1956686 2084452 1895770 1849696 1523084 1900034 1616775 1653116
6935 1653116 1533076 1562558 1641041 1510152 1658654 1587390 1463834 1457776 1255320 1903430
6925 1903430 1344144 1469629 1659688 1740763 1268215 1390895 1511468 1366068 1272152 1367142
6915 1367142 1171108 1422032 1042445 1392680 1154086 1044809 1360297 1127700 1208512 1390584
6905 1390584 1132969 1357112 1218626 1136653 1187213 1150989 1304067 1256915 1332237 1458240
6895 1458240 1214089 1120270 1140747 943486 1094063 1152424 910579 1173477 1039465 821484
6885 821484 992965 1103075 1171316 1025867 1322693 911487 735183 1055732 1249044 1075090
6875 1075090 1172640 1057369 983924 1141253 1038820 915416 1059125 836710 809574 938258
$$ packed form
6945A812729j26505J68774J01688J27766j88682m6074l26612L76950k83259L6341
6935A653116j20040K9482P8483j30889J48502p1264j23556o058k02456O48110
6925A903430n59286J25485J90059Q1075m72548J22680J20573j45400r3916R4990
6915A367142j96034K50924l79587L50235k38594j09277L15488k32597Q0812J82072
6905A390584k57615K24143j38486q1973N0560l6224J53078m7152P5322J26003
6895A458240k44151r3819K0477j97261J50577N8361k41845K62898j34012k17981
6885H21484J71481J10110O8241j45449K96826m11206j76304L20549J93312j73954
6875A075090R7550j15271p3445J57329j02433j23404J43709k22415k7136J28684
$$ plain form
6865 938258 1465071 806899 857585 1133943 915054 1127248 1466488 1041390 1113539 1075091
6855 1075091 1105044 850950 904794 908868 1557203 1184921 1053293 1285486 1353843 1238405
6845 1238405 1043577 1007719 1174274 1180617 1640174 1395188 1220751 1383813 1089530 839588
6835 839588 938023 1240929 914638 1236986 1034074 875579 790770 942509 1224817 972958
6825 972958 1045035 1105483 1181772 860366 1268397 846330 926567 1374702 1505774 1359990
6815 1359990 1251372 1347466 1154052 1237194 1185173 1254896 1581285 1171802 1927327 1476976
6805 1476976 1791598 1463169 1659486 1426476 920522 1439962 1278119 1185566 1127153 1654034
6795 1654034 1379685 1368766 956653 818970 1123806 964468 967775 900407 838135 635500
$$ packed form
6865I38258N26813o58172N0686K76358k18889K12194L39240m25098P2149l8448
6855A075091K9953k54094N3844M074O48335l72282j31628K32193O8357j15438
6845A238405j94828l5858J66555O343M59557k44986j74437J63062k94283k49942
6835H39588R8435L02906l26291L22348k02912j58495q4809J51739K82308k51859
6825I72958P2077O0448P6289l21406M08031m22067Q0237M48135J31072j45784
6815A359990j08618R6094j93414Q3142n2021O9723L26389m09483P55525m50351
6805A476976L14622l28429J96317k33010n05954N19440j61843r2553n8413N26881
6795A654034k74349j0919m12113j37683L04836j59338L307o7368o2272k02635
$$ plain form
6785 635500 585607 803629 1135751 708710 956447 916650 582581 669766 882854 1099221
6775 1099221 597596 1035006 1099588 638804 894862 965059 922065 988780 1016546 742346
6765 742346 784831 615858 989871 754339 759763 1038374 1119674 642734 1034259 948684 1365661
6754 1365661 996760 661600 913324 896885 841144 976622 847843 631283 1025582 1281346
6744 1281346 931551 771344 1104546 793660 981854 1254988 948448 1088009 846229 911835
6734 911835 980451 1021729 617558 1035136 872842 771161 585859 817205 809515 775435 902095
6723 902095 762169 1026988 994531 1182325 724087 643285 520393 697279 408244 744839
6713 744839 748848 858071 771679 512401 915367 682918 1176350 963043 879792 906348 590403
$$ packed form
6785F35500m9893K18022L32122m27041K47737l9797l34069Q7185K13088K16367
6775A099221n01625M37410O4582m60784K56058P0197m2994O6715K7766k74200
6765G42346M2485j68973L74013k35532N424K78611Q1300m76940L91525q5575M16977
6754A365661l68901l35160K51724j6439n5741J35478j28779k16560L94299K55764
6744A281346l49795j60207L33202l10886J88194K73134l06540J39561k41780O5606
6734I11835O8616M1278m04171M17578j62294j01681j85302K31346p690l4080J26660
6723I02095j39926K64819l2457J87794m58238q0802j22892J76886k89035L36595
6713G44839M009J09223q6392k59278M02966k32449M93432k13307q3251K6556l15945
$$ plain form
6702 590403 978710 765078 522918 982225 602831 1073518 961581 881275 623602 894140
6692 894140 855770 981460 518008 471553 889488 718914 685996 582602 613420 672630 749233
6681 749233 881862 586488 1048746 666523 1467136 679704 695690 573797 1253432 1001180
6671 1001180 817314 905158 806535 674277 945507 1254061 934497 787734 1249540 486931
6661 486931 809774 853304 1034904 932693 1212150 1078588 980490 974335 927990 1219282 1293121
6650 1293121 866632 1141499 1232075 1270557 1338907 1507183 996590 1180759 1147917 1011025
6640 1011025 1309455 1569705 1066168 986751 1423396 1363764 1127035 1307265 1147510 1291238
6630 1291238 1100399 1340217 1214168 1160536 1472215 1461130 1275378 1660893 1601185 1419980
$$ packed form
6702E90403L88307k13632k42160M59307l79394M70687j11937q0306k57673K70538
6692H94140l8370J25690m63452m6455M17935j70574l2918j03394L0818N9210P6603
6681G49233J32629k95374M62258l82223Q00613p87432J5986j21893O79635k52252
6671A001180j83866Q7844r8623j32258K71230L08554l19564j46763M61806p62609
6661D86931L22843M3530J81600j02211K79457j33562r8098o155m6345K91292P3839
6650A293121m26489K74867R0576L8482O8350J68276n10593J84169l2842j36892
6640A011025K98430K60250n03537p9417M36645n9632k36729J80230j59755J43728
6630A291238j90839K39818j26049n3632L11679j1085j85752L85515n9708j81205
$$ plain form
6620 1419980 1610671 1401059 1571688 1339442 1872439 1612960 2057724 1857765 1705857 2181842
6610 2181842 1788124 2038486 1774361 2276707 1946855 2214953 2400365 2168763 2993107 2862618
6600 2862618 3091899 3098971 3305062 3292859 3990804 4186718 4607815 4383995 4803961 5113278
6590 5113278 5842370 6307444 7340604 8574630 9380310 10410669 10846504 10512621 9817018
6581 9817018 8439162 7751148 6379638 5667731 5168894 4927517 4412569 4311771 3704721
6572 3704721 3480178 3631142 3490464 3428744 3502055 3113520 3055154 3133808 3050612 2619500
6562 2619500 2432064 2462978 2449906 2377391 2621615 2626312 2815577 2608881 2781888 2485778
6552 2485778 2299129 2109234 1915291 1746047 2145185 2008199 1775391 1802538 2053527 1667449
$$ packed form
6620A419980J90691k09612J70629k32246N32997k59479M44764j99959j51908M75985
6610B181842l93718K50362k64125N02346l29852K68098J85412k31602Q24344j30489
6600B862618K29281P072K06091j2203O97945J95914M21097k23820M19966L09317
6590E113278P29092M65074J033160J234026Q05680J030359M35835l33883o95603
6581I817018j377856o88014j371510p11907m98837k41377n14948j00798o07050
6572C704721k24543J50964j40678o1720P3311l88535n8366P8654q3196m31112
6562B619500j87436L0914j3072p2515K44224M697J89265k06696J73007k96110
6552B485778j86649j89895j93943j69244L99138j36986k32808K7147K50989l86078
$$ plain form
6542 1667449 1514372 1466171 1514280 1652109 1422796 1667889 1604361 1263470 1535548 1074600
6532 1074600 1752956 1164854 1251224 1668462 1924491 1272059 1322849 1142902 1081127 1255147
6522 1255147 1578739 1200495 1211232 1424913 1539656 1285952 1320659 1288200 1325127 1677293
6512 1677293 1458286 1392156 1837559 1680178 1957408 1911738 1786050 1626089 1521083 1812497
6502 1812497 1543091 1785217 1727926 1701955 1441789 1474371 1844272 1610485 1391379 1652034
6492 1652034 1748979 1581986 1271337 1271186 1455321 1282482 1462022 1290533 1525458 1484159
6482 1484159 1176413 1314348 1307797 1488638 1541566 1713873 1303664 1016820 1645855 1661663
6472 1661663 1381422 1376508 1408738 1525568 1716489 1642308 1558687 1575797 1021645 1601657 1292917
$$ packed form
6542A667449j53077m8201M8109J37829k29313K45093o3528l40891K72078m60948
6532A074600O78356n88102Q6370M17238K56029o52432N0790j79947o1775J74020
6522A255147L23592l78244J0737K13681J14743k53704L4707l2459L6927L52166
6512A677293k19007o6130M45403j57381K77230m5670j25688j59961j05006K91414
6502A812497k69406K42126n7291k5971k60166L2582L69901k33787k19106K60655
6492A652034R6945j66993l10649j51J84135j72839J79540j71489K34925m1299
6482A484159l07746J37935o551J80841N2928J72307m10209k86844O29035J5808
6472A661663k80241m914L2230J16830J90921p4181q3621J7110n54152N80012l08740
$$ plain form
6461 1292917 1448156 1382317 1489226 1230726 1270479 1308718 1606976 1428353 914470 1318455
6451 1318455 1292223 1353105 1318708 1352548 1324971 1363103 1309254 1233397 954706 1662419 1134408
6440 1134408 1505931 949128 1296010 1457833 1233092 1368534 1175274 1444777 1371380 1326428
6430 1326428 1414713 1455638 1535447 1262215 1309166 1714721 1602870 1243545 1631769 1366433
6420 1366433 1811218 1592993 1484069 1419465 1234076 1795567 1094630 1741154 1826317 1977266
6410 1977266 1623948 1672696 1613983 1481588 1889448 1501685 1726701 1558377 1584034 1298820
6400 1298820 1912925 1696141 1717398 1497107 1576786 1461212 1788372 1932773 1886863 1644602
6390 1644602 1617215 1768563 1571669 1853559 1863313 1997339 1846272 2030153 1863796 1952898
$$ packed form
6461A292917J55239o5839J06909k58500L9753L8239K98258j78623n13883M03985
6451A318455k6232O0882l4397L3840k7577L8132n3849p5857k78691P07713n28011
6440A134408L71523n56803L46882J61823k24741J35442j93260K69503p3397m4952
6430A326428Q8285M0925P9809k73232M6951M05555j11851l59325L88224k65336
6420A366433M44785k18225j08924o4604j85389N61491p00937O46524Q5163J50949
6410A977266l53318M8748n8713j32395M07860l87763K25016j68324K5657k85214
6400A298820O14105k16784K1257k20291P9679j15574L27160J44401m5910k42261
6390A644602k7387J51348j96894K81890R754J34026j51067J83881j66357Q9102
$$ plain form
6380 1952898 2096949 2020136 1952618 1998369 1847541 1985730 2245666 2436399 2166970 2352297
6370 2352297 2311971 2027027 2063095 2406006 2474437 2079008 2257804 2466052 2421833 2605096
6360 2605096 2601357 1909973 2497482 2549011 2534204 2585835 2672723 2617747 2736556 2754703 2855095
6349 2855095 2791597 3209787 2617893 3042025 2860598 3345117 3032248 3397561 3233825 3234534
6339 3234534 3386941 3613899 3350017 3496226 3593989 3756155 4241124 4199905 4210672 4386046
6329 4386046 4315570 4405437 3946544 3907192 4310226 4308118 4131756 3987919 4236846 4345992
6319 4345992 4529984 4624357 4715652 4477894 4722404 4578568 4865602 5012863 4845308 5013369
6309 5013369 5247272 5290871 5683752 5698149 5744037 5573591 5618000 5942464 5886020 6115246
$$ packed form
6380A952898J44051p6813o7518M5751j50828J38189K59936J90733k69429J85327
6370B352297m0326k84944L6068L42911O8431l95429J78796K08248m4219J83263
6360B605096l739o91384N87509N1529j4807N1631Q6888n4976J18809J8147J00392
6349B855095o3498M18190n91894M24132j81427M84519l12869L65313j63736P09
6339C234534J52407K26958k63882J46209R7763J62166M84969m1219J0767J75374
6329D386046p0476Q9867m58893l9352M03034k108j76362j43837K48927J09146
6319D345992J83992R4373R1295k37758K44510j43836K87034J47261j67555J68061
6309E013369K33903M3599L92881J4397M5888j70446M4409L24464n6444K29226
$$ plain form
6299 6115246 5743343 6241162 6435941 6560552 6761955 6917269 7323820 7480377 8056228 8297204
6289 8297204 8275410 9082708 9259147 9797819 10241552 10617280 11330422 11896164 12870099 14074759
6279 14074759 14376994 14911325 14461583 14432280 14145103 14159806 14390301 14114538 14562931 14322752
6269 14322752 14123015 14607723 14566707 14969497 15174457 15796078 16001292 17199689 18019441
6260 18019441 18788350 20221147 21434724 22833540 25035256 27186815 29803629 32884095
6252 32884095 37290453 41977718 48155632 55272646 64283318 73612292 82242095 90272530
6244 90272530 98048924 107134346 116431592 124695257 128590892 124924055 115120536 105213527
6236 105213527 98277406 93550454 88593390 81773848 74053389 65696924 57845710 51706463
$$ packed form
6299F115246l71903M97819J94779J24611K01403J55314M06551J56557N75851K40976
6289H297204k1794Q07298J76439N38672M43733L75728P13142N65742R73935J204660
6279A4074759L02235N34331m49742k9303k87177J4703K30495k75763M48393k40179
6269A4322752j99737M84708m1016M02790K04960O21621K05214J198397Q19752
6260A8019441P68909J432797J213577J398816K201716K151559K616814L080466
6252C2884095M406358M687265O177914P117014R010672R328974Q629803Q030435
6244I0272530P776394R085422R297246Q263665L895635l666837r803519r907009
6236A05213527o936121m726952m957064o819542p720459q356465p851214o139247
$$ plain form
6228 51706463 47347387 43284317 39689909 36531610 34569939 32020559 29762213 28071283
6220 28071283 26426101 24671501 23060987 21694412 20250551 19000822 17543062 16648736
6212 16648736 15954522 15033890 14262581 13628484 13026989 12321361 12387997 11884495 11492142 11038126
6202 11038126 10816898 10731290 10359414 10370768 9948953 9928745 9891456 9901998 9814999 9537350
6192 9537350 10073817 9880544 10006313 10485293 10621843 10616547 10875369 11752084 12381777 14060052
6182 14060052 15821418 17694219 18806310 19340879 18043283 15893750 14814440 13733338
6174 13733338 13696254 13875589 14585233 16102920 17754451 18388550 17765058 15880691 14211648
6165 14211648 11981276 10760182 9858671 9041021 8823856 8324953 7659323 7162699 7105334
$$ packed form
6228E1706463m359076m063070l594408l158299j961671k549380k258346j690930
6220B8071283j645182j754600j610514j366575j443861j249729j457760q94326
6212A6648736o94214r20632p71309o34097o01495p05628O6636n03502l92353m54016
6202A1038126k21228q5608l71876J1354m21815k0208l7289J0542q6999k77649
6192I537350N36467j93273J25769M78980J36550n296K58822Q76715O29693J678275
6182A4060052J761366J872801J112091N34569j297596k149533j079310j081102
6174A3733338l7084J79335P09644J517687J651531O34099o23492j884367j669043
6165A4211648k230372j221094r01511q17650k17165m98903o65630m96624n7365
$$ plain form
6156 7105334 6946944 6382856 6407938 6359160 6149175 6252437 6222763 5553560 5699030 5565918
6146 5565918 5191700 5158534 5288273 5320294 5156924 4945504 4761717 4342058 4495698 4391465
6136 4391465 4429643 4310915 4382599 4279203 4408611 3810327 3764798 4247745 4273683 4104648
6126 4104648 4361000 4387483 4028328 4357660 4086594 3982301 4261639 4349103 3871928 3887030
6116 3887030 3744787 4014604 4033579 3945731 3895914 3859730 4104553 3464301 3968843 3875605
6106 3875605 3758660 3884089 4172774 3622102 4053242 4133603 3926948 3844311 3952302 3914261
6096 3914261 4322916 4533615 4701091 4493391 4334532 4643894 4546649 4140512 4396740 4638760
6086 4638760 4647622 4651687 4571264 4942325 4910519 4386593 4911784 4870744 4609617 5098903 5202839
$$ packed form
6156G105334j58390n64088K5082m8778k09985J03262k9674o69203J45470j33112
6146E565918l74218l3166J29739L2021j63370k11420j83787m19659J53640j04233
6136D391465L8178j18728P1684j03396J29408n98284m5529M82947K5938j69035
6126D104648K56352K6483l59155L29332k71066j04293K79338Q7464m77175J5102
6116C887030j42243K69817J8975q7848m9817l6184K44823o40252N04542r3238
6106C875605j16945J25429K88685n50672M31140Q0361k06655q2637J07991l8041
6096C914261M08655K10699J67476k07700j58859L09362r7245m06137K56228K42020
6086D638760Q862M065q0423L71061l1806n23926N25191m1040k61127M89286J03936
$$ plain form
6075 5202839 5184669 5695928 6008048 7015455 8192860 9367891 9956084 7891051 6859847
6066 6859847 5911107 5391067 4985079 5140230 5094716 5034586 5006036 5116073 4692508 4626386
6056 4626386 4373990 4795204 4361445 4642046 4794493 4408914 4744707 4589737 4623345 4551262
6046 4551262 4540913 4760408 5105523 4709733 5029680 5136919 4689500 5327395 4823559 5127845
6036 5127845 5131240 5228740 5150193 5691369 5305101 5786036 5723736 5856058 5450773 5295088
6026 5295088 5368033 5480381 5616134 5645931 5487093 5454263 5544593 5701505 5639461 5361389
6016 5361389 5378498 5909725 5723969 5516382 5586262 5852150 5919634 5813876 6006666 6574365
6006 6574365 6450852 6572526 6715158 6097272 6119018 6153213 6484297 6695744 6291071 6548936
$$ packed form
6075E202839j8170N11259L12120J007407J177405J175031N88193k065033j031204
6066F859847r48740n20040m05988J55151m5514o0130k8550J10037m23565o6122
6056D626386k52396M21214m33759K80601J52447l85579L35793j54970L3608p2083
6046D551262j0349K19495L45115l95790L19947J07239m47419O37895n03836L04286
6036E127845L395R7500p8547N41176l86268M80935o2300J32322m05285j55685
6026E295088P2945J12348J35753K9797j58838l2830R0330J56912o2044k78072
6016E361389J7109N31227j85756k07587O9880K65888O7484j05758J92790N67699
6006F574365j23513J21674J42632o17886K1746L4195L31084K11447m04673K57865
$$ plain form
5996 6548936 6445688 6511091 6146512 6186799 5752370 5674128 5628013 5886478 5787254 5666110
5986 5666110 5639760 5390377 5428040 5602360 5846136 6122576 6046736 6138520 6303315 6049023
5976 6049023 6124481 6011323 6196346 6206175 6219596 6307035 6168048 6277766 5686029 5568383
5966 5568383 5823296 5776969 5853477 5704744 5648631 5515820 5619782 5025403 5420627 5244002
5956 5244002 5276786 5563956 4771222 5307072 5333137 4861764 4770289 5132264 4959303 4946811
5946 4946811 5090585 4968600 5044973 4987933 4978351 4890496 4785190 4843760 4768381 5025609 4930904
5935 4930904 4883224 4504928 4849564 4345536 4446844 4429104 4647282 4509061 4598635 4694278
5925 4694278 4614363 4505983 4753696 4758181 4954950 5164074 4844249 5168748 5345044 5176214
$$ packed form
5996F548936j03248O5403l64579M0287m34429p8242m6115K58465r9224j21144
5986E666110k6350k49383L7663J74320K43776K76440p5840R1784J64795k54292
5976F049023P5458j13158J85023R829J3421Q7439j38987J09718n91737j17646
5966E568383K54913m6327P6508j48733n6113j32811J03962n94379L95224j76625
5956E244002L2784K87170p92734N35850K6065m71373r1475L61975j72961j2492
5946D946811J43774j21985P6373n7040r582q7855j05306N8570p5379K57228r4705
5935D930904m7680l78296L44636n04028J01308j7740K18178j38221Q9574R5643
5925D694278p9915j08380K47713M485J96769K09124l19825L24499J76296j68830
$$ plain form
5915 5176214 5119536 4960078 5051872 4982940 5224617 5794937 5412707 5125042 4983071 5475220
5905 5475220 6088563 6101669 6437395 6765749 6952053 8118861 8676578 9480855 10694425
5896 10694425 11207462 10471578 10328908 10199895 9495421 9543953 9983525 10382504 10836343 11351284
5886 11351284 11335018 10289429 9403779 8868545 8245423 7676961 7356824 7464521 6890367
5877 6890367 6255221 6491017 6270078 6198326 6084511 5948374 5866186 5800372 6038110 5982179
5867 5982179 5538002 5906288 5903919 6507509 7131908 7485092 6979293 6159688 6031430 5747176
5857 5747176 5619988 5433187 5491700 4902827 5373109 5336587 5155759 4999042 4841807 5451267
5847 5451267 5016233 5271569 5410134 5503227 5367544 5403798 5819040 5519343 5438803 5877622
$$ packed form
5915E176214n6678j59458R1794o8932K41677N70320l82230k87665j41971M92149
5905E475220O13343J3106L35726L28354J86304J166808N57717Q04277J213570
5896A0694425N13037p35884j42670j29013p04474M8532M39572L98979M53839N14941
5886A1351284j6266j045589q85650n35234o23122n68462l20137J07697n74154
5877F890367o35146K35796k20939p1752j13815j36137q2188o5814K37738n5931
5867E982179m44177L68286k369O03590O24399L53184n05799q19605j28258k84254
5857E747176j27188j86801N8513n88873M70282l6522j80828j56717j57235O09460
5847E451267m35034K55336J38565R3093j35683L6254M15242k99697q0540M38819
$$ plain form
5837 5877622 5751496 6083968 5770526 6098120 6290854 6666655 7148770 7333589 7846754 8479223
5827 8479223 8441177 8429941 8074628 8154596 7621194 7912870 7714208 8088664 7925605 8549171
5817 8549171 8398664 7807102 7469820 7490977 6962168 6616858 6359576 6394949 5857742 5986414
5807 5986414 5971743 5984898 5905714 5490485 5534995 5619908 5669468 5433098 5872792 5645760 5488996
5796 5488996 5225202 5391194 5533619 5673733 5470944 6243783 5719076 6070192 5904122 6059764
5786 6059764 6361701 5932469 6306800 6118413 6473549 6214588 6848447 6681560 6870967 6812434
5776 6812434 6743864 6554348 6516155 6894100 6840380 6837396 7316087 6774769 7693559 7445368
5766 7445368 7701144 8045420 7845746 7935447 8173062 8186830 8338950 8241492 8448278 8395367
$$ packed form
5837E877622j26126L32472l13442L27594J92734L75801M82115J84819N13165O32469
5827H479223l8046j1236l55313P9968n33402K91676j98662L74456j63059O23566
5817H549171j50507n91562l37282K1157n28809l45310k57282L5373n37207J28672
5807E986414j4671J3155p9184m15229M4510Q4913M9560k36370M39694k27032j56764
5796E488996k63794J65992J42425J40114k02789P72839n24707L51116j66070J55642
5786F059764L01937m29232L74331j88387L55136k58961O33859j66887J89407n8533
5776F812434o8570j89516l8193L77945n3720k984M78691n41318R18790k48191
5766G445368K55776L44276j99674Q9701K37615J3768J52120r7458K06786n2911
$$ plain form
5756 8395367 8702428 8556792 8456214 8535612 8472525 8906130 9513273 9297511 9860946 10240109
5746 10240109 11022643 11952009 12493899 13509060 13809665 14293636 13837908 13612811 13170184
5737 13170184 12851854 12409173 12649521 13035521 13624348 14545394 15769389 17253984 18023771
5728 18023771 19493568 20339509 20476013 20593382 20110016 19584321 19258798 19748985 20500752
5719 20500752 21053654 21324104 20723448 20328841 19123865 17996125 16702660 15868473 15063923
5710 15063923 14899447 15009562 15145384 15200645 15721038 16896954 18037006 18982451 18915872
5701 18915872 17905690 16534962 15526640 15327700 14471049 14253700 14188557 14308890 14170617
5692 14170617 14293004 14649081 15070933 15242620 15737159 16588094 17562595 18026769 19025790
$$ packed form
5756H395367L07061j45636j00578P9398o3087M33605O07143k15762N63435L79163
5746A0240109P82534R29366N41890J015161L00605M83971m55728k25097m42627
5737A3170184l18330m42681K40348L86000N88827R21046J223995J484595P69787
5728A8023771J469797Q45941J36504J17369m83366n25695l25523M90187P51767
5719B0500752N52902K70450o00656l94607j204976j127740j293465q34187q04550
5710A5063923j64476J10115J35822N5261N20393J175916J140052R45445o6579
5701A8915872j010182j370728j008322j98940q56651k17349o5143J20333j38273
5692A4170617J22387L56077M21852J71687M94539Q50935R74501M64174R99021
$$ plain form
5683 19025790 19939790 21108085 22409830 23069869 24525472 26166693 27681317 29430184
5675 29430184 33416891 38639567 46310834 53798290 54679531 52066182 44841862 38413986
5667 38413986 35679528 33973834 33356428 32880434 32709634 32645643 32515096 32804432 33565856
5658 33565856 34469256 35910416 37937747 39656655 41803581 44750198 48020929 51204004
5650 51204004 54149739 56241684 58368690 60492224 64458260 69062716 74504919 78684154
5642 78684154 80892852 82424220 85348544 89207719 94543138 100681465 106630635 112736249
5634 112736249 119394843 126960408 134783332 141202136 147373632 152224789 157497995 163343922
5626 163343922 167637922 167489517 161920205 152980189 141500171 130743883 123601543 121078925
$$ packed form
5683A9025790R14000J168295J301745O60039J455603J641221J514624J748867
5675B9430184L986707N222676P671267P487456Q81241k613349p224320o427876
5667C8413986k734458j705694o17406m75994j70800o3991j30547K89336P61424
5658C3565856R03400J441160K027331J718908K146926K946617L270731L183075
5650E1204004K945735K091945K127006K123534L966036M604456N442203M179235
5642G8684154K208698J531368K924324L859175N335419O138327N949170O105614
5634A12736249O658594P565565P822924O418804O171496M851157N273206N845927
5626A63343922M294000j48405n569312q940016j1480018j0756288p142340k522618
$$ plain form
5618 121078925 117774735 115076480 115376042 113691212 114588645 116125503 110995436 99301713
5610 99301713 85874531 75200515 67147949 61481565 56909903 53804927 50416559 48480437
5602 48480437 46434371 45676702 44392657 43399429 42535529 42199052 42704215 42857173 42579629
5593 42579629 42318028 41089164 39404322 37457480 35628918 34162842 33209476 32183355
5585 32183355 31368087 30624590 30427630 30202152 29783669 29214390 29035055 28134900 28144717 27391024
5575 27391024 26175359 25043366 23321887 22531769 21191293 21210600 20320049 20352822 19702007
5566 19702007 19427055 19190335 19080948 18729974 18693446 18507275 18492142 18474980 18436031 18558886
5556 18558886 18268815 18442332 18459230 18123544 17855017 17779843 17294579 17265886 17099893 17297760
$$ packed form
5618A21078925l304190k698255K99562j684830Q97433J536858n130067j1693723
5610I9301713j3427182j0674016q052566n666384m571662l104976l388368j936122
5602D8480437k046066p57669j284045r93228q63900l36477N05163J52958k77544
5593D2579629k61601j228864j684842j946842j828562j466076r53366j026121
5585C2183355q15268p43497j96960k25478m18483n69279j79335r00155R817p53693
5575B7391024j215665j131993j721479p90118j340476J9307q90551L2773o50815
5566A9702007k74952k36720j09387l50974l6528j86171j5133j7162l8949J22855
5556A8558886k90071J73517J6898l35686k68527p5174m85264k8693j65993J97867
$$ plain form
5546 17297760 17357441 16885920 16355747 15953749 15873160 15588604 15664569 15882203 15930931 16087580
5536 16087580 15644393 16483743 16203108 16412242 16516129 16659985 16256045 16361885 16425975 16101448
5526 16101448 16065637 15891790 15862897 15913828 16022758 15846907 15858527 15764864 15968049 15854799
5516 15854799 15945490 15932687 15523432 15835796 15049688 15332154 14832277 14972859 15022949 14753957
5506 14753957 15004778 14900820 15083383 14926231 15112013 15119816 14787840 15006652 14609893 14083883
5496 14083883 14136401 13375610 13371845 13291173 12929061 12973280 12933145 12899348 12794061 12851531 13041226
5485 13041226 13649563 14005422 14205798 14503886 14600880 14604393 14159685 14162643 13840159 13437349
5475 13437349 13328920 12734142 12843351 12503690 11979642 11985392 11745988 11588934 11633596 11284460
$$ packed form
5546A7297760N9681m71521n30173m01998q0589k84556P5965K17634M8728J56649
5536A6087580m43187Q39350k80635K09134J03887J43856m03940J05840O4090l24527
5526A6101448l5811j73847k8893N0931J08930j75851J1620r3663K03185j13250
5516A5854799R0691j2803m09255L12364p86108K82466m99877J40582N0090k68992
5506A4753957K50821j03958J82563j57152J85782P803l31976K18812l96759n26010
5496A4083883N2518p60791l765q0672l62112M4219m0135l3797j05287N7470J89695
5485A3041226O08337L55859K00376K98088R6994L513m44708K958l22484m02810
5475A3437349j08429n94778J09209l39661n24048N750k39404j57054M4662l49136
$$ plain form
5465 11284460 11273400 11160569 11155964 10917985 10936575 11061201 10852279 11063320 10588006 10778820
5455 10778820 10901210 10548934 10595103 10449221 10409963 10603276 10385478 10521399 10246805 10153193
5445 10153193 10047914 10058311 9839696 10121493 10036255 9926844 10080407 10110839 10042415 10589487
5435 10589487 10172344 10326448 10421596 10579607 10598558 10657439 10674046 10553907 10998807 10744726
5425 10744726 11167185 11382858 11531931 12051879 12293392 12800278 12919111 12488543 12975284
5416 12975284 13103208 13275705 13270575 13483098 13643468 13668319 13974472 14642252 14439558 14554545
5406 14554545 15092379 15602618 16052674 16374895 16744954 17514065 17716893 18614386 19309061
5397 19309061 20000707 20691927 21410000 22167145 23099894 24108558 25655225 27509522 29304597
$$ packed form
5465A1284460j1060j12831m605k37979J8590J24626k08922K11041m75314J90814
5455A0778820J22390l52276M6169j45882l9258J93313k17798J35921k74594r3612
5445A0153193j05279J0397k18615K81797q5238j09411J53563L0432o8424N47072
5435A0589487m17143J54104R5148J58011J8951N8881J6607j20139M44900k54081
5425A0744726M22459K15673J49073N19948K41513N06886J18833m30568M86741
5416A2975284J27924J72497n130K12523J60370K4851L06153O67780k02694J14987
5406A4554545N37834N10239M50056L22221L70059P69111K02828Q97493O94675
5397A9309061O91646O91220P18073P57145R32749J008664J546667J854297J795075
$$ plain form
5388 29304597 30961766 32719632 35500876 38381821 41308157 44866042 49169518 54034847
5380 54034847 58835098 64449827 71676646 80001555 91984464 108241663 129494646 158792169
5372 158792169 199977105 255466911 320892233 350218037 303983462 239321807 198775032
5365 198775032 175349866 154714069 132585140 116239378 105287573 95208422 85528797
5358 85528797 77423597 71091185 66424742 62710227 59805799 58222218 56796533 54307670
5350 54307670 51187844 49355064 47264440 45635665 45115692 44871484 44695806 44683491 43264465
5341 43264465 41386475 38759583 36787889 35128485 34240054 33079169 32411268 31700121 30760549
5332 30760549 30715892 30353094 30397069 30360112 30575041 31257954 32104066 32715407 33976016 34681175
$$ packed form
5388B9304597J657169J757866K781244K880945K926336L557885M303476M865329
5380E4034847M800251N614729P226819Q324909J1982909J6257199K1252983K9297523
5372A58792169M1184936N5489806O5425322K9325804m6234575o4661655m0546775
5365A98775032k3425166k0635797k2128929j6345762j0951805j0079151r679625
5358H5528797q105200o332412m666443l714515k904428j583581j425685k488863
5350E4307670l119826j832780k090624j628775n19973k44208j75678j2315j419026
5341D3264465j877990k626892j971694j659404q88431j160885o67901p11147r39572
5332C0760549m4657l62798M3975l6957K14929O82913Q46112O11341J260609P05159
$$ plain form
5322 34681175 35870445 37562907 39873203 42987676 44170188 43417546 40659292 37631214
5314 37631214 36439820 34976126 34579693 33830691 33731724 33218066 32923632 32551420 32829207
5305 32829207 32747616 33280630 33572947 34142012 34894803 35638535 36930778 38076697 39332795
5296 39332795 40875311 42200543 43726151 46069305 49126867 53120953 58515686 64360569
5288 64360569 70606945 75311625 78653774 80740439 80453686 79349220 77765930 76658746
5280 76658746 77472033 79941101 82965693 86753685 92917808 99866424 109888577 123315583
5272 123315583 142671485 170508829 209352398 249586549 279706351 297229962 298710814
5265 298710814 279500196 250091114 214621749 176403409 147499643 128671196 114875353
$$ packed form
5322C4681175J189270J692462K310296L114473J182512p52642k758254l028078
5314C7631214j191394j463694l96433p49002r8967n13658k94434l72212K77787
5305C2829207q1591N33014K92317N69065P52791P43732J292243J145919J256098
5296C9332795J542516J325232J525608K343154L057562L994086N394733N844883
5288F4360569O246376M704680L342149K086665k86753j104466j583290j107184
5280G6658746Q13287K469068L024592L787992O164123O948616J0022153J3427006
5272A23315583J9355902K7837344L8843569M0234151L0119802J7523611J480852
5265B98710814j9210618k9409082l5469365l8218340k8903766j8828447j3795843
$$ plain form
5258 114875353 104296068 96446981 90002513 85434926 82667418 80335968 79151391 77906430
5250 77906430 76390890 74736046 71617367 68743986 64900166 61493963 58117031 55647792
5242 55647792 52968213 51412083 49842195 48849856 47400722 46301045 46487474 46027339 46144969
5233 46144969 46446045 47600159 48592275 50050718 52195624 54911067 56752280 58879185
5225 58879185 59876927 60319412 60613726 60620020 60332350 59389954 58948844 57964511 56601109 55147931
5215 55147931 52991505 50969347 49386238 47636163 46020882 44150473 42354002 40311099
5207 40311099 38854302 38108429 37364536 36492120 36410617 36444001 35986781 35737001 35839304 35125008
5197 35125008 34138330 33403951 32289247 31600834 30975945 30065566 29536338 29413311 28895833
$$ packed form
5258A14875353j0579285p849087o444468m567587k767508k331450j184577j244961
5250G7906430j515540j654844l118679k873381l843820l406203l376932k469239
5242E5647792k679579j556130j569888r92339j449134j099677J86429m60135J17630
5233D6144969L01076J154114R92116J458443K144906K715443J841213K126905
5225E8879185R97742M42485K94314O294k87670r42396m41110r84333j363402j453178
5215E5147931k156426k022158j583109j750075j615281j870409j796471k042903
5207D0311099j456797p45873p43893q72416q1503L3384m57220k49780J02303p14296
5197C5125008r86678p34379j114704o88413o24889r10379n29228j23027n17478
$$ plain form
5188 28895833 28423500 28229730 28126203 28021731 27570345 27916675 27862972 27329900 27574782 27486921
5178 27486921 27279168 27328704 27348044 27254025 27411879 27264426 27808849 27590459 27682526 27354617
5168 27354617 27400477 26922594 27120225 27379526 27844633 27980482 27831119 27874894 27265356 27564841
5158 27564841 27632175 27802558 27953939 28825917 28489377 29105853 29392943 29137967 29382372 29025881
5148 29025881 28976305 29132502 28939039 28937004 28769012 29366986 29280708 29061113 29657749 29479644
5138 29479644 29013943 29058811 28793710 28578565 28400098 28498727 28669315 28564402 28923835 29144594
5128 29144594 29116632 29241490 29499830 29490166 29224740 29658257 29535686 29691632 29974920 30879774
5118 30879774 30506853 31295285 31572464 32494539 33637447 35209957 38068771 41752153 46621722
$$ packed form
5188B8895833m72333j93770j03527j04472m51386L46330n3703n33072K44882q7861
5178B7486921k07753M9536J9340r4019J57854j47453N44423k18390R2067l27909
5168B7354617M5860m77883J97631K59301M65107J35849j49363M3775o09538K99485
5158B7564841O7334J70383J51381Q71978l36540O16476K87090k54976K44405l56491
5148B9025881m9576J56197j93463k035j67992N97974q6278k19595N96636j78105
5138B9479644m65701M4868k65101k15145j78467R8629J70588j04913L59433K20759
5128B9144594k7962J24858K58340r664k65426M33517j22571J55946K83288R04854
5118C0879774l72921P88432K77179R22075J142908J572510K858814L683382M869569
$$ plain form
5109 46621722 52892952 54890727 49166403 46301254 44971362 45840083 47874847 51150267
5101 51150267 56958158 66167173 77755756 76996877 60973696 51436219 47204874 44758406
5093 44758406 44204749 45301067 46860227 49601462 52144852 49915426 42935299 37847847
5085 37847847 35218525 34227363 33090021 32730341 31426354 31040161 30373942 29835668 30819106
5076 30819106 31145231 33164960 35530761 37768488 39471822 39439005 37501232 33881154 30397232
5067 30397232 28613338 26881941 25698488 24808257 23996200 24324587 23621593 22468275 21171038
5058 21171038 20227682 19990078 19978629 19892179 18659034 18251273 17970138 17579733 16369199
5049 16369199 15777745 15471188 14895951 14445780 14260090 14230776 13871255 14153670 13628439 13227716
$$ packed form
5109D6621722O271230J997775n724324k865149j329892Q68721K034764L275420
5101E1150267N807891R209015J1588583p58879j6023181r537477m231345k446468
5093D4758406n53657J096318J559160K741235K543390k229426o980127n087452
5085C7847847k629322r91162j137342l59680j303987l86193o66219n38274R83438
5076C0819106L26125K019729K365801K237727J703334l2817j937773l620078l483922
5067C0397232j783894j731397j183453q90231q12057L28387p02994j153318j297237
5058B1171038r43356k37604j1449q6450j233145m07761k81135l90405j210534
5049A6369199n91454l06557n75237m50171j85690k9314l59521K82415n25231m00723
$$ plain form
5039 13227716 13293307 12725565 12735019 12417201 12539077 12066754 12266545 12300109 12199015 12117573
5029 12117573 11529170 12160310 12018066 12409543 12631085 12115095 12310130 12438118 13002679
5020 13002679 13081590 13379701 13931527 14290166 14984706 15549777 16350478 17224283 18538756
5011 18538756 19559385 19341364 18017028 16667715 15625204 14459569 13524647 12766566 11916873
5002 11916873 11544419 11529756 11250497 10961556 10681382 10382040 10029869 10150699 10093626 9611401
4992 9611401 9955534 9980563 9541649 9455024 9486596 9110785 9240199 8980454 9163396 9294978
4982 9294978 8936907 8535448 8303377 8398124 8145082 8198579 7636070 7973852 7673997 7829735
4972 7829735 7778386 7723941 7838678 7385652 7401305 7626846 7323269 7667984 7554911 7223874
$$ packed form
5039A3227716O5591n67742R454l17818J21876m72323J99791L3564j01094q1442
5029A2117573n88403O31140j42244L91477K21542n15990J95035J27988N64561
5020A3002679P8911K98111N51826L58639O94540N65071Q00701Q73805J314473
5011A8538756J020629k18021j324336j349313j042511j165635r34922p58081q49693
5002A1916873l72454j4663k79259k88941k80174k99342l52171J20830n7073m82225
4992I611401L44133K5029m38914q6625L1572l75811J29414k59745J82942J31582
4982I294978l58071m01459k32071R4747k53042N3497n62509L37782k99855J55738
4972G829735n1349n4445J14737m53026J5653K25541l03577L44715j13073l31037
$$ plain form
4962 7223874 7418283 7425508 7828474 7897398 7974049 8360800 8884266 9306045 9602698 9250302
4952 9250302 8209129 8146512 8031081 8331903 8414988 8931221 9450704 10044101 11298127 12039395
4942 12039395 10114582 8878518 8229597 8225239 7931491 7831180 8033191 8151274 8479691
4933 8479691 8668142 8730184 8040089 7449318 6704266 6855387 6390617 6343266 6475142 6209506
4923 6209506 6086792 6012794 5755056 6032542 5949023 5987263 5847856 5669057 5931804 5814295
4913 5814295 5210906 5176885 4910984 5073456 4962644 4822026 4816907 4397124 4476463 4689715
4903 4689715 4409546 4119431 4209556 4442753 4446852 4330481 4042363 4071490 4225442 4092990
4893 4092990 3991807 3778024 3915328 4103651 4392653 4102602 3829465 4042905 3859483 3821754
$$ packed form
4962G223874J94409P225M02966O8924P6651L86751N23466M21779K96653l52396
4952I250302j041173o2617j15431L00822Q3085N16233N19483N93397J254026P41268
4942A2039395j924813j236064o48921m358k93748j00311K02011J18083L28417
4933H479691J88451O2042o90095n90771p45052J51121m64770m7351J31876k65636
4923F209506j22714p3998k57738K77486q3519L8240j39407j78799K62747j17509
4913E814295o03389l4021k65901J62472j10812j40618n119m19783P9339K13252
4903D689715k80169k90115R0125K33197M099j16371k88118K9127J53952j32452
4893D092990j01183k13783J37304J88323K89002k90051k73137K13440j83422l7729
$$ plain form
4883 3821754 4044214 3599406 3818212 3884264 3535652 3620062 3774791 3673041 3646236 3550368
4873 3550368 3432549 3887204 3545168 3370860 3812854 3224216 3421029 3213664 3117204 3047431
4863 3047431 3156755 3338244 3358140 3385687 3007131 3149251 3168794 2997901 3247960 3158844
4853 3158844 3096744 3004103 3176155 3358015 2957214 2878194 3038563 2900016 3321074 2986973
4843 2986973 3053806 2671712 2872284 2939232 2652905 2962371 2642989 2664558 2727993 2843255
4833 2843255 2972999 2803012 2872106 2258396 2826743 2969740 2529681 2422980 2654341 2666557
4823 2666557 2818847 2568677 2741630 2500100 2681565 2472928 2493199 2810080 2728642 2182713
4813 2182713 2337082 2121194 2497973 2549444 2520440 2459992 2577306 2150320 2409828 2268533
$$ packed form
4883C821754K22460m44808K18806O6052l48612Q4410J54729j01750k6805r5868
4873C550368j17819M54655l42036j74308M41994n88638J96813k07365r6460o9773
4863C047431J09324J81489J9896K7547l78556J42120J9543j70893K50059q9116
4853C158844o2100r2641J72052J81860m00801p9020J60369j38547M21058l34101
4843B986973O6833l82094K00572O6948k86327L09466l19382K1569O3435J15262
4833B843255J29744j69987O9094o13710N68347J42997m40059j06701K31361J2216
4823B666557J52290k50170J72953k41530J81465k08637K0271L16881q1438n45929
4813B182713J54369k15888L76779N1471k9004o0448J17314m26986K59508j41295
$$ plain form
4803 2268533 2401353 2576758 2468656 2375043 2213353 2463035 2418784 2489709 2740607 2633382
4793 2633382 2205024 2342670 2587013 2457685 2342254 2263288 2299384 2355354 2325341 2264636
4783 2264636 2376639 2535633 2074160 2230813 2304210 2051918 2238020 1892299 2281237 2101117
4773 2101117 1959188 2005457 2031475 2083637 2164268 2091329 1914352 1989647 2428623 2005842 1921665
4762 1921665 2018069 2232455 1876581 2019464 2009785 1884699 1909274 1749975 1791376 2302405
4752 2302405 1989155 1677070 2020405 1872693 2097694 1615911 1683049 2059341 1548325 1979273
4742 1979273 2208182 2125649 1862521 1764705 1894621 1809776 1853774 1573636 2214432 1875323
4732 1875323 1603331 1671519 1721205 1991198 1534960 1890815 1881080 1656123 1781182 1860220
$$ packed form
4803B268533J32820J75405j08102r3613j61690K49682m4251P0925K50898j07225
4793B633382m28358J37646K44343j29328j15431p8966L6096N5970l0013o0705
4783B264636J12003J58994m61473J56653P3397k52292J86102l45721L88938j80120
4773B101117j41929M6269K6018N2162Q0631p2939j76977P5295M38976m22781q4177
4762A921665R6404K14386l55874J42883r679j25086K4575j59299M1401N11029
4752B302405l13250l12085L43335j47712K25001m81783O7138L76292n11016M30948
4742A979273K28909q2533k63128r7816J29916q4845M3998k80138O40796l39109
4732A875323k71992O8188M9686K69993m56238L55855r735k24957J25059P9038
$$ plain form
4722 1860220 1674173 1937961 1627545 1737426 1585616 1661110 1790745 1598707 1621285 1817359
4712 1817359 1828037 2023981 2072148 1585333 1587669 1621501 1763819 1708751 1523731 1401805 1426982
4701 1426982 1596907 1557264 1803160 1524813 1751607 1680260 1682884 1676591 1569831 1420347 1373147
4690 1373147 1315726 1977449 1528472 1752966 1735964 1281103 1572331 1531755 1704953 1572925
4680 1572925 1492038 1378013 1678574 1568539 1903455 1567346 1657654 1586154 1287130 1925652
4670 1925652 1458906 1231260 1810875 1433188 1815670 1339947 1642932 1733041 1401118 1953235
4660 1953235 1411123 1720764 1417052 1452171 1206153 1343452 1414509 1627929 1416103 1835056
4650 1835056 1397219 1521556 1593705 1690512 1535284 1379774 1609717 1584278 1352398 1627781
$$ packed form
4722A860220j86047K63788l10416J09881j51810P5494J29635j92038K2578J96074
4712A817359J0678J95944M8167m86815K336L3832J42318n5068j85020j21926K5177
4701A426982J69925l9643K45896k78347K26794p1347K624o293j06760j49484m7200
4690A373147n7421O61723m48977K24494j7002m54861K91228m0576J73198j32028
4680A572925q0887j14025L00561j10035L34916l36109R0308p1500k99024O38522
4670A925652m66746k27646N79615l77687L82482m75723L02985R0109l31923N52117
4660A953235n42112L09641l03712L5119k46018J37299P1057K13420k11826M18953
4650A835056m37837J24337P2149R6807j55228j55510K29943k5439k31880K75383
$$ plain form
4640 1627781 1871493 1388624 1637940 1066758 1524786 1480046 1544582 1338267 1620467 1634564
4630 1634564 1537184 1482767 1423993 1253416 1316082 1200654 1407933 1592663 1683269 1522999
4620 1522999 1642543 1435215 1413208 1467733 1682123 1686847 1491826 1422451 1615385 1446107
4610 1446107 1675103 1531310 1677982 1653770 1154666 1603354 1759074 1529561 1639792 1343376
4600 1343376 1850468 1432381 1546164 1304369 1704778 1673466 1424580 1194790 1298994 1767704
4590 1767704 1862538 1707762 1380202 1271404 1206821 1425707 1269202 1356998 1564923 1027029
4580 1027029 1292674 1356545 1228926 1247323 1126681 1364940 1099311 1355638 1274593 1305073
4570 1305073 1279030 962717 1387085 1419935 885073 1117651 1299420 1236955 1282796 1321282
$$ packed form
4640A627781K43712m82869K49316n71182M58028m4740O4536k06315K82200J4097
4630A634564r7380n4417n8774j70577O2666j15428K07279J84730R0606j60270
4620A522999J19544k07328k2007N4525K14390M724j95021o9375J92934j69278
4610A446107K28996j43793J46672k4212m99104M48688J55720k29513J10231k96416
4600A343376N07092m18087J13783k41795M00409l1312k48886k29790J04204M68710
4590A767704R4834j54776l27560j08798o4583K18886j56505Q7796K07925n37894
4580A027029K65645O3871j27619J8397j20642K38259k65629K56327q1045L0480
4570A305073k6043l16313M24368L2850n34862K32578J81769o2465M5841L8486
$$ plain form
4560 1321282 1453615 1139871 1314820 935668 1214194 1065923 1301138 1391643 907939 1311506
4550 1311506 1171359 993974 666469 1170718 1043920 1028758 1220507 1072062 1324221 825937
4540 825937 1131640 1114739 1111926 1034719 1214151 1055133 827851 1018653 1322114 925144
4530 925144 1048159 1249590 1261080 924066 1224420 945466 1134202 719499 1109699 1208597
4520 1208597 1005427 1183811 687642 959579 1266541 884440 1034625 985614 1225474 802616
4510 802616 1511390 940168 1275762 1271373 746100 799294 524719 981904 1347835 1105276
4500 1105276 810933 806126 1193762 1049644 773032 772334 903720 816349 894520 875279 836896
4489 836896 801064 1279512 908544 1035503 1193975 1031798 1191192 1021682 877121 1320165
$$ packed form
4560A321282J32333l13744J74949l79152K78526j48271K35215R0505m83704M03567
4550A311506j40147j77385l27505N04249j26798j5162J91749j48445K52159m98284
4540H25937L05703j6901k813p7207J79432j59018k27282J90802L03461l96970
4530I25144J23015K01431J1490l37014L00354k78954J88736m14703L90200R8898
4520A208597k03170J78384m96169K71937L06962l82101J50185m9011K39860m22858
4510H02616P08774n71222L35594m389n25273N3194k74575M57185L65931k42559
4500A105276k94343m807L87636j44118k76612o98J31386q7371P8171j9241l8383
4489H36896l5832M78448l70968J26959J58472j62177J59394j69510j44561M43044
$$ plain form
4479 1320165 1151054 1060638 606949 845574 784110 782845 1043926 925276 1124360 694089
4469 694089 804133 910453 1165872 950604 896275 1037587 898586 1138980 884360 969416
4459 969416 932846 1333000 702308 1010046 948147 944682 945885 1518041 725207 1020202 911128
4448 911128 836839 1047816 985159 1084402 1020743 887147 909946 1064906 1079567 1209633 954076
4437 954076 1193081 983051 919729 922882 558739 985490 740909 1083599 1228971 1131820
4427 1131820 1000894 934949 1080237 1092262 768453 838965 884098 774891 1049358 869538
4417 869538 1261718 930233 1210181 653241 812549 1051264 940507 1170791 883660 922473
4407 922473 1541256 1615144 1025540 1258695 1350806 1203503 868509 868961 1268308 1215050 1169096
$$ packed form
4479A320165j69111r0416m53689K38625o1464j265K61081j18650J99084m30271
4469F94089J10044J06320K55419k15268n4329J41312j39001K40394k54620Q5056
4459I69416l6570M00154o30692L07738o1899l465J203N72156p92834K94995j09074
4448I11128p4289K10977o2657R9243o3659j33596K2799J54960J4661J30066k55557
4437I54076K39005k10030o3322L153l64143M26751k44581L42690J45372r7151
4427A131820j30926o5945J45288J2025l23809P0512M5133j09207K74467j79820
4417H69538L92180l31485K79948n56940J59308K38715j10757K30284k87131L8813
4407I22473O18783P3888n89604K33155R2111j47303l34994M52L99347n3258m5954
$$ plain form
4396 1169096 1355274 1129673 1152385 939716 1175679 1384295 1374678 1024190 1145167 1029332
4386 1029332 1589772 1579844 1446814 1194715 1524188 1178226 1441015 1172262 1417721 1364003
4376 1364003 1612769 1697370 1645731 1878707 1613945 1395253 1855075 1447382 1910757 1444686
4366 1444686 1605517 1670772 1884733 1923117 1633819 1614817 2026420 1451291 2066175 2009436
4356 2009436 1815851 2289071 1927018 2010522 2271142 2212480 2370118 2422043 2376010 2579432
4346 2579432 2497599 3282405 2942042 2720260 3360958 3309429 3559260 3674261 4251668 4528467
4336 4528467 4877786 5516903 5675539 5901245 5803871 5774480 5747847 5633758 4962900 4493438
4326 4493438 4259899 3602660 3680517 3415899 3298896 2820284 3227996 3020830 2752142 2505334
$$ packed form
4396A169096J86178k25601K2712k12669K35963K08616r617l50488J20977j15835
4386A029332N60440r928j33030k52099L29473l45962K62789k68753K45459n3718
4376A364003K48766Q4601n1639K32976k64762k18692M59822m07693M63375m66071
4366A444686J60831O5255K13961L8384k89298j9002M11603n75129O14884n6739
4356B009436j93585M73220l62053Q3504K60620n8662J57638N1925m6033K03422
4346B579432q1833P84806l40363k21782O40698n1529K49831J15001N77407K76799
4336D528467L49319O39117J58636K25706r7374k9391k6633j14089o70858m69462
4326D493438k33539o57239P7857k64618j17003m78612M07712k07166k68688k46808
$$ plain form
4316 2505334 2562080 2595820 2585813 2382117 2240893 2407091 2936934 2588318 3227385 3533460
4306 3533460 3104797 2458657 2298515 2153427 1870537 2035030 1936133 1643390 1733858 1670708
4296 1670708 1607326 1441363 1553397 1385348 1164573 1341636 1540120 1402534 1302218 1387351
4286 1387351 1594136 1516040 1357572 1513567 1448661 1515792 1749484 2064851 1809647 1629530
4276 1629530 1315532 1522745 1341284 1004835 1163719 1239603 1504250 981717 1044339 1032224
4266 1032224 1139750 910973 894749 714790 1303104 1044451 883408 1037195 920485 955597
4256 955597 1050113 1102396 1104974 744280 680106 1156823 981846 1098653 1252700 974956 940844
4245 940844 1038075 803447 815574 936605 763509 966221 1087437 889029 1024485 897864
$$ packed form
4316B505334N6746L3740j0007k03696j41224J66198N29843l48616O39067L06075
4306C533460m28663o46140j60142j45088k82890J64493r8897k92743R0468o3150
4296A670708o3382j65963J12034j68049k20775J77063J98484j37586j00316Q5133
4286A387351K06785p8096j58468J55995o4906O7131K33692L15367k55204j80117
4276A629530l13998K07213j81461l36449J58884P5884K64647n22533O2622j2115
4266A032224J07526k28777j6224j79959N88314k58653j61043J53787j16710L5112
4256I55597R4516N2283K578l60694o4174M76717j74977J16807J54047k77744l4112
4245I40844R7231k34628J2127J21031j73096K02712J21216j98408J35456j26621
$$ plain form
4235 897864 779553 809544 1147699 1108556 827625 1105353 939982 993724 1149908 1052161
4225 1052161 1037590 956000 1142228 810457 1282648 1148151 460881 910272 807720 1097387
4215 1097387 902032 611287 1158002 1045245 614770 1168248 836168 807240 794139 756888
4205 756888 862488 683983 1039967 650999 360010 989394 709657 601827 859951 807580
4195 807580 652677 1029399 654110 639309 481365 744680 645852 725934 865867 624316
4185 624316 715491 877451 683075 987171 619497 849241 901716 571512 791736 534145
4175 534145 536923 971551 845390 811314 874644 709182 543330 578294 1070644 978489 810713
4164 810713 672142 658531 1057489 750313 1049828 873210 893008 980874 788894 713374
$$ packed form
4235H97864j18311K9991L38155l9143k80931K77728j65371N3742J56184r7747
4225A052161j4571q1590J86228l31771M72191j34497o87270M49391j02552K89667
4215A097387j95355k90745N46715j12757m30475N53478l32080k8928j3101l7251
4205G56888J05600j78505L55984l88968k90989O29384k79737j07830K58124n2371
4195H07580j54903L76722l75289j4801j57944K63315r8828Q0082J39933k41551
4185F24316R1175J61960j94376L04096l67674K29744N2475l30204K20224k57591
4175E34145K778M34628j26161l4076O3330j65462j65852L4964M92350r2155j67776
4164H10713j38571j3611L98958l07176K99515j76618J9798Q7866j91980p5520
$$ plain form
4154 713374 856486 598735 483029 753357 698367 469457 711002 666387 723841 900173
4144 900173 1111881 666266 582084 1039427 779873 609147 646147 754683 981317 833383
4134 833383 916102 925184 1095657 1068214 928689 1031984 1046482 1139713 1400867 1211352 1669975
4123 1669975 1555880 1620609 1553308 1915514 1774640 1864827 1794591 1873756 2116154 2223448
4113 2223448 1611129 1823323 1737522 1535056 1968584 1487036 1590681 1374015 1302632 1481227
4103 1481227 1680996 1364986 1840002 1677468 1627788 2148116 1951590 2252584 2389707 2416077
4093 2416077 2708121 3314308 3404388 3562888 3670466 3584449 4132119 3806127 3237735 3381607
4083 3381607 2839741 2982810 3158651 2954899 2472039 2459837 1854695 1785330 1702325 2018457
$$ packed form
4154G13374J43112k57751j15706K70328n4990k28910K41545m4615N7454J76332
4144I00173K11708m45615q4182M57343k59554j70726L7000J08536K26634j47934
4134H33383Q2719R082J70473k7443j39525J03295J4498R3231K61154j89515M58623
4123A669975j14095O4729o7301L62206j40874R0187p0236P9165K42398J07294
4113B223448o12319K12194q5801k02466M33528m81548J03645k16666p1383J78595
4103A481227J99769l16010M75016j62534m9680N20328j96526L00994J37123K6370
4093B416077K92044O06187R0080J58500J07578q6017N47670l25992n68392J43872
4083C381607n41866J43069J75841k03752m82860j2202o05142o9365q3005L16132
$$ plain form
4073 2018457 2099074 1863624 1930671 1718041 1797883 1854224 1944410 2286268 2144753 2006338
4063 2006338 1984567 2522545 2464658 2608859 2999796 2862683 3259062 2784079 2682588 2802063
4053 2802063 2582914 2969070 1989755 2102599 2005483 1918660 1879460 1588898 1369577 1325318
4043 1325318 1558167 1364833 1538425 1449833 1390319 1388924 1600453 1397309 1712320 1921157
4033 1921157 1593870 1296788 1388377 1271795 1074766 994809 975708 1149924 919495 927821
4023 927821 831167 1050593 660108 820911 914033 1175988 926382 802940 937299 927422
4013 927422 961172 1157182 1237811 830276 1272998 800996 820190 854119 896939 971124 1107650
4002 1107650 1080410 877002 850783 946606 683660 1003363 829062 1237267 880600 862369
$$ packed form
4073B018457Q0617k35450O7047k12630P9842N6341R0186L41858j41515j38415
4063B006338k1771N37978n7887J44201L90937j37113L96379m74983j01491J19475
4053B802063k19149L86156r79315J12844r7116q6823l9200k90562k19321m4259
4043A325318K32849j93334J73592q8592n9514j395K11529k03144L15011K08837
4033A921157l27287k97082R1589j16582j97029p9957j9101J74216k30429Q326
4023I27821r6654K19426l90485J60803R3122K61955k49606j23442J34359r877
4013I27422L3750J96010Q0629m07535M42722m72002J9194L3929M2820P4185J36526
4002A107650k7240k03408k6219R5823k62946L19703j74301M08205l56667j8231
$$ plain form
3992 862369 718287 520665 864219 593169 871624 528729 486431 696724 1093833 622087
3982 622087 622018 347506 465387 384858 770958 292855 373985 273040 716904 734461 348758
3971 348758 482744 334396 649513 300496 660141 62426 273026 595353 313264 548939
3961 548939 516245 411808 364840 203868 690451 589400 216609 28151 204467 394676
3951 394676 265729 411976 623916 448895 264098 279499 278849 164716 208726 437439 392944
3940 392944 271289 21427 118661 138657 357933 360998 185544 387161 219491 302175 463502
3929 463502 176622 383037 259434 407329 324334 475223 159770 324602 235787 36550
3919 36550 250930 38891 109725 493890 354517 530994 357893 31198 157616 526979
$$ packed form
3992H62369j44082j97622L43554k71050K78455l42895m2298K10293L97109m71746
3982F22087o9k74512J17881q0529L86100m78103Q1130j00945M43864J7557l85703
3971C48758J33986j48348L15117l49017L59645n97715K10600L22327k82089K35675
3961E48939l2694j04437m6968j60972M86583j01051l72791j88458J76316J90209
3951C94676j28947J46247K11940j75021j84797J5401o50j14133M4010K28713m4495
3940C92944j21655k49862R7234J9996K19276L065j75454K01617j67670Q2684J61327
3929D63502k86880K06415j23603J47895q2995J50889l15453J64832q8815j99237
3919C6550K14380k12039P0834L84165j39373J76477j73101l26695J26418L69363
$$ plain form
3909 526979 78200 270811 547528 241945 185098 160677 251491 296679 65969 242336
3899 242336 -65460 211416 136033 441026 510411 320140 363368 245861 -28212 415477
3889 415477 156474 359872 222926 402904 379499 503829 131296 213130 479956 328908
3879 328908 663879 44506 293113 381765 134789 265154 213899 75303 131620 410865
3869 410865 356130 334934 436753 174859 -181581 539457 362422 359861 535877 178599
3859 178599 384319 195069 406375 429100 404737 307225 171617 661390 -48568 568738
3849 568738 582330 353692 164950 9777 80459 322418 216239 266549 297461 212962 81725
3838 81725 76700 371738 133028 57897 269467 323231 4155 120588 259884 481802 263270
$$ packed form
3909E26979m48779J92611K76717l05583n6847k4421R0814M5188k30710J76367
3899B42336l07796K76876p5383L04993O9385j90271M3228j17507k74073M43689
3889D15477k59003K03398j36946J79978k3405J24330l72533Q1834K66826j51048
3879C28908L34971o19373K48607Q8652k46976J30365n1255j38596N6317K79245
3869D10865n4735k1196J01819k61894l56440P21038j77035k561J76016l57278
3859A78599K05720j89250K11306K2725k4363r7512j35608M89773p09958O17306
3849E68738J3592k28638j88742j55173P0682K41959j06179N0310L0912q4499j31237
3838H1725n025K95038k38710p5131K11570N3764l19076J16433J39296K21918k18532
$$ plain form
3827 263270 350323 416058 530493 325521 475727 196135 503466 645747 12711 622083
3817 622083 402908 612768 864433 464818 488610 653629 344514 428928 546198 810196
3807 810196 370559 538732 653708 411459 540174 123337 650346 675254 851711 907375
3797 907375 540297 689957 524954 589744 702725 610495 988079 1108989 935861 1224576
3787 1224576 1156227 893751 965194 1338631 882499 1068366 1528319 1047800 947121 1251965
3777 1251965 915643 837873 1204454 1225661 1021516 1209100 945795 973315 973240 1100822 1215312
3766 1215312 1157850 966358 1253164 1522238 1377057 1299286 1708270 1791761 1633027 1538749
3756 1538749 1597452 1538535 1453687 1219758 1370395 1272581 1527941 1311634 1056389 793593
$$ packed form
3827B63270Q7053O5735J14435k04972J50206k79592L07331J42281o33036O09372
3817F22083k19175K09860K51665l99615K3792J65019l09115Q4414J17270K63998
3807H10196m39637J68173J14976k42249J28715m16837N27009K4908J76457N5664
3797I07375l67078J49660j65003O4790J12981r2230L77584J20910j73128K88715
3787A224576o8349k62476P1443L73437m56132J85867M59953m80519j00679L04844
3777A251965l36322p7770L66581K1207k04145J87584k63305K7520p5J27582J14490
3766A215312n7462j91492K86806K69074j45181p7771M08984Q3491j58734r4278
3756A538749N8703n8917q4848k33929J50637r7814K55360k16307k55245k62796
$$ plain form
3746 793593 815600 1149591 1009799 1189129 1489301 1065305 970408 1084456 986158 1185346
3736 1185346 1073484 1172545 1383409 1266678 1006753 1155878 1048171 985063 1182194 1203095
3726 1203095 1009635 936522 1453727 820693 1196271 1034840 566959 911516 736044 994719
3716 994719 654920 456999 425187 635650 796507 411019 831972 928191 880733 496710
3706 496710 584972 707433 394873 558813 294209 380197 647833 275251 474636 277102
3696 277102 636693 682913 340108 437398 592041 287079 448746 542331 964870 74884
3686 74884 135697 58112 35244 -129132 54885 194776 406121 225092 16834 426462
3676 426462 345915 458598 168991 290557 59012 -3532 -22672 415414 507836 153247
$$ packed form
3746G93593K2007L33991j39792J79330L00172m23996r4897J14048r8298J99188
3736A185346j11862R9061K10864j16731k59925J49125j07707o3108J97131K0901
3726A203095j93460p3113N17205o33034L75578j61431m67881L44557j75472K58675
3716I94719l39799j97921l1812K10463J60857l85488M20953R6219m7458l84023
3706D96710Q8262J22461l12560J63940k64604Q5988K67636l72582J99385j97534
3696B77102L59591M6220l42805R7290J54643l04962J61667R3585M22539q89986
3686G4884O0813p7585k2868j64376J84017J39891K11345j81029k08258M09628
3676D26462q0547J12683k89607J21566k31545o2544j9140M38086R2422l54589
$$ plain form
3666 153247 358041 286066 89782 126114 513734 8402 138632 145650 219660 110859 -7435
3655 -7435 98629 15978 347685 145544 81168 267981 222728 32386 287725 -40546 225288
3644 225288 65021 214327 159487 268373 269456 67115 377655 57127 228495 125766
3634 125766 271234 227723 70463 111757 261023 64541 26171 99802 585179 56367
3624 56367 76830 551228 -24237 362959 157603 -24514 37771 -68826 30972 149795
3614 149795 395009 147828 161957 270226 337063 448496 244595 90394 252819 503029
3604 503029 133175 208714 389150 104653 564790 17629 131487 307705 141745 -11820
3594 -11820 203165 100273 480194 566193 406415 221636 370064 16809 569511 360911
$$ packed form
3666A53247K04794p1975j96284L6332L87620n05332J30230P018P4010j08801j18294
3655g435J06064q2651L31707k02141o4376J86813m5253j90342K55339l28271K65834
3644B25288j60267J49306n4840J08886J083k02341L10540l20528J71368j02729
3634A25766J45468m3511j57260M1294J49266j96482l8370P3631M85377n28812
3624E6367K0463M74398n75465L87196k05356j82117O2285j06597R9798J18823
3614A49795K45214k47181J4129J08269O6837J11433k03901j54201J62425K50210
3604E03029l69854P5539J80436k84497M60137n47161J13858J76218j65960j53565
3594a1820K14985j02892L79921Q5999j59778j84779J48428l53255N52702k08600
$$ plain form
3584 360911 357692 537314 608647 428346 457484 173883 747356 177300 848393 775726 784889
3573 784889 864542 1615850 1683145 1922318 1710678 1029013 1197999 630479 531977 715714
3563 715714 776549 642074 261625 503407 365058 444391 271460 447363 463351 309590
3553 309590 479304 225566 733252 373180 378396 480286 390729 412854 421739 377438 184527
3542 184527 449548 880836 385342 201545 527591 878790 88525 330366 352016 164721
3532 164721 226792 216607 691184 501779 249692 483781 356890 256673 400464 319847
3522 319847 246936 376059 429188 461086 641662 609125 162945 474471 714635 319566
3512 319566 458311 449141 833999 266529 949737 763119 791608 858414 408211 497916 480895
$$ packed form
3584C60911l219J79622P1333j80301K9138k83601N73473n70056O71093p2667R163
3573G84889P9653P51308O7295K39173k11640o81665J68986n67520r8502J83737
3563G15714O0835j34475l80449K41782j38349P9333j72931J75903J5988j53761
3553C09590J69714k53738N07686l60072N216J01890q9557K2125Q885m4301j92911
3542A84527K65021M31288m95494j83797L26046L51199p90265K41841K1650j87295
3532A64721O2071j0185M74577j89405k52087K34089j26891j00217J43791q0617
3522C19847p2911J29123N3129L1898J80576l2537m46180L11526K40164l95069
3512C19566J38745r170L84858n67470O83208j86618K8489O6806m50203Q9705j7021
$$ plain form
3501 480895 369666 581926 372898 738952 779889 402925 373246 877838 563320 428784
3491 428784 785077 371171 898988 442730 547707 758497 670799 606168 516989 690820
3481 690820 499818 437113 945580 928136 947718 643073 826194 810715 831770 727178 902212
3470 902212 760999 765269 924465 604632 741780 849452 904799 883063 924754 701172 961562
3459 961562 953100 1066443 1069359 689071 1134038 1188476 1142910 1013042 1490127 1225742 1498728
3448 1498728 1254429 1348202 1376934 917700 1274572 1128696 1273567 1220381 1460629 1759159
3438 1759159 1777234 2019202 2444914 1989422 2114758 1978864 2361634 2716909 2297905 2254263
3428 2254263 2095768 1523433 2000710 1521010 1343205 1564645 1712172 1750545 1746622 1921120
$$ packed form
3501D80895j11229K12260k09028L66054M0937l76964k9679N04592l14518j34536
3491D28784L56293m13906N27817m56258J04977K10790q7698o4631q9179J73831
3481F90820j91002o2705N08467j7444J9582l04645J83121j5479K1055j04592J75034
3470I02212j41213M270J59196l19833J37148J07672N5347k1736M1691k23582K60390
3459I61562q462J13343K916l80288M44967N4438m5566j29868M77085k64385K72986
3448A498728k44299R3773K8732m59234L56872j45876J44871n3186K40248K98530
3438A759159J8075K41968M25712m55492J25336j35894L82770L55275m19004m3642
3428B254263j58495n72335M77277m79700j77805K21440J47527L8373l923J74498
$$ plain form
3418 1921120 1955773 1789835 1542584 1719101 1718113 1823045 1881846 2063390 1903542 1946852 2016198
3407 2016198 2224330 2129318 2195833 2510012 2329074 2482070 2297064 2870044 2776000 2686788
3397 2686788 2683962 2858611 3139589 3390428 3471228 3655532 4009588 4118511 4433359 4842974
3387 4842974 4766449 4556887 4510284 4416719 4833008 4675642 4900321 4869964 4995880 5151540
3377 5151540 4800667 5000444 5487472 5500095 5648477 6126376 6688392 6446156 6456034 7295288
3367 7295288 7715525 8195947 8610291 9072021 9324645 9787850 10379193 11216939 12657671
3358 12657671 13563506 14951786 16502350 18060905 19838193 22607577 25653674 31001055
3350 31001055 34481235 33418685 34676539 38099297 42854808 48964090 57912858 71289849
$$ packed form
3418A921120L4653j65938k47251J76517r88J04932N8801J81544j59848M3310O9346
3407B016198K08132r5012O6515L14179j80938J52996j85006N72980r4044q9212
3397B686788k826J74649K80978K50839Q0800J84304L54056J08923L14848M09615
3387D842974p6525k09562m6603r3565M16289j57366K24679l0357J25916J55660
3377E151540l50873J99777M87028J2623J48382M77899N62016k42236R878Q39254
3367G295288M20237M80422M14344M61730K52624M63205N91343Q37746J440732
3358A2657671R05835J388280J550564J558555J777288K769384L046097N347381
3350C1001055L480180j062550J257854L422758M755511O109282Q948768J3376991
$$ plain form
3342 71289849 90157537 113955553 153405539 212645171 322342145 379563103 236756013
3335 236756013 152300682 114625241 93188812 76952289 64059599 54461553 48933730
3328 48933730 44463505 41790221 40072431 40252231 40562748 37095666 34152505 32946345
3320 32946345 33342827 30100015 25837798 23425542 21258782 19518125 18200157 17056681
3312 17056681 16117940 14619578 13614144 12928372 11562506 10995876 10970967 10460375 9588908
3303 9588908 9042168 8719935 8546900 8040593 7577099 7225807 7136994 7127580 6576460 6280137
3293 6280137 5986831 5672093 5220099 5046652 4981870 4778770 4666508 4664019 4337642 4168857
3283 4168857 4203433 4212995 3850017 4129882 3654808 3348658 3479268 3494899 3027482 2878164
$$ packed form
3342G1289849J8867688K3798016L9449986N9239632J09696974N7220958j42807090
3335B36756013q4455331l7675441k1436429j6236523j2892690r598046n527823
3328D8933730m470225k673284j717790J79800L10517l467082k943161j206160
3320C2946345L96482l242812m262217k412256k166760j740657j317968j143476
3312A7056681r38741j498362j005434o85772j365866n66630k4909n10592q71467
3303I588908n46740l22233j73035n06307m63494l51292q8813r414n51120k96323
3293F280137k93306l14738m51994j73447o4782k03100j12262k489l26377j68785
3283D168857L4576R562l62978K79865m75074l06150J30610J5631m67417j49318
$$ plain form
3273 2878164 3180908 2918043 2717995 2743175 2751245 2658638 2378185 2280440 2506693 2447739 2374120
3262 2374120 2486668 2466787 2234836 2274187 2089168 1554570 2115847 1984712 1964465 2193463
3252 2193463 2068460 1787353 1879698 1960436 1826043 1785584 1529477 1837138 1591384 1641422
3242 1641422 1799977 1505354 1575235 1631638 1161201 1561652 1481873 921398 1040228 1475133
3232 1475133 1435467 1511914 1145188 1502641 1361202 1411742 1410149 1554706 1338527 933158
3222 933158 1111479 780568 980801 972792 1071444 1037268 546030 832346 871192 911011 864881
3211 864881 1286327 1173840 687425 784120 1270723 1533149 966086 843129 938450 743455
3201 743455 970901 823165 481249 574682 1018773 663793 578224 643415 890234 433205
$$ packed form
3273B878164L02744k62865k00048K5180Q070r2607k80453r7745K26253n8954p3619
3262B374120J12548j9881k31951L9351j85019n34598N61277j31135k0247K28998
3252B193463j25003k81107R2345Q0738j34393m0459k56107L07661k45754N0038
3242A641422J58555k94623O9881N6403m70437M00451p9779n60475J18830M34905
3232A475133l9666P6447l66726L57453j41439N0540j593J44557k16179m05369
3222I33158J78321l30911K00233q009R8652l4176m91238K86316L8846L9819m6130
3211H64881M21446j12487m86415R6695M86603K62426n67063j22957R5321j94995
3201G43455K27446j47736l41916R3433M44091l54980q5569O5191K46819m57029
$$ plain form
3191 433205 672892 523802 616206 921049 502731 635049 553647 722343 755093 809555
3181 809555 745332 752458 885327 408854 559900 826137 796705 711632 778547 548970 290890
3170 290890 395833 541419 545475 459639 391101 523578 504427 477096 397813 512922 614652
3159 614652 938975 890106 514473 456386 844144 506852 344575 241372 737871 611875
3149 611875 507107 540267 163501 525058 640263 498018 808893 728442 484784 599059
3139 599059 570997 893890 467072 809513 755486 374127 537110 754044 331245 739837
3129 739837 308129 686206 630446 683195 500173 288102 420303 446085 490020 438207 809276
3118 809276 498911 592426 502709 849414 470353 745436 649892 436950 483169 901514
$$ packed form
3191D33205K39687j49090R2404L04843m18318J32318q1402J68696L2750N4462
3181H09555o4223P126J32869m76473J51046K66237k9432q5073O6915k29577k58080
3170B90890J04943J45586M056q5836o8538J32477j9151k7331p9283J15109J01730
3159F14652L24323m8869l75633n8087L87758l37292j62277j03203M96499j25996
3149F11875j04768L3160l76766L61557J15205j42245L10875q0451k43658J14275
3139E99059k8062L22893m26818L42441n4027l81359J62983K16934m22799M08592
3129G39837m31708L78077n5760N2749j83022k12071J32201K5782M3935n1813L71069
3118H09276l10365R3515q9717L46705l79061K75083r5544k12942M6219M18345
$$ plain form
3108 901514 1099287 1122587 1231440 1219903 1321511 1897741 1975959 1852028 1772158 1062146
3098 1062146 891320 623193 706550 693567 365948 957011 726134 299093 717051 698817
3088 698817 239715 536416 171549 627678 224294 502599 474504 511283 331486 467846
3078 467846 308980 587579 327350 98713 158972 527451 639287 423214 29394 347900
3068 347900 451140 86262 478532 407475 410787 480193 204856 177182 697243 429429 407043
3057 407043 181947 142610 404890 588960 150770 587429 210283 193952 81106 397594
3047 397594 87826 214579 411196 387610 134644 274145 -30261 150385 186734 365733
3037 365733 243582 164375 338241 405736 11063 199833 139530 362351 456596 52618
$$ packed form
3108I01514J97773K3300J08853j1537J01608N76230P8218j23931p9870p10012
3098A062146j70826k68127Q3357j2983l27619N91063k30877m27041M17958j8234
3088F98817m59102K96701l64867M56129m03384K78305k8095L6779j79797J36360
3078D67846j58866K78599k60229k28637O0259L68479J11836k16073l93820L18506
3068C47900J03240l64878L92270p1057L312O9406k75337k7674N20061k67814k2386
3057D07043k25096l9337K62280J84070m38190M36659l77146j6331j12846L16488
3047C97594l09768J26753J96617k3586k52966J39501l04406J80646L6349J78999
3037C65733j22151p9207J73866O7495l94673J88770o0303K22821R4245m03978
$$ plain form
3027 52618 566454 482990 340032 627516 225721 387467 204917 254179 369141 290496
3017 290496 230291 213281 210196 214146 418613 57896 72262 165378 112209 6071 109291
3006 109291 406936 108585 184246 396997 168802 -22073 283631 -73381 232654 352725
2996 352725 483692 530009 96214 485314 685170 -112286 326844 -145326 463252 332297
2986 332297 170500 289283 94022 410366 177401 -70441 201539 31710 469547 542369
2976 542369 521554 154963 -125579 157300 638342 291675 249636 82578 332791 615116
2966 615116 13818 165128 138714 142350 159975 184548 493633 367972 451966 485384 337113
2955 337113 407535 -79750 240475 292973 -8013 -100260 4168 153566 126140 213211 40116
$$ packed form
3027E2618N13836q3464j42958K87484m01795J61746j82550M9262J14962p8645
3017B90496o0205j7010l085L950K04467l60717J4366R3116n3169j06138J03220
3006A09291K97645k98351P5661K12751k28195j90875L05704l57012L06035J20071
2996C52725J30967M6317m33795L89100J99856p97456M39130m72170O08578j30955
2986C32297j61797J18783j95261L16344k32965k47842K71980j69829M37837P2822
2976E42369k0815l66591k80542K82879M81042l46667m2039j67058K50213K82325
2966F15116o01298J51310k6414L636J7625K4573L09085j25661Q3994L3418j48271
2955C37113P0422m87285L20225N2498l00986r2247J04428J49398k7426Q7071j73095
$$ plain form
2944 40116 210086 152770 98352 285017 144580 249391 157031 -45491 256658 263521 212592
2933 212592 39086 366571 335892 195522 232685 299546 203847 84925 -84342 101948
2923 101948 130374 369233 717891 455414 338201 122555 108311 354738 234046 173854
2913 173854 150512 190077 434704 163017 189769 241442 -91117 49502 83520 227124 65490
2902 65490 348891 426258 -54099 351725 315899 241886 -252842 -13604 303814 200355
2892 200355 192382 66877 -76393 101598 293949 245408 98140 290980 429350 112549
2882 112549 507772 152406 239404 55585 17755 554162 -26699 330605 77094 495521
2872 495521 -55356 253348 193557 196477 -26911 194655 255651 120217 208533 505219 111535
$$ packed form
2944D0116J69970n7316n4418J86665j40437J04811r2360k02522L02149O863n0929
2933B12592j73506L27485l0679j40370L7163O6861r5699j18922j69267J86290
2923A01948K8426K38859L48658k62477j17213k15646j4244K46427j20692o0192
2913A73854k3342L9565K44627k71687K6752N1673l32559J40619L4018J43604j61634
2902F5490K83401P7367m80357M05824l5826p4013m94728K39238L17418j03459
2892B00355p973j25505j43270J77991J92351m8541j47268J92840J38370l16801
2882A12549L95223l55366Q6998j83819l7830N36407n80861L57304k53511M18427
2872D95521n50877L08704n9791K920k23388K21566O0996j35434Q8316K96686l93684
$$ plain form
2861 111535 -153522 16742 88775 301255 -26484 -97914 473714 277775 245953 322614
2851 322614 43644 -6478 104370 214946 -33948 -133914 20537 18497 181557 -70979
2841 -70979 238345 268202 -51177 283614 67871 -29996 331544 181858 83748 -157040
2831 -157040 38233 140954 333036 371591 103937 375510 739031 91080 188864 150897
2821 150897 38868 120875 346659 -191477 189849 214472 459667 237494 108288 649711
2811 649711 12271 98471 13063 214812 127189 244375 128483 141256 285037 36619
2801 36619 281717 -2383 251265 417302 234912 198623 216243 193670 98733 -158422 31962
2790 31962 101923 -47035 25530 180361 40447 526520 210938 -30146 396707 -158112
$$ packed form
2861A11535k65057J70264P2033K12480l27739p1430N71628j95939l1822P6661
2851C22614k78970n0122J10848J10576k48894r9966J54451k040J63060k52536
2841g0979L09324K9857l19379L34791k15743r7867L61540j49686r8110k40788
2831a57040J95273J02721J92082L8555k67654K71573L63521o47951R7784l7967
2821A50897j12029Q2007K25784n38136L81326K4623K45195k22173j29206N41423
2811F49711o37440Q6200q5408K01749q7623J17186j15892J2773J43781k48418
2801C6619K45098k84100K53648J66037j82390l6289J7620k2573r4937k57155J90384
2790C1962O9961j48958P2565J54831j39914M86073l15582k41084M26853n54819
$$ plain form
2780 -158112 -152016 20510 -314377 -28141 -8146 46407 204279 202291 79745 187420 319219
2769 319219 450981 173531 -153305 553509 253330 250661 71383 387033 -400206 281232
2759 281232 71452 188924 78133 207491 129715 153833 159509 128493 -59703 29332 491565
2748 491565 144669 28084 122240 169894 -107469 37900 32232 348802 104889 38820 118615
2737 118615 72133 277369 147156 495640 103631 50925 174160 214314 144862 105636 37538
2726 37538 -113851 110768 67794 135022 100777 68990 253668 75760 -29668 348005 409929
2715 409929 149814 318116 276003 287434 258549 160448 -212605 107468 512881 254687
2705 254687 -44060 171646 -133221 498739 12429 111227 -65488 94349 436759 120575
$$ packed form
2780a58112O096J72526l34887K86236J9995N4553J57872j988j22546J07675J31799
2769C19219J31762k77450l26836P06814l00179k669j79278L15650p87239O81438
2759B81232k09780J17472j10791J29358p7776K4118N676l1016j88196Q9035M62233
2748D91565l46896j16585R4156M7654k77363J45369n668L16570k43913o6069P9795
2737A18615m6482K05236j30213L48484l92009n2706J23235M0154o9452l9226o8098
2726C7538j51389K24619m2974O7228l4245l1787J84678j77908j05428L77673O1924
2715D09929k60115J68302m2113J1431k8885r8101l73053L20073M05413k58194
2705B54687k98747K15706l04867O31960m86310R8798j76715J59837L42410l16184
$$ plain form
2695 120575 211341 37301 254235 137828 78666 -46099 17147 150028 283471 278019 255857
2684 255857 469215 -65664 224653 317202 23966 60412 410205 -65704 108783 -112146
2674 -112146 219950 522523 350226 320173 -13730 50978 66748 365724 161552 146410
2664 146410 -141382 52311 227451 91030 -146228 296524 -116739 233633 59116 168590
2654 168590 104946 229643 -43854 -46954 71696 374744 -393447 384203 -210583 313904
2644 313904 277042 308044 55946 -226551 -68246 200902 109292 43335 253719 -61259
2634 -61259 439689 170079 -71092 308401 14104 185563 -121372 -20341 205426 119069
2624 119069 89277 -175082 -192024 -222000 49924 -161351 -37555 -20805 205908 330221
$$ packed form
2695A20575R0766j74040K16934j16407n9162j24765O3246J32881J33443n452k2162
2684B55857K13358n34879K90317R2549k93236L6446L49793m75909J74487k20929
2674a12146L32096L02573j72297l0053l33903O4708J5770K98976k04172j5142
2664A46410k87792J93693J75140j36421k37258M42752m13263L50372j74517J09474
2654A68590o3644J24697k73497l100J18650L03048p68191P77650n94786N24487
2644C13904l6862L1002k52098k82497J58305K69148r1610o5957K10384l14978
2634f1259N00948k69610k41171L79493k94297J71459l06935J01031K25767q6357
2624A19069k9792k64359j6942k9976K71924k11275J23796J6750K26713J24313
$$ plain form
2614 330221 168552 4234 228703 -44717 159431 384471 -19694 92148 229226 213710
2604 213710 244585 129425 232721 24061 1670 45951 103701 339773 144817 258860
2594 258860 154911 381248 400790 159689 148281 -15079 -63820 323151 -163328 288008
2584 288008 -24939 -37866 250518 310168 -20833 182412 -35397 -95253 205016 -356577
2574 -356577 133188 -68043 137904 97179 206365 31953 106508 -111021 102376 143448
2564 143448 102231 270680 -313000 180847 39669 28250 197207 -67926 286065 59364
2554 59364 214263 99114 140527 -59586 -206797 21097 264629 445436 239928 199945
2544 199945 -126646 229773 -68129 352416 427921 82458 86154 115484 136507 280245 90815
$$ packed form
2614C30221j61669j64318K24469k73420K04148K25040m04165J11842J37078j5516
2604B13710L0875j15160J03296k08660k2391M4281N7750K36072j94956J14043
2594B58860j03949K26337J9542k41101j1408j63360m8741L86971m86479M51336
2584B88008l12947j2927K88384N9650l31001K03245k17809n9856L00269n61593
2574c56577M89765k01231K05947m0725J09186j74412P4555k17529K13397M1072
2564A43448m1217J68449n83680M93847j41178j1419J68957k65133L53991k26701
2554E9364J54899j15149M1413k00113j47211K27894K43532J80807k05508l9983
2544A99945l26591L56419k97902M20545P5505l45463L696K9330K1023J43738j89430
$$ plain form
2533 90815 -22441 325124 44828 -102347 -364766 571842 -151779 89919 242948 49147
2523 49147 89714 75165 212824 190376 -60099 83337 -56782 445555 -22981 252268
2513 252268 115786 632 127471 229846 -33405 72093 -2360 260311 -117581 109938
2503 109938 1117 42604 89940 155556 -53799 -88132 189283 -105702 39533 81867 37561
2492 37561 151701 401671 -123031 135579 64159 487191 145269 300938 126326 6816
2482 6816 92975 253340 7687 101295 79808 311432 508375 59451 -108271 183803 -167042
2471 -167042 318652 78158 -190227 63773 -169432 136730 -32838 -13757 -65237 258320
2461 258320 238722 -71870 272057 399845 260941 527524 184009 122867 265433 528104
$$ packed form
2533I0815j13256L47565k80296j47175k62419R36608p23621K41698J53029j93801
2523D9147M0567j4549J37659k2448k50475J43436j40119N02337m68536K75249
2513B52268j36482j15154J26839J02375k63251J05498p4453K62671l77892K27519
2503A09938j08821M1487M7336O5616k09355l4333K77415k94985J45235M2334m4306
2492C7561J14140K49970n24702K58610p1420M23032l41922J55669j74612j19510
2482F816Q6159J60365k45653R3608k1487K31624J96943m48924j67722K92074l50845
2471a67042M85694k40494k68385K54000k33205L06162j69568J9081n1480L23557
2461B58320j9598l10592L43927J27788j38904K66583l43515o1142J42566K62671
$$ plain form
2451 528104 325987 324459 -98892 -37989 127804 155780 359008 284346 -208285 236066 -106383
2440 -106383 -10626 189496 -84415 341110 -244463 119948 -45295 353508 245049 187711
2430 187711 -172702 46585 -42613 372505 7659 304213 226568 413443 118978 115446
2420 115446 448525 322436 338042 350089 99984 161474 278901 278107 182212 54174 95806
2409 95806 -145759 225697 7551 67566 16750 13417 30089 66330 -247097 522679 72274
2398 72274 177844 38615 -45777 129274 -37144 33000 323157 -100788 -173482 -21911
2388 -21911 342984 50073 -635 -130231 -86423 -72877 -146693 -148995 13578 -26278 46880
2377 46880 -184604 91006 537043 401187 432787 395806 -3097 -88112 -117215 -28964 139848
$$ packed form
2451E28104k02117j528m23351O0903J65793K7976K03228p4662m92631M44351l42449
2440a06383R5757K00122k73911M25525n85573L64411j65243L98803j08459n7338
2430A87711l60413K19287q9198M15118l64846K96554p7645J86875k94465l532
2420A15446L33079j26089J5606J2047k50105O1490J17427p94r5895j28038M1632
2409I5806k41565L71456k18146O0015n0816l333J6672L6241l13427P69776m50405
2398G2274J05570j39229q4392J75051j66418P0144K90157m23945p2694J51571
2388b1911L64895k92911n0708j29596M3808J3546p3816k302J62573l9856P3158
2377D6880k31484K75610M46037j35856L1600l6981l98903q5015k9103Q8251J68812
$$ plain form
2366 139848 50271 84204 184968 206148 99697 31738 -11934 45825 12912 -17935 205580
2355 205580 497340 15817 213549 456756 -65068 313389 175543 -2269 281914 -42035
2345 -42035 -98735 115082 73493 -168586 -221057 117716 243979 -51848 -62817 -66936 291332
2334 291332 139664 56290 39074 97990 292842 83472 234565 455410 101251 179575
2324 179575 -155361 245077 -234171 290259 154401 -24513 83489 408422 -236405 -227823
2314 -227823 49665 -41294 226816 163371 -276656 139275 -56539 144763 132558 49567
2304 49567 -4666 62763 83323 254617 -372105 -176954 278762 21301 15740 -22339 164433
$$ packed form
2366A39848q9577L3933J00764K1180j06451o7959m3672N7759l2913l0847K23515
2355B05580K91760m81523J97732K43207n21824L78457j37846j77812K84183l23949
2345d2035n6700K13817m1589k42079n2471L38773J26263k95827j0969m119L58268
2334B91332j51668q3374j7216N8916J94852k09370J51093K20845l54159P8324
2324A79575l34936M00438m79248N24430j35858j78914J08002L24933o44827Q582
2314b27823K77488r0959K68110o3445m40027M15931j95814K01302j2205q2991
2304D9567n4233O7429K0560J71294o26722J95151M55716k57461n561l8079J86772
$$ [...]
##END NTUPLES=NMR SPECTRUM
##END=
