##TITLE=1H_EC-3316(II-31)X2
 DMSO
 8 sc, 
 2.12.2024
##JCAMPDX= 6.0         $$ Bruker NMR JCAMP-DX V2.0
##DATA TYPE= NMR SPECTRUM
##DATA CLASS= NTUPLES
##ORIGIN= UXNMR, Bruker Analytische Messtechnik GmbH
##OWNER= root
$$ XWIN-NMR		Version 3.5
$$ Mon Dec  2 13:57:56 2024 Russian Standard Time (UT+4h)  she@DPX200
##.OBSERVE FREQUENCY= 200.1315
##.OBSERVE NUCLEUS= ^1H
##.ACQUISITION MODE= SIMULTANEOUS
##.ACQUISITION SCHEME= undefined
##.AVERAGES= 8
##.DIGITISER RES= 18
##SPECTROMETER/DATA SYSTEM= spect
##.PULSE SEQUENCE= zg30
##.SOLVENT NAME= DMSO
##.SHIFT REFERENCE= (INTERNAL, DMSO, 0, 19.5518)
##AUDIT TRAIL= $$ (NUMBER, WHEN, WHO, WHERE, WHAT)
$$ ##TITLE= Audit trail, XWIN-NMR		Version 3.5
$$ ##JCAMPDX= 5.01
$$ ##ORIGIN= Bruker BioSpin GmbH
$$ ##OWNER= she
$$ F:/spectra/data/she/nmr/H-F/1/pdata/1/auditp.txt
$$ ##AUDIT TRAIL=  $$ (NUMBER, WHEN, WHO, WHERE, WHAT)
(   1,<2024-12-02 13:56:48.92 +0400>,<she>,<DPX200>,
      <created by zg, POWCHK disabled, PULCHK disabled
       configuration hash MD5:
       00 E9 B6 7A A2 85 ED C7 34 08 36 98 17 FE 4E 26
       data hash MD5: 16K
       BD 34 32 CD 64 A5 51 29 1A AB 3A 12 29 0C 41 D0>)
(   2,<2024-12-02 13:56:52.28 +0400>,<she>,<DPX200>,
      <Start of raw data processing
       efp BC_mod = 2 LB = 0.24 FT_mod = 6 PKNL = 1 PHC0 = -26717.44 PHC1 = 15.58744 SI = 16K 
       data hash MD5: 16K
       40 81 54 6D EB 1B EE 74 5A D9 CE 32 EA 7E 0E 47>)
(   3,<2024-12-02 13:57:10.85 +0400>,<she>,<DPX200>,
      <pk PHC0 = -1.373469 PHC1 = -1.2 
       data hash MD5: 16K
       74 94 A1 F1 7E EC A2 32 48 10 D9 FB 9E 9B 6B 56>)
(   4,<2024-12-02 13:57:14.17 +0400>,<she>,<DPX200>,
      <abs ABSG = 5 
       data hash MD5: 16K
       F5 C5 89 5A 39 89 2C D3 BF FA 99 5C 6E C1 57 74>)
$$ ##END=
$$ 
$$ hash MD5
$$ D7 4E 77 5D 10 10 BF 95 61 A3 B6 DE EA 04 78 92
##$RELAX= 
##$RELAX= 
##$RELAX= 
##$RELAX= 
##$RELAX= 
##$RELAX= 
$$ Bruker specific parameters
$$ --------------------------
##$DU= <F:/spectra>
##$EXPNO= 1
##$NAME= <H-F>
##$PROCNO= 1
##$TYPE= <nmr>
##$USER= <she>
##$AMP= (0..31)
100 100 100 100 100 100 100 100 100 100 100 100 100 100 100 100 100 100 
100 100 100 100 100 100 100 100 100 100 100 100 100 100 
##$AQSEQ= 0
##$AQ_mod= 1
##$AUNM= <au_zg>
##$AUTOPOS= <>
##$BF1= 200.13
##$BF2= 200.13
##$BF3= 200.13
##$BF4= 200.13
##$BF5= 200.13
##$BF6= 200.13
##$BF7= 200.13
##$BF8= 200.13
##$BYTORDA= 1
##$CFDGTYP= 0
##$CFRGTYP= 5
##$CHEMSTR= <none>
##$CNST= (0..31)
1 1 145 1 1 1 1 1 1 1 1 1 1 1 1 1 1 1 1 1 1 1 1 1 1 1 1 1 1 1 1 1 
##$CPDPRG= <>
##$CPDPRG1= <>
##$CPDPRG2= <>
##$CPDPRG3= <>
##$CPDPRG4= <mlev>
##$CPDPRG5= <mlev>
##$CPDPRG6= <mlev>
##$CPDPRG7= <mlev>
##$CPDPRG8= <mlev>
##$CPDPRGB= <>
##$CPDPRGT= <>
##$D= (0..31)
0 1.2 0 0 0 0 0 0 0 0.06 0 0.03 0 0 0 0 0.0002 0 0 0 0 0 0 0 0 0 0 0 0 
0 0 0 
##$DATE= 1733133408
##$DBL= (0..7)
120 120 120 120 120 120 120 120 
##$DBP= (0..7)
150 150 150 150 150 150 150 150 
##$DBP07= 0
##$DBPNAM0= <>
##$DBPNAM1= <>
##$DBPNAM2= <>
##$DBPNAM3= <>
##$DBPNAM4= <>
$$ [...]
##$SUBNAM3= <"">
##$SUBNAM4= <"">
##$SUBNAM5= <"">
##$SUBNAM6= <"">
##$SUBNAM7= <"">
##$SUBNAM8= <"">
##$SUBNAM9= <"">
##$SW= 24.0689530833862
##$SWIBOX= (0..15)
0 0 2 0 0 0 0 0 0 0 0 0 0 0 0 0 
##$SW_h= 4816.95568400771
##$TD= 16384
##$TD0= 1
##$TE= 0
##$TE2= 300
##$TE3= 300
##$TEG= 300
##$TL= (0..7)
0 120 120 120 120 120 120 120 
##$TP= (0..7)
150 150 150 150 150 150 150 150 
##$TP07= 0
##$TPNAME0= <>
##$TPNAME1= <>
##$TPNAME2= <>
##$TPNAME3= <>
##$TPNAME4= <>
##$TPNAME5= <>
##$TPNAME6= <>
##$TPNAME7= <>
##$TPOAL= (0..7)
0.5 0.5 0.5 0.5 0.5 0.5 0.5 0.5 
##$TPOFFS= (0..7)
0 0 0 0 0 0 0 0 
##$TUNHIN= 0
##$TUNHOUT= 0
##$TUNXOUT= 0
##$USERA1= <user>
##$USERA2= <user>
##$USERA3= <user>
##$USERA4= <user>
##$USERA5= <user>
##$V9= 5
##$VALIST= <valist>
##$VCLIST= <CCCCCCCCCCCCCCC>
##$VD= 0
##$VDLIST= <DDDDDDDDDDDDDDD>
##$VPLIST= <PPPPPPPPPPPPPPP>
##$VTLIST= <TTTTTTTTTTTTTTT>
##$WBST= 1024
##$WBSW= 4
##$XGAIN= (0..3)
0 0 0 0 
##$XL= 0
##$YL= 0
##$YMAX_a= 489928
##$YMIN_a= -361468
##$ZGOPTNS= <>
##$ZL1= 120
##$ZL2= 120
##$ZL3= 120
##$ZL4= 120
##$ABSF1= 19.55176
##$ABSF2= -4.517374
##$ABSG= 5
##$ABSL= 3
##$ALPHA= 0
##$AQORDER= 0
##$ASSFAC= 0
##$ASSFACI= 0
##$ASSFACX= 0
##$ASSWID= 0
##$AUNMP= <proc_1d>
##$AZFE= 0.1
##$AZFW= 0.1
##$BCFW= 0
##$BC_mod= 2
##$BYTORDP= 0
##$COROFFS= 0
##$CY= -3
##$DATMOD= 1
##$DC= 0
##$DFILT= <>
##$DTYPP= 0
##$F1P= 0
##$F2P= 0
##$FCOR= 1
##$FTSIZE= 16384
##$FT_mod= 6
##$GAMMA= 0
##$GB= 0
##$INTBC= 1
##$INTSCL= 2.524811e-10
##$ISEN= 128
##$LB= 0.24
##$LEV0= 0
##$LPBIN= 0
##$MAXI= 10000
##$MC2= 0
##$MEAN= 0
##$ME_mod= 0
##$MI= 1.114404
##$NCOEF= 0
##$NC_proc= -5
##$NLEV= 6
##$NOISF1= 3.799351
##$NOISF2= 2.8
##$NSP= 0
##$NTH_PI= 0
##$NZP= 0
##$OFFSET= 19.55176
##$PC= 1
##$PHC0= -26718.81
##$PHC1= 14.38744
##$PH_mod= 1
##$PKNL= yes
##$PPARMOD= 0
##$PSCAL= 0
##$PSIGN= 0
##$REVERSE= no
##$SF= 200.129995583378
##$SI= 16384
##$SIGF1= 3
##$SIGF2= 2
##$SINO= 5.538805
##$SIOLD= 16384
##$SREGLST= <1H.CDCl3>
##$SSB= 0
##$STSI= 16384
##$STSR= 0
##$SW_p= 4816.95568400771
##$SYMM= 0
##$S_DEV= 0
##$TDeff= 16384
##$TDoff= 0
##$TI= <>
##$TILT= no
##$TM1= 0
##$TM2= 0
##$TOPLEV= 0
##$USERP1= <user>
##$USERP2= <user>
##$USERP3= <user>
##$USERP4= <user>
##$USERP5= <user>
##$WDW= 1
##$XDIM= 16384
##$YMAX_p= 415481689
##$YMIN_p= -175807
$$ End of Bruker specific parameters
$$ ---------------------------------
##NTUPLES= NMR SPECTRUM
##VAR_NAME=  FREQUENCY,     SPECTRUM/REAL,   SPECTRUM/IMAG
##SYMBOL=    X,             R,               I
##VAR_TYPE=  INDEPENDENT,   DEPENDENT,       DEPENDENT
##VAR_FORM=  AFFN,          ASDF,            ASDF
##VAR_DIM=   16384,         16384,           16384
##UNITS=     HZ,            ARBITRARY UNITS, ARBITRARY UNITS
##FACTOR=    0.29402158847633, 1,            1
##FIRST=     3912.89358638057, 0,            0
##LAST=      -904.062097627136, 0,           0
##MIN=       -904.062097627136, -175807,     0
##MAX=       3912.89358638057, 415481689,    0
$$ Real data points
##PAGE= N=1
##DATA TABLE= (X++(R..R)), XYDATA
$$ [...]
8823F3387K9828J218l7901P9661m7958j41445J6684R3765K1173j6228l239j0393
8811D8552m2322N4257M3131j0690K7601j0011J8899n8414n2187O6972P4819J8726
8799A79333q4606Q0695k08p877N243M3046l9413l2044J8610K889M9631o0351K1314
8786A76262K3597J6939L9229p2325J2077n7250O5177O3417r7301p102j0833l6232
8774A15655J02477p7689l004n448K3080O7618l7640m5857M4782q120j2489n524
8762A57841O8641J6451R424o7369N5874l9229j8878P1916J468k0211J8195K9143
8750B83266O5935j4780j903K0505k2119l1641L8453l7595n1356R5183j3358M814
8738C35404Q0500r209k6746l8580M8288l6891k7558J18086p8646M7493m3549R5487
$$ plain form
8823 63387 93215 94433 56532 136193 88235 -53210 -36526 57239 78412 62184 58945 48552
8811 48552 6230 60487 103618 92928 120529 110518 129417 71003 18816 85788 160607 179333
8799 179333 94727 175422 175214 167337 172580 215626 176213 144169 162779 165668 215299 154948 176262
8786 176262 199859 216798 256027 183702 195779 138529 203706 267123 169822 162720 151887 115655
8774 115655 218132 140443 137439 131991 155071 222689 185049 139192 183974 175854 163365 157841
8762 157841 226482 242933 252357 184988 240862 201633 182755 254671 256139 235928 254123 283266
8750 283266 349201 334421 332518 353023 330904 299263 337716 300121 248765 343948 330590 335404
8738 335404 415904 406695 379949 341369 389657 352766 325208 443294 364648 412141 368592 464079
8726D64079K3253J4236M3060p4615Q663L2194J0014O9869J455N8711k1580K5669
8714F55008O2632j7412R692l958R5776J14188M9739n2956M0481N2276J23313l3790
8702A094989l1605R3163N0249N553Q0614N0507Q8506P8473k934J61146M3157J14889
8690A826707Q9378K4354J01246O6019J38239J76178J55844J89789P9832K32685
8680C080271J57822J72087K88216K17751K44698L43365K95417M78011M00157M99456
8670F177251O62360Q20231R89931J099612J328583J366280J439602J210582Q58606
8661A5953038N38883J12572k44651o46545r20147j112103j224106j038526q95166
8652A0523249o76318m41005l28909j31865j7165l04J74364K52610K53969M87777
$$ plain form
8726 464079 487332 501568 544628 470013 478676 510870 520884 590753 592208 650919 629339 655008
8714 655008 717640 700228 709920 705962 801738 915926 965665 912709 953190 1005466 1128779 1094989
8702 1094989 1063384 1156547 1206796 1212349 1292963 1343470 1431976 1510449 1507515 1668661 1711818 1826707
8690 1826707 1916085 1940439 2041685 2107704 2245943 2422121 2577965 2767754 2847586 3080271
8680 3080271 3238093 3410180 3698396 3916147 4160845 4504210 4799627 5277638 5677795 6177251
8670 6177251 6839611 7659842 8649773 9749385 11077968 12444248 13883850 15094432 15953038
8661 15953038 16491921 16604493 16359842 15713297 14793150 13681047 12456941 11418415 10523249
8652 10523249 9846931 9405926 9077017 8945152 8927987 8927683 9102047 9354657 9608626 10096403
8642A0096403O95583R80852J199963J245950J279131J140909R03168L45420o4823
8633A7822556o22209j058670j220302j414819j374948j318180j132115r42426
8625H738887p55139n40419n70344l42383l24285l67957l51953l43774k24045k77126
8615D641462l43686k09912j41272j21181j71187k00965j60882j06568j78407n6957
8605B950445j28751j1211q6442j66034j20138m3151r447p8248r2365j37179j3873
8594B063606l0591j24990m5523l440j69681k9235l4854n6601k0734q8051K5493
8583A485399K4734j07077n7524k9064P0046q6890j9270j11005K0392p553p4767
8572A107421q4365l8422J3745p9785j4891J05202K026r0181L3531p0692J7944
$$ plain form
8642 10096403 10791986 11772838 12972801 14218751 15497882 16638791 17541959 17887379 17822556
8633 17822556 17200347 16141677 14921375 13506556 12131608 10813428 9681313 8738887
8625 8738887 7983748 7443329 6872985 6530602 6206317 5838360 5486407 5142633 4918588 4641462
8615 4641462 4297776 4087864 3946592 3825411 3654224 3453259 3292377 3185809 3007402 2950445
8605 2950445 2821694 2810483 2724041 2558007 2437869 2394718 2385271 2307023 2214658 2077479 2063606
8594 2063606 2033015 1908025 1862502 1859062 1689381 1660146 1625292 1568691 1547957 1459906 1485399
8583 1485399 1510133 1403056 1345532 1316468 1386514 1299624 1280354 1169349 1189741 1182188 1107421
8572 1107421 1023056 984634 998379 918594 903703 1008905 1010931 920750 954281 883589 901533
8561I01533K4592M8426m8957P539l2628j35801L7182l6980K0435M1171q2569j7597
8549G26346L8128j0890P997o4140L4144K8608r5824l4015L0501j06217j7010J00302
8537F37930j6439l3563P2247p0314o3677Q9977m9685j4069O618Q458M2680j5735
8525E94428K8894K4260K358q2241k183J1511L616R6609N8069O21J3840k7705l127
8512G18950J4790l4393n6275K286p3023m5266O861O8773Q703q0446r5553l1255
8500D04152j491j4600k9458j4699R9798r6352J8949L8942l1348r4740J2654P8598
8488C70405O6510r6430K798J7618O5698P6417k32289M347J7747j9212j9853k7366
8476B26390K7152m3848O5193l0513N2699J8240j8575j4503j12668k8156J07630
$$ plain form
8561 901533 926125 974551 925594 933133 900505 764704 801886 764906 785341 826512 743943 726346
8549 726346 764474 753584 761581 697441 731585 760193 664369 630354 660855 554638 537628 637930
8537 637930 621491 587928 660175 589861 526184 616161 566476 552407 559025 567483 610163 594428
8525 594428 623322 647582 649940 567699 565516 577027 580643 677252 735321 735942 749782 722077 718950
8512 718950 733740 699347 643072 645358 572335 527069 533930 602703 611406 530960 435407 404152
8500 404152 402661 388061 358603 343904 443702 347350 366299 405241 373893 279153 291807 370405
8488 370405 436915 340485 343283 360901 426599 503016 270727 275074 292821 273609 253756 226390
8476 226390 253542 209694 274887 244374 297073 315313 296738 282235 169567 141411 249041
8465B49041J1181M0906P42j6164n8124M6786j1302n3102J6131L2427k334k0048
8453B36140n642J06865K1463l7271p1278l733m846L972J4226J1829J0712L1842
8441C14279M6271m6486r5690L1747Q546K1802O4098k0362j1802M6973j1858N076
8429C52594K4040j02565N0930M8009p1608J7413O5846l5825N0327p6492l561N3221
8417C72329O2371m7103J2589R006L543L3440m3762j36309M4070o335L5600M4864
8405C84303R195m1348R6937L6965q289q983n6780L7474M4448j4849m6370L1613
8393D64316J9414J1459P223n7593J3952N7018l8673J3404O4902n9370L5096m380
8381E26768J4179K710j16457M2812L5849J8664J2413j2783l4007m4084j7252J36477
$$ plain form
8465 249041 260222 301128 301870 285706 227582 274368 263066 209964 226095 258522 256188 236140
8453 236140 230498 337363 358826 321555 250277 246544 241698 245670 259896 271725 282437 314279
8441 314279 360550 314064 218374 250121 258667 280469 344567 324205 312403 359376 347518 352594
8429 352594 376634 274069 324999 373008 301400 318813 384659 348834 399161 322669 319108 372329
8417 372329 434700 387597 400186 409192 412735 446175 402413 266104 310174 303839 339439 384303
8405 384303 393498 352150 449087 486052 477763 468780 412000 449474 493922 479073 432703 464316
8393 464316 483730 495189 502412 444819 458771 515789 477116 490520 555422 496052 531148 526768
8381 526768 540947 543657 427200 470012 505861 524525 536938 524155 490148 446064 428812 565289
8369E65289r8724N4774K4042K1354p4949k2441J46679j08602j0426K5714q732
8358E13978N3342R180K6250N3837j69090J26585r388o1683L1567k4290P4572K0116
8346F44976n647L8193k6686L0077J6314k0086J20126q4865k6306r83j7749l4760
8334F32604Q1475J3581N0430J6815n4153P3831L0424L85j6720L7181K4207M3146
8322I33206M6783N0327J1129L0015k5804N9734L4524Q4281M541K5297J05197N3871
8310A413101K0277P4569J18800K7001Q3624Q4619Q5457J25568J71601L1593N7933
8299B294143l6114J44332J00127p374J21767J42394Q6649J00134J17242J69579
8289C232879J88022J15212J69549K42524K19631K99192K93320L33266N45301M34241
$$ plain form
8369 565289 466565 521339 545381 566735 491786 469345 616024 507422 496996 522710 513978
8358 513978 567320 576500 602750 656587 487497 614082 604694 543011 574578 550288 624860 644976
8346 644976 639329 677522 650836 680913 697227 677141 797267 712402 686096 685113 667364 632604
8334 632604 714079 727660 778090 794905 740752 814583 845007 845392 828672 865853 890060 933206
8322 933206 979989 1030316 1041445 1071460 1045656 1105390 1139914 1224195 1228736 1254033 1359230 1413101
8310 1413101 1433378 1507947 1626747 1653748 1737372 1821991 1907448 2033016 2204617 2236210 2294143
8299 2294143 2258029 2402361 2502488 2495114 2616881 2759275 2845924 2946058 3063300 3232879
8289 3232879 3420901 3536113 3705662 3948186 4167817 4467009 4760329 5093595 5638896 6073137
8279F073137O04582O84413Q85240R47124J062908J035799Q92859P63626L59804
8270A3309492m8565l61693o78218p94182p69367p50215o75975m82554l63988k33168
8260H151567m9004l0495Q7144J49459K83937L25731M11513M43123O83518Q11632
8250A1268125R83405J216743J434618J573633J549163J304996R09128M04689j81922
8241B0462578q74663j288944j617673j628808j566888j347057j103377r83693
8233A0051475p19952n97690l81468m59545l71466l34053l01233j60209j51384
8224F574475j18729j87698j95772p6311p8875j40340k12405j01693j19016M109
8214E347745k707j04936L8243j06389M946Q3231K9012o8422L0666K2027K993J06454
$$ plain form
8279 6073137 6677719 7362132 8247372 9194496 10257404 11293203 12186062 12949688 13309492
8270 13309492 13260927 12899234 12221016 11426834 10657467 9907252 9231277 8748723 8384735 8151567
8260 8151567 8102563 8072068 8159212 8308671 8592608 8918339 9329852 9772975 10456493 11268125
8250 11268125 12251530 13468273 14902891 16476524 18025687 19330683 20239811 20644500 20462578
8241 20462578 19587915 18298971 16681298 15052490 13485602 12138545 11035168 10051475
8233 10051475 9331523 8733833 8352365 7892820 7521354 7187301 6886068 6725859 6574475
8224 6574475 6455746 6268048 6072276 5995965 5917090 5776750 5564345 5462652 5343636 5347745
8214 5347745 5345038 5240102 5278345 5171956 5176902 5260133 5289145 5220723 5251389 5273416 5276409 5382863
8202E382863P3363J7353L0783J69877J41360J85241J34647L37354K41279L43568
8192G057688l5992N76060Q83246P51861R47125P01652O76943M80270L07200M5754
8182A2391807j60204l31174n33679p14313n63794m94285k13923j77619j27436
8173I075380L9838O4832J29834L42954K95357N03727O55760Q03428R94030J106403
8163A4011543J110131R68232P08313N10177K33196j07282m61703p36221q61158
8154A5375228r93871r20586q91880p71854p23652o73471m73797k14725k57266
8145I454126j48183j86293m8316K0024n0908K02642K15217M40261M32125N37359
8135A0868054N35246M29609J83516J10373p0855k05743k60939n13148n01834n72565
$$ plain form
8202 5382863 5456226 5473579 5504362 5674239 5815599 6000840 6135487 6472841 6714120 7057688
8192 7057688 7021696 7597756 8481002 9232863 10179988 10881640 11558583 12038853 12346053 12391807
8182 12391807 12231603 11900429 11366750 10652437 10088643 9594358 9380435 9202816 9075380
8173 9075380 9115218 9180050 9309884 9652838 9948195 10451922 11107682 11911110 12905140 14011543
8163 14011543 15121674 16089906 16798219 17308396 17541592 17434310 16972607 16236386 15375228
8154 15375228 14381357 13460771 12568891 11797037 11073385 10399914 9926117 9711392 9454126
8145 9454126 9305943 9119650 9071334 9091358 9040450 9243092 9458309 9898570 10330695 10868054
8135 10868054 11403300 11832909 12016425 12126798 12055943 11850200 11589261 11076113 10574279 10001714
8125A0001714m90930m89244l47540k46651k66969j03025n3303K0615N6416K34266
8115H315349K53069K92044M23263K69888K53606k3288l09417l94687l50558l18738
8105H410531j83951q2134q3230J41979K35062K97530L69536M35433L24524R7432
8095I962712p1170k61355m54580l64028l80273k15272j65320p7734J08344J59561
8085H240885M17322L30613N59741M19227K39411J13800k85002m47252l83294l98385
8075H807066m17711l20565j04429J582J07237J49740J84115K23077K82713J68155
8065I080980J67351j19769k65929l49621l81136l54948k40139j95314j46488q1996
8055G112991q2290N2347N8989J22046J16466J88541K22883M04465L08641M13346
$$ plain form
8125 10001714 9510784 9021540 8674000 8427349 8160380 8057355 8004052 8024667 8081083 8315349
8115 8315349 8568418 8860462 9283725 9553613 9807219 9783931 9474514 9079827 8729269 8410531
8105 8410531 8226580 8144446 8061216 8203195 8438257 8735787 9105323 9540756 9865280 9962712
8095 9962712 9891542 9630187 9175607 8811579 8431306 8216034 8050714 7972980 8081324 8240885
8085 8240885 8658207 8988820 9548561 9967788 10207199 10320999 10035997 9588745 9205451 8807066
8075 8807066 8389355 8068790 7964361 7965943 8073180 8222920 8407035 8630112 8912825 9080980
8065 9080980 9248331 9128562 8862633 8513012 8131876 7776928 7536789 7341475 7194987 7112991
8055 7112991 7030701 7083048 7142037 7264083 7380549 7569090 7791973 8196438 8505079 8918425
8045H918425N47463N23796N70835O47463O27868M67518M64725M39793K73187K30354
8035A3711427K79623L56559N43408N59807N68034N09802N56127M69586L36063
8026A7890436J78473l075k40883o15405p36375q29789r49162o96005n10733l03218
8016A3184264r2368M8359K05488M00247N80089N62871P83813R23778R82708J085868
8006A8665117J146593J074026J110427J188154J164017R86007M11126j29993o07769
7997B5007705j256053j752398j926750j939915j793025j458199j183234r83558
7989A2714573o14443o30895m92948l64382l52770k44693k30925J3970J19001K37601
7979A0154089L26662M12398L23122K74366J02179j63766n46402n79107p24505
$$ plain form
8045 8918425 9465888 9989684 10560519 11207982 11835850 12303368 12768093 13207886 13481073 13711427
8035 13711427 13991050 14347609 14891017 15450824 16018858 16528660 17084787 17554373 17890436
8026 17890436 18068909 18065834 17824951 17209546 16473171 15643382 14694220 13998215 13487482 13184264
8016 13184264 13091896 13140255 13345743 13745990 14326079 14888950 15672763 16596541 17579249 18665117
8006 18665117 19811710 20885736 21996163 23184317 24348334 25334341 25745467 25615474 25007705
7997 25007705 23751652 21999254 20072504 18132589 16339564 14881365 13698131 12714573
7989 12714573 12100130 11469235 10976287 10611905 10259135 10014442 9783517 9797487 9916488 10154089
7979 10154089 10480751 10893149 11216271 11490637 11592816 11429050 10882648 10303541 9579036
7970I579036p83958q05057o53057m65330m63771k97123k85458k67627k50435k94642
7960E012578j45638j55695k32474k10180k12758j61969j04110j51332j38049r6258
7950C404115q9804j65463o9718j10798n988p6980k01243j47196j1082n4491n7828
7939B413524K5641j8096n6140o8848k4612r7481j00646j02448p8601k0939j2232
7928A859122l1176j2168j5832l9847j7268r1201o9225N4851k7444n2635q9037
7917A468140K5603N0536n7633k0184k4118j2870P0183r509q3406o2804n7324N84
7905A287198N8424r3232j6150P5815j0926j764q1414Q3464J05751n3812l7613
7894A315741R166P736k5012L1075r4602N9661R4626M0834q4246J8739k8913L7879
$$ plain form
7970 9579036 8795078 7990021 7336964 6871634 6407863 6110740 5825282 5557655 5307220 5012578
7960 5012578 4866940 4711245 4478771 4268591 4055833 3893864 3789754 3638422 3500373 3404115
7950 3404115 3314311 3148848 3079130 2968332 2962344 2885364 2684121 2536925 2525843 2471352 2413524
7939 2413524 2439165 2421069 2364929 2296081 2271469 2173988 2073342 1970894 1892293 1871354 1859122
7928 1859122 1827946 1815778 1799946 1760099 1742831 1651630 1582405 1637256 1609812 1557177 1468140
7917 1468140 1493743 1544279 1486646 1466462 1442344 1429474 1499657 1490148 1406742 1343938 1286614 1287198
7905 1287198 1345622 1252390 1236240 1312055 1301129 1299365 1217951 1301415 1407166 1353354 1315741
7894 1315741 1324907 1332643 1307631 1338706 1244104 1303765 1398391 1439225 1354979 1373718 1344805 1382684
7882A382684o233j325M9223N9394Q1525n2255m4472R4090M3219k6384P2536M1986
7870A693988Q0853J50356J01006N6079P8292J52873R8139Q0962J03374J43141
7860B739063J74876K66006J53151K11872K02396J02331J91070K71085K50629L01456
7850D863935K93920N3102l8496M5297p6516q4992p1382L1529J10354k1768n86
7839E104397j72438j81886j28844n8086l8566p3293P0686m4551L4152J96862J34544
7828D842977K91081K98213K50381K49338L45084J84122K68763M25441M40911L82524
7818G978835K68949J29172j14374j95430k23274j88125j64259l3551j15501k63380
7808G079062j76054n03267l90189l93946k80359m06990l07001j90516q3176n5483
$$ plain form
7882 1382684 1376451 1375126 1424349 1483743 1565268 1513013 1468541 1562631 1605850 1579466 1652002 1693988
7870 1693988 1774841 1925197 2026203 2082282 2160574 2313447 2411586 2492548 2595922 2739063
7860 2739063 2913939 3179945 3333096 3544968 3747364 3849695 4040765 4311850 4562479 4863935
7850 4863935 5157855 5210957 5172461 5217758 5141242 5056250 4984868 5016397 5126751 5104983 5104397
7839 5104397 4931959 4750073 4621229 4563143 4524577 4451284 4521970 4477419 4511571 4708433 4842977
7828 4842977 5134058 5432271 5682652 5931990 6277074 6461196 6729959 7155400 7596311 7978835
7818 7978835 8247784 8376956 8262582 8067152 7843878 7655753 7491494 7457943 7342442 7079062
7808 7079062 6903008 6399741 6009552 5615606 5335247 4928257 4621256 4430740 4347564 4292081
7798D292081j21657k4753L8351l474L7116Q5844m5571j6839J46073K12503R9815
7787D699489P0678L5914p1485k67365j47778j11567n2099j11984m6622o2980k19684
7776C714517j79669l22088k76903j55668k22118j59332j30420l5760j81679q6409
7766A964471j01369j07497m0266m2041j08887n3401J3326p1369n6021J8216J7153
7755A432315p9745j37679P9775o2873p2510M2951r916k7006p8618P373M1631m989
7743A130709j3237K5664l3666J249k6082K8384l5464p4324j326j6203m2639N603
7731I48668n8796n5460l2368r1712J14958N1195r4823j22655m3434L3274l9821
7720F09026k000K7570l1035n0786l06l7617J6023L1638o0884k5956j1056q1228
$$ plain form
7798 4292081 4170424 4145671 4184022 4180548 4217664 4303508 4257937 4241098 4387171 4599674 4699489
7787 4699489 4770167 4806081 4734596 4467231 4319453 4207886 4155787 4043803 3997181 3934201 3714517
7776 3714517 3534848 3212760 2935857 2780189 2558071 2398739 2268319 2232559 2050880 1964471
7766 1964471 1863102 1755605 1715339 1673298 1564411 1511010 1524336 1452967 1396946 1415162 1432315
7755 1432315 1352570 1214891 1294666 1231793 1159283 1202234 1192318 1165312 1086694 1094067 1135698 1130709
7743 1130709 1117472 1143136 1109470 1110719 1084637 1113021 1077557 1003233 1001907 985704 943065 948668
7731 948668 889872 834412 802044 710332 825290 876485 781662 659007 615573 648847 609026
7720 609026 607026 634596 603561 552775 552469 514852 530875 562513 501629 475673 464617 383389
7708C83389J5891J5866Q724k4056p5135L826M6302l0497n7789R2943K6301r2236
7696C13529j6303l7322O571p389J4757k1945K4801p2213J1534M735K7317Q574
7684B56646j8969J4331l9128M1280M1429m6136p448O029n9696J9488K6491J7549
7672B51866M6228k0441q3981l9843l5698L2198m1589M1311L9028j3370m9027j8758
7660A07924N1123m975k0639j2767n945L1830O0202K1905q2713O453k5582o3484
7648F3332K0387n5510R7472l9914M2963K4601k0471l0686k5213q688N5255j8732
7636A04796q772j2163j6506l5873J5778K999j5579M7903P386M7268P7795l8354
7624A76678n2923p3569j8488N5478r3208N7281j6528J2346l5963M7266l719M739
$$ plain form
7708 383389 399280 415146 423870 399814 324679 328505 374807 344310 286521 379464 405765 313529
7696 313529 297226 259904 266475 259086 273843 251898 276699 204486 216020 220755 248072 256646
7684 256646 237677 252008 212880 254160 295589 249453 242005 248034 188338 207826 234317 251866
7672 251866 298094 277653 193672 153829 118131 150329 108740 150051 189079 175709 126682 107924
7660 107924 159047 154072 133433 120666 114721 146551 206753 228658 145945 152398 126816 63332
7648 63332 83719 28209 125681 85767 128730 153331 132860 102174 76961 68273 123528 104796
7636 104796 96024 83861 67355 31482 47260 50259 34680 82583 89969 137237 215032 176678
7624 176678 123755 50186 31698 87176 -6032 51249 34721 47067 11104 58370 54651 59390
7612E9390n0693Q5598o9165m5484N5402N5032k9039k8723K3299j855M7717J0505
7600A11984o9679J7499o469j5029N8542K7440r296m2870R493o5423O3313L8385
7588A17890n2598O8083o3019n2887r666N1881N472J4879N2421q9008J7107J12085
7576A72640q4803O6459k6855n1660m6552K6212L4157n9553P69j1623J8279N9153
7564I6623J8204j03629J00761n7133n4252M9353l5956j2524M3674p5251O5996
7553C5866J6974k7524J6075o720m2890R788N6095O5948k2933l405p190Q762o0484
7540C8362m2503M344M1359K317J486q3609l0391J06731m2171M9992M853n8253
7528g483l0616R7671k6226K8489k7455p0509M4445L8849k4320o8021Q5035K2061
$$ plain form
7612 59390 8697 94295 25130 -20354 35048 90080 61041 32318 55617 53762 101479 111984
7600 111984 42305 59804 53335 38306 96848 124288 114992 72122 81615 16192 79505 117890
7588 117890 65292 133375 70356 17469 7803 59684 65156 80035 132456 43448 60555 172640
7576 172640 87837 154296 127441 75781 29229 55441 89598 30045 30814 19191 37470 96623
7564 96623 114827 11198 111959 54826 574 49927 13971 1447 45121 -30130 35866
7553 35866 52840 25316 41391 34671 -8219 1569 57664 123612 100679 97274 90084 98846 38362
7540 38362 -4141 203 41562 43879 45365 -38244 -68635 38096 -4075 45917 50770 -7483
7528 -7483 -38099 59572 33346 61835 34380 -36129 8316 47165 22845 -45176 39859 61920
7516F1920r3255k8798L8148j74k1317K6410K4253k6684j395L8535L0535o7573
7504a9395J1811K8642l2046P8966m671n5859Q909J8305Q7911o1893p595l8306
7492A4779l6429n3901J02922j5878O345j8391q3684Q1896N4844k4483n8015n838
7480c5833j1114l916N1114J1078r693J9279l5537Q0166l175L448p2325N6748j3502
7467C6738m9604p1739L689M0284N650K289l4575L4905k3788J7531M5495o610P6988
7454G7253L7131j25173L2198L8443r3648k0767P4066o6317k259j8567l614L4144
7442c7110n2131O5004k6573l4645M5460j1815P0993n2511M8860M0843k0342m534
7430C1499O3246m347k2618l2277k9100N8307N264R20n3050o3257m1134J02412
$$ plain form
7516 61920 -31335 -60133 -21985 -22159 -43476 -17066 7187 -19497 -20892 17643 48178 -19395
7504 -19395 -7584 21058 -10988 67978 63307 7448 16357 34662 122573 60680 53085 14779
7492 14779 -21650 -75551 27371 11493 17838 -553 -84237 -2341 52503 28020 -29995 -35833
7480 -35833 -46947 -50863 251 11329 1636 20915 -14622 65544 62369 65817 -6508 50240 36738
7467 36738 -12866 -84605 -80916 -40632 -34982 -32693 -67268 -32363 -56151 -38620 6875 265 77253
7454 77253 114384 -10789 21409 59852 -33796 -54563 19503 -46814 -49073 -67640 -71254 -37110
7442 -37110 -89241 -24237 -50810 -85455 -39995 -51810 19183 -33328 15532 56375 36033 31499
7430 31499 94745 90398 67780 35503 6403 64710 69974 70894 17844 -45413 -86547 15865
7418A5865P590Q8512o0129l2777Q003l09j4965m0767j6564J0176K6018j5536J8823
7405f060n0593P9574L6666k7781j0951j05568J35337M8523q3640j6806K1024l7001
7393a7276K7042J04183l8926o6271J5846P1149o3656l6935M7026P9540K6170q2529
7381F5363M1640o3342l9884R6469K9266j2646n6391L1511r898p3882Q034N5315
7369G1555M8047M847J0065n6711p8764K7987K6917N318j8737n7530J515L7422
7357B1931o9224J9469R8323l4221n3161N4199J1756L651l2455K689O6567k8221
7345F1303K5201j6400q147J4366l455n7034O1529L2944p9713O6235N171j7197
7333H4803L6649K9183q6810l561L3893O4740O8316l4627r864k3398n5783j6822
$$ plain form
7418 15865 23455 111967 51838 19061 27064 26755 11790 -28977 -45541 -35365 -9347 -24883 -6060
7405 -6060 -56653 22921 59587 31806 20855 -84713 50624 99147 15507 -1299 19725 -17276
7393 -17276 9766 113949 75023 8752 24598 95747 32091 -4844 42182 121722 147892 65363
7381 65363 107003 43661 3777 100246 129512 116866 60475 91986 82088 8206 16240 71555
7369 71555 119602 124449 134514 77803 -961 27026 53943 59261 40524 -17006 -15491 21931
7357 21931 -47293 -27824 70499 36278 -16883 37316 49072 52723 20268 22957 89524 61303
7345 61303 86504 70104 61957 76323 72868 15834 77363 110307 30594 96829 102000 84803
7333 84803 121452 150635 63825 60264 94157 158897 227213 192586 182722 159324 103541 86719
7321H6719o881Q3871N3503l4176l6996L8648k4779q302Q5433J5352J8424J05905
7309C76721l4714n2927m8105P839R2379J1905o679m0344K7697o717Q5472r6151
7297C16376K9730R5881J7931O6892o8987O6248j1484M2465J51909N4107L3399
7286G94467J22329J33485K5975Q7474M6159P8813J49200J06633L6439Q7855Q3542
7275A752371m9885m1489o9948K4500m2637j44611p4372k4012q9265j33539j42559
7264I64554j35311r726j8313p2413j681m7358r5336P2471j19442j2630O5360m3213
7252E46962o8361r2182O931o4769J4968m5417M4879n6629n3085L6022n3607M3327
7240B59039L5703p993j03724R818M5400q5176k8164l4753J0321J5657j8608n4526
$$ plain form
7321 86719 79838 163709 217212 183036 146040 184688 159909 151607 237040 252392 270816 376721
7309 376721 342007 289080 240975 248814 341193 353098 346419 306075 333772 327055 412527 316376
7297 316376 346106 441987 459918 526810 457823 524071 512587 555052 706961 761068 794467
7286 794467 916796 1050281 1076256 1163730 1209889 1288702 1437902 1544535 1580974 1668829 1752371
7275 1752371 1702486 1660997 1591049 1615549 1572912 1428301 1353929 1329917 1240652 1107113 964554
7264 964554 829243 819517 801204 728791 727110 679752 584416 656887 537445 524815 590175 546962
7252 546962 478601 386419 393350 328581 343549 298132 343011 286382 233297 269319 215712 259039
7240 259039 294742 286749 183025 192843 238243 153067 124903 90150 100471 116128 97520 42994
7228D2994K358O3905M8448m991j06434M5851r688J7955r6197K8176P1229K4009
7216A27615o62r0689O7371j2121m580L8770k9925j28276n4707J21353Q5056L9854
7204A59059m3286n213n4561o1586K8902M1645j8636l5165q212M7976K5348j8173
7192E8098L4170r0531r9363L5942M1553Q10K3481p617m2745k6584J07177O309
7180D0700J663j0753J7193j3923n6438o521L9772Q2530m8603j6844P757n4052
7168a7519j0176p7709N7160J08558m3312j0903m1344j9815Q0766R2869p143k9611
7156H1821l2013M4056l3136q7334j379L7375M3084r1649K0864k1661J3081O1170
7144C4279N2276n6284L3927p0821J4866J5099j0673k3765K326J0169r572N542
$$ plain form
7228 42994 45352 109257 157705 152714 46280 92131 82443 100398 4201 32377 103606 127615
7216 127615 126953 36264 103635 91514 86934 125704 95779 -32497 -87204 34149 119205 159059
7204 159059 115773 110560 55999 -5587 23315 64960 46324 11159 2947 50923 76271 58098
7192 58098 92268 1737 -97626 -61684 -20131 -19321 4160 -3457 -46202 -72786 34391 40700
7180 40700 42363 31610 48803 34880 -21558 -28079 11693 94223 45620 28776 36533 -17519
7168 -17519 -27695 -105404 -48244 60314 17002 6099 -35245 -55060 25706 118575 111432 81821
7156 81821 49808 93864 60728 -26606 -27985 9390 52474 -39175 -18311 -39972 -26891 34279
7144 34279 86555 30271 64198 -6623 8243 23342 12669 -11096 -8770 1399 -8173 -2631
7132b631L1365m1786O444N4035M9001n4253l0887l6450J520M5375J4851J4569
7120E1153n569k3703O2979N3140j23769J4986m2702p145N0673K2753o2187O8676
7108E9285m7636j7992K3293N2132k8123J4892l966M7198o2053J3124l8463k908
7096H783J6595L9968k9592q2208L1542O0689j04636l0535M0258J5252l0438J10476
7084D6154K0675j09192N3703L8179N9232n4808k9430L045L5588L2652m2075P653
7072F1376R709J8621n1937k4143J9714J9688P8096l2921j6594j29859j5366O0629
7060b987k6058j8373K6174M364l360J00356P570m7885O875N1471j3671k3095r1881
7047c0500K5432j5554P4047m2690K1393k1295k9925M7549m0764L1921L0463n0458
$$ plain form
7132 -2631 28734 -13052 -6608 47427 96428 42175 11288 -25162 -23642 21733 36584 51153
7120 51153 45584 21881 84860 138000 14231 29217 -13485 -20630 30043 52796 -9391 59285
7108 59285 11649 -6343 16950 69082 40959 55851 51885 99083 37030 50154 11691 8783
7096 8783 25378 65346 35754 -46454 -14912 45777 -58859 -89394 -49136 -33884 -64322 46154
7084 46154 66829 -42363 11340 49519 108751 53943 24513 27558 63146 95798 53723 61376
7072 61376 71085 89706 37769 13626 33340 53028 131124 98203 81609 -48250 -63616 -2987
7060 -2987 -29045 -47418 -21244 -16880 -20240 80116 87686 39801 46676 98147 84476 61381 -30500
7047 -30500 -5068 -20622 53425 10735 32128 10833 -19092 28457 -12307 19614 50077 -381
7035c81k3221K5288k5332K9910O0090p1436o7553M0151k8109N7546o016k0114
7023b9177q1574L6854K336P5983k6118J22784p5633l5451r936R7710l7108L376
7011D4046l4663m0692N6569L2870K8760o9988m921K7064k9841L5125k0284n6452
6999c2407M21p805N1761N1554l736m1869n982q9566L8424m377k0062R1419n0994
6986b3219O304N4276k9695k8921R0883J1831r7920O3426r920p061m523k6725j7276
6973a8540O2420k3512M5815p9581N8939J28903m3244l6090k1785r1853J2535J20997
6961A15004p0919o2443P9333p5631k8063N3946J625P8053J5593J6989j11285r513
6949B689p4388m4951R8051m5071M5280O1474l6662J213m6979J5593o174K2372
$$ plain form
7035 -381 -23602 1686 -23646 6264 66354 -5082 -72635 -32484 -60593 -3047 -9063 -29177
7023 -29177 -110751 -73897 -71561 4422 -21696 101088 25455 -9996 -19932 77778 40670 44046
7011 44046 9383 -31309 25260 58130 86890 16902 11981 39045 9204 44329 24045 -32407
6999 -32407 -31986 -39791 11970 63524 59788 17919 11937 -77629 -39205 -43582 -63644 27775 -23219
6986 -23219 -16915 37361 7666 -21255 69628 81459 -16461 46965 37045 29984 25461 -1264 -18540
6973 -18540 43880 20368 66183 -13398 45541 174444 131200 95110 73325 -18528 -5993 115004
6961 115004 44085 -18358 60975 -14656 -42719 11227 12852 90905 106498 123487 12202 2689
6949 2689 -71699 -116650 -18599 -63670 -18390 43084 6422 7635 -39344 -23751 -29925 -7553
6937g553N1457m2114J9397P3398N2618l8452Q802o0745o9367J9026m732n3116
6925e1381M7074J377O2812M1603q8956R535m7184n045j1247l3937Q6646l1594
6913b0297R260j3249m468N5216m1349j3348R0599k0631j5513o1475J1921O6948
6901D3614J8656M1226q7016n1734M309Q847N3582k8074R7189K5992K453j9038
6889A10006o2785L419J864j02m4519m305K9589Q856m8902O7505k8421l5396j9552
6876b2743N8959o917J3901l6312o410J06971J9890k0969q2736n0620P9428n5633
6864c191J8945L7641L6881L7900q4540j8899J8019o415k0232K291M7775K2324
6852H8499J657k2731N656j4176M974J9103M12o637m9869O5298J8264K9310q130
$$ plain form
6937 -7553 43904 1790 21187 94585 147203 108751 117553 56808 -12559 6467 1735 -51381
6925 -51381 -4307 -2930 59882 101485 12529 22064 -25120 -30165 -41412 -75349 11297 -20297
6913 -20297 -11037 -24286 -28754 26462 -14887 -28235 62364 41733 26220 -35255 -23334 43614
6901 43614 62270 103496 16480 -35254 -30945 -22098 31484 3410 100599 126591 129044 110006
6889 110006 47221 50640 52504 52402 7883 3578 33167 42023 -6879 60626 32205 -3191 -22743
6876 -22743 36216 29299 43200 6888 478 107449 127339 106370 23634 -26986 52442 -3191
6864 -3191 15754 53395 90276 128176 43636 24737 42756 36341 16109 18400 66175 88499
6852 88499 90156 67425 73081 58905 63879 82982 83394 76757 26888 92186 110450 139760 131630
6839A31630J5254p0789M4454j2965j4089o7582m2429K6521k8942j3522N5756J9647
6827D2944J6738l6574k3899K6626k4201k2728L6098J6425p2356n5944R3586M5287
6815D2002j1895M813j06278J16006J1465l4913R733m224l211J9379M3046j6987
6803F8936l8394M1913r743K4776M3177o0648r3515j6805N099N819O6878L9104
6791G6597n713J092l7090m407L1091P662n7970n2119L8302N6310p046K7117j3647
6778F0179q0060N894P3737N7866p7910n872q356l4097J01209L1547j63712P8119
6766C8544J0259p9842L5154N9383o4728k0850O1242n1452J16089L2046j36458
6755f13m1523l4741Q5785P4726n2659K8627m0181K4098O7992l6563l9493j4007
$$ plain form
6839 131630 146884 76095 120549 107584 93495 25913 -16516 10005 -18937 -32459 23297 42944
6827 42944 59682 23108 -791 25835 1634 -21094 15004 31429 -40927 -96871 -3285 42002
6815 42002 30107 34920 -71358 44648 56113 21200 30933 26709 23498 42877 85923 68936
6803 68936 30542 72455 62712 87488 130665 70017 -23498 -40303 -35204 -29385 37493 76597
6791 76597 70884 71976 34886 30479 61570 69232 11262 -40857 -2555 53755 46709 73826 60179
6778 60179 -19881 -13987 59750 117616 39706 33834 25478 -8619 92590 124137 -39575 38544
6766 38544 48803 -31039 4115 63498 -1230 -22080 39162 -12290 103799 135845 -613
6755 -613 -42136 -76877 8908 83634 30975 59602 19421 43519 111511 74948 35455 21448
6743B1448P015J7672k1677l5613j7457N3062m7328N3643l44j3818l4381M5550
6731B7772p389l0465Q2195K531n1734Q4154L3734l5655r9707L1938m56J9104j4690
6718D1332m5977j4139l6651p099R436Q8824K3382p0771l108N3961L7762M2881
6706A19833q2522k9720J1300K7603L7529j5179n7503P5643P620O7310q5683l676
6694G2555J5234q2217Q9490L4694p6871l0773Q2711j8792n9333j2145n9594M5582
6682E41k7010L2908J00312q0502l22k3134n6771J3959N4424o66N4682J5998j352
6669H3067k7870r507m187J8323l63p5832J3873o2978O1052K0947J901k3586L2682
6656B7522Q9047p7937k622j2838L8171p282L5963O0057j37617K9863q3J3554n544
$$ plain form
6743 21448 28463 46135 24458 -11155 -28612 24450 -22878 30765 30421 16603 -17778 27772
6731 27772 20383 -10082 72113 74644 22910 107064 140798 105143 5436 37374 36918 56022 41332
6718 41332 -4645 -18784 -55435 -62534 -53098 35726 59108 -11663 -14771 39190 76952 119833
6706 119833 37311 7591 18891 46494 84023 68844 11341 86984 94604 161914 76231 72555
6694 72555 87789 5572 95062 129756 52885 22112 104823 86031 26698 14553 -45041 541
6682 541 -26469 6439 106751 26249 25927 2793 -53978 -40019 14405 13739 68421 84419 83067
6669 83067 55197 45690 41503 59826 59463 -16369 -2496 -65474 -4422 16525 18426 -5160 27522
6656 27522 116569 38632 36010 23172 61343 54061 90024 150081 12464 42327 42244 55798 50254
6643E0254J2705m4855K3561L2006L3279n9367J3834l2237j7206P2138k9943J8815
6631G2984l4774k4816l4909O9111M1243q008j25q5472N6279l0732J8597o411j4007
6618A8960M864j0543M2954j7228q268J1174L5088k4597j1852M9296p9390M6314
6606E6772M444n0151k7026K2002K3431j5599k3057N9221j804L0429O7274k3560
6594A22376M035j05206K1103l6729l9233Q2826N8089K9252l8128o1675L3870j224
6582F9356L0150n7173K3914L8826K2356j60426Q0789j9950J8732M6789j7788N1224
6570A26799q303n5154J5150O7419m6049l3721N1110l8932P0292q0514J2998M6056
6558A27151L3359j10838j2209l5271M2547M0742j8908L2323o3297J2282j13086
$$ plain form
6643 50254 62959 18104 41665 73671 106950 47583 61417 29180 11974 84112 54169 72984
6631 72984 38210 13394 -21515 47596 88839 80831 80706 -4766 51513 20781 39378 32967 18960
6618 18960 23824 13281 56235 39007 30739 41913 77001 52404 40552 89848 10458 56772
6606 56772 61216 11065 -15961 6041 29472 13873 -9184 50037 48233 78662 145936 122376
6594 122376 126411 21205 42308 5579 -33654 49172 107261 136513 98385 36710 70580 69356
6582 69356 99506 42333 66247 105073 127429 -32997 47792 27842 46574 93363 75575 126799
6570 126799 118496 63342 78492 145911 99862 66141 117251 78319 148611 68097 81095 127151
6558 127151 160510 49672 37463 2192 44739 85481 66573 98896 35599 47881 -65205
6547f5205J01919L5358K4785N1625n5595q944J9180q6147M4666K7164L5302J736
6535A25844M0513p2836m4103O5761O0469m6908l7478Q8371n2219p1225l3921m85
6523B1783K8468q451K620P6211l259N046m901l143J7241o9769J5831N958N1534
6510A35169o0554q128L2587k0852O9648l6901R861p42j4090m1939N080O8693n8332
6497G9500q870l2928P124L3559k7682k7475Q7140K4660k2130o8352K8486Q234
6485H1266K1418j3676M590M9208k615m1524L719r659j8444Q108m8973O0192J6715
6472A10325j9117J594J659k09o1147o046l7778k064J9641J34688M8747K8367n4654
6459A64006j3994J0745n1609o9565L188O4577m6401K0630L8241K220m1444Q1844
$$ plain form
6547 -65205 36714 72072 96857 148482 92887 83943 103123 16976 61642 88806 124108 125844
6535 125844 166357 93521 49418 115179 175648 128740 91262 179633 127414 56189 22268 21783
6523 21783 50251 41800 44420 120631 117372 122418 117517 114374 131615 61846 77677 83635 135169
6510 135169 74615 66487 99074 78222 147870 110969 120830 120088 105998 64059 69139 137832 79500
6497 79500 70630 37702 44826 78385 50703 23228 110368 135028 112898 44546 73032 81266
6485 81266 102684 89008 93598 142806 140191 98667 102386 92727 74283 82391 33418 93610 110325
6472 110325 91208 92802 94461 94252 33105 27059 -10719 -12783 6858 141546 190293 218660 164006
6459 164006 150012 160757 109148 39583 42771 107348 60947 81577 119818 122038 80594 162438
6447A62438J2720L1536q126l282k9227l3380o9134J8540N1138j0398o158P7588
6435A94255L4703r5278q359P1106l6347n7173J4581k3721Q7141K7782K801P8289
6423B89780n4758j30831Q928J04575K389R179j6419K9530M8581N5135j44495K8347
6411B29941K8489r3348K9031J4308L7203o0417n6561L9974k4393O8639k3389M8866
6399B38343J239n1578n7925M8092P7997p0643l121L2705L4880J0063L611J0392
6387B74055m0313j7232l6997K3689J02182n0230K7567J3281L4894l6394m8030
6376B46472N2889K4086p4834J6434j1030M8102J8567r1336O1700M8692O608l3746
6364C12604j9016l88l0660L6450l6535L3112L3544k4069k7945J7092J04598k5552
$$ plain form
6447 162438 175158 206694 198568 195286 166059 132679 63545 82085 133223 122825 116667 194255
6435 194255 228958 133680 125321 196427 160080 102907 117488 93767 180908 208690 211491 289780
6423 289780 235022 104191 113119 217694 220083 229262 212843 242373 290954 346089 201594 229941
6411 229941 258430 165082 194113 208421 245624 185207 128646 168620 144227 212866 189477 238343
6399 238343 239582 188004 130079 178171 256168 185525 182404 215109 249989 260052 263663 274055
6387 274055 233742 216510 179513 203202 305384 255154 282721 296002 330896 294502 246472
6376 246472 299361 323447 248613 265047 254017 302119 320686 229350 291050 339742 346350 312604
6364 312604 293588 293200 262540 298990 262455 295567 329111 305042 277097 294189 398787 373235
6352C73235o9431m6673j7092R763L2861K8378k8805L38n959K7610n8013L760N8330
6339C08302M2616o6743n6828j7117K4512P2189M4610K2955j9790l1464j2903n3131
6327B57208J12027p4866m7660N4762O2313k9407M917O6548Q44J4881j07731P027
6315C20863N4859k196K6169L8271o1158p2888Q7487L7503l6250k8400M9130k3887
6303C89503o3975N0078M4492J6938o4806O288J00140q6592O1058J518J3122O2442
6291E30206j03155M6613p396K2717k1826o8685L6012J09626o8436M077m3701M6658
6279D82710k1022N0226k3836j4846L6298r458L6962K2739N7142L4509m934M4824
6267F91314j1078o2662l9191O9313m6749J18244K6872l8969M0805j8535O4815
$$ plain form
6352 373235 303804 257131 240039 249802 282663 311041 282236 282574 276615 304225 246212 249972 308302
6339 308302 350918 284175 227347 210230 234742 306931 351541 374496 354706 323242 310339 257208
6327 257208 369235 294369 246709 301471 363784 334377 339294 405842 406686 421567 313836 320863
6315 320863 375722 373526 399695 437966 376808 303920 391407 428910 392660 364260 413390 389503
6303 389503 325528 375606 420098 437036 372230 378518 478658 392066 453124 454642 467764 530206
6291 530206 427051 473664 466268 488985 467159 398474 434486 544112 475676 479753 436052 482710
6279 482710 461688 511914 488078 473232 509530 500072 537034 559773 616915 651424 646490 691314
6267 691314 680236 617574 578383 647696 600947 719191 746063 707094 747899 729364 794179
6256G94179m1502k0270N809L2759k8060L1903N8377l1201P8305L9219j3303P1512
6244I77727K7398R7476J7728M656Q6298j4291Q048k7056J00782j1102Q1782K9707
6232A379153M9622O8228K2409R2456K4266J12498J50064m8627M8485J73048R7589
6221B169191N2146j1098K07694N2948J44341J06997J44922J33723J05956J78367
6211C285187J84332J75077J13247J51015P6370J79069J93149J01586O7130J58155
6201D684317K02129J12082K59410J35990J71139K45079K96205K08870K07769K23258
6191F746248K38576K82768K76201L19276L89916L21162L48878M62437L91358M82934
6181A0259754M35601M47026N38301N47784N43936M53137M34632L34114J68722
$$ plain form
6256 794179 752677 732407 738216 770975 742915 774818 833195 801994 880299 919518 906215 977727
6244 977727 1005125 1102601 1120329 1124985 1211283 1196992 1205040 1177984 1278766 1267664 1349446 1379153
6232 1379153 1428775 1497003 1519412 1611868 1636134 1748632 1898696 1850069 1898554 2071602 2169191
6221 2169191 2221337 2210239 2417933 2470881 2615222 2722219 2867141 3000864 3106820 3285187
6211 3285187 3469519 3644596 3757843 3908858 3985228 4164297 4357446 4459032 4526162 4684317
6201 4684317 4886446 4998528 5257938 5393928 5565067 5810146 6106351 6315221 6522990 6746248
6191 6746248 6984824 7267592 7543793 7863069 8252985 8574147 8923025 9385462 9776820 10259754
6181 10259754 10695355 11142381 11680682 12228466 12772402 13225539 13660171 13994285 14163007
6172A4163007J00970o830M648p9117q8352Q7447K56397L51554L24615L82526N06990
6161A6003855O75671O99930O15083O64838N34569J98524p898l64935m43597o07337
6151A7968703o38362o23085m63899m41140k44009j73186J3848L1667L8054K05101
6141A5673692Q9193K22807r097m140q8068k89074l64232m68927n53341n40852
6131A3667961m81003m65419m48120m46820m26558l77257l38178m13147m07372
6122I864087l32084l88996l76204l89017m46105l87707l67192l47553k24078k11259
6112F393892l49089l02287j62357k44959j68384q1951k40779j18816j36620j58730
6102D429920j81056j98820k5207r1767j63772n4431l8039j54074n2339p9767r5366
$$ plain form
6172 14163007 14263977 14257147 14261795 14182678 14094326 14181773 14438170 14789724 15114339 15496865 16003855
6161 16003855 16679526 17379456 17994539 18659377 19193946 19392470 19384572 19019637 18576040 17968703
6151 17968703 17330341 16707256 16243357 15802217 15558208 15385022 15398870 15430537 15468591 15673692
6141 15673692 15762885 15985692 15976595 15972455 15884387 15595313 15231081 14762154 14208813 13667961
6131 13667961 13186958 12721539 12273419 11826599 11400041 11022784 10684606 10271459 9864087
6122 9864087 9532003 9143007 8766803 8377786 7931681 7543974 7176782 6829229 6605151 6393892
6112 6393892 6044803 5742516 5580159 5335200 5166816 5084865 4844086 4725270 4588650 4429920
6102 4429920 4248864 4050044 4024837 3933070 3769298 3714867 3676828 3522754 3470415 3390648 3295282
6091C295282m7450n5820m1806q2996n9695j3872j36616r1239k4113j2197q3539
6080B645939m4968m7517k908l3047m7881l0876q4059K9001p0410n5385n328j26379
6068B126182L4164m3952N8301k7069j06776L2264r469k1271p3503n1640L6181
6057A953412o0557M955k0587M9815k1523k7789K531m7876M2544O1188j05949M2898
6045A873062k3941n8370N7543l204O7479M3138K7987Q2347r865R1956n1476o0881
6033B035775J81457L3866k6774k6163K5551J389L5705R1013K8847N1067j4802
6022B416931N6931L3759k8563J09035R5240l7560k4949J14361M5319J15355j6741
6011B879118K3736R9565N2479M223O1030N3048J54628L3253K0296l1953R2586
$$ plain form
6091 3295282 3247832 3192012 3150206 3067210 3007515 2993643 2857027 2765788 2741675 2729478 2645939
6080 2645939 2600971 2553454 2550546 2517499 2469618 2438742 2354683 2383684 2313274 2257889 2252561 2126182
6068 2126182 2160346 2116394 2174695 2147626 2040850 2073114 2063645 2042374 1968871 1917231 1953412
6057 1953412 1892855 1897810 1877223 1927038 1905515 1877726 1880257 1832381 1874925 1936113 1830164 1873062
6045 1873062 1849121 1790751 1848294 1845090 1912569 1955707 1983694 2066041 2056176 2148132 2096656 2035775
6033 2035775 2217232 2251098 2224324 2198161 2223712 2225101 2260806 2351819 2380666 2431733 2416931
6022 2416931 2473862 2507621 2479058 2588093 2683333 2645773 2620824 2735185 2780504 2895859 2879118
6011 2879118 2902854 3002419 3054898 3059121 3120151 3173199 3327827 3361080 3381376 3349423 3442009
6000C442009J1388k9778Q942n3939K3771J600l4275o1198K4350P1587k5805r409
5988C369243L6161L4868p3568J02176J23753J13448k5585J47737J17406M0037
5978C985676O5669J19246P5997R2922J24798L0593J85499J12385J39946J16843
5968E049574J37103J49264R3381J53033J01444O773J16397J27126N7289L9151
5958F030535j1877N3201n400l5608r0912m8050l0032p3944n0150o2797o276k0179
5946E648511J03076J7847N9713M0782J21933M5615P8332M7319P9849O849J07356
5935F357182J0034j7203Q330o9167r7409m0851j7002l4173j95951j24768q0163
5924E698859p1060L189k4197n635L9336o1273q571O9545M0221m093J35531n9172
$$ plain form
6000 3442009 3453397 3423619 3432561 3378622 3402393 3403993 3369718 3308520 3332870 3404457 3378652 3369243
5988 3369243 3405404 3440272 3366704 3468880 3592633 3706081 3680496 3828233 3945639 3985676
5978 3985676 4051345 4170591 4246588 4339510 4464308 4494901 4680400 4792785 4932731 5049574
5968 5049574 5186677 5335941 5429322 5582355 5683799 5690572 5806969 5934095 5991384 6030535
5958 6030535 6018658 6071859 6066459 6030851 5939939 5891889 5861857 5787913 5737763 5674966 5668690 5648511
5946 5648511 5751587 5769434 5829147 5869929 5991862 6037477 6115809 6163128 6242977 6249826 6357182
5935 6357182 6367216 6350013 6358343 6289176 6191767 6150916 6133914 6099741 5903790 5779022 5698859
5924 5698859 5627799 5630988 5606791 5601156 5640492 5579219 5570648 5640193 5680414 5676321 5811852 5752680
5912E752680j33584Q2012r7332N3933o4796r1423r4253R5957J2947n2390r1235
5901E372516p678M8562k3471l3012M4977L3088J47311Q7020O2363J26001N1891
5890E909568O5616p977Q8509M4223L4868p3994P1078J8061r3549N8868p0182p456
5878F037633O4049J14564l7334K1447M729Q2027J56616J98218J82160J80521K09669
5867G214299K25126L71673K65691K99492L49147K96231L20386K64517K26555K38070
5857A0071187K28572R0027J56815J65196K05679K10671K66093K50727L02466L06244
5847A2253677M13811M02062L04480K40566J74875J72781j02813j49582j46545
5838A3563312k06216k85370l90566m24944j71528l56823k35669j41596r2255k15798
$$ plain form
5912 5752680 5619096 5701108 5603776 5657709 5592913 5501490 5407237 5503194 5516141 5463751 5372516
5901 5372516 5364838 5413400 5389929 5356917 5401894 5434982 5582293 5669313 5731676 5857677 5909568
5890 5909568 5975184 5967207 6055716 6099939 6134807 6060813 6131891 6149952 6056403 6115271 6045089 6037633
5878 6037633 6101682 6216246 6178912 6200359 6205088 6287115 6443731 6641949 6824109 7004630 7214299
5867 7214299 7439425 7811098 8076789 8376281 8725428 9021659 9342045 9606562 9833117 10071187
5857 10071187 10299759 10389786 10546601 10711797 10917476 11128147 11394240 11644967 11947433 12253677
5847 12253677 12667488 13069550 13374030 13614596 13789471 13962252 13859439 13709857 13563312
5838 13563312 13357096 13071726 12681160 12256216 12084688 11727865 11492196 11350600 11258345 11042547
5828A1042547j29456j26242j02953j79537k18578k65581l74346m29512l78252
5819H838090l47430k88756l92777l47797l84439k69311k32027k32969k43150j98817
5809E900617j56800j19214j21364k24201m3776r4169j89061j59600q8602k9699
5799D674131r2281m3498J5875k4858M1691j50491m2730j7216O0792m4475j3719
5788D363221m1527K7717j16581j17402J14847n9817j14526j5369P6445o2485L871
5777D058394k8595o0367J7129j7615K1431N7018o1811o9767K3077O6967N4488
5766D060349q2167J0560j5486R8123R92l795k7257J0634M7801J0172K4501P5722
5754D210149P658L4176M111J2456J7290J5094O987L8295J9504N1151O6389M919
$$ plain form
5828 11042547 10913091 10786849 10683896 10504359 10285781 10020200 9645854 9216342 8838090
5819 8838090 8490660 8201904 7809127 7461330 7076891 6807580 6575553 6342584 6099434 5900617
5809 5900617 5743817 5624603 5503239 5279038 5235262 5141093 4952032 4792432 4703830 4674131
5799 4674131 4581850 4538352 4554227 4529369 4571060 4420569 4377839 4360623 4421415 4376940 4363221
5788 4363221 4321694 4349411 4232830 4115428 4230275 4170458 4055932 4040563 4117008 4054523 4058394
5777 4058394 4029799 3969432 3986561 3968946 3990377 4047395 3985584 3915817 3938894 4005861 4060349
5766 4060349 3978182 3988742 3973256 4071379 4072371 4068576 4041319 4051953 4099754 4109926 4134427 4210149
5754 4210149 4217807 4251983 4256094 4268550 4285840 4300934 4307921 4346216 4365720 4416871 4483260 4488179
5742D488179N9427l135O9412M7207j9625Q5668M3404P3463o424k3478Q7229J22566
5730E023893P5191O3553J22733J23034j6039R0215P3909J32363J11919K6731J40496
5719E967998J03120J47149P2131J09787J04434R8521O4698J28651K48063J07645
5709G152197P2706J85251J67020R5393K05040J44396P2746K15204J46250J42916
5699H599119J96551J85137J42773K44793J73872K29586J51767K97217J59004K22448
5689A0602267K29615K59541K19712L19871K75511K89872L40395K74153L75538
5680A3186475L60195L85698M32829M69213N41618M56751N01605M92089N27260
5671A7353733N64493O05859N98266P27152Q09820P40714Q32480R08758R38487
$$ plain form
5742 4488179 4547606 4544471 4613883 4661090 4641465 4727133 4770537 4844000 4837576 4814098 4901327 5023893
5730 5023893 5099084 5162637 5285370 5408404 5392365 5482580 5556489 5688852 5800771 5827502 5967998
5719 5967998 6071118 6218267 6290398 6400185 6504619 6603140 6667838 6796489 7044552 7152197
5709 7152197 7224903 7410154 7577174 7672567 7877607 8022003 8094749 8309953 8456203 8599119
5699 8599119 8795670 8980807 9123580 9368373 9542245 9771831 9923598 10220815 10379819 10602267
5689 10602267 10831882 11091423 11311135 11631006 11906517 12196389 12536784 12810937 13186475
5680 13186475 13546670 13932368 14365197 14834410 15376028 15832779 16334384 16826473 17353733
5671 17353733 17918226 18524085 19122351 19849503 20659323 21400037 22232517 23141275 24079762
5662B4079762R78900J116561J045147J076506J224971J241613J370800J505886
5654C3640146J422170J667397J773665J826901K001880K062564K171817K444682
5646D9011222K422817K540364K725955K858172K851305K963939K955314K960938
5638G1290026L043368L314277L544405L762314M066410M578686M960973N480488
5630A04040947N997008O601886P145786P869530Q658247R363119J0263181J1038626
5622A70978330J1913105J3073431J4524012J6221270J8029178K0186606K2217509
5615B87143441K3903651K5006207K4692020K2691211J8261640J1285251K498268
5608D15481689o577563j4820583k0853925k4476621k5778898k5297068k3827938
$$ plain form
5662 24079762 25058662 26175223 27220370 28296876 29521847 30763460 32134260 33640146
5654 33640146 35062316 36729713 38503378 40330279 42332159 44394723 46566540 49011222
5646 49011222 51434039 53974403 56700358 59558530 62409835 65373774 68329088 71290026
5638 71290026 74333394 77647671 81192076 84954390 89020800 93599486 98560459 104040947
5630 104040947 110037955 116639841 123785627 131655157 140313404 149676523 159939704 170978330
5622 170978330 182891435 195964866 210488878 226710148 244739326 264925932 287143441
5615 287143441 311047092 336053299 360745319 383436530 401698170 412983421 415481689
5608 415481689 408904126 394083543 373229618 348752997 322974099 297677031 273849093
5601B73849093k1842392j9570961j7553975j5751075j4004717j2554553j1292081
5594A61279339j0226502r217878q355663p600219o756533o224738n781095n221491
5586A01895220m781496m342392m122738l718424l383104l287071l009368k776697
5578G2473930k667539k411294k349072k255579k231650k113223k020620j957985
5570E4466968j812574j869843j696101j671547j658652j512205j538260j403908
5562D1303878j366710j222336j176872j218838j058349r89621q06773q73607q36812
5553C1753960q16997o44378o43743o26272o11024n19635m88838m47780n22194
5544B6433099m02598m69018n10574m97282n05292n14178m51426m36883m69323
$$ plain form
5601 273849093 252006701 232435740 214881765 199130690 185125973 172571420 161279339
5594 161279339 151052837 141834959 133479296 125879077 119122544 112897806 107116711 101895220
5586 101895220 97113724 92771332 88648594 84930170 81547066 78259995 75250627 72473930
5578 72473930 69806391 67395097 65046025 62790446 60558796 58445573 56424953 54466968
5570 54466968 52654394 50784551 49088450 47416903 45758251 44246046 42707786 41303878
5562 41303878 39937168 38714832 37537960 36319122 35260773 34271152 33464379 32590772 31753960
5553 31753960 30936963 30292585 29648842 29022570 28411546 27891911 27403073 26955293 26433099
5544 26433099 26030501 25561483 25050909 24553627 24048335 23534157 23082731 22645848 22176525
5535B2176525m19930l10879l21152m64240k91882l22590l32528l08230k49688
5526A9155406l41014k47139k57341k99953k88112k59350k61797k41430k26924
5517A6732346j59177k08355j39572j90793j88288j21323j62612j56331j12199
5508A5293696j03327j25981n3723r6725j52731j11304j20311j12825k37619j63936
5498A4015214j23609j35644j88282j29040j24654o9684p8414j80417n9668j50221
5488A2775581k18935j18766n4375j24380j87552j75621r7806p0138j33135j69153
5478A1425720j51136j05456r4711j34900p0627J4885j34492q2231K5425p5290
5468A0617187l4598j03333R77l2532q3653m9776J1550j8772P1141O4728j7657
$$ plain form
5535 22176525 21756595 21445716 21124564 20660324 20368442 20045852 19713324 19405094 19155406
5526 19155406 18814392 18567253 18309912 18009959 17721847 17462497 17200700 16959270 16732346
5517 16732346 16573169 16364814 16225242 16034449 15846161 15724838 15562226 15405895 15293696
5508 15293696 15190369 15064388 15010665 14913940 14761209 14649905 14529594 14416769 14179150 14015214
5498 14015214 13891605 13755961 13567679 13438639 13313985 13244301 13165887 12985470 12925802 12775581
5488 12775581 12556646 12437880 12383505 12259125 12071573 11895952 11798146 11728008 11594873 11425720
5478 11425720 11274584 11169128 11074417 10939517 10868890 10883775 10749283 10667052 10692477 10617187
5468 10617187 10582589 10479256 10480233 10447701 10364048 10314272 10325822 10307050 10378191 10442919 10425262
5457A0425262Q2504N4252J04328N1602P3968K5349K4835J37271J12021O0180K01576
5446A1353148K12717J07644J34141J29785J86547J25974J75725L32821K62005
5437A3020507J81114L87624L19161M46621M19416M96709N29554M77306N23634
5428A6801646M15797M01343L73923L33830K64387K40873L01607L45576K99783
5419A9778765M12269M71249M97472O24384O76688P72717Q16165Q59861P14204
5410B5623774N87529L90365L15683N8265k1246j23895k82493j38457R6746O8939
5400B6575210J4218J08935k4016J50893J65585M8218J97793O4819P6130J61155
5390B7538940j42654j76209l71726m27367l86195m63278l15975k79436k49111
$$ plain form
5457 10425262 10507766 10562018 10666346 10717948 10791916 10817265 10842100 10979371 11091392 11151572 11353148
5446 11353148 11565865 11673509 11807650 11937435 12123982 12249956 12425681 12758502 13020507
5437 13020507 13201621 13589245 13908406 14355027 14774443 15271152 15800706 16278012 16801646
5428 16801646 17217443 17618786 17992709 18326539 18590926 18831799 19133406 19478982 19778765
5419 19778765 20191034 20662283 21159755 21784139 22460827 23233544 24049709 24909570 25623774
5410 25623774 26211303 26601668 26917351 26975616 26954370 26830475 26547982 26409525 26506271 26575210
5400 26575210 26589428 26698363 26674347 26825240 26990825 27039043 27236836 27301655 27377785 27538940
5390 27538940 27396286 27220077 26848351 26420984 26034789 25571511 25255536 24976100 24726989
5381B4726989j44005q4901O1403j25938r1300k37262l84307n99307p20256p68219
5371B1632897p96591p91945p02767o77625n09228n05931l16432k99663l18756
5362A6713959k00099l11779k01371k41414k24290j49391o2844r5324o1470m4636
5352A5121341j3377M7652J4534q17O7258K26937J20760J39272K34664K34132M02156
5341A6594512M30020M45701N70104M63210N14931M98210M09539L20460J44509
5332B0391196k1019n158m9088o2966o8077l9545j222o4884M9649k06221k98497
5321A9624168l08533m05990l57712l06560j79317q0428j40023j99343j86638j65505
5311A7294119k78240l87211k79462m54586m69998l53535m60180m39240m49385
$$ plain form
5381 24726989 24582984 24498083 24559486 24433548 24342248 24104986 23720679 23121372 22401116 21632897
5371 21632897 20836306 20044361 19341594 18663969 18154741 17648810 17332378 17032715 16713959
5362 16713959 16513860 16202081 16000710 15759296 15535006 15385615 15322771 15227447 15165977 15121341
5352 15121341 15107964 15155616 15170150 15169333 15236591 15463528 15584288 15723560 15958224 16192356 16594512
5341 16594512 17024532 17470233 18040337 18503547 19018478 19516688 19926227 20246687 20391196
5332 20391196 20370177 20365019 20315931 20252965 20184888 20145343 20144121 20079237 20128886 19922665 19624168
5321 19624168 19315635 18909645 18551933 18245373 18066056 17985628 17845605 17646262 17459624 17294119
5311 17294119 17015879 16628668 16349206 15894620 15424622 15071087 14610907 14171667 13722282
5302A3722282k27619l19138k39707k31575k70820k50979l52791l64231l27222
5293A1138200l55596l35795l76410k28564k62230k97797j98616k05875j79509
5284H697808k15525j43660j23011j87253l7013n0995j08054m5505q2857o1417
5274G642518r7294k00320j29759n9792p2730m0868m4582m4264k6564j15099J7784
5263F829030j4783m1458k9369j7674j36512p7974o6264j41176o7857j11816l4307
5252F089840j29533n5033j8820j49624o2002M8169o9677k1623j13955p0609j2498
5241E434635N5441j03360n2459n8002j22960K8000k2937p5590p6897q4586q5090
5230D836195m8960L277p823l5277o2439k2987L6039k4988k0514N519J28149l7414
$$ plain form
5302 13722282 13494663 13175525 12935818 12704243 12433423 12182444 11829653 11465422 11138200
5293 11138200 10782604 10446809 10070399 9841835 9579605 9281808 9083192 8877317 8697808
5284 8697808 8482283 8338623 8215612 8028359 7991346 7940351 7832297 7786792 7703935 7642518
5274 7642518 7545224 7344904 7215145 7155353 7082623 7041755 6997173 6952909 6926345 6811246 6829030
5263 6829030 6814247 6772789 6743420 6725746 6589234 6511260 6444996 6303820 6235963 6124147 6089840
5252 6089840 5960307 5905274 5886454 5736830 5674828 5722997 5653320 5631697 5517742 5447133 5434635
5241 5434635 5490076 5386716 5334257 5276255 5153295 5181295 5158358 5082768 5005871 4921285 4836195
5230 4836195 4787235 4790512 4782689 4747412 4684973 4661986 4698025 4673037 4652523 4658042 4786191 4748777
5218D748777R7309M9023Q8821L6124K7595R9565J43356Q8794J25449J24905J28384
5207E758102K33265K02702J43476O5052J59569P5522J32458J48381J47757J4973
5197G081257N2261M9186N2960K4312R8844J7895O3697R3339o570p489N2220R6277
5185G668189j3198J7957M9277k2022J8707k2475J38034J32288P997o7816J24519
5174H031457J28283R8220R4685J23128J90999K56093J94985J70976J80315k4605
5164I444536j77601l69406l54997m13388k58944j78142k27152j63028r7549m1886
5154G162443J3371l7946q1053R1540k4373L4453N6292K5898Q9690J8090N0829
5143G399234P4644N1861N6033J29482P7341J95912J16144J12755J50192J57591
$$ plain form
5218 4748777 4846086 4895109 4983930 5020054 5047649 5147214 5290570 5379364 5504813 5629718 5758102
5207 5758102 5991367 6194069 6337545 6402597 6562166 6637688 6770146 6918527 7066284 7081257
5197 7081257 7133518 7182704 7235664 7259976 7358820 7376715 7440412 7533751 7527181 7519692 7571912 7668189
5185 7668189 7654991 7672948 7722225 7700203 7718910 7696435 7834469 7966757 7974754 7906938 8031457
5174 8031457 8159740 8257960 8352645 8475773 8666772 8922865 9117850 9288826 9469141 9444536
5164 9444536 9266935 8897529 8542532 8129144 7870200 7692058 7464906 7301878 7204329 7162443
5154 7162443 7175814 7137868 7056815 7148355 7123982 7158435 7214727 7240625 7330315 7348405 7399234
5143 7399234 7473878 7525739 7581772 7711254 7788595 7984507 8100651 8213406 8363598 8521189
5133H521189Q7188K05364J04610J11831K04613J24917O6321J85722J46941P1013
5123I829709J74214J82336K28665J93772K10656J49198J66459J77207J87356K67968
5113A1767540K20121L26108L84221K88247M25273M46754N00632N34339M35560
5104A5328795L04514J48474j8789j15169l02805k01117k34965k11187r4481n9068
5094A4544202N2404J78654J75530K54073K92503L23353K44365J31585n5998l34536
5084A5806135k79303l51692k59226k15766j91261K4513Q4156J71740K59848L24438
5074A5373582M50565O04786O38193O42260J003437R68185J071601J352298J395668
5065B3500575J512230J491130J185016R24438M71568l6829m79631m97342o10696
$$ plain form
5133 8521189 8608377 8813741 8918351 9030182 9234795 9359712 9426033 9611755 9758696 9829709
5123 9829709 10003923 10186259 10414924 10608696 10819352 10968550 11135009 11312216 11499572 11767540
5113 11767540 11987661 12313769 12697990 12986237 13411510 13858264 14358896 14893235 15328795
5104 15328795 15633309 15781783 15762994 15647825 15345020 15143903 14908938 14697751 14603270 14544202
5094 14544202 14596606 14775260 14950790 15204863 15497366 15820719 16065084 16196669 16140671 15806135
5084 15806135 15526832 15175140 14915914 14700148 14508887 14533400 14617556 14789296 15049144 15373582
5074 15373582 15824147 16428933 17067126 17709386 18712823 19681008 20752609 22104907 23500575
5065 23500575 25012805 26503935 27688951 28613389 29084957 29048128 28568497 28071155 27460459
5056B7460459n59157m57052l08257j60326J6161J12320K22315K29306K54049J53502
5046B6963320j55956m98097q09077j089158j430151j412512j472345j352628j267193
5037A7476203j202887j064024q14470q61060p97089o10274o21977m94657n35770
5028A0473995n13664m83194m12165l40638k93398k93766l12520k29351l69079
5019G226220k34684j89200k74291k83834j82055j12788j56293k24490j78236j83028
5009E207321j64065p1831j48815j68673j33118j03037j45929k02663J8046j00945
4999C986291r9230j08457q4210m5297j06311n3802p4779k4967j00336p9498j25137
4988C084267L1770j05143o1173P4680j18272n3174r5902J831k3895q2494m6425
$$ plain form
5056 27460459 26901302 26444250 26135993 25975667 25991828 26104148 26326463 26555769 26809818 26963320
5046 26963320 26807364 26309267 25500190 24411032 22980881 21568369 20096024 18743396 17476203
5037 17476203 16273316 15209292 14394822 13533762 12736673 12126399 11504422 11009765 10473995
5028 10473995 9960331 9477137 9064972 8724334 8430936 8137170 7824650 7595299 7226220
5019 7226220 6991536 6802336 6528045 6244211 6062156 5949368 5793075 5568585 5390349 5207321
5009 5207321 5043256 4971425 4822610 4653937 4520819 4417782 4271853 4069190 4087236 3986291
4999 3986291 3887061 3778604 3694394 3649097 3542786 3488984 3414205 3389238 3288902 3209404 3084267
4988 3084267 3116037 3010894 2949721 3024401 2906129 2852955 2757053 2758884 2734989 2652495 2606070
4977B606070L0326j06038q2430l007j6865n4658M9257q8219j03260L4586K0848
4966B286610P281J4355O6218J7786Q8029J19698J99944R2575K04513N5997J6617
4955C169623k3989j90997j86665j67156k31348j10189j17260j37308l0858j20813
4945A853040M2770k4704l4333k02097o4736N0451N2635k5281j07609M705K5036
4934A569877J744k4132q2910Q1630l5513r908p2402o1313J36803r6943O3577o6745
4922A403765l106k060K550r924N2814m2441o6181J965j3010N3360j8025l5526
4910A324181L4755M9204l036J377J4940j8263L5948J3476K8164p636K5153n943
4898A492320M6979P8676Q037O2253K6847K7610O7387R1761K8449k9679r395K893
$$ plain form
4977 2606070 2636396 2530358 2447928 2444921 2428056 2373398 2422655 2334436 2231176 2265762 2286610
4966 2286610 2293891 2308246 2374464 2392250 2480279 2599977 2799921 2892496 3097009 3153006 3169623
4955 3169623 3145634 2954637 2767972 2600816 2369468 2259279 2142019 2004711 1973853 1853040
4945 1853040 1895810 1871106 1836773 1634676 1569940 1620391 1673026 1647745 1540136 1544841 1569877
4934 1569877 1571621 1547489 1464579 1546209 1510696 1500788 1428386 1367073 1503876 1406933 1470510 1403765
4922 1403765 1400659 1398599 1401149 1391225 1444039 1401598 1335417 1337382 1324372 1377732 1359707 1324181
4910 1324181 1358936 1408140 1405104 1406481 1421421 1403158 1439106 1452582 1480746 1473110 1498263 1492320
4898 1492320 1539299 1617975 1626012 1688265 1715112 1742722 1810109 1901870 1930319 1900640 1891245 1894138
4886A894138N177J0869l7062p8318J6199M5713L7291j9004J5971J07201J60215
4875B158390L5127r9504Q7150K0078P7088j8729p4821k7874Q8437l502J6358M2349
4863B300547n9097k0323L3070P6595J19638R4809O7690J07307J01294P9750J26976
4852C028256O1895Q7859J37127N9220Q1318J43825J90141J48640M4576K41877
4842D224734K07518R4584K21253J55417K82247L24858K36199L19730L60721K95887
4832F723148M80966M06567N15377N93700P32792P94506R44959J034844J182682
4823A3409541J269214J469972J629727J510690J571363J526949J520500J811363
4815B5719319K008264J908369J606723J206340R92158J015535J184042J332047
$$ plain form
4886 1894138 1899315 1910184 1873122 1794804 1811003 1856716 1894007 1875003 1890974 1998175 2158390
4875 2158390 2193517 2094013 2181163 2201241 2278329 2259600 2184779 2156905 2245342 2241840 2258198 2300547
4863 2300547 2241450 2221127 2254197 2330792 2450430 2545239 2612929 2720236 2821530 2901280 3028256
4852 3028256 3090151 3178010 3315137 3374357 3455675 3599500 3789641 3938281 3982857 4224734
4842 4224734 4432252 4526836 4748089 4903506 5185753 5510611 5746810 6066540 6427261 6723148
4832 6723148 7204114 7610681 8126058 8719758 9452550 10247056 11192015 12226859 13409541
4823 13409541 14678755 16148727 17778454 19289144 20860507 22387456 23907956 25719319
4815 25719319 27727583 29635952 31242675 32449015 33441173 34456708 35640750 36972797
4807C6972797Q14914q1129p34778j195764j289014j091320j146780j543781j704896
4798B9000249j985833j975827j642203j503799j500317j473609j602787j552187
4790A5763687j428500j159642r69063p91526p73260p11014n81248n94438n80833
4781H174163m89218m19603l33915l14476l06713k43153j76751k32833k41410k29701
4771E186390j97940j29077k41194k20308j57195j60753j34992p8103j72530o4181
4761C630117o3657j51890j35501k21307p2909o5380j25552j17006r6636j5783
4751B564496n0139j03073m1707m6807l1986K789j20624o0049k5176l9756k9345
4740B018623k9196k5861o4067L6950l5123o0451M9117R5860o6051k0194j23978
$$ plain form
4807 36972797 37787711 37706582 36971804 35776040 34487026 33395706 32248926 30705145 29000249
4798 29000249 27014416 25038589 23396386 21892587 20392270 18918661 17315874 15763687
4790 15763687 14335187 13175545 12206482 11414956 10641696 9930682 9349434 8754996 8174163
4781 8174163 7684945 7265342 6931427 6616951 6310238 6067085 5890334 5657501 5416091 5186390
4771 5186390 4988450 4859373 4618179 4397871 4240676 4079923 3944931 3866828 3694298 3630117
4761 3630117 3566460 3414570 3279069 3057762 2984853 2919473 2793921 2676915 2580279 2564496
4751 2564496 2514357 2411284 2369577 2322770 2290784 2293573 2172949 2112900 2087724 2047968 2018623
4740 2018623 1989427 1963566 1899499 1936449 1901326 1840875 1889992 1985852 1919801 1899607 1775629
4729A775629j05710k9227m5249k2289r5142m8979N2437j07954j1490K0032M4731
4718A426789m8484o8945n189K0876L1197q0545n1999N1253K3781l1096J9567J1419
4706A298624l2551o8221P2216j4463k1561j2843K2638k4454l6389J9815j1876
4695A190935j72914J3855J990j5027K8960M0391j6097k6101r0771N8002o1474
4684I51749L7398l9718m5300K4922M3990n9820K2196K9730k5779k7668k0134o656
4672H84910l3353N733L6093k6423o2164K8004K799m7865n1397l3643N9284Q129
4660G70107n1933L9781m7786l2206M7768M7653j2775J7309l3712o564R118K6673
4648G73433M8677j3941l5485j5522j5273k8487O3636L3824K4247m5050P2164l9980
$$ plain form
4729 1775629 1669919 1640692 1595443 1573154 1478012 1429033 1481470 1373516 1362026 1382058 1426789
4718 1426789 1378305 1309360 1304171 1325047 1356244 1275699 1223700 1274953 1298734 1267638 1287205 1298624
4706 1298624 1266073 1197852 1270068 1255605 1234044 1221201 1243839 1219385 1182996 1202811 1190935
4695 1190935 1018021 1031876 1033866 1018839 1047799 1088190 1072093 1045992 955221 1013223 951749
4684 951749 989147 949429 904129 929051 973041 913221 935417 965147 939368 911700 891566 884910
4672 884910 851557 857290 893383 866960 804796 832800 835599 787734 736337 702694 761978 770107
4660 770107 718174 757955 710169 677963 725731 773384 760609 777918 744206 737642 746760 773433
4648 773433 822110 808169 772684 757162 741889 713402 777038 810862 835109 790059 862223 822243
4636H22243j9075j5403L5980R7257J3212J3356J8635K6798n4245J3337K3330P6060
4624A051485R3941J08383n975J24403k4168l6010R4333M3159l6280J08078j5596
4613A505753o3462k9377l5878n8040o9880r2373l8329j15267m7791l731K3908
4602I75533m9020n5723J33973J576j10831R5064j867l8273k8414M1618j879K7510
4590I89267l5269P4877N0973N1351L8577K2015k0626L1927J436j336n501J15862
4578A313553R2974N4788j0711p3978L6607J42422N6372L1059N2068P8412M7948
4567A821514k1059R6433R3548o249L5266R3103J42645J10711O7295J46307R9217
4556B678731J69471J57494K94339L61683K56744L75649N58952O51512O84004N87854
$$ plain form
4636 822243 803168 787765 823745 921002 934214 947570 966205 993003 938758 952095 975425 1051485
4624 1051485 1145426 1253809 1247834 1372237 1348069 1312059 1406392 1449551 1413271 1521349 1505753
4613 1505753 1442291 1412914 1377036 1318996 1249116 1156743 1118414 1003147 955356 951625 975533
4602 975533 926513 870790 1004763 1006339 895508 990572 988705 950432 922018 963636 961757 989267
4590 989267 953998 1028875 1079848 1131199 1169776 1191791 1171165 1203092 1204528 1203192 1197691 1313553
4578 1313553 1406527 1461315 1450604 1376626 1413233 1555655 1612027 1643086 1695154 1773566 1821514
4567 1821514 1800455 1896888 1990436 1984187 2019453 2112556 2255201 2365912 2433207 2579514 2678731
4556 2678731 2848202 3005696 3300035 3661718 3918462 4294111 4853063 5504575 6188579 6776433
4546F776433K69834l6034l14430m34877l74349m22666j53091n0034r236R4152
4536E345702J76834K11639L25963M74794N85143P00090R63474J241094J496575
4527A1521308J390360Q32128K26764k01662l01464j547P97888J531556P34662
4518A6529993j07409r63839j634160k182213j545475j070963q54939p03733m23494
4509G043768m04428l30467k73866k75614j64953m5262r4230j00434k3074J9907
4499E351347J06042J87181K86153M22186N08768O39260O06025M01925K56025N2126
4489H817038j60982l21818m70019o96474q19048q58853o41142m76618l63091l13333
4479C695660k31227k42341k44150j25111j69215j25946j1000k17476j77812o3794
$$ plain form
4546 6776433 7046267 7010233 6695803 6260926 5886577 5463911 5310820 5260786 5251550 5345702
4536 5345702 5522536 5734175 6060138 6534932 7120075 7820165 8783639 10024733 11521308
4527 11521308 12911668 13743796 13970560 13768898 13467434 13465887 14263775 15795331 16529993
4518 16529993 16422584 15458745 13824585 11642372 10096897 9025934 8170995 7467262 7043768
4509 7043768 6639340 6308873 6035007 5759393 5594440 5549178 5454948 5354514 5331440 5351347
4499 5351347 5457389 5644570 5930723 6352909 6861677 7500937 8106962 8508887 8764912 8817038
4489 8817038 8656056 8334238 7864219 7167745 6348697 5489844 4848702 4372084 4008993 3695660
4479 3695660 3464433 3222092 2977942 2852831 2683616 2557670 2546670 2329194 2151382 2087588
4469B087588p0091j07490M8451o6874r3121j07855r365p2569j8917J997j7560
4458A574194j0872J7131j03029n6694j20651O4499R985r0985o3055j5857k9446
4447A175220l9574M127j6934l0292j39463N5537k423o7091K4078j7646M2868o112
4435I82295M282K2303L2895K7605J1673N833K3221K2086J413Q369j777M5079q3577
4422A101700j7530J14470o9763p6869N9073l7591l0664m2735k0450p838n7736
4411I14067n1320P1650k9445L217L6230J7847n0391M383o186q1188M2542L584
4399H74990J8894O3221P0677n0562P8200N4736M8338l6961J1281K0174P6515J08900
4387A338403J3542p8547M3868K3971O793J0360J0945r19P0946K3988N0121M144
$$ plain form
4469 2087588 2017497 1910007 1958458 1891584 1798463 1690608 1681243 1608674 1589757 1591754 1574194
4458 1574194 1563322 1580453 1477424 1420730 1300079 1364578 1374563 1283578 1220523 1204666 1175220
4447 1175220 1135646 1139773 1122839 1092547 953084 1008621 1006198 939107 963185 945539 988407 982295
4435 982295 986577 1008880 1041775 1069380 1081053 1086886 1110107 1132193 1133606 1141975 1140198 1185277 1101700
4422 1101700 1084170 1198640 1128877 1052008 1111081 1073490 1042826 1000091 979641 971803 914067
4411 914067 862747 934397 904952 908169 944399 962246 911855 916238 910052 828864 871406 874990
4399 874990 893884 957105 1027782 977220 1055420 1110156 1158494 1121533 1132814 1152988 1229503 1338403
4387 1338403 1351945 1273398 1317266 1341237 1348030 1358390 1369335 1368416 1439362 1463350 1513471 1517615
4375A517615Q9439L3198J17858K4413J25242J72669J44975J85505K23927J89666
4365B824507Q9538K00987J87765L38820K86907M35191N41356O73771P18757Q62083
4355G159682O16980L28162J79102o4181l17037m13482n84033p11093p96655p40118
4345D657327o29671m53145l83540k93972j63388j80586p3924q4192j79450j58805
4335B056654j22320r1281o6804p9156k804J3255r5345q7030r4139p4967r3050
4324A263013J8790K0901O4576K2122j52658k9473J513r9071p6489Q443M9337r1
4312A090913M7832j31494j5441l825p9720N5538j03592Q9K6853J9858j7216k4049
4300H65746o934p1253K9995m731j10023q1202O6381L164l025p274q214j4381M9237
$$ plain form
4375 1517615 1607054 1640252 1758110 1782523 1907765 2080434 2225409 2410914 2634841 2824507
4365 2824507 2914045 3115032 3302797 3641617 3928524 4363715 4905071 5578842 6297599 7159682
4355 7159682 7776662 8104824 8283926 8219745 7902708 7489226 6905193 6194100 5397445 4657327
4345 4657327 4027656 3574511 3190971 2896999 2733611 2553025 2479101 2394909 2215459 2056654
4335 2056654 1934334 1843053 1776249 1697093 1694289 1707544 1612199 1525169 1431030 1356063 1263013
4324 1263013 1281803 1302704 1367280 1389402 1236744 1207271 1208784 1109713 1033224 1041667 1091004 1090913
4312 1090913 1138745 1007251 991810 987985 908265 963803 860211 860300 887153 907011 889795 865746
4300 865746 858812 787559 817554 812823 702800 621598 687979 691143 688118 680844 672630 658249 707486
4287G07486p2874J2719M2503m450k5999N0703K8076m4774p687j4020n0303L1009
4275F52389J6198j679k432L2520j1613k0174k6514m5375R7848L5202m1206L7422
4263G22586O4667L8394p5574m3092P7834M1994N2694n8977k4503M7428O184k2377
4251H27258N3339O976L1092J27684M2282l2842k6340J26891j8616J35355J02135
4240A375214R291N4095O0704R7192K7765J23382Q1618J8022J78076J91485J1583
4229B228427J64364J97861L38870L14776L96652L42371M79623N48366M90658N71866
4219F073834N75027Q21945J135017P19343L6279n03865r55332j270031j058793
4210E573424p83882o40029n19463l18554k70127l09482j79172r4958j33425j43916
$$ plain form
4287 707486 634612 647331 689834 685384 659385 710088 738164 693390 685703 671683 621380 652389
4275 652389 668587 666908 664476 696996 685383 665209 638695 593320 691168 726370 685164 722586
4263 722586 787253 825647 750073 706981 784815 826809 879503 820526 796023 843451 849635 827258
4251 827258 880597 887573 918665 1046349 1088631 1055789 1029449 1156340 1137724 1273079 1375214
4240 1375214 1384505 1438600 1499304 1596496 1624261 1747643 1829261 1847283 2025359 2216844 2228427
4229 2228427 2392791 2590652 2929522 3244298 3640950 3983321 4462944 5011310 5501968 6073834
4219 6073834 6648861 7470806 8605823 9325166 9361445 8857580 7902248 6632217 5573424
4210 5573424 4789542 4149513 3630050 3311496 3041369 2731887 2552715 2457757 2324332 2180416
4200B180416j45973j78885j11210P468m3168j17232j40158n2941J9114o8236j14601
4189A234594j1445O2489n8359r8003k7742q1851J3504J0238j7258M3822o0395
4178A009594q4331j1514J6743o6619j797j24022q896K9022o7299L7360k7816K6772
4166G27197n8268L4019L5636j16188J1865J0143K5782P4028j44285M4716O257
4155F50902k2081n7865k6385O627N3792R874j13508J1487Q0686k9731l5573N9679
4143E87904j4107k3880k8691k7723k9549L3693j3724k1634M396O2987l3412N9888
4131E56148j09759p4597N5640Q660n4350K9718j7841L2448J0116r488r535j7933
4119C99227K4694K4149q7495l8975J04575N1909m1926N262L0524J7143j4851l2529
$$ plain form
4200 2180416 2034443 1855558 1744348 1751816 1708648 1591416 1451258 1398317 1417431 1349195 1234594
4189 1234594 1223149 1285638 1227279 1129276 1101534 1019683 1033187 1043425 1026167 1069989 1009594
4178 1009594 925263 913749 930492 863873 862076 738054 729158 758180 690881 728241 700425 727197
4166 727197 668929 702948 738584 622396 634261 644404 670186 744214 599929 644645 650902
4155 650902 628821 570956 544571 551198 604990 614864 501356 512843 593529 563798 528225 587904
4143 587904 573797 549917 521226 493503 463954 497647 483923 462289 466685 529672 496260 556148
4131 556148 446389 371792 427432 436092 381742 411460 393619 426067 436183 426695 417160 399227
4119 399227 423921 448070 360575 321600 426175 478084 436158 441420 471944 489087 474236 441707
4107D41707R7199J1564n6705m1069K4098l6745M702J2268k4340O1779l1859n0108
4095D12491L0112M6347l5948k8613K6853r854q089o5660m0769K2896m035Q612
4083C54343K0513P84J6848o8236p642m329j2323M4302j3174Q0422m4163Q018L1686
4070D07049k4831l8610n0007N0096j0580p159K9351l707r3637P5396N3022M1701
4058D28084N692j1425j8599q2379Q865L4899J865l2076m8643L4881L3719j5645
4046C39238j4240o204P163l4349M0528J4663L8667l8057l001j2032L339K3553
4034C59268K0244K2133j5361p0297Q826N9478l4505R503l700k9767P7162n2284
4022C50700K2203j6548j5856p641J9488K5298k0994N3520n873M3522J9141m9510
$$ plain form
4107 441707 538906 550470 493765 452696 476794 440049 444751 457019 432679 494458 462599 412491
4095 412491 442603 488950 453002 424389 451242 441388 433299 367639 326870 349766 345731 354343
4083 354343 374856 375640 392488 324252 316610 312281 299958 344260 331086 411508 367345 375363 407049
4070 407049 382218 343608 293601 343697 333117 325958 355309 351602 257965 333361 386383 428084
4058 428084 433776 422351 403752 321373 330238 365137 367002 334926 286283 321164 354883 339238
4046 339238 324998 318794 325957 291608 332136 346799 385466 347409 344408 332376 335715 359268
4034 359268 379512 401645 386284 315987 324813 384291 349786 359289 355589 325822 402984 350700
4022 350700 372903 356355 340499 332858 352346 377644 356650 410170 404297 447819 466960 417450
4010D17450m3117K7004P6434J5650o7843K1640L5591l9762Q4733n5676O0794K7824
3998E60722M0433l8938m7648Q803M5737R887k8834R7523Q831J01391j01094O7092
3986G23905K3895J4535R7229K4210J4854m3679m3684K4798k471J1004j3531J0275
3974H41340Q19L5717q3480K1722J6645M3083j7481N7804J2468j821L0835P9148
3962A036799M0816N8396o4747j35773p514K6272L1178j02672J6249l0001N0263
3951I19266K0387j5032m4991K5867n6867K5718O1601K413m2831J05130N2709l5655
3939A017715M2866l19Q1179N5807P5380N4723j6374o436m941N1931Q3879K3641
3927A459051K761M5317J09835j2141N8829k9860q0261p7636j18176j37856m1750
$$ plain form
4010 417450 374333 401337 477771 493421 425578 447218 482809 443047 527780 472104 532898 560722
3998 560722 601155 562217 514569 523372 569109 578996 550162 647685 656516 757907 656813 723905
3986 723905 747800 762335 859564 883774 898628 854949 811265 836063 833592 844596 831065 841340
3974 841340 842159 877876 794396 816118 832763 875846 858365 916169 928637 926816 957651 1036799
3962 1036799 1077615 1136011 1071264 935491 927977 954249 985427 882755 899004 869003 919266
3951 919266 939653 924621 879630 905497 848630 874348 935949 938362 895531 1000661 1053370 1017715
3939 1017715 1060581 1060262 1141441 1197248 1272628 1327351 1310977 1304541 1299600 1351531 1435410 1459051
3927 1459051 1461812 1507129 1616964 1604823 1663652 1633792 1553531 1475895 1357719 1219863 1178113
3916A178113k4196j5214l0445j22952n6350O279M8777L0945k3586L1928l7822
3905I85477n57J10417J1627m2102k7705O8398J123m0565O1830L496k4445n9263
3893A047731J7836M1507J3495O0393M5153O6532Q3719P3679P6165O1205J14897
3882A702312J34080K10027J83557J22979M8592m3825k04650l04846j41118j52565
3872A554543j54164L7392j34422k09338j9008j21511j7425m4959Q649l5343k5939
3861H38475K2794k2293r0788M3598O7044j03912j9287J2005L417m0990l4870Q5667
3849G60860l6927j11753j2438N5504k1253n1979j9274J8560K6304J6615o7337
3838E56882Q1331p8767K8718M0636J0158M9713n4060P6299L3381k0238p826k7577
$$ plain form
3916 1178113 1153917 1138703 1108258 985306 928956 935235 984012 1014957 991371 1023299 985477
3905 985477 984920 1095337 1106964 1064862 1037157 1105555 1106678 1066113 1127943 1131439 1106994 1047731
3893 1047731 1065567 1107074 1120569 1180962 1226115 1292647 1376366 1450045 1526210 1587415 1702312
3882 1702312 1836392 2046419 2229976 2352955 2401547 2357722 2153072 1848226 1707108 1554543
3872 1554543 1400379 1437771 1303349 1094011 1075003 953492 936067 891108 899757 864414 838475
3861 838475 861269 838976 748188 791786 858830 754918 735631 747636 751053 710063 675193 760860
3849 760860 723933 612180 599742 655246 633993 582014 562740 581300 607604 624219 556882
3838 556882 638213 559446 588164 628800 638958 688671 634611 710910 744291 724053 716227 688650
3826F88650J15108K2219l2641p329k7599Q8461J50890N3936r859j1289M170O4112
3814A098829K923O7922N4506M4282n8649p2624o7190n6571r1158M6245o1095q5585
3802H21835o6813m2472L5394M6036k210j62055K617k9844j1981l4640m4189J1651
3790E23329J4957M6751m5711K7707m0565n5630M4950m4171N5935o7973r2846O670
3778C73403q766M2740J9334l5389j0723J22288j6597J2103o0667l3435J8722l8309
3766C84704j6457N8545k7801l5916J9961p872m0525k18k779O6169l6226M0279
3754D01864K0088n6076j6258J9792J14032k2683o5650K3084J21575l8263n2149
3743D49356m8773j8858L2464o761j21186N898L6415L0637J2829r4953l1525L6900
$$ plain form
3826 688650 803758 825977 793336 786007 758408 846869 997759 1051695 1041836 1030547 1034717 1098829
3814 1098829 1101752 1169674 1224180 1268462 1209813 1137189 1069999 1013428 922270 968515 907420 821835
3802 821835 755022 712550 747944 793980 791770 629715 632332 602488 590507 555867 511678 523329
3790 523329 538286 585037 539326 567033 526468 470838 515788 471617 527552 459579 366733 373403
3778 373403 364637 407377 426711 391322 380599 502887 486290 498393 437726 404291 423013 384704
3766 384704 368247 426792 398991 363075 383036 375164 334639 334421 331642 397811 361585 401864
3754 401864 421952 365876 349618 369410 483442 460759 395109 418193 539768 501505 449356
3743 449356 400583 381725 414189 407428 286242 292140 328555 359192 372021 277068 245543 282443
3731B82443L0666P8520p5561j8642p1963J7797m762R9107q4200L1149O1434p2660
3719B73328J5471o8419P1573p8139M9931l2539m0374M3545m5422k3578J09640
3708B75017M5500l7752o9738R4008n8534n7227O4815K9368M0003p7899L6153O4736
3696C48450p698l0825k6070L0122J7843o3352L0208k4046Q244J9987l1970M0422
3684C11315K4767J1318j1196p054P2627l5912n9538P4685l294N610N061J1158
3672C99547r8055m7506J9718L7774l2634K02K1663M0635j12496N2632n1261N0400
3660B80619Q3588L9820n7664p7575K2353k5697j7834l7838N1780M1457l7101M138
3648B70046l5123K1285K9306k3965J0188m999q0912n1022j9106K7364J27010k5682
$$ plain form
3731 282443 313109 391629 316068 297426 225463 243260 238498 337605 253405 284554 345988 273328
3719 273328 288799 220380 291953 213814 263745 231206 190832 234377 188955 165377 275017
3708 275017 320517 282765 213027 307035 248501 191274 256089 285457 325460 247561 283714 348450
3696 348450 340752 309927 283857 313979 331822 268470 298678 274632 282876 302863 270893 311315
3684 311315 336082 347400 336204 329150 401777 365865 306327 381012 377718 383328 388389 399547
3672 399547 301492 253986 273704 311478 278844 279046 300709 341344 228848 281480 230219 280619
3660 280619 364207 404027 346363 268788 291141 265444 247610 209772 261552 303009 265908 270046
3648 270046 234923 256208 285514 261549 271737 266738 185826 134804 115698 143062 270072 244390
3636B44390j05732L1957P7913p3778R741L25j4427n888K3533n6784L0443j1001
3624A50692n008K5705l0013M2540k5673j7053R2543n3484M3616Q305n1529O3378
3612B44019j09132m4046j4260O2851m5569K085O7651j978m5808J0376J3095L8129
3600A77413N6205p8577J06872q3455O377n4558J9867K6728M6066j28587o3556
3589C0795N0716n829n3288r560o351K0038J02325l2263j13780Q8961l2757Q8825
3577A27832L6612q3630K654O4677k9158N1429q341q8527n3554M9963M3788n0246
3565F3499R2427l2885o2744o459N1340k1312m9547K3391R2902k8067p1970K3270
3553G3845m8041P2049N5564l4320o0129p5653N4584Q6752L4459k04643O8145K4208
$$ plain form
3636 244390 138658 170615 248528 174750 184491 184816 170389 164501 188034 131250 161693 150692
3624 150692 145684 171389 141376 183916 158243 141190 233733 180249 223865 232170 180641 244019
3612 244019 134887 90841 76581 139432 93863 95948 163599 161621 115813 126189 139284 177413
3600 177413 233618 155041 261913 178458 184835 130277 150144 176872 222938 94351 30795
3589 30795 81511 75682 22394 12834 6483 26521 128846 96583 -17197 71764 39007 127832
3577 127832 164444 80814 83468 148145 118987 170416 162075 73548 19994 69957 113745 63499
3565 63499 155926 123041 60297 53838 105178 83866 34319 57710 150612 122545 50575 73845
3553 73845 25804 97853 153417 119097 58968 -16685 37899 124651 159110 -45533 22612 46820
3541D6820j9322M570l8614j3088q946j3343L665L8425L1067j0877O2965p33j369
3528H1220n3353L9070j0089l2345J2104L991N6457k0463n9106j5087m2893N4974
3516A4480k5559P8520M7429n3713k2579N5722k8403l2756M419k4039K7132J0084
3504E0737m8621j9368N7094K1076l7313o2562K32Q732j4426l9336J60865o3733
3492A3377K7139L9347p8649K508n1540k1121n6686K3192Q3784j7594M4272J7906
3480B5935l169j8694p3737Q9683o1710K0191k6173N2673P1715m7621J1070r2712
3468e2549k4633J09437O691l7960P7796m6729o606L5370o5543k9384p573j1720
3456e3403l1232M4960R1876q978O818J3286m2290M3846l6272l1980L267j1528
$$ plain form
3541 46820 27498 32068 -6546 -19634 -28580 -41923 -38258 167 31234 20357 83322 82589 81220
3528 81220 27867 66937 56848 24503 36607 40598 97055 76592 17486 2399 -40494 14480
3516 14480 -11079 67441 114870 61157 38578 94300 65897 33141 37560 13521 40653 50737
3504 50737 2116 -17252 39842 60918 23605 -38957 -38725 -29993 -44419 -83755 77110 13377
3492 13377 40516 79863 1214 3722 -47818 -68939 -125625 -102433 -18649 -36243 8029 25935
3480 25935 22766 4072 -69665 20018 -41692 -21501 -47674 4999 76714 29093 40163 -52549
3468 -52549 -77182 32255 38946 986 78782 32053 25447 60817 -4726 -34110 -41683 -53403
3456 -53403 -84635 -39675 52201 43223 50041 63327 21037 64883 28611 -3369 -102 -11630
3444a1630k5999k9997P2435J5954M9966n8511m131l180j4403J9506M4671o7779
3432a3098k9694k126k8545J74K6629P4847L5288J380n6151j5102p675n122n2631
3419g1826M6700N3026p1355O3079m7235L8852K5873J0838p0348k4129L3386N2756
3407C9617J7893n8816l795j9497Q7208p0969M5147l8099l380L1213n5329j1623
3395d0430J9899j7880j4118n1449R8596J41007p2334N1133j40927l5363N3019
3384h847N0359O2246o2301o1541K4560J7003m1405J2419O2398K4890k8513o5248
3372a3980o2280R2437j070K5924n6729K4681M1552k569p9600J4032M1848o3068
3360c8822L2865j3887L1459M4502Q014L4345q0881M1261m241J6399O0824m5212
$$ plain form
3444 -11630 -37629 -67626 4809 20763 70729 12218 8087 4907 -9496 10010 54681 -13098
3432 -13098 -42792 -44918 -73463 -73289 -46660 28187 63475 64855 8704 -6398 -14073 -19195 -71826
3419 -71826 -25126 27900 -43455 19624 -27611 11241 37114 47952 -22396 -46525 -13139 39617
3407 39617 57510 -1306 -5101 -24598 62610 -8359 36788 -1311 -4691 26522 -28807 -40430
3395 -40430 -20531 -38411 -52529 -103978 -5382 135625 63291 114424 -26503 -61866 -8847
3384 -8847 41512 103758 41457 -20084 4476 21479 -19926 -7507 54891 79781 51268 -13980
3372 -13980 -76260 16177 15107 41031 -15698 8983 50535 47966 -31634 -17602 24246 -38822
3360 -38822 -5957 -19844 11615 56117 64131 98476 17595 58856 54615 71014 131838 86626
3348H6626k2871o4419M6620k2277K1081O675k4910L0809N1240q4315r2174m0123
3336a08038M8180J052J026L9641M1705k0183r93l9487p1171P2139j160M0903J8009
3323B1623o1194O559p0599j9938R2985N4959j8182o1587m8015P0779L3785K0132
3311B1307K3707m8270J9857p0549k0565L6917N0543k785m7982k8902N5524L9688
3299B8490l1123j8718N6485n0942L2884K7585o6390k7952J6156Q903n5934P4995
3287e561M167m3247l0290K6848L7458K0900j6084L3412R384M9503l4337J8747
3275G0900k6230J1208l6555j4258K6779k2699j0439j2185q740q756O4875j02993
3263f9093o434o865K2269M2929L2805k76L0317o0635n256Q072k3501O335l272
$$ plain form
3348 86626 63755 -664 45956 23679 44760 51435 26525 57334 108574 24259 -67915 -108038
3336 -108038 -59858 -58806 -57780 -18139 23566 3383 2390 -37097 -108268 -36129 -37289 3614 21623
3323 21623 -39571 -33012 -103611 -123549 -30564 24395 6213 -55374 -103389 -32610 1175 21307
3311 21307 45014 -3256 16601 -53948 -74513 -37596 12947 10162 -37820 -66722 -11198 28490
3299 28490 -2633 -21351 35134 -15808 17076 44661 -21729 -49681 -33525 -24622 -80556 -5561
3287 -5561 -1394 -44641 -74931 -48083 -10625 10275 -5809 27603 36987 86490 52153 70900
3275 70900 44670 55878 19323 5065 31844 9145 -1294 -13479 -22219 -30975 33900 -69093
3263 -69093 -75527 -82392 -60123 -17194 15611 15335 45652 -14983 -20239 -12167 -35668 -29333 -32605
3250c2605j6390l3548N4323P9806m7247n4886L6918L493n068M4309q4221J9828
3238c5288R4878L9554n4254N247l45m7147P319k044J7030l5025O5350l4137l3152
3225a2014K170k0594M1224l3057j0375R1950o1081L310K4182j2422O1510J8203
3213I3006j01874k6126N6775N6396k8539k1958K9232K4027n3525p2593L8147N5036
3201D8004k4286P5587p7993m0937N9460j0691r4153J0284O7432L7268Q43n8203
3189g385r655L657o4136P4069M56L2706l6559n8715j3712l2326Q2172n1092m071
3176h4591J2895O8560M1068p364O4337o98j1787N8888p2612m7685n1542K247M4894
3163A6610l4571L640P9924l2630Q891q5525N8338L180K17k4627j9770L5954K6140
$$ plain form
3250 -32605 -48995 -82543 -28220 51586 4339 -50547 -13629 -10136 -15204 29105 -55116 -35288
3238 -35288 59590 99144 44890 50137 49792 2645 9964 7920 24950 -10075 55275 21138 -12014
3225 -12014 -9844 -30438 10786 -22271 -32646 59304 -1777 1533 25715 13293 74803 93006
3213 93006 -8868 -34994 21781 78177 49638 27680 56912 80939 27414 -45179 -7032 48004
3201 48004 23718 99305 21312 -19625 39835 29144 -65009 -54725 12707 49975 50818 -7385
3189 -7385 -17040 -13383 -77519 -3450 -2994 29712 -6847 -65562 -79274 -111600 -29428 -80520 -84591
3176 -84591 -71696 -3136 37932 30568 94905 94207 82420 141308 68696 21011 -30531 -28284 16610
3163 16610 -17961 -14321 65603 32973 41864 -43661 14677 17857 18074 -6553 -26323 9631 35771
3150C5771o5691L4771K2091l7810m3589P5562o2808O6093N3737k6591l3013J0701
3138B9224l1100o5408J4675L9465j4967m7920J2031l89Q0214j0597l8336J3505
3126a9603K9797k1622M857Q3898j1208q3810o9843O9268L6824J7798J2300l9276
3114I380K0336o6955L0481j3570K1039M2503L0427m2955j3899N5626o5226L7433
3102D4620J2327M8679k180L5333M1373l7313k201O327l8127l1526M3273k8206
3090I2379M5293j45704L4077n2575K0000l9012P0885M7636q6739n0431P5777k41
3078A1345J4845O6686p010p0051j5850Q477O8618k8608J0962L174l2849p7094
3066d7355J08086l0672j1872k6699n9142N9856K0159P2891j2195l1276L1073o6635
$$ plain form
3150 35771 -29920 4851 26942 -10868 -54457 21105 -41703 24390 78127 51536 18523 29224
3138 29224 -1876 -67284 -52609 -13144 -28111 -76031 -64000 -64389 15825 5228 -33108 -19603
3126 -19603 10194 -11428 -6571 77327 66119 -17691 -87534 -18266 18558 36356 48656 9380
3114 9380 29716 -37239 -6758 -20328 711 43214 73641 30686 16787 72413 7187 44620
3102 44620 56947 105626 103446 138779 180152 142839 140638 146965 108838 77312 120585 92379
3090 92379 137672 -8032 26045 -26530 -6530 -45542 25343 72979 -13760 -64191 11586 11345
3078 11345 26190 92876 85866 15815 -35 8442 77060 48452 59414 62588 29739 -47355
3066 -47355 60731 30059 18187 -8512 -67654 -7798 12361 85252 73057 41781 72854 6219
3054F219M987L5805N3610o5673n2381P1567n8816K5430l4616L4620o9538J040
3042d7746k5907k1202K1174O1136K3433m6628J961O7391p7858L6703m4865L7426
3030a4982n2375N3559L2156J4351K7026l9823m0747r4969O9383M6546k3305J2952
3018a0228J00760l6661J8878j4156o8899L7197m7457J1909Q3435j03772j1442
3007d0436K9412l7230k7419L2180R830M6666l543p000m2853j4937Q2410R066o4607
2994b8461Q929J3872l5321k662l0646K6922O8828q4270r579P3912R9441M0917
2982A41882j39567m1999j4429M1288j2187N1831K829O0658o1558m1105M1484l9991
2970a0864K0419l5901m6567N1201o4301P3755R413m8911Q8330l7034J7667N7589
$$ plain form
3054 6219 11206 47011 100621 34948 -17433 54134 -4682 20748 -13868 20752 -48786 -47746
3042 -47746 -73653 -94855 -73681 -12545 10888 -35740 -33779 33612 -44246 -7543 -52408 -14982
3030 -14982 -67357 -13798 18358 32709 59735 19912 -20835 -115804 -46421 125 -23180 -10228
3018 -10228 90532 53871 72749 58593 -10306 26891 -20566 -8657 74778 -28994 -40436
3007 -40436 -11024 -48254 -75673 -43493 -33663 13003 9460 2460 -40393 -55330 27080 36146 -28461
2994 -28461 -19532 -5660 -40981 -43643 -74289 -47367 21461 -62809 -72388 1524 100965 141882
2982 141882 2315 -39684 -54113 -12825 -25012 26819 29648 90306 28748 -12357 29127 -10864
2970 -10864 9555 -26346 -72913 -21712 -86013 -12258 -2845 -51756 36574 -460 17207 74796
2958G4796j04520m9686P8068Q0268p8117l4287K4322n8018k4421N6143J2083J10226
2946H6857q6077j2159m740M212L6141p327M3037L4667j7517l6721q1490m1658
2934h2775r816k3133R9480J0717Q299o1666J0470K1416Q2433m4406n626l1482
2922b6089m3147K6077p4123K7586K7158P2814r6341L120M8253j4729J7723l71
2910c2069K7289L0883o433k7819J6614l1496K2576K2414l385n232M0465m8854
2898D953O543q003k6685J2544O9945l7477O647l2068K6771j15473j3325J3724
2886i1904m815P9924N3718j7032l8366K2056O0160k4353o9414N6272K1366l489
2874D4123o385o7492l599j7702p592M2716K9667J0210k2884p1632O3691n6325
$$ plain form
2958 74796 -29724 -79410 -1342 78926 809 -33478 -9156 -67174 -91595 -35452 -23369 86857
2946 86857 780 -11379 -16119 -11907 24234 16907 59944 94611 77094 40373 -41117 -82775
2934 -82775 -92591 -115724 -16244 -5527 2772 -58894 -48424 -27008 55425 11019 5393 -26089
2922 -26089 -69236 -43159 -117282 -89696 -62538 10276 -86065 -82945 -34692 -49421 -31698 -32069
2910 -32069 -4780 26103 19670 -8149 8465 -23031 -455 21959 18574 13342 53807 4953
2898 4953 11496 3493 -23192 -10648 59297 21820 28467 -3601 23170 -92303 -105628 -91904
2886 -91904 -96719 -16795 36923 19891 -18475 3581 63741 39388 -30026 26246 47612 44123
2874 44123 37738 -29754 -33353 -51055 -58647 -15931 13736 23946 1062 -70570 -6879 -63204
2862f3204l9900J02652L4893m9672j6473M5070K0576m8209j5678K4642m1489K0692
2850b6100J9252L1675J01739r622j06142K8070l0082M089r483J5998L1451l2838
2838A8007j05414J06381j9924o9278K2749P6743m0710L5739J8397q6082M9722
2827F330P7976j8569o6701K0865k9359L6082j5794j9647k904m418q203k8727Q6244
2814C3175p8691M7796K7660p3162P0196L856l7569K6171K2910o9734j5160K4645
2802a7907M0639k0850j2171j7936M0297k9679J4289Q3304m5274P738k6156j9216
2790b922K455J3018L5920K2315K2712m0219o5436j1190k7760J7900L2346o4696
2778f5557P7565J9429j1940L2768k7550m1102n467m4359j3571N3914R055J9604
$$ plain form
2862 -63204 -103104 -452 34441 -15231 -31704 13366 33942 -14267 -29945 -5303 -46792 -26100
2850 -26100 -6848 24827 126566 116944 10802 38872 8790 12879 3396 19394 50845 18007
2838 18007 -87407 18974 -950 -70228 -47479 29264 -11446 24293 42690 -43392 6330
2827 6330 84306 65737 -964 19901 -9458 26624 10830 -8817 -11721 -16139 -24342 -53069 33175
2814 33175 -45516 2280 29940 -43222 26974 30830 -6739 19432 42342 -27392 -42552 -17907
2802 -17907 22732 1882 -10289 -28225 12072 -17607 -3318 79986 34712 42450 16294 -2922
2790 -2922 -467 12551 48471 70786 93498 53279 -12157 -23347 -51107 -33207 -861 -65557
2778 -65557 12008 31437 19497 52265 24715 -16387 -21854 -66213 -79784 -25870 -16815 2789
2766B789O7339N3195q5361l662J7743l9554N9304q8620M9648N1114N086k3696
2754F5325j55270L4696R283J2619j9469J063R092N596K2159j195N8217l0414j4714
2741c012j969j1155J0251m341M905K1082j0248J6540l5507k5546J6877O5376r2518
2728d9265m8137M7992N0434L2644k0514m2336M8496k0014m4676J03446o9281j1501
2716b2712p8654k4544J0786J4529Q9502J3286j8978O338L5904k4780q37O96k920
2703b384m0533l2054N3402M0997J7853r3618j9087L5843L9220m729J1104N3990
2691F0004K3644n7163j4802n6287n1694L7753l6397M4641M0524k0390M2860m6356
2679c3663j6554O3207J4697j5778o7685o699O5047n9388L1174Q9246l3672N306
$$ plain form
2766 2789 70128 123323 37962 34300 52043 12489 71793 -16827 32821 83935 89021 65325
2754 65325 -89945 -55249 -45966 -33347 -52816 -51753 -42661 -37065 -14906 -16101 42116 11702 -3012
2741 -3012 -4981 -16136 -5885 -10226 -5321 15761 5513 22053 -13454 -39000 -22123 43253 -49265
2728 -49265 -97402 -49410 1024 33668 13154 -29182 19314 -700 -45376 58070 -11211 -22712
2716 -22712 -101366 -125910 -115124 -100595 -11093 2193 -16785 -10447 25457 677 -160 536 -2384
2703 -2384 -42917 -74971 -21569 19428 37281 -56337 -75424 -39581 -361 -5090 6014 60004
2691 60004 83648 26485 11683 -44604 -96298 -58545 -94942 -50301 -9777 -30167 12693 -33663
2679 -33663 -50217 12990 27687 11909 -55776 -62475 2572 -56816 -25642 63604 29932 35238
2667C5238N0127n8857m6813J3923M1124j1182j0583j817J13765m1446o8975o5069
2655e0565M8073k7185l3629L4731P015o423N886q3909n31N1851m5953Q3941K181
2642a4517K8677l4005l1583Q7703R777p858K4395q7028k9558O1729L7577k9708
2630A5601j1237p7113N0207k8326m3238M7197M0319o388N3685k0844j7883o7955
2618f5975J11911K9030o8133J2444l4305k0217Q2393p111j14787J0603P0135N4861
2606F0849J5352m9304q5041m0691r701L6926L900L0790l152k0048p815M9766q8968
2593a07137P8643l2146K6940K9539p2163P3624J03579j22646L302J5077K5875
2582B2487P5053j62456N6409N3859J02251j35036l6578K2828Q712l5622l4723
$$ plain form
2667 35238 85365 26508 -20305 -6382 34742 23560 12977 11160 124925 83479 14504 -50565
2655 -50565 -2492 -29677 -63306 -28575 -21560 -27983 -22097 -106006 -106537 -54686 -100639 -16698 -14517
2642 -14517 14160 -19845 -51428 36275 46052 38194 62589 -24439 -53997 7732 45309 15601
2630 15601 4364 -72749 -22542 -50868 -94106 -46909 -6590 -12978 40707 19863 1980 -65975
2618 -65975 45936 74966 6833 19277 -15028 -35245 47148 40037 -74750 -64147 5988 60849
2606 60849 76201 26897 -58144 -98835 -108536 -71610 -67710 -36920 -40072 -60120 -67935 -18169 -107137
2593 -107137 -28494 -60640 -33700 -4161 -76324 -2700 100879 -21767 -18465 -3388 22487
2582 22487 97540 -64916 -8507 45352 147603 12567 -24011 -1183 7529 -28093 -62816
2571f2816L4621L0148o4094K8860L2360m8635O7024M987k7610p7925m9217M2404
2559h9893J9139P3493P6232q184j26405o5191P3468L6068j7953j7034O8877L9673
2547F2290J3795n1448j5226m6490R627P9520Q610n8384j9801K5708n0423P3534
2535C1312m6356M6600M258o3347r464M72L5825n586n5621N5533L0098M5041q2634
2522a3869m1623O821n3996O9361j5487J4585m3716J57847n6376p333m3548j1143
2510c8477Q1038K8645M1474r8718o467k7641n6456J01065k0134K339j699k3262
2498a8293M0548l676L7738o2525Q384L9609K4753j1706k6824l2634l6404M1662
2486F32K1062l3620j264L3154j7898p0271Q3965m2290P2992J0237q3404O4035
$$ plain form
2571 -62816 -28195 1953 -62141 -33281 -921 -49556 17468 22455 -5155 -83080 -132297 -89893
2559 -89893 -70754 2739 78971 70787 -55618 -120809 -47341 -11273 -29226 -46260 22617 62290
2547 62290 76085 24637 9411 -37079 -27452 52068 60678 2294 -17507 8201 -42222 31312
2535 31312 -15044 31556 35814 -27533 -36997 -36525 -700 -6286 -61907 -6374 23724 68765 -13869
2522 -13869 -55492 -48671 -102667 -33306 -48793 -34208 -77924 79923 23547 16214 -27334 -38477
2510 -38477 42561 71206 112680 13962 7495 -20146 -76602 24463 4329 6668 4969 -18293
2498 -18293 22255 18579 56317 -6208 2176 41785 66538 54832 28008 -4626 -41030 632
2486 632 21694 -11926 -13190 19964 2066 -68205 15760 -26530 46462 56699 -26705 37330
2474C7330n8192m663O0228K1417m9261o0842N324N3670L473k3317M1990k4382
2462B775r8273P7626L6074j8700l2365K833J429K3471P8121o2348j5786J8j44871
2449a49996J24029Q7691l5055k5512m411L2401k2523j8752j1935j0740r6714l81
2437a31898J04832r91O2603P821m7680j3480l2401m3035K8922J10694k3712R916
2425C1591k2878O4475r981Q2379j35028q0360L5572J05035n48r1204R4017k9286
2413D3784J4491p4503L6511l7471O0359p2416Q3832K9987r9784l3105L8392M4716
2401C4793k2387m0161O5656o4835K6672j6014l9939l2891N2707J8229n062M7838
$$ plain form
2474 37330 -20862 -25525 34703 56120 6859 -53983 -48659 5011 8484 -14833 27157 2775
2462 2775 -95498 -17872 18202 -498 -32863 -30030 -28601 -5130 72991 10643 -5143 -5125 -149996
2449 -149996 -25967 61724 26669 1157 -3254 29147 6624 -12128 -24063 -34803 -131517 -131898
2437 -131898 -27066 -28057 34546 42367 -5313 -18793 -51194 -94229 -65307 45387 21675 31591
2425 31591 8713 73188 63207 145586 10558 -69802 -34230 70805 70257 -20947 73070 43784
2413 43784 58275 -16228 20283 -17188 43171 -29245 54587 84574 -15210 -48315 -9923 34793
2401 34793 12406 -27755 37901 -26934 -262 -16276 -56215 -89106 -36399 -18170 -23232 24606
$$ [...]
##END NTUPLES=NMR SPECTRUM
##END=
