##TITLE=C13_EC-3263c
 DMSO-d6, 1900 sc

 7.6.2022
##JCAMPDX= 6.0         $$ Bruker NMR JCAMP-DX V2.0
##DATA TYPE= NMR SPECTRUM
##DATA CLASS= NTUPLES
##ORIGIN= UXNMR, Bruker Analytische Messtechnik GmbH
##OWNER= root
$$ XWIN-NMR		Version 3.5
$$ Wed Jun  8 16:34:28 2022 Russian Standard Time (UT+4h)  she@DPX200
##.OBSERVE FREQUENCY= 50.327896
##.OBSERVE NUCLEUS= ^13C
##.ACQUISITION MODE= SIMULTANEOUS
##.ACQUISITION SCHEME= undefined
##.AVERAGES= 1903
##.DIGITISER RES= 17
##SPECTROMETER/DATA SYSTEM= spect
##.PULSE SEQUENCE= zgpg30
##.SOLVENT NAME= CDCl3
##.SHIFT REFERENCE= (INTERNAL, CDCl3, 0, 222.089)
##AUDIT TRAIL= $$ (NUMBER, WHEN, WHO, WHERE, WHAT)
$$ ##TITLE= Audit trail, XWIN-NMR		Version 3.5
$$ ##JCAMPDX= 5.01
$$ ##ORIGIN= Bruker BioSpin GmbH
$$ ##OWNER= she
$$ F:/spectra/data/she/nmr/c13/1/pdata/1/auditp.txt
$$ ##AUDIT TRAIL=  $$ (NUMBER, WHEN, WHO, WHERE, WHAT)
(   1,<2022-06-08 16:33:07.32 +0400>,<she>,<DPX200>,
      <created by zg, POWCHK disabled, PULCHK disabled
       terminated by command 'halt'
       configuration hash MD5:
       00 E9 B6 7A A2 85 ED C7 34 08 36 98 17 FE 4E 26
       data hash MD5: 32K
       89 B4 25 54 37 8B CD 88 6B E1 65 06 4E 0B AB 52>)
(   2,<2022-06-08 16:33:10.09 +0400>,<she>,<DPX200>,
      <Start of raw data processing
       efp BC_mod = 2 LB = 1 FT_mod = 6 PKNL = 1 PHC0 = -371.1224 PHC1 = 29.28472 SI = 32K 
       data hash MD5: 32K
       00 67 D5 AD C6 2A C2 E1 20 5D D4 13 18 7B 6E 28>)
(   3,<2022-06-08 16:33:40.82 +0400>,<she>,<DPX200>,
      <abs ABSG = 5 
       data hash MD5: 32K
       15 EF 6E A9 49 DA 12 78 71 ED 1B 73 C6 8D A5 0C>)
$$ ##END=
$$ 
$$ hash MD5
$$ FB 8F 3F CC 96 3C 8E F4 C6 AA 0C 16 A4 37 33 0B
##$RELAX= 
##$RELAX= 
##$RELAX= 
##$RELAX= 
##$RELAX= 
##$RELAX= 
##$RELAX= 
##$RELAX= 
$$ Bruker specific parameters
$$ --------------------------
##$DU= <F:/spectra>
##$EXPNO= 1
##$NAME= <c13>
##$PROCNO= 1
##$TYPE= <nmr>
##$USER= <she>
##$AMP= (0..31)
100 100 100 100 100 100 100 100 100 100 100 100 100 100 100 100 100 100 
100 100 100 100 100 100 100 100 100 100 100 100 100 100 
##$AQSEQ= 0
##$AQ_mod= 1
##$AUNM= <au_zg>
##$AUTOPOS= <>
##$BF1= 50.322709
##$BF2= 200.13
##$BF3= 50.322709
##$BF4= 500.13
##$BF5= 500.13
##$BF6= 500.13
##$BF7= 500.13
##$BF8= 500.13
##$BYTORDA= 1
##$CFDGTYP= 0
##$CFRGTYP= 5
##$CHEMSTR= <none>
##$CNST= (0..31)
1 1 145 1 1 1 1 1 1 1 1 1 1 1 1 1 1 1 1 1 1 1 1 1 1 1 1 1 1 1 1 1 
##$CPDPRG= <waltz16>
##$CPDPRG1= <>
##$CPDPRG2= <waltz16>
##$CPDPRG3= <>
##$CPDPRG4= <mlev>
##$CPDPRG5= <mlev>
##$CPDPRG6= <mlev>
##$CPDPRG7= <mlev>
##$CPDPRG8= <mlev>
##$CPDPRGB= <>
##$CPDPRGT= <>
##$D= (0..31)
0 2 0.00345 0 0 0 0 0 0 0 0 0.03 2e-05 3e-06 0 0 0 0 0 0 0 0 0 0 0 0 0 
0 0 0 0 0 
##$DATE= 1654686334
##$DBL= (0..7)
120 120 120 120 120 120 120 120 
##$DBP= (0..7)
150 150 150 150 150 150 150 150 
##$DBP07= 0
##$DBPNAM0= <>
##$DBPNAM1= <>
##$DBPNAM2= <>
##$DBPNAM3= <>
##$DBPNAM4= <>
##$DBPNAM5= <>
##$DBPNAM6= <>
##$DBPNAM7= <>
##$DBPOAL= (0..7)
0.5 0.5 0.5 0.5 0.5 0.5 0.5 0.5 
$$ [...]
##$SUBNAM4= <"">
##$SUBNAM5= <"">
##$SUBNAM6= <"">
##$SUBNAM7= <"">
##$SUBNAM8= <"">
##$SUBNAM9= <"">
##$SW= 239.972175391363
##$SWIBOX= (0..15)
0 1 3 0 0 0 0 0 0 0 0 0 0 0 0 0 
##$SW_h= 12077.2946859903
##$TD= 32768
##$TD0= 1
##$TE= 0
##$TE2= 300
##$TE3= 300
##$TEG= 300
##$TL= (0..7)
120 120 120 120 120 120 120 120 
##$TP= (0..7)
150 150 150 150 150 150 150 150 
##$TP07= 0
##$TPNAME0= <>
##$TPNAME1= <>
##$TPNAME2= <>
##$TPNAME3= <>
##$TPNAME4= <>
##$TPNAME5= <>
##$TPNAME6= <>
##$TPNAME7= <>
##$TPOAL= (0..7)
0.5 0.5 0.5 0.5 0.5 0.5 0.5 0.5 
##$TPOFFS= (0..7)
0 0 0 0 0 0 0 0 
##$TUNHIN= 0
##$TUNHOUT= 0
##$TUNXOUT= 0
##$USERA1= <user>
##$USERA2= <user>
##$USERA3= <user>
##$USERA4= <user>
##$USERA5= <user>
##$V9= 5
##$VALIST= <valist>
##$VCLIST= <CCCCCCCCCCCCCCC>
##$VD= 0
##$VDLIST= <DDDDDDDDDDDDDDD>
##$VPLIST= <PPPPPPPPPPPPPPP>
##$VTLIST= <TTTTTTTTTTTTTTT>
##$WBST= 1024
##$WBSW= 4
##$XGAIN= (0..3)
0 0 0 0 
##$XL= 0
##$YL= 0
##$YMAX_a= 12388303
##$YMIN_a= -10458568
##$ZGOPTNS= <>
##$ZL1= 120
##$ZL2= 120
##$ZL3= 120
##$ZL4= 120
##$ABSF1= 222.0892
##$ABSF2= -17.90747
##$ABSG= 5
##$ABSL= 3
##$ALPHA= 0
##$AQORDER= 0
##$ASSFAC= 0
##$ASSFACI= 0
##$ASSFACX= 0
##$ASSWID= 0
##$AUNMP= <proc_1d>
##$AZFE= 0.1
##$AZFW= 0.5
##$BCFW= 0
##$BC_mod= 2
##$BYTORDP= 0
##$COROFFS= 0
##$CY= -3
##$DATMOD= 1
##$DC= 0
##$DFILT= <>
##$DTYPP= 0
##$F1P= 0
##$F2P= 0
##$FCOR= 0.5
##$FTSIZE= 32768
##$FT_mod= 6
##$GAMMA= 0
##$GB= 0
##$INTBC= 1
##$INTSCL= 4.134877e-10
##$ISEN= 128
##$LB= 1
##$LEV0= 0
##$LPBIN= 0
##$MAXI= 10000
##$MC2= 0
##$MEAN= 0
##$ME_mod= 0
##$MI= 0.1934396
##$NCOEF= 0
##$NC_proc= -1
##$NLEV= 6
##$NOISF1= 120.0001
##$NOISF2= 80.00006
##$NSP= 0
##$NTH_PI= 0
##$NZP= 0
##$OFFSET= 222.0892
##$PC= 1.4
##$PHC0= -371.1224
##$PHC1= 29.28472
##$PH_mod= 1
##$PKNL= yes
##$PPARMOD= 0
##$PSCAL= 0
##$PSIGN= 0
##$REVERSE= no
##$SF= 50.3227585034004
##$SI= 32768
##$SIGF1= 140
##$SIGF2= 120
##$SINO= 11.81781
##$SIOLD= 32768
##$SREGLST= <13C.CDCl3>
##$SSB= 0
##$STSI= 32768
##$STSR= 0
##$SW_p= 12077.2946859903
##$SYMM= 0
##$S_DEV= 0
##$TDeff= 32768
##$TDoff= 0
##$TI= <>
##$TILT= no
##$TM1= 0
##$TM2= 0
##$TOPLEV= 0
##$USERP1= <user>
##$USERP2= <user>
##$USERP3= <user>
##$USERP4= <user>
##$USERP5= <user>
##$WDW= 1
##$XDIM= 32768
##$YMAX_p= 541911319
##$YMIN_p= -6144882
$$ End of Bruker specific parameters
$$ ---------------------------------
##NTUPLES= NMR SPECTRUM
##VAR_NAME=  FREQUENCY,     SPECTRUM/REAL,   SPECTRUM/IMAG
##SYMBOL=    X,             R,               I
##VAR_TYPE=  INDEPENDENT,   DEPENDENT,       DEPENDENT
##VAR_FORM=  AFFN,          ASDF,            ASDF
##VAR_DIM=   32768,         32768,           32768
##UNITS=     HZ,            ARBITRARY UNITS, ARBITRARY UNITS
##FACTOR=    0.368581032318806, 1,           1
##FIRST=     11176.1413227862, 0,            0
##LAST=      -901.153363204117, 0,           0
##MIN=       -901.153363204117, -6144882,    0
##MAX=       11176.1413227862, 541911319,    0
$$ Real data points
##PAGE= N=1
##DATA TABLE= (X++(R..R)), XYDATA
$$ [...]
10670g50855N47244L04633L50321K13290P55324O57017J95044m89049k6622q32423
10660I23924r62041n25834p5347P10739O44875P8551N87508M64642q9089o32737
10650A125191M92754O73768K59516p49657j654159j415795p18658q81345j153966
10641d022351r65466J052162K506130J696972O48133K2830l55183M4791n01941
10632A26077j230096p50927m94735M67188J812583J231160M20205K77187N67682
10623B426324J3408j628047j55542n60318q21170N2767j145744j106343M74910
10614b449755J334811J074933L09568Q08014R42716k36873k91505o7843j81501
10605A242565k47975k28511l11516j589572j560571N20993P40026N05926L01272
$$ plain form
10670 -750855 -203611 101022 451343 664633 1419957 2076974 2272018 1782969 1756347 923924
10660 923924 -38117 -563951 -639298 71441 716316 794867 1382375 1847017 1757928 1125191
10650 1125191 1617945 2291713 2551229 1801572 147413 -1268382 -1987040 -2868385 -4022351
10641 -4022351 -4987817 -3935655 -1429525 267447 915580 938410 583227 628018 126077
10632 126077 -1104019 -1854946 -2349681 -1882493 -69910 1161250 1581455 1858642 2426324
10623 2426324 2439732 811685 656143 95825 -725345 -672578 -1818322 -2924665 -2449755
10614 -2449755 -1114944 -40011 269557 1077571 2020287 1783414 1491909 1424066 1242565
10605 1242565 994590 766079 454563 -1135009 -2695580 -2174587 -1434561 -928635 -627363
10596f27363O923q05657j88476J286565J36406q8589L43255r34690m65926Q3527
10586a254025L69474K04389K41993J42752k84056k32407K454q82607l81715Q15516
10576a258232M19038l80787p12251O71584K058567O00075p22358r20859P218m5625
10566b83630k43343L02730K83050l92124j898242r90749N20801J230169O13814
10557h57524q1138O9304l12546J65999P13573J3071j05997r93653j099428p8611
10547b566950N75876P29282O37236M31807N58871m61208L31642N87380k88151
10538E35785q79191r83582l47245l74689P08418J052413O88891K17896o3320q7723
10528D67653M87437L63431J39764K67446m40184o01629j274196n46888O32341
$$ plain form
10596 -627363 -620440 -1426097 -1614573 -328008 -191602 -280191 63064 -871626 -1337552 -1254025
10586 -1254025 -884551 -680162 -438169 -295417 -579473 -811880 -809426 -1692033 -2073748 -1258232
10576 -1258232 -839194 -1219981 -1932232 -1260648 797919 1397994 675636 -245223 -238005 -283630
10566 -283630 -526973 -224243 58807 -333317 -2231559 -3222308 -2701507 -1471338 -857524
10557 -857524 -938662 -869358 -1181904 -1015905 -302332 -289261 -395258 -1388911 -2488339 -2566950
10547 -2566950 -1991074 -1261792 -624556 -192749 366122 -95086 236556 823936 535785
10538 535785 -343406 -1326988 -1674233 -2048922 -1340504 -288091 400800 618696 555376 467653
10528 467653 955090 1318521 1458285 1725731 1285547 683918 -590278 -1137166 -504825
10519e04825M06893K45489M36447o36721m47000l86856L39873m597k65052J75461
10509f40888l3062o71219m90710N06748J32928j75479o3029P54568R53314N39148
10499H12319L77914p63179n81924R25937Q3347n43759L40285N50226r6926n79450
10489E24790L35311Q84699K02973o19506m27798M24295L42424j21882n84449P0669
10479A031526N99973M25779Q9962p5443p65249n59958m46791o36007J9898J32833
10469a83477R4744R77532P16626l75198j211777j158590l01366J0332k24163k09416
10459a864753m67234L46042N91609L2941p38764m69409j83677k26800P91585J567078
10449f21382O85310p54153j30079J93150m81282j38850K97343P83041K99236l84015
$$ plain form
10519 -504825 -97932 147557 584004 -52717 -499717 -886573 -546700 -551297 -816349 -640888
10509 -640888 -673950 -1345169 -1835879 -1329131 -1196203 -1371682 -1434711 -680143 273171 812319
10499 812319 1190233 427054 -154870 771067 854414 310655 650940 1201166 1104240 524790
10489 524790 860101 1744800 1947773 1328267 900469 1324764 1667188 1545306 960857 1031526
10479 1031526 1631499 2057278 2147240 2071797 1306548 746590 299799 -336208 -316310 -183477
10469 -183477 -88733 888799 1605425 1230227 18450 -1140140 -1441506 -1431174 -1655337 -1864753
10459 -1864753 -2331987 -1985945 -1394336 -1361395 -2100159 -2569568 -2753245 -2980045 -2188460 -621382
10449 -621382 63928 -690225 -820304 -627154 -1108436 -1247286 -949943 -166902 132334 -251681
10439b51681r3552M49844L42238J2736L7565n24689j48708J396918J506760n05643
10429B221788q09318j56636m1243p01548n39722L11128P23740O84907m90622j843309
10419f40835o27099R71248J545675J192615o35990j656970j307186K70521R97668
10410A09647P99761l44291j148309M00357m6919r82150p81707k08261N33683L53466
10400a314723J057612O76131K78959R87738J106305L2982j335696j181043o67764
10391c59499J080279J480274J63975r18697l55588p36666n12712J30742j20811
10382a48703p1809r48198m47527R23871M31540o95329j97549k72255O38088P15391
10372g2480L31724l35446k4350m11644j291127l78955Q42507N86972n30156R45617
$$ plain form
10439 -251681 -345233 104611 446849 459585 497150 -27539 -176247 1220671 2727431 2221788
10429 2221788 1412470 1255834 1214591 513043 -26679 284449 1008189 1693096 1202474 -640835
10419 -640835 -1267934 -296686 1248989 2441604 1805614 148644 -1158542 -888021 109647
10410 109647 909408 565117 -583192 -182835 -229754 -1211904 -1993611 -2201872 -1668189 -1314723
10400 -1314723 -257111 419020 697979 1685717 2792022 2825004 1489308 308265 -359499
10391 -359499 720780 2201054 2365029 1446332 1090744 354078 -158634 -27892 -148703
10382 -148703 -220512 -1168710 -1616237 -692366 -260826 -956155 -1153704 -1425959 -787871 -72480
10372 -72480 259244 -76202 -100552 -512196 -1803323 -2182278 -1339771 -752799 -1282955 -337338
10362c37338J389787K88449r41538j044392j123265j211565n16066O26024J597567
10353a272337J182380J3373J44873l35964m52092P8798L87765O28455j84015n68051
10343c76815M26331O81713m86027j248787r04760J07583O98346L88692L61068
10334c52656K65150N25879O62344p67557l52094k7155q32215j230241J76671J398723
10324e33151Q29038J77273K4503k17875M16619P44100R64619P69878j93779r50354
10314B030871r39018L67517O31533n29168q19493l57961J40743R6132J74619L23994
10304A119769Q52406J333881O46944j216823j311731o3431N16389Q86670P78231
10295C542305j67637K6777O05116M22567L64990M01586M22705Q32028J483796
$$ plain form
10362 -337338 1052449 1340898 399360 -645032 -1768297 -2979862 -3495928 -2869904 -1272337
10353 -1272337 -89957 -76584 68289 -267675 -719767 -640969 -253204 375251 191236 -376815
10343 -376815 49516 731229 245202 -1003585 -1908345 -1800762 -1102416 -713724 -352656
10334 -352656 -87506 438373 1100717 333160 -18934 -46089 -878304 -2108545 -1931874 -533151
10324 -533151 295887 473160 497663 279788 696407 1440507 2405126 3175004 2981225 2030871
10314 2030871 1091853 1459370 2090903 1561735 742242 384281 525024 621156 795775 1119769
10304 1119769 1972175 3306056 3953000 2736177 1424446 1361015 1877404 2764074 3542305
10295 3542305 3374668 3401445 4006561 4429128 4794118 5195704 5618409 6450437 7934233
10286G934233J733335K575096L469953M753808O510059Q668543J2562808J6155817
10278F4363652J3960710l48975j4767814j6172732j2500881q367671n677213m410559
10270A6078517l109611k620746q20212n67251j704736k360556j124360J525380
10262E296425R75280j577635j645333l21124j43514R87339M72976j025963j714252
10253A304199o21869M37372M28417n61318q07866L81545O77638J36808L58039
10244A732965N09656N66271l50169q88176p49628m10397M81760N19992J64959
10235A577233L17987n8761j36029K07403J52571Q6491Q5912K18181l63713M25448
10225B512723n05332k094178r68920m4439L31851J08116j37297J09171J120136
$$ plain form
10286 7934233 9667568 12242664 15712617 20466425 26976484 35645027 48207835 64363652
10278 64363652 78324362 77975387 63207573 47034841 34533960 26166289 20489076 16078517
10270 16078517 12968906 10348160 9527948 8960697 7255961 4895405 3771045 5296425
10262 5296425 6271705 4694070 3048737 2727613 2584099 3571438 4044414 3018451 1304199
10253 1304199 682330 1119702 1548119 986801 178935 560480 1238118 1374926 1732965
10244 1732965 2242621 2808892 2458723 1570547 820919 410522 892282 1412274 1577233
10235 1577233 1895220 1836459 1700430 1907833 2060404 2146895 2232807 2450988 2087275 2512723
10225 2512723 2007391 -86787 -1055707 -1100146 -768295 -660179 -797476 -688305 431831
10216D31831O51482J55457n16350j026764j397881k15030R91141Q30683l6910
10207a32341L38490n55211q11034k14693M80911k65424m67193m70882l24496N64939
10197a856934Q20279K885j20806K90085K65013J84986j9324k93858q23905j248042
10187b799621q52375K53072O58041R25535R42630J46351l66761M1157M4164M71886
10177e35921R89250L72034j74043l36221o39445K78508Q07874k7794l71112j40637
10167B22493N41040M60804j37808l90493l05865O18393m41136l91330M83010J189008
10157A848116O64373R6593o25661j252572j196243O0640J82089L85893l34322
10148a71094q56573j83737m26953l67900P98788J082908P4635J92845N54821K20920
$$ plain form
10216 431831 1083313 1238770 722420 -304344 -1702225 -1917255 -926114 -95431 -132341
10207 -132341 206149 -349062 -1160096 -1374789 -893878 -1159302 -1626495 -2097377 -2421873 -1856934
10197 -1856934 -1036655 -1033770 -1154576 -864491 -599478 -414492 -433816 -727674 -1551579 -2799621
10187 -2799621 -3651996 -3398924 -2740883 -1815348 -872718 -726367 -1093128 -1051971 -1007807 -535921
10177 -535921 453329 825363 651320 315099 -324346 -45838 762036 734242 363130 222493
10167 222493 763533 1224337 1086529 696036 390171 1008564 567428 176098 659108 1848116
10157 1848116 2512489 2609082 1983421 730849 -465394 -404754 -222665 163228 -171094
10148 -171094 -1027667 -1211404 -1638357 -2006257 -1207469 -124561 -49926 142919 697740 918660
10138I18660M71511L40004K55476n29060k86459R67466J26945j087565p61342
10129D15636l96762K87617J179052J357960R6581m26200j79439j004185k061895
10120g31635n92645P87235J39728J57734l74794r18277m61847j09437L11993M94799
10110a297146M86743J54002M3012O06786J95666Q690m76620J80488K47740P2975
10100B22336Q3647N7328M43346M89660j33404l45077m8099J38598K0792J65052
10090A094179P10538M7684k89869M47372m09000o96347q6888l32964j165346L43326
10080c37315J166766r14230j551143j761060j419219l68140Q11671J049767J338256
10071a984647N95446m45310p21000r32082K64204J280416M76165Q04369q3205
$$ plain form
10138 918660 1390171 1730175 1985651 1456591 1170132 2137598 2264543 1176978 415636
10129 415636 18874 306491 1485543 2843503 2940084 2513884 2334445 1330260 -731635
10120 -731635 -1324280 -537045 -397317 -239583 -614377 -1532654 -1994501 -2103938 -1791945 -1297146
10110 -1297146 -810403 -656401 -613389 -6603 189063 197753 -278867 -98379 149361 222336
10100 222336 305983 363311 806657 1296317 1162913 817836 769737 908335 929127 1094179
10090 1094179 1804717 1852401 1562532 2009904 1600904 904557 817669 484705 -680641 -337315
10080 -337315 829451 -84779 -1635922 -3396982 -4816201 -5184341 -4372670 -3322903 -1984647
10071 -1984647 -1389201 -1834511 -2555511 -3487593 -3223389 -1942973 -1466808 -662439 -745644
10062g45644j053884o30604M28772J122236Q61164R74186Q32492q39200l10561
10053F38957O44276N22156o76329r19631K2755O44156P10827J026205P44764p04567
10043B653569j230162j161628l06820n62394j84771L15637J196639J200610O52707
10034B573387o03476n29507k20114q21480j021205j57792P42547k84301n21935
10025h43876K2665N56922l24296m82880O54317L09644O19055Q19996M3878k32982
10015A142443o31012p54842m8620N51625J477903P61660K70626K48916o29066
10006B389633j146684j121123K37215K02527n15735k95953l11664k84463N32756
9997c13491L30961L19666K42273l21032K18280J161634O13827o02787j584210
$$ plain form
10062 -745644 -1799528 -2430132 -2001360 -879124 -17960 956226 1788718 949518 638957
10053 638957 1283233 1805389 1129060 209429 232184 876340 1587167 2613372 3358136 2653569
10043 2653569 1423407 261779 -45041 -607435 -792206 -476569 720070 1920680 2573387
10034 2573387 1969911 1440404 1220290 398810 -622395 -780187 -37640 -321941 -843876
10025 -843876 -821211 -264289 -588585 -1071465 -417148 -107504 511551 1331547 1375425 1142443
10015 1142443 511431 -243411 -292031 259594 1737497 2499157 2769783 3018699 2389633
10006 2389633 1242949 121826 359041 561568 45833 -250120 -561784 -846247 -313491
9997 -313491 17470 337136 579409 258377 476657 1638291 2252118 1649331 65121
9988F5121j047483n77256J86302M13688n42169q29051J88901M50151q33403r31718
9978c456917N85152M97650K0357k89551L69320J100801J88026J74444O65094J0182
9968a35442l79990j25910r80249q57898k60105p3064p8698q498J086209J301125
9958e12520j34670J39664l47371k25271j67726r19081Q6618N43870n16306J12473
9948a940320J168963M27169O15118L26717p08275m7151q9763j39793K97468m31911
9938e21778l06520k9231K68186K98043l11963m95462r82858J002518J840298o8644
9928F92589o97798Q7798O06721J80208J11469o92011j370195r13995k36424m59445
9918b691083K37628R73708O29666J84493R13424J164200P14730O17168M45938
$$ plain form
9988 65121 -982362 -1559618 -1373316 -959628 -1501797 -2330848 -2141947 -1691796 -2525199 -3456917
9978 -3456917 -2871765 -2374115 -2353758 -2643309 -2273989 -1173188 -985162 -810718 -145624 -135442
9968 -135442 -515432 -641342 -1621591 -2479489 -2739594 -2812658 -2891356 -2899854 -1813645 -512520
9958 -512520 -647190 -507526 -854897 -1080168 -1247894 -2166975 -2080357 -1536487 -2052793 -1940320
9948 -1940320 -771357 -344188 270930 597647 -110628 -157779 -247542 -387335 -89867 -521778
9938 -521778 -828298 -857529 -589343 -291300 -603263 -1098725 -2081583 -1079065 761233 692589
9928 692589 -5209 82589 689310 869518 980987 288976 -1081219 -1995214 -2231638 -2691083
9918 -2691083 -2453455 -1479747 -850081 -665588 247836 1412036 2126766 2743934 3189872
9909C189872m70018k94468j10473m86107p86387j087437j053266j76517O85571
9900e89230J146522L10153m92106p60492m51926m8544K77151O76255l08402N84332
9890C43713N88585j356187m95252J107035l88177j072588K54515R11451L88603
9881B81698N37568l59386R1806J50398Q44203M84502q75089j170473j472186j00510
9871a587469Q43165L22610J88071J98263J64612Q73995K30230j153121j299975
9862a219619N348O94682O02612l09082k23910k19351m81212n60165m24536N12045
9852a623188N28214K25323Q51804K77037l95325M26129J606341j23844j528122
9843B44369o44622K005M86548r9213r21492J58892M84564J28324Q83778O32757
$$ plain form
9909 3189872 2719854 2425386 2314913 1828806 1042419 -45018 -1098284 -1274801 -589230
9900 -589230 557292 867445 375339 -385153 -837079 -885623 -608472 67783 -240619 343713
9890 343713 932298 -423889 -919141 187894 -200283 -1272871 -1018356 -106905 281698
9881 281698 819266 459880 551686 702084 1546287 2030789 1155700 -14773 -1486959 -1587469
9871 -1587469 -744304 -421694 -233623 -35360 129252 1003247 1233477 80356 -1219619
9862 -1219619 -1214271 -519589 83023 -226059 -449969 -669320 -1150532 -1710697 -2135233 -1623188
9852 -1623188 -1094974 -869651 -17847 259190 -136135 289994 1896335 1772491 244369
9843 244369 -400253 -398248 88300 -10913 -932405 -773513 -288949 -160625 723153 1355910
9833A355910L46958J17749q81704k020713n21414O3854O16515J107610M23876
9824F08641p85998j187804n37111j84049l21081l49414R45130J459134O95782
9815C43230N67302k10416k082842j503143l18797p0365N18531J34130O58236P13954
9805a250180L22566j13588j126174M75601K039837P7221k84843q9743l32291k61501
9795e43095k04288l296O36413j73152J03500R75619K50930M88329L36232K27864
9785B095056M94399n41913j452212p88348L86688L28530L4647L77951J72010o67131
9775D39677j054201r68861j055834k37029P16515O14908j67571M50613R92595
9766b69188N66354L83416j97570l09420L62386j68834j94750P12500q99308r23045
$$ plain form
9833 1355910 1702868 1820617 938913 -1081800 -1603214 -1539360 -922845 184765 608641
9824 608641 -177357 -1365161 -1902272 -2086321 -2407402 -2756816 -1811686 -352552 343230
9815 343230 910532 700116 -1382726 -2885869 -3204666 -3275031 -2756500 -2622370 -1964134 -1250180
9805 -1250180 -927614 -1041202 -2167376 -1691775 348062 425283 140440 50697 -281594 -543095
9795 -543095 -747383 -750679 -114266 -287418 -183918 791701 1042631 1530960 1867192 2095056
9785 2095056 2589455 2047542 595330 -193018 193670 522200 556847 934798 1106808 439677
9775 439677 -614524 -1583385 -2639219 -2876248 -2159733 -1544825 -1712396 -1261783 -269188
9766 -269188 297166 680582 483012 173592 535978 367144 172394 884894 -14414 -937459
9756i37459L0883k14758J86986M68336N9273j44200k56333n27604q97775r4667
9746b327318Q34248O75452j26799k00238O004J73502J99217R13803J135556l09086
9736I74341j004218m83047q80758k13283M94296J42736J12962N67953K51499j038370
9726a075889q16515j40744K39739j289933k46583J217177J195828n3586o91832
9717a662338k04322K24368j39174J75515k87069k01394N31358P49244j63162q21313
9707a798287K56521Q81583O20049R03877J003949j151173j739035q65125N0382
9698a837259J19863k95416k45824L17236L42848M73013J439728J55987n08181
9689c8005o96896l35222J557471J605130M33915K01349L00346q55000r97746n07989
$$ plain form
9756 -937459 -906576 -1121334 -934348 -466012 -406739 -550939 -807272 -1334876 -2232651 -2327318
9746 -2327318 -1493070 -817618 -944417 -1144655 -1138651 -965149 -765932 147871 1283427 974341
9736 974341 -29877 -512924 -1393682 -1606965 -1112669 -969933 -856971 -289018 -37519 -1075889
9726 -1075889 -1892404 -2033148 -1793409 -3083342 -3329925 -2112748 -916920 -970506 -1662338
9717 -1662338 -1866660 -1642292 -1781466 -1605951 -1893020 -2094414 -1563056 -813812 -976974 -1798287
9707 -1798287 -1541766 -660183 -40134 863743 1867692 716519 -1022516 -1887641 -1837259
9698 -1837259 -1717396 -2012812 -2258636 -1941400 -1598552 -1125539 314189 470176 -38005
9689 -38005 -734901 -1070123 487348 2092478 2526393 2727742 3028088 2173088 1175342 667353
9679F67353k41643m13593L6983r04069j1969J104208m18543m68100P31733J009852
9669A092212N36143K29117q6996M44693K49220O1320j35794p40977p70576K55832
9659A134194j30002j771188p37665R10358P41908O32172L4972m15223j65581j74170
9649E9775m94363j27073k45202l49435k52024K18087J025412O59077o04815n58906
9639f69467j5191j03094n56131P9903Q60560O81535L61985J38746o2867j47320
9629E68659j002357n72472j74247p27586l29535L15954O17552P06153L87788K68964
9619E8873N56825K70631n70716r14079P34361M12628j036799j172608K79201J459952
9609G8269J508292N57325p66651k30697R55280n01956n94740M49357l41493j360986
$$ plain form
9679 667353 425710 12117 49100 -854969 -866938 237270 -181273 -649373 82360 1092212
9669 1092212 1628355 1857472 1770476 2215169 2464389 2525709 2389915 1648938 878362 1134194
9659 1134194 1004192 -766996 -1504661 -594303 147605 779777 814749 399526 233945 59775
9649 59775 -434588 -561661 -806863 -1156298 -1408322 -1190235 -164823 494254 -110561 -669467
9639 -669467 -684658 -787752 -1343883 -1263980 -403420 278115 640100 778846 715979 568659
9629 568659 -433698 -1006170 -1180417 -1908003 -2237538 -1921584 -1304032 -597879 -210091 58873
9619 58873 615698 886329 315613 -598466 135895 548523 -488276 -1660884 -1381683 78269
9609 78269 1586561 2143886 1377235 1146538 2101818 1599862 1005122 1454479 1112986 -248000
9599b48000j55934P27811K39454r89177q84826k40278m8766N98647P41781O10194
9589C50906l20735r57397p58192n3849k20279n21308k07015n63563m81717m55973
9579d189122O39801J547424J644657K57140q1422O42806K23177m83771j124125
9570i23435j192160k86776l0318j014875J62765J023726P94356J76152j77015
9561a467580N1474o65292M74209J584215N18870K9907P42754J053279j17846j577904
9551F26086j391090k4623M86923K0348p23412r51073p25047K86475L70870M9317
9541a975226N11403J140717J89949k77698K12857K08098o10075n58298J74992
9532i83281J205027J023042N96569p35309j304578m1160J032016L76805N2461
$$ plain form
9599 -248000 -403934 323877 563331 -425846 -1310672 -1550950 -1599716 -1001069 -259288 350906
9589 350906 30171 -927226 -1685418 -1739267 -1959546 -2480854 -2687869 -3251432 -3733149 -4189122
9579 -4189122 -3549321 -2001897 -357240 -100100 -181522 461284 684461 200690 -923435
9570 -923435 -2115595 -2402371 -2432689 -3447564 -3284799 -2261073 -1466717 -1290565 -1467580
9561 -1467580 -1416106 -2081398 -1607189 -22974 495896 525803 1268557 2321836 2203990 626086
9551 626086 -765004 -789627 -302704 -282356 -1005768 -1956841 -2681888 -2395413 -2024543 -1975226
9541 -1975226 -1463823 -323106 -133157 -410855 -197998 10100 -599975 -1158273 -983281
9532 -983281 221746 1244788 1841357 1106048 -198530 -239690 792326 1169131 1221592
9523A221592K610J14723Q65965k6906q44698P34249O3656j781303j372607K78583
9513g44136M3818j66006P12416R93957L53853K077J39945j001036q77182L24991
9503b17303M09383N14436o96387l74737M5192K68618O63318K04342l11477l37015
9493A68370r70648q03508l90259k1251o60033p43242J85557R80599J859742Q58907
9483D64234k70496j60891P38555J031364M58501l46238o9227q9282O64400K28748
9473B649668j24694j30708K38553J01480k91024j64796N8892l37760o46689n36811
9463H16111m14252k64437L50529M60887J15047L24530j84155q39007n77435m51899
9453f64081o56821p803N15695j64243p38238m45237P25376J408069L03553l56676
$$ plain form
9523 1221592 1224202 1338925 2204890 2177984 1333286 2067535 2131191 349888 -1022719 -744136
9513 -744136 -700318 -866324 -153908 840049 1193902 1195979 1335924 334888 -542294 -217303
9503 -217303 192080 706516 10129 -364608 -319416 -50798 612520 816862 505385 168370
9493 168370 -802278 -1605786 -1996045 -2017296 -2677329 -3420571 -3235014 -2254415 -394673 464234
9483 464234 193738 32847 771402 1802766 2261267 1915029 1845802 1756520 2420920 2649668
9473 2649668 2524974 2394266 2632819 2734299 2443275 2278479 2337371 1999611 1352922 816111
9463 816111 401859 137422 487951 948838 1063885 1388415 1204260 365253 -212182 -664081
9453 -664081 -1320902 -1328705 -813010 -977253 -1715491 -2160728 -1435352 -27283 276270 -80406
9443h0406N07143j03163j283664k62698R21834J111778l1947j464683j281006
9434a966812l33067J023394J473006m98159j113828M79922P53112p71941j160853
9425b115226O59923k83775r67275k84256N28703N80929K80929M33294R45211m8942
9415b70485j050650o9550J576643J406356J19087j411272j424017m35573k62756
9406a822217k06623K06666R11242q7810J93659O58632O95874J070120N66389k2250
9396B163682N11445k85991j351461r7343P57357K2674j11961k07298m86741L97290
9386A311653j44838k11616j754j12535j46990P26779M08973j499627n32616N70411
9376C67840J89402n87528O46476L14904k37658N03563j25955n54232N75244M05000
$$ plain form
9443 -80406 426737 323574 -960090 -1222788 -300954 810824 778877 -685806 -1966812
9434 -1966812 -2299879 -1276485 196521 -301638 -1415466 -935544 -182432 -954373 -2115226
9425 -2115226 -1455303 -1739078 -2706353 -2990609 -2461906 -1880977 -1600048 -1166754 -221543 -270485
9415 -270485 -1321135 -1390685 185958 1592314 1711401 300129 -1123888 -1559461 -1822217
9406 -1822217 -2028840 -1822174 -910932 -998742 -805083 -146451 549423 1619543 2185932 2163682
9396 2163682 2675127 2389136 1037675 940332 1697689 1720363 1608402 1401104 914363 1311653
9386 1311653 1166815 955199 953445 840910 693920 1420699 1829672 330045 -202571 367840
9376 367840 557242 -30286 616190 931094 693436 1196999 1071044 516812 1092056 1497056
9366A497056L35747M46501n48725R7831K85868o88215j127941p26838l12152O56375
9356h4493Q03098N23886j12392p24067o60878L64248N7784r1593k25776K95840
9346A45657Q89378k06301p05445j029184p31586J24719P08132Q17872N37744m65195
9336H5791Q5506J104320n4294j277339j554392m18739M09989k23543R5931Q46533
9326i00237k51065m37218N26189J546786N88288p06731r33812M83656J309596
9317A225452J188622O63239k62096k07748O8694L84416O47527p81492j350709
9308A575905q2590N85461P46194r22148j646338q7130l48782L05244J245603k35596
9298A135823j455072j676955j057824k80484m96103K39507J136608R29798M61116
$$ plain form
9366 1497056 1832803 2279304 1730579 1828410 2114278 1426063 298122 -428716 -740868 -84493
9356 -84493 718605 1242491 1130099 406032 -254846 109402 167186 75593 -150183 145657
9346 145657 1035035 828734 123289 -905895 -1637481 -1512762 -804630 13242 550986 85791
9336 85791 171297 1275617 1221323 -56016 -1610408 -2029147 -1619158 -1842701 -1746770 -900237
9326 -900237 -1151302 -1588520 -1062331 484455 1072743 366012 -567800 -84144 1225452
9317 1225452 2414074 3077313 2815217 2607469 2676163 3060579 3708106 2926614 1575905
9308 1575905 1493315 2078776 2824970 1902822 256484 169354 -179428 125816 1371419 1135823
9298 1135823 -319249 -1996204 -3054028 -3334512 -3830615 -3591108 -2454500 -1524702 -1063586
9289a063586N25256P05502P16445r70952q83736N07656k99993n65971m13983n43085
9279b286447L74691J885301M06013j065814M01697J057202l10059L78970J95102
9270A036656q52211j143512j49556L13723M22285n39863m72952J4641n76780o01510
9260b549079M85240K86568m94445m96877j78472L05379L77943O4388n46494K22136
9250b523713R53166O72332k64400j23797m65308j13232J047006N2778k47973P70883
9240b42258K33987j92122M56327J105092K20674m76715N5287k06373l01144J025703
9230A678458j51639k077209q53943L16267Q80825N55235P69757P91201L10776
9221B219728Q7400R6551j33162P63038J296132O53496k1358q9188n22877j398889
$$ plain form
9289 -1063586 -538330 167172 883617 -87335 -971071 -463415 -763408 -1329379 -1743362 -2286447
9279 -2286447 -1911756 -26455 379558 -686256 -284559 772643 462584 841554 1036656
9270 1036656 184445 -959067 -1108623 -794900 -372615 -912478 -1385430 -1370789 -1947569 -2549079
9260 -2549079 -2063839 -1777271 -2271716 -2768593 -2947065 -2641686 -2263743 -2199355 -2745849 -2523713
9250 -2523713 -1570547 -898215 -1162615 -1286412 -1751720 -1864952 -817946 -765168 -1013141 -242258
9240 -242258 -8271 -200393 255934 1361026 1581700 1104985 1160272 953899 652755 1678458
9230 1678458 1526819 -550390 -1404333 -1088066 -207241 347994 1117751 1908952 2219728
9221 2219728 2307128 2403679 2270517 3033555 4329687 4983183 4961825 4872637 4349760 2950871
9211B950871j270465n3803Q44534N94847J052421l20808l19291M85970P12442
9202D676718J610601K344429J743627R68695J544092K310391K960533K837782
9194B0996868K546255K092491L124337L750115L910150J760129l64709k503843
9186C5311793l028652k636802l000333l802397l545993k699469k849692k352524
9178A1395931j104468n70633j314063j616121q21426N35546N09264P08047r16868
9169F805209k115787j563729j338915p20975l84150L89060P51391J566394L68442
9160C756940p22492r41900o55905K78303L22327l59757k39771o08133J20468O32345
9150A582425j84991N00714N45243K04705l93693j311520j656998q08266N94592
$$ plain form
9211 2950871 1680406 1626603 2471137 3065984 4118405 3797597 3478306 3964276 4676718
9202 4676718 6287319 8631748 10375375 11344070 12888162 15198553 18159086 20996868
9194 20996868 23543123 25635614 28759951 32510066 36420216 38180345 37815636 35311793
9186 35311793 32283141 29646339 26646006 22843609 19297616 16598147 13748455 11395931
9178 11395931 10291463 9720830 8406767 6790646 5969220 6504766 7014030 7722077 6805209
9169 6805209 4689422 3125693 1786778 1065803 681653 1070713 1822104 3388498 3756940
9160 3756940 3034448 2092548 1436643 1714946 2037273 1677516 1437745 829612 950080 1582425
9150 1582425 1397434 1898148 2443391 2648096 2254403 942883 -714115 -1522381 -927789
9141i27789J226750J88509p68718k54597J169094P50496m48159p03977j161756
9132i30147p81759J40764N98601N98143L11127J42968O72543K83489o48146m10946
9122b3363j21719n1699j19705k16328r4287P50007M53755k08095l80416q38903
9112h50753l10935J179905P05564K08875K26896M54736J96322k34749m87792m39571
9102F48498r26000j108408K2567R35177L67103J74121K93123r6282m85562j48852
9092c24515q01265q1988Q23808M11503k11128k38516o71921o13620M42796N63208
9082g01638j82401l82918M00067K77788j70733j68906Q45314R75377j53595K58650
9072I97005N77816j4568Q32380K3194p98122k53254r37440p16871L98567J130282
$$ plain form
9141 -927789 298961 487470 -281248 -535845 633249 1383745 935586 231609 -930147
9132 -930147 -1711906 -1571142 -972541 -374398 -63271 79697 752240 1035729 387583 -23363
9122 -23363 -145082 -196781 -316486 -532814 -627101 122906 576661 368566 -11850 -850753
9112 -850753 -1161688 18217 723781 932656 1159552 1614288 1810610 1575861 1088069 648498
9102 648498 -277502 -1385910 -1363343 -428166 -61063 113058 406181 309899 -175663 -324515
9092 -324515 -1125780 -1207768 -383960 27543 -183585 -422101 -1094022 -1707642 -1264846 -701638
9082 -701638 -884039 -1266957 -866890 -589102 -759835 -928741 -83427 891950 738355 997005
9072 997005 1574821 1560253 2392633 2415827 1617705 1364451 427011 -289860 108707 1238989
9062A238989Q00843K141j50948q5044n96146m93222o18204j275097j021189m02151
9052b600028J49138k55790n0353R86445N71092m35189q54389M31883m22573r06055
9042c385819P90207N96834M40649L95841L40797Q12827K59032p11600m93964j51588
9032a106784m28525N38226O62278K72746O24451M54295k77562m29180n59151Q00071
9022E50865J550718P4193j130238r91027j40064M5239M40617k09422n07136L8577
9012b77678N52744J85154m38149K2140K64568K48735O16005n66519r21526j52986
9002d67512m1472p61407q01127J17005k35872l08590J88923L39343J019445L20897
8992f30367R3307J234925M49742q84691j374734p09065N03639M80361O99831L04985
$$ plain form
9062 1238989 2039832 2041973 1891025 1805981 1209835 716613 98409 -1176688 -2197877 -2600028
9052 -2600028 -2450890 -2706680 -2757033 -1770588 -1199496 -1634685 -2489074 -2057191 -2479764 -3385819
9042 -3385819 -2595612 -1998778 -1558129 -1162288 -821491 -8664 250368 -461232 -955196 -1106784
9032 -1106784 -1535309 -997083 -334805 -62059 562392 1016687 739125 309945 -249206 550865
9022 550865 2101583 2175776 1045538 54511 -85553 -40314 400303 190881 -316255 -277678
9012 -277678 275066 460220 22071 44211 308779 557514 1173519 607000 -314526 -467512
9002 -467512 -508984 -1270391 -2071518 -1954513 -2190385 -2498975 -2310052 -1970709 -951264 -630367
8992 -630367 -537060 697865 1147607 262916 -1111818 -1820883 -1317244 -836883 -137052 167933
8982A67933M3675j60199m39499N20803Q22908q3858o09080n62934p03171m86158
8972a489580L95468j0588m71127k16179L96591n6324M94274M00450N9985O08560
8962A11530L2418R62895J085459n99543j683629j553672q42811j13492J378196
8953a222649J373733L13897k10621m59248k23869m9216L31965R35183K11246j87394
8943H13027L63921N07653o21672l81057M71857k47725q8478L31370O64724R84099
8933B797719j8331j299341p21646m4314j115530k054443p83086P89363Q06743
8924a642866k09876p89122J06068R70573J41612n20427k51090L52555Q01294O25153
8914d16126o99265M468J33629n29227M96929L81924p1124L93475M78205J30680
$$ plain form
8982 167933 211608 51409 -388090 132713 955621 871763 262683 -300251 -1003422 -1489580
8972 -1489580 -1094112 -1104700 -1575827 -1792006 -1395415 -1451739 -957465 -557015 -497030 111530
8962 111530 143948 1106843 2192302 1592759 -90870 -1644542 -2487353 -2600845 -1222649
8953 -1222649 151084 464981 254360 -204888 -428757 -477973 -146008 789175 1000421 813027
8943 813027 1176948 1684601 1062929 681872 1153729 906004 817526 1148896 1813620 2797719
8933 2797719 2779388 1480047 758401 714087 -401443 -2455886 -3238972 -2449609 -1642866
8924 -1642866 -1852742 -2641864 -2535796 -1565223 -1423611 -1944038 -2195128 -1842573 -1041279 -416126
8914 -416126 -1115391 -1110923 -977294 -1506521 -1009592 -627668 -698792 -305317 172888 303568
8904C03568P73423J360756K68307j514104n93307O21981R7784k08625q12440p60692
8894d63349j88827O55603J78631j578022p24074J386078R16719J34983p84727
8885d66985o72078L25118l82139l79378j5563O83011J116322J740395M70948J88830
8875B608481L68798l12120q05474j345178j867834r21287J021633R10867P27089
8866C84975J53076j193750r13770m09772k51337j39324K71187Q24382J063844
8857b10489J036552l44668q59117m10969n60766q1525N31297L87075Q17873Q12837
8847A118100k80579q65224n43326L33945J25189N15O5605K5792O29297m03493
8837B05821j105230N81547J229322M83260n22088j131219j349338l5338N6961
$$ plain form
8904 303568 1076991 2437747 2706054 1191950 598643 1220624 1318408 1109783 297343 -463349
8894 -463349 -652176 3427 182058 -1395964 -2120038 -733960 182759 317742 -466985
8885 -466985 -1139063 -813945 -1196084 -1575462 -1591025 -908014 208308 1948703 2419651 2608481
8875 2608481 2977279 2665159 1859685 514507 -1353327 -2274614 -1252981 -342114 384975
8866 384975 538051 -655699 -1569469 -1979241 -2230578 -2369902 -2098715 -1274333 -210489
8857 -210489 826063 481395 -377722 -788691 -1349457 -1430982 -899685 -512610 305263 1118100
8847 1118100 837521 -27703 -571029 -237084 -111895 -111380 -45775 -19983 609314 205821
8837 205821 -899409 -317862 911460 1394720 872632 -258587 -1607925 -1643263 -1586302
8828a586302j064227j142363l12486J649514J798979Q61131j96103q75880k77977
8819a145714r0984J55857O51434K69118j98525K57003R16771J48499L8695l80725
8809F21429r67465l37475M75046j34672m13851j22516N06408Q27152l0659L90324
8799H13721M76610M24339j19961j039999j383425j75979L43899P6345k52048l80552
8789a217050l59728J69749P34495q8682P7631Q61634n17419l35927M36121L32061
8779I2885R59706o5956m55047l42291j57005J25772J17723J272075Q91268M66046
8769B905176P75300J09990j033239j355975j65935J62168l99610j19250L491m92136
8759C89980n22362p12768o71390p46612L56323P06360J174705R27423L27140m54632
$$ plain form
8828 -1586302 -2650529 -3792892 -4105378 -2455864 -656885 204246 8143 -867737 -1145714
8819 -1145714 -1236698 -1080841 -429407 -160289 -358814 -101811 814960 963459 1002154 621429
8809 621429 -346036 -683511 -208465 -343137 -756988 -879504 -373096 454056 423397 813721
8799 813721 1290331 1714670 1594709 554710 -828715 -1004694 -660795 -584450 -836498 -1217050
8789 -1217050 -1576778 -1407029 -672534 -761216 -683585 178049 -339370 -675297 -239176 92885
8779 92885 1052591 986635 531588 189297 32292 158064 275787 1547862 2439130 2905176
8769 2905176 3680476 3790466 2757227 1401252 1235317 1397485 997875 878625 882116 389980
8759 389980 -132382 -845150 -1516540 -2263152 -1906829 -1200469 -25764 901659 1228799 774167
8749G74167L93042R62716L43780j115213j818871j90433R68150P88424N51855
8740A657617j05691n5199p12078j565469m00957j27915k81279Q89958O48843J29648
8730G7478J94952l0425l57725q02761r27105p52487q2345R75402J63130K03258
8720a338628o6534J85996P90J20734N26790m3280l85684k48977K60209Q24196
8710a64388p9174j251315l04961J055402O67923o91828j288305j235975K02845
8701c089776J292541J644396J068547Q06277k81528j413587p84373M72084q0329
8692c65748p66749l63917j28524M96664O06689n6474K56373P97610J200146M45642
8682B121712n16134j214189j575021o68651l66780j12403J340766J432605P37069
$$ plain form
8749 774167 1167209 2129925 2473705 1358492 -460379 -650812 317338 1105762 1657617
8740 1657617 1551926 1496727 784649 -780820 -1181777 -1309692 -1590971 -701013 -52170 77478
8730 77478 272430 242005 -115720 -918481 -1845586 -2598073 -2680418 -1705016 -1541886 -1338628
8720 -1338628 -1405162 -1219166 -1218376 -1097642 -570852 -614132 -999816 -1248793 -988584 -164388
8710 -164388 -243562 -1494877 -1799838 -744436 -76513 -768341 -2056646 -3292621 -3089776
8701 -3089776 -1797235 -152839 915708 1721985 1440457 26870 -757503 -285419 -365748
8692 -365748 -1132497 -1496414 -1624938 -1128274 -521585 -578059 -321686 475924 1676070 2121712
8682 2121712 1605578 391389 -1183632 -1852283 -2219063 -2331466 -990700 441905 1178974
8673A178974O10024j034181j880830p88233j75256j16911n83577N59194J649231
8664e81565J663681O9032M97527J174617m76677q63063m43022J48034j29542j346273
8654b87251j046329j12424Q6342J70115Q0160j158412J9318J281884Q37933R17669
8644G89005N46906m2738N92869J00309j259527l13135l33881k61292j25376n96154
8634i03014m41361k95465K51468O27600N29428M01374N3639p83m51064j187203
8624a415381N9480L84616K70569J103866N89494l37214j452695J57451Q73412
8615B33598K70206l63611o92359M99287J196198M79486M59413N33199j720434
8606H94983k328269p35862Q10151Q46099J283901J197393M23951J224085J79247
$$ plain form
8673 1178974 1788998 754817 -1126013 -1914246 -2089502 -2206413 -2789990 -2230796 -581565
8664 -581565 1082116 1151148 1648675 2823292 2346615 1483552 1040530 1188564 1059022 -287251
8654 -287251 -1333580 -1446004 -1359662 -1189547 -1109387 -2267799 -2248481 -966597 -128664 789005
8644 789005 1335911 1293173 1886042 1986351 726824 413689 79808 -181484 -306860 -903014
8634 -903014 -1344375 -1639840 -1388372 -760772 -231344 170030 223669 222886 -228178 -1415381
8624 -1415381 -1355901 -971285 -700716 403150 992644 655430 -797265 -639814 233598
8615 233598 503804 140193 -552166 -52879 1143319 1622805 2082218 2615417 894983
8606 894983 -1433286 -2169148 -1358997 -512898 771003 1968396 2392347 3616432 3795679
8597C795679j379237o71270L3180m89330j063449l88303M27444K7319o19889l37502
8587f65358l48483j243384q58294p5798R66075L22830k01302P77551j45610R1629
8577a380144O25632k35055n6307p1158m70098J52605K98289N81439J57968p35468
8567a132297L24989m0603p05203k48618r0398J151238O85526Q68441Q21277j007528
8557F26824k100209j480191N39844J107273N07054J74557m13112Q20493J044574
8548H27107m76364j11817M45242Q44827O1418o20512p96353l46981L30468N7364
8538B14399N27370Q58229j82969n98552p64350o78686M88697P80006L18871K95035
8528A258050q75357j415354p81125n90363J210505J086895m2402j06935m97112
$$ plain form
8597 3795679 2416442 1745172 1778352 1289022 225573 -162730 264714 292033 -327856 -665358
8587 -665358 -1013841 -2257225 -3115519 -3191317 -2225242 -1902412 -2103714 -1326163 -1471773 -1380144
8577 -1380144 -754512 -989567 -1045874 -1117032 -1587130 -1434525 -1136236 -554797 -396829 -1132297
8567 -1132297 -807308 -847911 -1553114 -1801732 -1892130 -740892 -55366 813075 1634352 626824
8557 626824 -1473385 -2953576 -2413732 -1306459 -799405 -624848 -1037960 -217467 827107
8548 827107 350743 238926 684168 1528995 1590413 969901 173548 -173433 157035 214399
8538 214399 741769 1599998 1417029 818477 54127 -624559 -135862 644144 963015 1258050
8528 1258050 382693 -1032661 -1813786 -2404149 -1193644 -106749 -149151 -256086 -753198
8519g53198M62343K32060J9786N04305P370L10244J39438m01216o58941p39408
8509h77217k78036N93358Q76435K73732m23630m27349P74776J522921L69858m84099
8499A920749p15640p07115k13792n36169n66165P64204J630446J275454M75954
8490C327926L70247j081314j755053p02191o79288n69075j57608m71580p94919
8481b512855o16914o24488o80337K07829P92404J294444J801427K83803p2159
8472a26846K98689L09282m77903q16478k0638Q28891Q01883l75467r65912o94033
8462a238532p09806K57611P72543K65346j57262p24841p45504K33888J687903
8453c58654J301261n3999r03464K01291O65537k031107j145456N88293M82706
$$ plain form
8519 -753198 -290855 -58795 -39009 465296 472666 782910 922348 521132 -137809 -877217
8509 -877217 -1155253 -561895 314540 588272 164642 -262707 512069 2034990 2404848 1920749
8499 1920749 1205109 497994 284202 -251967 -818132 -53928 1576518 2851972 3327926
8490 3327926 3698173 2616859 861806 159615 -519673 -1088748 -1246356 -1717936 -2512855
8481 -2512855 -3129769 -3754257 -4434594 -4226765 -3434361 -2139917 -338490 -54687 -126846
8472 -126846 171843 481125 3222 -813256 -833894 -5003 796880 421413 -544499 -1238532
8462 -1238532 -1948338 -1690727 -918184 -652838 -810100 -1534941 -2280445 -2046557 -358654
8453 -358654 942607 888608 -14856 186435 851972 -1179135 -2324591 -1736298 -1253592
8444a253592P03030N66373Q22377L53210r40653q918o3845m84003P11830K19722
8434F25531K97833p205j76107j72257K99803n5448o86323M85505Q32505N87998
8424B031835k17809j57850Q63994J497397Q17560p67174j174370n24193q99998
8415A469392q13904j80986n25082k26641J89895J099051m3935k33222J36564R2749
8405I63881M16423P96110k65548j83391M40495R76982L57423j214713r42527M22494
8395A767629L46098l11684l20505p80786j039700N78554N06903p92874Q9284R53364
8385I96283J380356R88484O08278r24881m16886L45373K19n25145J08979P58747
8375C319807J78865m63206j76831Q890q68528l52549J802780J152539k7786j74087
$$ plain form
8444 -1253592 -550562 15811 838188 1191398 250745 241827 177982 -306021 405809 625531
8434 625531 923364 916159 740052 567795 867598 812150 125827 611332 1443837 2031835
8424 2031835 1814026 1656176 2520170 4017567 4835127 4067953 2893583 2369390 1469392
8415 1469392 655488 474502 -50580 -277221 -87326 1011725 967790 734568 871132 963881
8405 963881 1380304 2176414 1910866 1727475 2167970 3144952 3502375 2287662 1345135 1767629
8395 1767629 2113727 1802043 1481538 700752 -338948 239606 746509 -46365 42919 996283
8385 996283 2376639 3365123 3973401 3048520 2631634 2977007 2977226 2452081 2561060 3319807
8375 3319807 3498672 3035466 2858635 2867525 1998997 1646448 3449228 4601767 4573981 4399894
8365D399894o84875r79449j050284O60266P93821n6934l45262K74991P63987O22079
8355D398234P11175J362990J657455J326216J398043K469221K267014J806326
8347A7396674K893662L777108L351549M200019M840116N316924O695454P294641
8339E5766147P522125Q192364Q471226O490624K773882k037586o399497q525297
8331G2253988q500174q422235q281212p736748n100281l430822m106761m435767
8323B2239988l690655k198453j330036k062015j734420m88215n12693j624648
8315H598853j886859J10069J083216l96247r78813j671399j618935o59329L05344
8306B885900J110202L09087J51503J003943N39370r49086j164302k55807O9660
$$ plain form
8365 4399894 3715019 2735570 1685286 2345552 3139373 3082439 2737177 3012168 3776155 4398234
8355 4398234 5109409 6472399 8129854 9456070 10854113 13323334 15590348 17396674
8347 17396674 20290336 24067444 27418993 31619012 36459128 41776052 48471506 55766147
8339 55766147 63288272 71480636 79951862 86442486 89216368 87178782 80779285 72253988
8331 72253988 63753814 55331579 47050367 39313619 34213338 30782516 26675755 22239988
8323 22239988 18549333 16350880 15020844 12958829 11224409 10736194 10223501 8598853
8315 8598853 6711994 6822063 7905279 7509032 6530219 4858820 3239885 2580556 2885900
8306 2885900 3996102 4305189 4456692 5460635 6000005 5050919 3886617 3630810 3700470
8297C700470k58261m70025n2424o2071k76002M4463M10089l61356l12148K43074
8287B605809p32659j73028O55830J70130l47712k93267J89484l84871k89619o48459
8277G51638l49092j32041k40616o8430o47565n26603J1612K83540N43036K51059
8267a23462j59239k48097K33284J46452M02835O81983l65748r84255p32541K31961
8257i16827J070276O84286n00913n33380L29861P62762K55773K78163l99065m5825
8247I85111O94966Q70738O97606L2814p48785j262858l63728K16411o90919o70373
8237b39017L18190O47261R37190L16182p94868p68813P21165N8218n21378P05946
8227A380076K61655k15955L7169k25482m86591m73352k81766P1260L53432K78561
$$ plain form
8297 3700470 3442209 2972184 2919760 2857689 2581687 2626150 3036239 2674883 2362735 2605809
8287 2605809 1873150 1700122 2355952 2526082 2178370 1885103 2074587 1689716 1400097 751638
8277 751638 402546 270505 29889 -38541 -686106 -1212709 -1201097 -917557 -374521 -123462
8267 -123462 -282701 -530798 -297514 -151062 251773 933756 568008 -416247 -1148788 -916827
8257 -916827 153449 837735 336822 -196558 133303 896065 1151838 1430001 1030936 985111
8247 985111 1680077 2550815 3248421 3281235 2532450 1269592 905864 1122275 431356 -239017
8237 -239017 79173 726434 1663624 1979806 1184938 416125 1137290 1195508 674130 1380076
8227 1380076 1641731 1425776 1462945 1237463 750872 277520 -4246 67014 420446 699007
8217F99007l2481j04284K25433M42225L09864J349267J254882k45308n99079K93331
8207C592857K46095n37101n00817n63888j55709K79936k20813P57480P73556l25401
8197C346195m76779j443324j064656J000329J299915j89926j5322J86070o75800
8188A966702j24435J76414m00621n47848q7396J062351O03234q36799j151817
8179F59785n87827L66625P94890P74574l0214n16146l48518k24461K56013J019526
8169B164247P22690K3282J027336R54690r63009p48418j2029K37268J491538J026872
8159E924467o35645m84983p63343j096342j33461O78952J49316r76579p91812
8150A870570L16656K13523K09092J356785P94440k6074j37593L09690L44225J76154
$$ plain form
8217 699007 666526 562242 787675 1229900 1539764 2889031 4143913 3898605 3299526 3592857
8207 3592857 3838952 3301851 2801034 2237146 2081437 2361373 2140560 2898040 3671596 3346195
8197 3346195 2869416 1426092 361436 1361765 2661680 2471754 2456432 2642502 1966702
8188 1966702 1842267 2018681 1618060 1070212 982816 2045167 2648401 1811602 659785
8179 659785 71958 438583 1233473 2008047 1977833 1461687 1113169 888708 1144721 2164247
8169 2164247 2886937 2910219 3937555 4892245 3929236 3180818 3168789 3406057 4897595 5924467
8159 5924467 5288822 4803839 4040496 2944154 2810693 3489645 3638961 2662382 1870570
8150 1870570 2187226 2400749 2609841 3966626 4761066 4734992 4597399 4907089 5251314 5427468
8140E427468K69424l15512J63409l2565r36817r0965M15216J39374O1181J0724
8130E110937r1090J222578J083925M84715J069344R84093R37634J025640R19571
8121A2747347J346944J446270Q44744Q11984J969721K400581J665000J717153
8113B4949744K961297M686644N640471O211152N981819N567035P125883P791540
8105G0915585N816056K876925m637l331781o268282o829514o473849p167829o801987
8096D2730687n138391l492048m188902l264889k250109l358717k337425o16609
8088A8083597r76777k124857j844786j207560j491630j260226j38611l37815k44856
8079H456479L96279N35107K11793k48578m40602r22232n85408k39879n65432k54957
$$ plain form
8140 5427468 5696892 5381380 5544789 5512224 4575407 4484442 4899658 5039032 5100213 5110937
8130 5110937 5019847 6242425 7326350 7811065 8880409 9864502 10802136 11827776 12747347
8121 12747347 14094291 15540561 16385305 17197289 19167010 21567591 23232591 24949744
8113 24949744 27911041 32597685 38238156 44449308 50431127 55998162 63124045 70915585
8105 70915585 76731641 79608566 79603929 76272148 70003866 63174352 56700503 49532674 42730687
8096 42730687 37592296 34100248 29911346 26646457 24396348 21037631 18700206 18083597
8088 18083597 17106820 14981963 13137177 11929617 10437987 9177761 9039150 8701335 8456479
8079 8456479 8852758 9387865 9599658 9351080 8910478 7988246 7402838 7162959 6597527 6342570
8069F342570P2085J048533J159654L66094n55202j350489r2604j5398o31932L8267
8059F381578L99153R63105N17984n30380J58628R8218l64202o92288j152751p63475
8049E015570J2873k15531L9018k49912n88089m06372K19231K19124p03850n19145
8039B822917J69293L42088O2660K98352j47973k28884J4146q51275r27093L33672
8029A887903N36724l32165m47540l5019k61028M90555J863292J605212J91533
8020E499467p10532L1801L33565K33051L94481p99871L1874M72044N15000L20596
8010F321476K27247J10286N18105J81355o09481l47884J104699Q77379Q87227
8001I270409P50627J457305K526261J280240J386774J569636J781800L076842
$$ plain form
8069 6342570 6414655 7463188 8622842 8988936 8433734 7083245 6990641 6975243 6343311 6381578
8059 6381578 6780731 7743836 8261820 7731440 7890068 7988286 7624084 6931796 5779045 5015570
8049 5015570 5028443 4812912 4851930 4602018 4013929 3607557 3826788 4045912 3342062 2822917
8039 2822917 2992210 3334298 3396958 3695310 3547337 3318453 3332599 2481324 1554231 1887903
8029 1887903 2424627 2092462 1644922 1609903 1348875 1839430 3702722 5307934 5499467
8020 5499467 4788935 4820736 5154301 5387352 5781833 4981962 5013836 5485880 6000880 6321476
8010 6321476 6548723 6659009 7177114 7358469 6748988 6401104 7505803 8383182 9270409
8001 9270409 10021036 11478341 14004602 15284842 16671616 18241252 20023052 23099894
7993B3099894L833007N144140N404461O176241O610629P528993P807876N811904
7985G1417145L658540P31646j152738k896435n082721p370361q356132q237730
7977D2711214o347525n194587m261843l601710k230056j641699j427208j838172
7969A6168414j067757M09049l19466M49476J62324J65058P85241q4666j138118
7960A5529555l94787m79030n91064j62706J41091K96693k20732L71371J370920
7951A5861311N86179M35653P84430L46371J175181K077309J984711K436938L318958
7942B9007041M156863M577430N412596N668587O584216R296485J2524017J4476119
7934I1703354J7399103K0667843K3121025K4393748K2205453J8512025J2061278
$$ plain form
7993 23099894 26932901 32077041 37481502 43657743 50268372 57797365 65605241 71417145
7985 71417145 75075685 75807331 74654593 71758158 66675437 59305076 50948944 42711214
7977 42711214 36363689 31169102 26907259 23305549 21075493 19433794 18006586 16168414
7969 16168414 15100657 15509706 15190240 15639716 15802040 15967098 16752339 16667673 15529555
7960 15529555 15134768 14655738 14064674 13901968 14043059 14339752 14119020 14490391 15861311
7951 15861311 16447490 16883143 17667573 18013944 19189125 21266434 23251145 25688083 29007041
7942 29007041 33163904 37741334 43153930 48822517 55406733 64703218 77227235 91703354
7934 91703354 109102457 129770300 152891325 177285073 199490526 218002551 230063829
7927B30063829L004549o935904j6181660k2012089k4110499k2397403j9558091
7920A21872732j6667315j4344811j1553063r082394p712836o600281m271104l146688
7912D8494240l220758j170438r04757j862319k043605j013458m08413n38226o99087
7903C6633179q43039j452844j253301k72J48067N2600J5159J04094J306343J333232
7893C6043218N63118L53409K495211K622129K267236K866821L739381M657434
7885E5607957O730720Q524343R514536J2190146J5716798J8250763K2343870K8086934
7877A76966067L4940739M1530059M5980550M8747809M7411515L9088183K2674296
7870D57339218K776906j5513485l1941611m2937788m5869707m5859999m2749159
$$ plain form
7927 230063829 233068378 226132474 209950814 187938725 163828226 141430823 121872732
7920 121872732 105205417 90860606 79307543 70225149 62512313 55912032 51640928 48494240
7912 48494240 45273482 44103044 43198287 41335968 39292363 38278905 37870492 37332266 36633179
7903 36633179 35790140 34337296 33083995 33083723 33231790 33284390 33299549 33403643 34709986 36043218
7893 36043218 36606336 36959745 39454956 42077085 44344321 47211142 50950523 55607957
7885 55607957 62338677 70863020 80377556 92567702 108284500 126535263 148879133 176966067
7877 176966067 211906806 253436865 299417415 348165224 395576739 434664922 457339218
7870 457339218 460116124 444602639 412661028 369723240 323853533 277993534 235244375
7863B35244375l6332350k9753405k3494475j8635497j5424921j2680083r457437
7856H9466207p910930o392377m897405m230757m300020k996423j417162j013073
7848E6308060k181152k019204j621911k492881l439263l025835j687207q26519
7840C9014088J098345J619370L60402j55752P18959J784587J913729K228203M200928
7831E2782859N277580N612557O450054P794806R734113J2406235J4221672J7599503
7823A31879379K1249489K5779275L1882007L9012325M6676894N3621801N7520116
7816D07621286N4659375M5415897K8815835N398926j8720301l8268225n1833967
7809D33088826n6898309n5028771n0165811m2169639l5157231k8891544k2841282
$$ plain form
7863 235244375 198912025 169158620 145664145 127028648 111603727 98923644 89466207
7856 89466207 81555277 75162900 70265495 66034738 61734718 58738295 57321133 56308060
7848 56308060 54126908 52107704 50485793 47992912 44553649 41527814 39840607 39014088
7840 39014088 40112433 41731803 42092205 41936453 42655412 44439999 46353728 48581931 52782859
7831 52782859 58060439 63672996 70123050 77917856 87651969 100058204 114279876 131879379
7823 131879379 153128868 178908143 210790150 249802475 296479369 350101170 407621286
7816 407621286 462280661 507696558 536512393 541911319 523191018 484922793 433088826
7809 433088826 376190517 321161746 270995935 228826296 193669065 164777521 141936239
7802A41936239j7188956j4874789j2899509j0268949p692630n611110m920224
7795F8480072m416411l136794k865071l037702k650489j856030k372296k501069
7787D5644210j370034j132408j405912k450424k409941O9630J046326Q84011Q42220
7778C9717678J117186K927908L719631L395089K588741L829776N830689P375296
7770G0501994Q752788R976872J1587534J3845884J6997499K2547337K8337636
7763A82547544L3503498L9454035M5923251M8616862M5193731L7738771K3338312
7756D56316004L824810j5779831l2262836m3330269m7293875m6335800m2493231
7749B32644972l5580692k8973607k3506861j8573785j5060398j2209661r489693
$$ plain form
7802 141936239 124747283 109872494 96972985 86704036 79011406 73400296 68480072
7795 68480072 64063661 60926867 58061796 55024094 52373605 50517575 48145279 45644210
7787 45644210 44274176 43141768 41735856 39285432 36875491 36945121 37991447 38875458 39717678
7778 39717678 40834864 43762772 47482403 50877492 53466233 57296009 63126698 70501994
7770 70501994 79254782 89231654 100819188 114665072 131662571 154209908 182547544
7763 182547544 216051042 255505077 301428328 350045190 395238921 432977692 456316004
7756 456316004 460140814 444360983 412098147 368767878 321474003 275138203 232644972
7749 232644972 197064280 168090673 144583812 126010027 110949629 98739968 89250275
7742H9250275q082709o656334n017897k708509l18201Q14874K533441L690700
7734G3505640L238751J700949K24246j939368m938585n599707o451254o272418
7726E3468254n344830m042675k722310k374966j684641j186330j228694q23033
7718C4060775N90626J712092J631513J068446J636621L552586N963730O303047
7710E6519436P469244Q463960R541972J2452540J6978641K0086303K2191234K3129800
7702A76833130K2061273J9937317J1487414J567392p446320j7098507k3194604
7695A84147095k4305997k3428302k1271691j8818328j6139181j3321805j0203002
7688E6658789q068106o215475n219394m371089l229236k179814k505336k652343
$$ plain form
7742 89250275 81167566 74511232 69493335 66784826 66466625 67281499 69814940 73505640
7734 73505640 76744391 78445340 78669586 76730218 71791633 66191926 59740672 53468254
7726 53468254 48123424 44080749 41358439 38983473 37298832 36112502 34883808 34060775
7718 34060775 34651401 36363493 37995006 39063452 40700073 44252659 50216389 56519436
7710 56519436 63988680 72452640 81994612 94447152 111425793 131512096 153703330 176833130
7702 176833130 198894403 218831720 230319134 231886526 224440206 207341699 184147095
7695 184147095 159841098 136412796 115141105 96322777 80183596 66861791 56658789
7688 56658789 48590683 42375208 37155814 32784725 29555489 27375675 24870339 22217996
7680B2217996k354626j797578m24097J12918j435249k063627j446856p87029m97028
7671A1524824l04744J5337j36264l14125R262j16432o93561j37917J400333J040016
7661A2286729j62810r2765P29510P33843N09133J294830J660945J498773J517940
7652A9976128K766664L838785N610012O507148O519788P061845O962528N860489
7644F5103387N261920L952736M90293k162730n027089q198902q163854p735882
7636D3519879p192076n499774l817929l783829l366511k491654j935455k080725
7628A3351926k153937j513138n51909r03332j763657j515870l02591o84754j533688
7619B429050k68505m7704r08478o94106l54152j003945k38919K78788J61855R86090
$$ plain form
7680 22217996 19863370 18065792 17641695 17754613 16319364 14255737 12808881 12021852 11524824
7671 11524824 11220080 11235417 11099153 10785028 10794290 10677858 9984297 9846380 11246713 12286729
7661 12286729 12123919 12031154 12760664 13494507 14003640 15298470 16959415 18458188 19976128
7652 19976128 22742792 26581577 32191589 38698737 45218525 52280370 59242898 65103387
7644 65103387 70365307 74318043 74808336 72645606 67618517 59419615 51255761 43519879
7636 43519879 36327803 30828029 27010100 23226271 19859760 17368106 15432651 13351926
7628 13351926 11197989 9684851 9132942 8229610 6465953 4950083 4647492 3962738 2429050
7619 2429050 2160545 2112841 1204363 510257 156105 -847840 -1086759 -807971 -646116 339974
7609C39974J122565J388956j42900j136273L74435L72877j33482O94399N73430
7600C453981n49049q81959m43633J55624k18982m85315N45625O87936Q8866K70284
7590B623378j80215m50880m24710j44874M43924R90545k8406n65358j07753p78077
7580A377574n60823l57495l04840N20447N61969K25106Q14820M62094p60625q52683
7570A125544l0771j62968q78792K47762J427486L79j62904J355284R38196m67046
7560C392170j26766P1030m81255j154143q75031o65468l97088P43959O51613j09402
7550A049619J01306J067692O42211j43840q73847j250410o70668q19563n35561
7541a433061j57714K88918l32931J91089J484110R40640j55952q72718R7603j09021
$$ plain form
7609 339974 1462539 2851495 2708595 1572322 1946757 2319634 2186152 2880551 3453981
7600 3453981 2904932 2022973 1579340 1734964 1515982 1030667 1576292 2264228 2353094 2623378
7590 2623378 2443163 1992283 1567573 1422699 1866623 2857168 2828762 2263404 2155651 1377574
7580 1377574 816751 459256 154416 674863 1236832 1461938 2276758 2738852 1978227 1125544
7570 1125544 1094773 931805 53013 300775 1728261 1728640 1565736 2921020 3859216 3392170
7560 3392170 3265404 3336434 2855179 1701036 826005 160537 -236551 507408 1159021 1049619
7550 1049619 1150925 2218617 2860828 2716988 1843141 592731 -77937 -897500 -1433061
7541 -1433061 -1590775 -1301857 -1634788 -1443699 40411 981051 825099 -47619 49984 -59037
7531e9037p72846J83735J136702Q56153m64251M53658J394172k14627l67149o39411
7521A507099j62230n74249k12775N82698K52206m79964j76725J079418K062477
7512C877955O59010k01712m26070n40880k79190L3137k48556K41587J5956m33699
7502B697538k91069l47811j488416o77023j73119K00233O47241P94473m25096
7493I36951o73687k69513k4349Q66001P30912R55809Q62452M52642j29479q25059
7483B882680j093670j298182j119768q43671j74277r24700J56836J716741J002381
7474C04370K11818p53043o76980O45414J414828L62462n0477l40360J39274k79378
7464I77928K9579K08372m35865j407876n8848L0238r17257p98567l77831N96663
$$ plain form
7531 -59037 -831883 -648148 488554 1344707 880456 1334114 2728286 2513659 2146510 1507099
7521 1507099 1344869 770620 557845 1140543 1392749 912785 736060 1815478 3877955
7512 3877955 4536965 4335253 3909183 3368303 3089113 3122250 2873694 3115281 3131237 2697538
7502 2697538 2406469 2058658 570242 -106781 -279900 -79667 567574 1362047 936951
7493 936951 263264 -6249 -30598 835403 1566315 2522124 3384576 3837218 3707739 2882680
7483 2882680 1789010 490828 -628940 -1472611 -1646888 -2571588 -2414752 -698011 304370
7474 304370 516188 -236855 -913835 -268421 1146407 1508869 1458392 1118032 1257306 977928
7464 977928 1007507 1215879 780014 -627862 -686710 -656472 -1573729 -2372296 -2750127 -2153464
7454b153464N16690j61378O04313J21720k45814P39535R09428M8368j213266j140820
7444a974688j09126M05254O94574J89941m32878M51760J302930M62371R91951
7435A982089l3825l76572n45158j214405l60980j81959o80314n97780j17983Q46781
7425a280106k86296j671252O2011J731441M51714k33771N26199J196137M45419
7416I41496l51418K86135j9310m84464k89671k14282Q52823Q13569k60742j38882
7406A135254J55772O35515J049191N41478o80038r66341j87416O82375J032627
7397C398417j213269k386711n75530o7989J9507O82310N50851Q16590R13199k80876
7387A856499q5927J88340q01039j82305j08305j93698k40605o1869p3813N48308
$$ plain form
7454 -2153464 -1636774 -1798152 -1193839 -1072119 -1317933 -578398 331030 379398 -833868 -1974688
7444 -1974688 -2083814 -1678560 -983986 -794045 -1226923 -775163 527767 990138 1982089
7435 1982089 1948264 1571692 1026534 -187871 -548851 -730810 -1411124 -2008904 -2126887 -1280106
7425 -1280106 -1566402 -3237654 -3175643 -1444202 -992488 -1226259 -700060 496077 941496
7416 941496 590078 876213 856903 372439 82768 -131514 721309 1534878 1274136 1135254
7406 1135254 1291026 1926541 2975732 3517210 2837172 1870831 1683415 2365790 3398417
7397 3398417 2185148 -201563 -777093 -845082 -825575 -143265 407586 1224176 2137375 1856499
7387 1856499 1770572 1958912 1157873 975568 867263 673565 432960 371091 297278 845586
7377H45586O99040O79867K74812l4359n16219l21594O0053j1018l16060N19535
7367A879643J063823L25917M27025J028889J221329J375156J839172J533398J83112
7358A0877464Q57564J588307J720926K102352K418875L543033M644947N148120
7350C2901588M606472K769023J956994L09493j863550k395214l264736n088632
7342B9931438m857470l746315k988336k716265k646217j859716n49972n57254
7334A0009893j267776j180257q80145o94033r41638q61954n48946O3590K53626
7325C952360k65275m41487j80436o35953q20519O9793O84749J39119q13962j822756
7315a34367j441623o58997R05656R93739K64920k41936n11654p93160J95294J663103
$$ plain form
7377 845586 1544626 2224493 2499305 2464946 1948727 1627133 1687186 1676168 1360108 1879643
7367 1879643 2943466 3269383 3696408 4725297 5946626 7321782 9160954 10694352 10877464
7358 10877464 11735028 13323335 15044261 17146613 19565488 23108521 27753468 32901588
7350 32901588 37508060 40277083 42234077 42543570 40680020 38284806 35020070 29931438
7342 29931438 25073968 21327653 18339317 15623052 12976835 11117119 10567147 10009893
7334 10009893 8742117 7561860 6681715 5987682 5046044 4184090 3635144 3698734 3952360
7325 3952360 3687085 3245598 3065162 2429209 1608690 1678483 2363232 2502351 1688389 -134367
7315 -134367 -1575990 -2234987 -1329331 -335592 -70672 -312608 -824262 -1617422 -1422128 240975
7305B40975P67687l40347j57003J10824j05220l71468K45143L35159j06692L97179
7295A016237K25364o12945m36834n14601n88190o51185n85654k65253J032058
7286a381003O68892J89960m8089N55125J58649m67414j98472j47706k22174j41847
7276a034079j94324R43765M40526J286367J290812j43710o06706m71974j303741
7267B06936n18586M99331N0341q7873J78197N63262J685768M79119r27197o94967
7257A434331r7679l40025l08430p99827J79483O74561k78365k2955M4655K9291
7247E15040m93479K44052L37989J74072j13394q56212O583j20524m93292j23303
7237i22468R50777Q94287o32335R271k80625j282332o55987k51788J99298J47424
$$ plain form
7305 240975 1008662 668315 511312 622136 516916 145448 390591 725750 619058 1016237
7295 1016237 1241601 628656 191822 -322779 -910969 -1562154 -2147808 -2413061 -1381003
7286 -1381003 -712111 -522151 -570240 -15115 143534 -323880 -522352 -670058 -892232 -1034079
7276 -1034079 -1228403 -284638 155888 1442255 2733067 2589357 1982651 1510677 206936
7267 206936 -311650 187681 238022 150149 328346 891608 2577376 3056495 2129298 1434331
7257 1434331 1336652 996627 688197 -111630 67853 742414 464049 441094 485749 515040
7247 515040 21561 265613 603602 777674 664280 -191932 -185349 -305873 -799165 -922468
7237 -922468 28309 922596 290261 299532 18907 -1263425 -1919412 -2171200 -1971902 -1824478
7227a824478j389912q74490l9315k00180j084531n84802J314702K639455K589906
7218E46355Q73849j202552j333825q50878j46019K04683J18141M57874K97016
7209a035356j4784M00342K39548L4032n12859q77337L40832N18157O79749N03700
7199B76024j0974j48674r60896q23965K18555R01149p60797m18541O79556M2628
7189a005935j1279L38945N07968N72262k42398n66209j326238q65087K51321J055422
7179a291228K31689p39929j26316P01072J321630J074815l8865j094142j249918
7170a211192q6822K13666n94133j72513L66225q09923o56068J67314O62136Q57872
7160a263438Q38814M75432N42444m15881q44676L95543j14655k80656l81303O9286
$$ plain form
7227 -1824478 -3214390 -4088880 -4128195 -4328375 -5412906 -5997708 -4683006 -2043551 546355
7218 546355 1420204 217652 -1116173 -1967051 -2113070 -1908387 -1790246 -1332372 -1035356
7209 -1035356 -1050140 -649798 -410250 -376218 -889077 -1766414 -1425582 -907425 -227676 276024
7199 276024 265050 116376 -844520 -1668485 -1449930 -548781 -1309578 -1728119 -1048563 -1005935
7189 -1005935 -1017214 -678269 -170301 401961 159563 -406646 -1732884 -2597971 -2346650 -1291228
7179 -1291228 -1059539 -1799468 -1925784 -1224712 96918 1171733 1132868 38726 -1211192
7170 -1211192 -1298014 -1084348 -1678481 -1850994 -1484769 -2294692 -2950760 -2783446 -2121310 -1263438
7160 -1263438 -424624 50808 593252 177371 -667305 -271762 -386417 -667073 -1048376 -979090
7150i79090R54763O63685k29522l49758j36548J73573Q32229L19274o43346q33623
7140b28363j173214k04990P60444K19595l28717n7589j77998J74296k06805j052503
7130b275844l14061O44487j1531J61645J319023J093806N26635l63878k92490
7121D87792J094465K07944j539802j162552O0149J4040k47478M35936k01968j066374
7111a917848r76438K63727P56191N08985k21089q0177N37314O12732O93581k05207
7101b8229J059916J179975K2781n44641j50280l96958O35743j59229j212874m27065
7091b0861j92612n02688m15935M20780P57701l03962j437683m44489L37423j26370
7081a928696j81572J76784P17571R0527k41218K5243J08867m21614j008603j448141
$$ plain form
7150 -979090 -24327 639358 409836 60078 -76470 97103 929332 1248606 605260 -228363
7140 -228363 -1401577 -1606567 -846123 -626528 -955245 -1012834 -1190832 -1016536 -1223341 -2275844
7130 -2275844 -2589905 -1945418 -1956949 -1795304 -476281 617525 1144160 780282 487792
7121 487792 1582257 1790201 250399 -912153 -852004 -837964 -1085442 -649506 -851474 -1917848
7111 -1917848 -2894286 -2630559 -1874368 -1365383 -1586472 -1666649 -1129335 -516603 176978 -28229
7101 -28229 1031687 2211662 2234443 1689802 1539522 1142564 1778307 1619078 406204 -20861
7091 -20861 -213473 -716161 -1132096 -711316 46385 -257577 -1695260 -2139749 -1802326 -1928696
7081 -1928696 -2110268 -1933484 -1215913 -1125386 -1366604 -1341361 -1232494 -1654108 -2662711 -4110852
7071d110852l27778J160311J729054P79045m97578k2657J1459m0650M48550K13737
7061f57359K04945o6238n73014m77284j47378L71551J118033M67627k71857M23712
7051C92738p28360j138432P84974J271519l25906M50725Q26577n87678q79177
7042F6980J094825J494098L61428j29828p05767j288419o85930M3083q18426J20613
7032d47343J089329K46588n87451j008031n12706q47132K92563J09514q75629
7023b540298j70792J665908J027015m79852j274898r71816N85605M27500O76018
7014a055610L63069m65302j95994L63022N77579K49676K4933L13743N91654L66906
7004A133676m40622j051642j321354j88840P88170P22027M23Q4448l78067m61081
$$ plain form
7071 -4110852 -4438630 -3278319 -1549265 -770220 -1267798 -1290455 -1278996 -1319646 -871096 -657359
7061 -657359 -452414 -518652 -1091666 -1568950 -1716328 -1344777 -226744 240883 -30974 392738
7051 392738 -335622 -1474054 -689080 582439 256533 707258 1533835 946157 66980
7042 66980 1161805 2655903 3017331 2887503 2181736 893317 207387 250470 -567956 -447343
7032 -447343 641986 888574 301123 -706908 -1219614 -2066746 -1774183 -1664669 -2540298
7023 -2540298 -2711090 -1045182 -18167 -498019 -1772917 -2744733 -2159128 -1731628 -1055610
7014 -1055610 -692541 -1157843 -1353837 -990815 -413236 -163560 -138627 175116 766770 1133676
7004 1133676 693054 -358588 -1679942 -1868782 -1080612 -358585 -358162 -273714 -651781 -1112862
6994a112862L33896J3463J43725J71940o58269o14520P62514P32447K30027N06010
6984E08371k28204p14162k04603j107664q97994j1914M97472J609907J246571
6975F97780j144833j080579j20960k38842j149804O938N29203K40324R37450J631164
6965C07841N88475O2065m95520m90241n22327P7172O3889o31273p0986L76534
6955g34371P99388M13680O17051j04857j7929M02860L64017j38521p45168m14585
6945D41565R79691J003854j016457k107058m46444K74189l32130L96705J071964
6936B65879K11210O07249m8946k09159L16985o11709p80452Q71227Q03299l70587
6926A054996o44335o22990J54149L41550L98236O66239N40339n73324n81094m79905
$$ plain form
6994 -1112862 -778966 -765503 -621778 -449838 -1108107 -1722627 -960113 -227666 2361 508371
6984 508371 280167 -433995 -638598 -1746262 -2644256 -2656170 -2158698 -548791 697780
6975 697780 -447053 -1527632 -1648592 -1887434 -3037238 -3030300 -2501097 -2260773 -1323323 307841
6965 307841 896316 958381 462861 -27380 -549707 -472535 -408646 -1039919 -1110905 -734371
6955 -734371 65017 478697 1095748 990891 972962 1375822 1739839 1601318 856150 441565
6945 441565 1421256 2425110 1408653 -698405 -1144849 -870660 -1202790 -806085 265879
6936 265879 477089 1084338 1035392 826233 1143218 531509 -248943 622284 1425583 1054996
6926 1054996 410661 -212329 -58180 283370 681606 1347845 1888184 1314860 733766 253861
6916B53861j47247r45971j173792r45148K22871J030507J030911j64375n79991
6907a418374p0940J40662K20396R67665O57836n72347j539161o24516N41412J277362
6897d20005R20945K0804L04581P11001N42681K61462j051037j398265j090945
6888a198778k43426P82574k87828j190183K04153J273892K68559q05882l29301
6879a526220K078J87152L87858k16137p25496p70022q70118k50201K60757q9569
6869c609918p80565o99180P13764P73471Q85690Q03266N80458J10977K3527J2138
6859a186372m73874k4552N65818M33242q1332m10651j07565l25543q1102O83332
6849a008599O15812K93882M24194O89810O15579q57588j387549p60343R9518L26745
$$ plain form
6916 253861 106614 -839357 -2013149 -2958297 -2735426 -1704919 -674008 -838383 -1418374
6907 -1418374 -1489314 -1348652 -1128256 -160591 497245 -75102 -1614263 -2238779 -1697367 -420005
6897 -420005 500940 521744 826325 1537326 2080007 2341469 1290432 -107833 -1198778
6888 -1198778 -1442204 -659630 -947458 -2137641 -1933488 -659596 -391037 -1196919 -1526220
6879 -1526220 -1524142 -1336990 -949132 -1165269 -1890765 -2660787 -3530905 -3781106 -3520349 -3609918
6869 -3609918 -4390483 -5089663 -4375899 -3602428 -2716738 -1913472 -1333014 -1222037 -1198510 -1186372
6859 -1186372 -1660246 -1684798 -1118980 -685738 -767070 -1177721 -1285286 -1610829 -1691931 -1008599
6849 -1008599 -392787 -98905 325289 1015099 1630678 773090 -614459 -1374802 -1275284 -948539
6839i48539K83920O94005P87174J259383J064445k48259q36773p30588M29657
6830A754425K29371N53178J00620k29151K23221L63632L34025M03874O24949N00644
6820D858788P06039N64068n72339l23214K03043M22154J217032K095774J790125
6811A0961470Q90880K492334L379826L300778M998649O276080P861380J1680808
6803E1842205J7156910K5422623L4679053L7323187J2553421k8825614l9351666
6796A10800119k9958535k0676735j4206528j0440244p278181m320579l218474
6789B0700843k848055k927498k615613k005930k047773j969852k355320n28761
6781C402041O36018p22865j699846k505431n56677Q12583O52214L57755m65391
$$ plain form
6839 -948539 -664619 29386 816560 2075943 3140388 2892129 2055356 1324768 1754425
6830 1754425 1983796 2536974 2637594 2408443 2631664 2995296 3329321 3733195 4358144 4858788
6820 4858788 5564827 6128895 5556556 5233342 5436385 5858539 7075571 9171345 10961470
6811 10961470 11852350 14344684 17724510 21025288 26023937 32300017 40161397 51842205
6803 51842205 68999115 94421738 129100791 166423978 178977399 150151785 110800119
6796 110800119 80841584 60164849 45958321 35518077 28239896 23919317 20700843
6789 20700843 17852788 14925290 12309677 10303747 8255974 6286122 3930802 3402041
6781 3402041 4038059 3315194 1615348 -890083 -1446760 -634177 18037 375792 -89599
6772h9599K9165R93368P58561o10867j598294j98167J075368N20037J74519j12755
6762I41336O42640Q92329p89351j016512M252J37554L01054R80870O47705K40744
6752B982621m84334K36659K33156j160435j516558r92315p56834j151365j41628
6743b751033N19213L77211M32371P56024M57860Q69163O85010o8975K9636n43626
6733G62854m25081L04058L88474p0825J83264L48094n65895m70045R74870J084838
6723B514606O81954O4759m02319P94103O75743J88471R4460m45787j284486j712057
6713A169447j463823J48719L07796O73752M61285L8078P94271j03285l56326p78097
6703H91817j497968m82275J37925m12457K59055Q92231J194860P64611j54980
$$ plain form
6772 -89599 -60434 932934 1691495 1080628 -517666 -715833 359535 879572 1054091 941336
6762 941336 1583976 2476305 1686954 670442 674694 812248 1113302 2094172 2741877 2982621
6752 2982621 2498287 2734946 2968102 1807667 291109 -701206 -1458040 -2609405 -2751033
6743 -2751033 -2231820 -1854609 -1422238 -666214 -208354 660809 1345819 1276844 1306480 762854
6733 762854 337773 641831 1030305 959480 1142744 1490838 924943 454898 1429768 2514606
6723 2514606 3196560 3261319 2859000 3653103 4328846 4517317 4611777 4165990 2881504 1169447
6713 1169447 -294376 -145657 162139 835891 1297176 1335254 2129525 2026240 1669914 891817
6703 891817 -606151 -1088426 -950501 -1362958 -1103903 -211672 983188 1747799 1592819
6694A592819k40829l59085J40062K04951O77882o13981m86115q00815j156312
6685a041423j60791O40912L11067O53721O26386J97386O05337k80858j093441
6676D58296o17261n21172N55256R09112P8818j12674M12367K67029K23492l05379
6666A347884j427529k44799J222932J058048K59283n44372m97296J83098L54949
6657A712198q21075m47445P98635k85254l9248J010253O68273m31817j261261
6648I03259o57416J45667J035677P30256l05892J81494k24563j439221q12577
6639d43316L67043J32491k44044L50403O79556M60780J199947J497862J885259
6630E885981J411532J380909J678535K212524L965217N658478Q238380P903326
$$ plain form
6694 1592819 1351990 992905 1132967 1337918 2015800 1401819 915704 114889 -1041423
6685 -1041423 -1202214 -561302 -250235 403486 1029872 1227258 1832595 1551737 458296
6676 458296 -158965 -680137 -124881 784231 863049 750375 1162742 1429771 1653263 1347884
6666 1347884 -79645 -324444 898488 1956536 2215819 1671447 1174151 1357249 1712198
6657 1712198 891123 443678 1242313 957059 917811 1928064 2596337 2164520 903259
6648 903259 245843 391510 1427187 2157443 1851551 2033045 1808482 369261 -443316
6639 -443316 -76273 56218 -187826 162577 842133 1302913 2502860 4000722 5885981
6630 5885981 7297513 8678422 10356957 12569481 16534698 22193176 30431556 38334882
6622C8334882J33239r369897r724552m904635k467332k550445j470912r24785
6614G055563j441449j224246j619843j687453j155211k34915N83614k31899m86271
6605d42110K1930K56452M13136J289875O40881l45803n75508Q24179O71699Q6879
6595B841610k33288o88764j321206o25933k90916Q3654P24842M63260l4483m87483
6585D31293j13590J2110K30159K93013k21789n77833j285383k16385J408501Q07903
6575G67999L4569j142031q67529M34316J213801q460p52860J99546J853994K086107
6565C819452m61026q00987k91064j115024j859276j221285m67872M00447Q61196
6556a135439R20628N47220J015612M31998o57467n35377p91006K68819Q97300
$$ plain form
6622 38334882 38468121 29098224 19373672 14469037 12001705 9451260 7980348 7055563
6614 7055563 5614114 4389868 2770025 1082572 -72639 -307554 276060 44161 -442110
6605 -442110 -420180 -163728 249408 1539283 2180164 1834361 1258853 2083032 2754731 2841610
6595 2841610 2608322 1919558 598352 -27581 -318497 -234843 489999 953259 918776 431293
6585 431293 317703 329813 559972 852985 631196 53363 -1232020 -1448405 -39904 767999
6575 767999 802568 -339463 -1206992 -772676 441125 432665 -320195 -120649 1733345 3819452
6565 3819452 3358426 2557439 2266375 1151351 -707925 -1929210 -2397082 -1996635 -1135439
6556 -1135439 -214811 332409 1348021 1780019 1122552 587175 -203831 64988 962288
6547I62288P69728n9301k82344n53556p24407o22033l85191l38664P15418M23410
6537i4652j80801J315782J021318M9364Q5520K39090q11609n33274M86415M69961
6527B047114J16686J74191L07520o6110k23002n53891l04446r1097l77110m98690
6517E31165P18960J350479M59735n52981o66215J5721K86493n04433n57892Q244
6507A089276J343756J280616J049222J024049l79977p1786J967808K370067K002105
6498A1675136J173770Q27957J572136K710373K778441K584171L656357M548995
6490C1527336O387660P258778R280922J2762458J4441544J7069676J8193483J1669940
6482A28591797j534535j2394787j7640688j6961686j4032663j1561637j0034206
$$ plain form
6547 962288 1732016 1672715 1390371 836815 112408 -509625 -894816 -1233480 -518062 -94652
6537 -94652 -275453 1040329 2061647 2111011 2196531 2435621 1624012 1090738 1577153 2047114
6527 2047114 2163800 2337991 2645511 2579401 2356399 1802508 1498062 1406965 1029855 531165
6517 531165 1250125 2600604 3060339 2507358 1841143 1856864 2143357 1638924 1081032 1089276
6507 1089276 2433032 3713648 4762870 5786919 5406942 5335156 7302964 9673031 11675136
6498 11675136 12848906 13676863 15248999 17959372 20737813 23321984 26978341 31527336
6490 31527336 37914996 45173774 54454696 67217154 81658698 98728374 116921857 128591797
6482 128591797 127057262 114662475 97021787 80060101 66027438 54465801 44431595
6475D4431595q866406o931020m483652k979348k244580k063711k596566k383131
6467A1883181q82383n89913k358127k938459j115578N91532j51182n49743j12371
6458C776957r7945Q8193m77178j155039p80617P70613K64828j68205R759m87371
6448A743995o52926q88419J07624N83299j193755K14405J336339J192320J33234
6439B576116J17818M55149p2322m16526L59903L32635k87141j21180P8803M47044
6429C470299o65863j393032L70651J867924J161835K0028l62225J83520K38685
6420D891822k8378Q75098J084382j26703O62581J797830K333353L157032M024174
6411A8671191M557671M863316N983726P813081P800115O095898L596687j464639
$$ plain form
6475 44431595 35565189 28634169 24150517 21171169 18926589 16862878 14266312 11883181
6467 11883181 11000798 10410885 8052758 5114299 3998721 4590253 4439071 3889328 3776957
6458 3776957 3679012 3767205 3290027 2134988 1354371 2124984 2389812 2221607 2231366 1743995
6448 1743995 1091069 202650 310274 893573 -300182 -85777 1250562 2442882 2576116
6439 2576116 2693934 3149083 3076761 2660235 3020138 3352773 3065632 2944452 3023255 3470299
6429 3470299 2804436 1411404 1782055 3649979 4811814 4831842 4469617 4653137 4891822
6420 4891822 4863444 5738542 6822924 6696221 7358802 9156632 11489985 14647017 18671191
6411 18671191 23228862 28092178 34075904 41888985 49689100 55784998 59381685 57917046
6403E7917046o849174q084369p536108n782038n184223m796808l464438j858559
6395A4361329j673287j789422j656313j538175j016569l50462M8063m55962j106919
6386D822283j177891q48732l91163p02849k73981k41762j25854J05192o66927
6377D98316m77238k1869N25859R72124l96553j545773q58259j020073m54683P74082
6367b004067P25062Q54921J102696J074566m535j92361M67028J086693m40759
6358B669244j295205l88406L02423J34390n54757n88634l01466N10112Q28963
6349A316664P42848J23656L896j026341o95088M22997L31369k85754R92390J774059
6339C700696L75648o17950j03895j030005j883141n30414j74335o89300q10136
$$ plain form
6403 57917046 51067872 42983503 35447395 29665357 24481134 19684326 16219888 14361329
6395 14361329 12688042 10898620 9242307 7704132 6687563 6337101 6385164 5929202 4822283
6386 4822283 3644392 2795660 2404497 1701648 1427667 1185905 1060051 1165243 498316
6377 498316 21078 -791 525068 1497192 1100639 -445134 -1303393 -2323466 -2778149 -2004067
6367 -2004067 -1279005 -424084 678612 1753178 1748643 1556282 2023310 3110003 2669244
6358 2669244 1374039 985633 1288056 1422446 867689 279055 -22411 487701 1316664
6349 1316664 2059512 2183168 2187064 1160723 465635 888632 1220001 934247 1926637 3700696
6339 3700696 4076344 3458394 3354499 2324494 441353 -89061 -263396 -952696 -1762832
6330a762832j51887N59503Q93953R29181O21332L71703L66008l08826l79332n77395
6320E61408p79139j036413j003448l9432J168253R51533l60066k37683k12119
6311i87106K19945J453692R33224O39516O39890J93207P04389l97395j913936
6302A485426m81010j139737j778477m68927M18602P03055J72719J396911J371234
6293A679796J224316L26042o58119j408857j613702j373443o96255r6850O34619
6284a982453R90449J081878J090639n23673p32225r3666J04121L5776L75945Q1029
6274D27820J87620O01945L55396J3177R2734J134631L1251p58630m07014O53563
6264B332493J711253k23160j573946n82258J43309q8558r89440j081093o48943
$$ plain form
6330 -1762832 -1914719 -1355216 -461263 467918 1089250 1460953 1826961 1518135 1138803 561408
6320 561408 -217731 -1254144 -2257592 -2297024 -1128771 -177238 -537304 -774987 -987106
6311 -987106 -767161 686531 1619755 2259271 2899161 3092368 3796757 3399362 1485426
6302 1485426 1004416 -135321 -1913798 -2382725 -1964123 -1261068 -1088349 308562 1679796
6293 1679796 2904112 3230154 2572035 1163178 -450524 -1823967 -2520222 -2617072 -1982453
6284 -1982453 -992004 89874 1180513 656840 -75385 -169051 -64930 -29154 346791 427820
6274 427820 615440 1217385 1572781 1585958 1678692 2813323 2844574 2085944 1678930 2332493
6264 2332493 4043746 3820586 2246640 1664382 1807691 1719133 729693 -351400 -1000343
6255a000343N69760J567108N10168N68547O1942o84589j37507M23724J154371
6246C033181N77958n11973j22943J095728J526046l01966n20864J06607K4795
6237D906569M50562J689134J387131O38963J351299J449463K363008L518308L615725
6228B1370162M723880P292721Q127618O985730M910314J205740k964408o812890
6220D4838867q048214o443556n168505l370009k605615j425395j702184k853144
6212A3222245k523980k027835j801602r14758q48653j111603j028655r11544k08670
6203A844945O49881L290l66926Q00855L82208j001432j600757J56199J099742
6194A968005M78697k01834m07110k79017j114490j120138J003653Q12206j11006
$$ plain form
6255 -1000343 -430583 1136525 1646693 2215240 2277182 1592593 1455086 1878810 3033181
6246 3033181 3611139 3099166 2976223 4071951 5597997 5296031 4775167 4881774 4906569
6237 4906569 5357131 7046265 8433396 9072359 10423658 11873121 14236129 17754437 21370162
6228 21370162 26094042 33386763 41514381 48500111 53410425 54616165 51651757 44838867
6220 44838867 36790653 30347097 25178592 21808583 19202968 17777573 16075389 13222245
6212 13222245 10698265 8670430 6868828 5954070 5105417 3993814 2965159 2053615 1844945
6203 1844945 2494826 2498116 2131190 2932045 3314253 2312821 712064 868263 1968005
6194 1968005 2446702 2244868 1837758 1558741 444251 -675887 327766 1139972 1028966
6185A028966J67741q60521q65764J13451K33032K06688k70943q41877p83068N06260
6175a366035J391887Q51796J31626l52003n58595O66890Q11530J011507M83388
6166C071991q53508p86930o40550m70911N53516J028735Q15292K98257o90421
6157B325471q32878j66581P72294J017167l91159j232710r36214j03227j60597
6148B91566j323034l85312J003298K48403o12129L25159R58047J094711K82619
6139A883328k30025K23388L50474k10039o17834p66833k54434k9811q58748q80725
6129a391259j372774j435264k68127J114267P42933P60070P94618K2326M37050
6120e96160j13920k40052j229863j059608J125753Q09758K47476q19711j23448
$$ plain form
6185 1028966 1196707 336186 -529578 -416127 -183095 23593 -247350 -1089227 -1872295 -1366035
6175 -1366035 25852 877648 1009274 657271 98676 765566 1577096 2588603 3071991
6166 3071991 2218483 1431553 791003 320092 873608 1902343 2717635 3015892 2325471
6157 2325471 1492593 1326012 2098306 3115473 2724314 1491604 555390 452163 291566
6148 291566 -1031468 -1416780 -413482 -165079 -777208 -452049 505998 1600709 1883328
6139 1883328 1653303 1876691 2227165 2017126 1399292 632459 378025 348214 -510534 -1391259
6129 -1391259 -2764033 -4199297 -4467424 -3353157 -2610224 -1850154 -1055536 -1033210 -596160
6120 -596160 -710080 -950132 -2179995 -3239603 -2113850 -1304092 -1056616 -1876327 -1999775
6111a999775L06322k59469l86872K64203M46438K08795M85939J86539Q91834O07832
6101G51786r83161j364780p63605L74957K95967j42721Q13077N95823l22769N08796
6091b36630R8865j351208j250475m7376R64731Q03389l85246q4428J95705J77852
6081a114821N00809O16204r1846O10329N41729N345k98005J83061R1139q04531
6071B39413k74750L87774m65664r04071R7229O27118J07964O63935J271379k59657
6061A490670j063338l95414N13477J69652k67605m25483q0518O60650J498129
6052B100220P19550m08854m76179L04232N76875k86763j560906r41785q29607
6043h03217j8997J071543N96501k10305M0920O36508Q29887o89866r63154l61082
$$ plain form
6111 -1999775 -1693453 -1952922 -2339794 -2075591 -1629153 -1420358 -934419 -747880 143954 751786
6101 751786 -231375 -1596155 -2359760 -1984803 -1688836 -1831557 -1018480 -422657 -745426 -236630
6091 -236630 -137765 -1488973 -2739448 -2786824 -1822093 -1018704 -1403950 -1488378 -1292673 -1114821
6081 -1114821 -614012 2192 -89654 520675 1062404 1067749 769744 952805 1043944 239413
6071 239413 -35337 352437 -113227 -1017298 -920069 -292951 -184987 478948 1750327 1490670
6061 1490670 427332 31918 545395 715047 447442 21959 -58559 602091 2100220
6052 2100220 2819770 2410916 1934737 2238969 2815844 2529081 968175 26390 -803217
6043 -803217 -822214 249329 845830 635525 676445 1312953 2142840 1452974 489820 128738
6033A28738n80210m7839O40070j29312j009256p25223k718P63121J386791M13455
6023H37617m66119q14515m26200J91468l46642j4307O04301L34024M38497P33415
6013A071539j47342j130100j531581k9868Q35744R57631O14496p662j087681j037770
6003a492594P57743J505433o072n77861l23303l29590r76607p8146N13061K14866
5993g93070j3041k71429J15931J45278P17522J381367k37012j527603o29510L62878
5983g48689P24525k25831o35574j10778P6468J056861N51941j08836K7343K74909
5973H82339J19714k31501R5936O14086N14483n52734j220548l67839Q24973N25662
5963A204571O92563M17312O31344N12684K43184r23026j530001q94037J37737
$$ plain form
6033 128738 -451472 -499311 140759 11447 -997809 -1723032 -1725750 -962629 424162 837617
6023 837617 371498 -443017 -869217 -677749 -1024391 -1038698 -434397 -100373 338124 1071539
6013 1071539 924197 -205903 -1737484 -1767352 -931608 26023 640519 632857 -454824 -1492594
6003 -1492594 -734851 770582 764510 186649 -136654 -466244 -1442851 -1520997 -1007936 -793070
5993 -793070 -806111 -1077540 -961609 -816331 -98809 1282558 1045546 -482057 -1111567 -748689
5983 -748689 -24164 -249995 -885569 -996347 -919879 136982 688923 580087 607430 882339
5973 882339 1002053 770552 866488 1480574 1995057 1442323 221775 -146064 678909 1204571
5963 1204571 1897134 2314446 2945790 3458474 3701658 2778632 1248631 354594 492331
5954D92331J342110J674683L51809m67741j055508K9597l48133j048596K48846
5945A219398L77049J17225P13559J922670O07909j056754r74074L27183J291071
5936D545236p6861o71819Q5040O58o60979J138612K010219J75831j90029Q26569
5926G182477K69028J084258K593903K443266K432052K748912L775559L651311
5918B6180766L502620L772327N440571O425343L623557l35370m100862o277857
5910C8231095n193430l704324l806184l555325l122724l485509k446579j386259
5902A1530761k305132k268254j637906o76405l90496m07640k63655P92908Q14548
5893E188729l48342j155358n88393L88159N04400l81958j158968n27546k76366
$$ plain form
5954 492331 1834441 3509124 3860933 3393192 2337684 2367281 2019148 970552 1219398
5945 1219398 1596447 1713672 2427231 4349901 4957810 3901056 2926982 3254165 4545236
5936 4545236 4468375 3796556 3881596 3882254 3221275 4359887 6370106 6545937 6355908 7182477
5926 7182477 7451505 8535763 11129666 13572932 16004984 18753896 22529455 26180766
5918 26180766 29683386 33455713 38896284 45321627 48945184 48609814 44508952 38231095
5910 38231095 33037665 29333341 25527157 21971832 18849108 15363599 12917020 11530761
5902 11530761 9225629 6957375 5319469 4643064 4252568 3844928 3581273 4374181 5188729
5893 5188729 4840387 3685029 3096636 3484795 3989195 3607237 2448269 1920723 1644357
5884A644357r20365o59441k90862n30705l64682R40821J807783L03737l22489
5875A608154O04768Q66215J20269L22871J004619O16137K09024o03665r35258
5866C813134p10708o54310p33504l96561J75232o468l90788m80060q23236k31808
5856d39077J98033q61193j281198p39485M70851R36669M42838m9182o36153L79568
5846a578329k01602q97773Q39550J375023R28213M6191j033652k9587O43528R50808
5836A042370O40774J108667N56313j118053j126531J70114k60276p23918L41206
5827F30666J718669J049450N10356l8238k234268k541142m64549L70936J039249
5818D1129J350758J201694N74290N1766p15345j896862j410511n5697N51544j02429
$$ plain form
5884 1644357 723992 64551 -226311 -757016 -1121698 -180877 1626906 1930643 1608154
5875 1608154 2212922 3079137 3199406 3522277 4526896 5143033 5352057 4748392 3813134
5866 3813134 3102426 2448116 1714612 1318051 1493283 1486815 1096027 615967 -207269 -439077
5856 -439077 -241044 -1102237 -2383435 -3122920 -2652069 -1715400 -1272562 -1321744 -1957897 -1578329
5846 -1578329 -1779931 -2677704 -1838154 -463131 465082 511273 -522379 -551966 91562 1042370
5836 1042370 1683144 2791811 3348124 2230071 1103540 1273654 1013378 289460 630666
5827 630666 2349335 3398785 3909141 3870903 1636635 -904507 -1369056 -998120 41129
5818 41129 1391887 2593581 3167871 3219637 2504292 607430 -803081 -858778 -307234 -409663
5808d09663O74439O83419Q72306L33721n33219r08236o9146l30507j94144J84170
5798C03140J126813K112975J23913r28610p81747J05900n35789j920318k10178
5789f03901R59355N3235q02141j168622o89190M64058J385078P95917M78920K50279
5779A122988j32115l40686o20892m85729M59319R63328L79243j54943j002990
5770A87523q25765k54396O8973k61329o68314j9837m07858l1596J185462N26715
5760e00422L94006M64895o8914m37619J40260N46094j28263j3927J74952q04857
5750b33795q66038k43136O7903q5049p2602K28002Q03314k9990P21142N19930
5740H09681n59916k65089O44834O7878j82265l74542M58994j11731m72636o07242
$$ plain form
5808 -409663 264776 948195 1820501 2154222 1621003 712767 643621 313114 118970 303140
5798 303140 1429953 3542928 3666841 2738231 1956484 2062384 1526595 -393723 -603901
5789 -603901 355454 408689 -393452 -1562074 -2251264 -1787206 -402128 393789 872709 1122988
5779 1122988 990873 650187 29295 -456434 2885 966213 1345456 1190513 187523
5770 187523 -638242 -892638 -823665 -1084994 -1753308 -1773145 -2181003 -2212599 -1027137 -500422
5760 -500422 -106416 358479 289565 -148054 -7794 538300 410037 396110 571062 -233795
5750 -233795 -1099833 -1342969 -1275066 -1360115 -1432717 -1204715 -401401 -431391 289751 809681
5740 809681 249765 -15324 629510 697388 515123 140581 599575 487844 15208 -592034
5730e92034j197405k48360J055094J327786N70714o6190p29208l58139m08167
5721f45909p431N5883j078679q99142j86268J101538P0773j260735p5329P03352
5711b221947k892K23572J005293J126191Q19002K2756n18491K94985k77494n694
5701D65281Q16513k75718j037938l57494j65300M67263Q22085M52673n4338P17598
5691A850625N47766j73363k87172j073068n44190j27275p47797n7394k05258K5753
5681g91373L72113M99184P54990N55721J06765n28471m35687N99513k61893j83232
5671F87630L53027J3377n83243r03618j198736q02105Q75806J637090J411618
5662A490846P26641O40017n05956j97844j63225p3258k87028j111731o57967M99651
$$ plain form
5730 -592034 -1789439 -2037799 -982705 345081 915795 849605 120397 -237742 -645909
5721 -645909 -653340 -597457 -1676136 -2575278 -2761546 -1660008 -1589235 -2849970 -2925299 -2221947
5711 -2221947 -2224839 -2001267 -995974 130217 949219 971975 453484 748469 470975 465281
5701 465281 1281794 1006076 -31862 -389356 -554656 -87393 734692 1187365 1133027 1850625
5691 1850625 2398391 2225028 1937856 864788 320598 193323 -554474 -611868 -817126 -791373
5681 -791373 -419260 79924 834914 1390635 1497400 968929 533242 1132755 870862 687630
5671 687630 1040657 1054034 470791 -432827 -1631563 -2433668 -1557862 79228 1490846
5662 1490846 2217487 2857504 2351548 2153704 1990479 1917221 1630193 518462 -139505 360146
5652C60146R45850O24526n6690P45172O28315Q62211M01115r54054j101139j183920
5642A271532o42029j221231j646392j90249J44618j8889J287200J481452J026242
5633A492254M40778j054414j133146k26331O99507J52340j57066N84628k35332
5624E63218k60695M09333J085190J866689R4957j061938n87256K58869m46910
5615A921457q31342q80557j69014j59646m97219m82348J80043J347721N19000
5606I48095n80197O07655J50462k65170K14860M82318K73869j224584p68726M39505
5596B78087K75314R53136K83801o40016K88007K36211r33877o83369r28044m32388
5586a303138J087946P96597J114116L65502p24633r95184j283590p57976k23307
$$ plain form
5652 360146 1305996 1930522 1873832 2619004 3247319 4109530 4510645 3556591 2455452 1271532
5642 1271532 629503 -591728 -2238120 -2428369 -2283751 -2302640 -1015440 466012 1492254
5633 1492254 1933032 878618 -254528 -480859 218648 370988 213922 798550 563218
5624 563218 302523 711856 1797046 3663735 3758692 2696754 2109498 2368367 1921457
5615 1921457 1090115 209558 40544 -119102 -616321 -1098669 -918626 429095 948095
5606 948095 367898 975553 1126015 860845 1075705 1558023 1831892 607308 -161418 278087
5596 278087 553401 1506537 1790338 1150322 1438329 1674540 740663 57294 -870750 -1303138
5586 -1303138 -215192 581405 1695521 2061023 1336390 341206 -942384 -1700360 -1923667
5577a923667N39471L10854L4159K2830J82069J291329J001060j207546j492499
5568a241940P91744J397524J327703N49900l00240o60071j147151n78731J009143
5559A147881J108242r7142J86379O85717j1580j85692k80925l27579P5952j051936
5549A249317n00041L23857o23232p29238M17736Q05101L58705K70398M13854N33409
5539B519866o35117m38586J020761P8411q45499j83422J29959K98571M67889L35106
5529B747939Q04378P79484J372439J229108J388734K263939J459187P76667K68442
5520A3090317K010200L663419M175120L890520M976570P202777O186202M542497
5512D9737622K838438j567349o125598p257749n527119m590100n240736l426120
$$ plain form
5577 -1923667 -1384196 -1073342 -1039183 -1016353 -834284 457045 1458105 250559 -1241940
5568 -1241940 -450196 947328 2275031 2824931 2524691 1864620 717469 138738 1147881
5559 1147881 2256123 2158981 2345360 3031077 3019497 2833805 2552880 2225301 2301253 1249317
5549 1249317 749276 1073133 449901 -279337 138399 943500 1302205 1572603 1986457 2519866
5539 2519866 1884749 1446163 2466924 2545335 1699836 1516414 1646373 1944944 2412833 2747939
5529 2747939 3552317 4331801 5704240 6933348 8322082 10586021 12045208 12821875 13090317
5520 13090317 15100517 18763936 22939056 26829576 31806146 39008923 45195125 49737622
5512 49737622 52576060 51008711 44883113 37625364 32098245 27508145 22267409 18841289
5504A8841289k931916k414568j864790j020270m02195q46327j133298j658900
5496F569025j057538l21220q67666j813379q26192k16090K27480J38698q2658
5487A750460K31853P09200j33277n77290l2839M20025N62857j047224j653630
5478B30135m50131M86993J63854q51858J28637N91993R18606R76013m12395Q244
5468A790091k68469k3359R31162J146351Q61005n6909K8549j23407l72362k85000
5458C627652O2556n68037k06157l17604n52248O83192M86625p67027j677186n93826
5448A77940J74737l74862n68770P92882P80166J70630M19761p1595k39520r68648
5438B92721n83514J162548J243900O68903K98748n75963j028022j332453k09728
$$ plain form
5504 18841289 15909373 13494805 11630015 10609745 10207550 9361223 8227925 6569025
5496 6569025 5511487 5190267 4322601 2509222 1683030 1466940 1694420 1833118 1750460
5487 1750460 1982313 2691513 2558236 1980946 1948107 2368132 2930989 1883765 230135
5478 230135 -219996 266997 430851 -421007 -292370 299623 1218229 2194242 1781847 1790091
5468 1790091 1521622 1498263 2429425 3575776 4436781 4379872 4408421 4285014 3912652 3627652
5458 3627652 3690208 3122171 2916014 2598410 2046162 2729354 3215979 2448952 771766 177940
5448 177940 352677 -22185 -590955 201927 982093 1152723 1572484 1500889 1261369 292721
5438 292721 -290793 871755 2115655 2784558 3083306 2507343 1479321 146868 -62860
5429f2860R90968J695256J142852l08859j105854j273129r2537R19133J86254
5420B091224j60898M69045J72052P5549L7586j27331M4902P9509J43820Q77368
5410C702826k0971j322917m69114J73316n89690k27449L33106M28096O6037j254625
5400H18615r05939K28085M88326L83345K54168P46221O2601j070606j201622l72435
5390e69241j317970r65690O65927R16510R26286M80941k56500o84678q17971K26485
5380a395901J724436m2861j475715m08656O49376K87391p1079J54552J48243K92173
5370a38041J58193N64830K48930p32166l72068j210741j280748K79354L25924
5361b156533k89401L93868P60277M27899M01167Q16790L80794j045885j650J367770
$$ plain form
5429 -62860 928108 2623364 3766216 3457357 2351503 1078374 985837 1904970 2091224
5420 2091224 1930326 2399371 2571423 2646972 2684558 2557227 2602129 2681638 2825458 3702826
5410 3702826 3681855 2358938 1889824 2063140 1473450 1246001 1579107 2007203 2073240 818615
5400 818615 -87324 140761 629087 1012432 1266600 2012821 2075422 1004816 -196806 -569241
5390 -569241 -1887211 -2852901 -2186974 -1270464 -344178 136763 -119737 -804415 -1622386 -1395901
5380 -1395901 328535 285674 -1190041 -1598697 -949321 -661930 -733009 -578457 -430214 -138041
5370 -138041 20152 584982 833912 101746 -270322 -1481063 -2761811 -2482457 -2156533
5361 -2156533 -2445934 -2052066 -1291789 -863890 -462723 354067 734861 -311024 -312674 1055096
5351A055096j59618j604136M33382J379174j66325o12725m06950K32412K32595
5342C82905J23778n72903o88630q0470p22321k10361N57519M81913k69998n87109
5332a585677L54509k43589n06233J72959O27924J33936Q62404J066777J142630
5323B025640J031819k25729r14590n28837N3486q54866j385700L37986Q58126
5314C97335O6196R0162j75264N99361J399182J13442j453604o86739m38607j005632
5304a094168K74608R15386K20905o57006j109147q77760k56751J627236R48875
5295g822k37395k75728N44986J02013q65349j5643L04114m43308p55539l32343
5285a982014K25358P16773M56449L89312O06399L09909j11516n97678n39368l67604
$$ plain form
5351 1055096 895478 -708658 -275276 1103898 937573 324848 -82102 150310 382905
5342 382905 506683 -66220 -754850 -835320 -1557641 -1768002 -1210483 -728570 -998568 -1585677
5332 -1585677 -1231168 -1474757 -1980990 -1808031 -1180107 -1046171 -183767 883010 2025640
5323 2025640 3057459 2831730 1917140 1388303 1441789 586923 -798777 -460791 397335
5314 397335 463531 553693 378429 977790 2376972 2490414 1036810 350071 -88536 -1094168
5304 -1094168 -819560 95826 316731 -340275 -1449422 -2327182 -2583933 -956697 -7822
5295 -7822 -245217 -520945 24041 126054 -739295 -754938 -450824 -894132 -1649671 -1982014
5285 -1982014 -1756656 -1039883 -583434 -194122 412277 722186 610670 12992 -526376 -893980
5275h93980L87136l71413r80415J44509J850865J382607J07783k33258j029401
5266C64433j094798J61824J238253Q38684p50474o06054j28087l07248n4155r23326
5256a260948j006520o28445R4898J999815J777394P14473m90572k039898j684914
5247b524717o16843Q07990J345895Q10096R79041J134456J37861r84970r91341
5238I7468N67630N24988l61721q86772o01418n90424q27772l90771O1790j57292
5228b564294O13016J338841L76854P62403J278882R28951K2152q31571j31643
5219A793591p353k52052J51247K62733q08537j552522n63997m49878o95448j56200
5209b278416N33170O91644l19170j96900P03215O2007j10249O13501K42202L57408
$$ plain form
5275 -893980 -506844 -878257 -1858672 -1714163 136702 1519309 1627092 1393834 364433
5266 364433 -730365 -568541 669712 1508396 757922 151868 23781 -283467 -337622 -1260948
5256 -1260948 -2267468 -2895913 -2801015 -801200 976194 1690667 1200095 -839803 -2524717
5247 -2524717 -3141560 -2333570 -987675 -177579 801462 1935918 2073779 1088809 97468
5238 97468 665098 1190086 828365 -58407 -659825 -1250249 -2078021 -2468792 -2407002 -2564294
5228 -2564294 -1951278 -612437 -235583 526820 1805702 2734653 2756805 1925234 1793591
5219 1793591 1786238 1534186 1685433 1948166 1139629 -412893 -976890 -1426768 -2122216 -2278416
5209 -2278416 -1745246 -1053602 -1372772 -1569672 -866457 -804450 -914699 -301198 -58996 298412
5199B98412K17887J22335J52932j79422M69185M79307n06166l72754M9531P69618
5189A500865J78321k76744r5042j66423l72642o20567k68268r07512o22101M36262
5179a213851L67220J69911m964J90369N19719L66425M70034j1129k34245j221
5169F18268l68199O13387K31457k4393P58041k39762q41932o63656n10578J017550
5159E90183J142298k70136o10130o37291m97536K20568L99405j56043j76312m60741
5149d55735P6M1370n94962K73621Q86027r21527j197496M72363J072711L15196
5139a08356m24200j80539m5862m72370l03983L23512L69789J17355j025465M05874
5129a344245J015520l70736j250355l65098J296166J153411J003868j40100r76252
$$ plain form
5199 298412 516299 638634 791566 612144 1081329 1560636 1054470 681716 731247 1500865
5189 1500865 1679186 1402442 1307400 1140977 768335 147768 -120500 -1028012 -1650113 -1213851
5179 -1213851 -846631 -676720 -681684 -491315 28404 394829 864863 853734 619489 618268
5169 618268 250069 863456 1094913 1070520 1828561 1588799 746867 83211 -427367 590183
5159 590183 1732481 1462345 852215 214924 -282612 -62044 337361 181318 5006 -455735
5149 -455735 -455659 -414289 -1009251 -735630 150397 -771130 -1968626 -1496263 -423552 -108356
5139 -108356 -532556 -713095 -758957 -1231327 -1535310 -1211798 -842009 -724654 -1750119 -1344245
5129 -1344245 -328725 -699461 -1949816 -2314914 -1018748 134663 1138531 998431 22179
$$ [...]
##END NTUPLES=NMR SPECTRUM
##END=
