##TITLE=1H_CG-1175-1
 CDCl3
 8 sc, 
 30.8.2023
##JCAMPDX= 6.0         $$ Bruker NMR JCAMP-DX V2.0
##DATA TYPE= NMR SPECTRUM
##DATA CLASS= NTUPLES
##ORIGIN= UXNMR, Bruker Analytische Messtechnik GmbH
##OWNER= root
$$ XWIN-NMR		Version 3.5
$$ Wed Aug 30 17:21:23 2023 Russian Standard Time (UT+4h)  she@DPX200
##.OBSERVE FREQUENCY= 200.13135
##.OBSERVE NUCLEUS= ^1H
##.ACQUISITION MODE= SIMULTANEOUS
##.ACQUISITION SCHEME= undefined
##.AVERAGES= 8
##.DIGITISER RES= 18
##SPECTROMETER/DATA SYSTEM= spect
##.PULSE SEQUENCE= zg30
##.SOLVENT NAME= CDCl3
##.SHIFT REFERENCE= (INTERNAL, CDCl3, 0, 15.7381)
##AUDIT TRAIL= $$ (NUMBER, WHEN, WHO, WHERE, WHAT)
$$ ##TITLE= Audit trail, XWIN-NMR		Version 3.5
$$ ##JCAMPDX= 5.01
$$ ##ORIGIN= Bruker BioSpin GmbH
$$ ##OWNER= she
$$ F:/spectra/data/she/nmr/H-F/1/pdata/1/auditp.txt
$$ ##AUDIT TRAIL=  $$ (NUMBER, WHEN, WHO, WHERE, WHAT)
(   1,<2023-08-30 17:19:17.32 +0400>,<she>,<DPX200>,
      <created by zg, POWCHK disabled, PULCHK disabled
       configuration hash MD5:
       00 E9 B6 7A A2 85 ED C7 34 08 36 98 17 FE 4E 26
       data hash MD5: 16K
       DA F8 83 09 2E C9 80 55 CF A6 95 8F 5F CF E5 E2>)
(   2,<2023-08-30 17:19:20.25 +0400>,<she>,<DPX200>,
      <Start of raw data processing
       efp BC_mod = 2 LB = 0.24 FT_mod = 6 PKNL = 1 PHC0 = -21048.4 PHC1 = 15.85272 SI = 16K 
       data hash MD5: 16K
       1E 0E 42 7D A5 90 5A 17 33 5C FD FC 0C 25 63 38>)
(   3,<2023-08-30 17:19:40.53 +0400>,<she>,<DPX200>,
      <pk PHC0 = -155.2223 PHC1 = -7.4 
       data hash MD5: 16K
       9C 11 36 3B 25 A7 CA 4A 0B 24 8B BA 79 15 57 D1>)
(   4,<2023-08-30 17:19:45.37 +0400>,<she>,<DPX200>,
      <abs ABSG = 5 
       data hash MD5: 16K
       D2 8A A0 3B E9 8F A8 7F 1A F4 89 8E 20 CC 09 CB>)
$$ ##END=
$$ 
$$ hash MD5
$$ 0F C1 54 B5 C7 D9 F2 0B 41 5A 6B 56 63 6B 2D 55
##$RELAX= 
##$RELAX= 
##$RELAX= 
##$RELAX= 
##$RELAX= 
##$RELAX= 
$$ Bruker specific parameters
$$ --------------------------
##$DU= <F:/spectra>
##$EXPNO= 1
##$NAME= <H-F>
##$PROCNO= 1
##$TYPE= <nmr>
##$USER= <she>
##$AMP= (0..31)
100 100 100 100 100 100 100 100 100 100 100 100 100 100 100 100 100 100 
100 100 100 100 100 100 100 100 100 100 100 100 100 100 
##$AQSEQ= 0
##$AQ_mod= 1
##$AUNM= <au_zg>
##$AUTOPOS= <>
##$BF1= 200.13
##$BF2= 200.13
##$BF3= 200.13
##$BF4= 200.13
##$BF5= 200.13
##$BF6= 200.13
##$BF7= 200.13
##$BF8= 200.13
##$BYTORDA= 1
##$CFDGTYP= 0
##$CFRGTYP= 5
##$CHEMSTR= <none>
##$CNST= (0..31)
1 1 145 1 1 1 1 1 1 1 1 1 1 1 1 1 1 1 1 1 1 1 1 1 1 1 1 1 1 1 1 1 
##$CPDPRG= <>
##$CPDPRG1= <>
##$CPDPRG2= <>
##$CPDPRG3= <>
##$CPDPRG4= <mlev>
##$CPDPRG5= <mlev>
##$CPDPRG6= <mlev>
##$CPDPRG7= <mlev>
##$CPDPRG8= <mlev>
##$CPDPRGB= <>
##$CPDPRGT= <>
##$D= (0..31)
0 1.2 0 0 0 0 0 0 0 0.06 0 0.03 0 0 0 0 0.0002 0 0 0 0 0 0 0 0 0 0 0 0 
0 0 0 
##$DATE= 1693401556
##$DBL= (0..7)
120 120 120 120 120 120 120 120 
##$DBP= (0..7)
150 150 150 150 150 150 150 150 
##$DBP07= 0
##$DBPNAM0= <>
##$DBPNAM1= <>
##$DBPNAM2= <>
##$DBPNAM3= <>
##$DBPNAM4= <>
$$ [...]
##$SUBNAM3= <"">
##$SUBNAM4= <"">
##$SUBNAM5= <"">
##$SUBNAM6= <"">
##$SUBNAM7= <"">
##$SUBNAM8= <"">
##$SUBNAM9= <"">
##$SW= 18.05172834244
##$SWIBOX= (0..15)
0 0 2 0 0 0 0 0 0 0 0 0 0 0 0 0 
##$SW_h= 3612.71676300578
##$TD= 16384
##$TD0= 1
##$TE= 0
##$TE2= 300
##$TE3= 300
##$TEG= 300
##$TL= (0..7)
0 120 120 120 120 120 120 120 
##$TP= (0..7)
150 150 150 150 150 150 150 150 
##$TP07= 0
##$TPNAME0= <>
##$TPNAME1= <>
##$TPNAME2= <>
##$TPNAME3= <>
##$TPNAME4= <>
##$TPNAME5= <>
##$TPNAME6= <>
##$TPNAME7= <>
##$TPOAL= (0..7)
0.5 0.5 0.5 0.5 0.5 0.5 0.5 0.5 
##$TPOFFS= (0..7)
0 0 0 0 0 0 0 0 
##$TUNHIN= 0
##$TUNHOUT= 0
##$TUNXOUT= 0
##$USERA1= <user>
##$USERA2= <user>
##$USERA3= <user>
##$USERA4= <user>
##$USERA5= <user>
##$V9= 5
##$VALIST= <valist>
##$VCLIST= <CCCCCCCCCCCCCCC>
##$VD= 0
##$VDLIST= <DDDDDDDDDDDDDDD>
##$VPLIST= <PPPPPPPPPPPPPPP>
##$VTLIST= <TTTTTTTTTTTTTTT>
##$WBST= 1024
##$WBSW= 4
##$XGAIN= (0..3)
0 0 0 0 
##$XL= 0
##$YL= 0
##$YMAX_a= 259019
##$YMIN_a= -196205
##$ZGOPTNS= <>
##$ZL1= 120
##$ZL2= 120
##$ZL3= 120
##$ZL4= 120
##$ABSF1= 15.80088
##$ABSF2= -2.250971
##$ABSG= 5
##$ABSL= 3
##$ALPHA= 0
##$AQORDER= 0
##$ASSFAC= 0
##$ASSFACI= 0
##$ASSFACX= 0
##$ASSWID= 0
##$AUNMP= <proc_1d>
##$AZFE= 0.1
##$AZFW= 0.1
##$BCFW= 0
##$BC_mod= 2
##$BYTORDP= 0
##$COROFFS= 0
##$CY= -3
##$DATMOD= 1
##$DC= 0
##$DFILT= <>
##$DTYPP= 0
##$F1P= 0
##$F2P= 0
##$FCOR= 1
##$FTSIZE= 16384
##$FT_mod= 6
##$GAMMA= 0
##$GB= 0
##$INTBC= 1
##$INTSCL= 3.70164e-10
##$ISEN= 128
##$LB= 0.24
##$LEV0= 0
##$LPBIN= 0
##$MAXI= 10000
##$MC2= 0
##$MEAN= 0
##$ME_mod= 0
##$MI= 1.114404
##$NCOEF= 0
##$NC_proc= -8
##$NLEV= 6
##$NOISF1= 3.799351
##$NOISF2= 2.8
##$NSP= 0
##$NTH_PI= 0
##$NZP= 0
##$OFFSET= 15.73808
##$PC= 1
##$PHC0= -21203.62
##$PHC1= 8.452721
##$PH_mod= 1
##$PKNL= yes
##$PPARMOD= 0
##$PSCAL= 0
##$PSIGN= 0
##$REVERSE= no
##$SF= 200.130006697704
##$SI= 16384
##$SIGF1= 3
##$SIGF2= 2
##$SINO= 5.538805
##$SIOLD= 16384
##$SREGLST= <1H.CDCl3>
##$SSB= 0
##$STSI= 16384
##$STSR= 0
##$SW_p= 3612.71676300578
##$SYMM= 0
##$S_DEV= 0
##$TDeff= 16384
##$TDoff= 0
##$TI= <>
##$TILT= no
##$TM1= 0
##$TM2= 0
##$TOPLEV= 0
##$USERP1= <user>
##$USERP2= <user>
##$USERP3= <user>
##$USERP4= <user>
##$USERP5= <user>
##$WDW= 1
##$XDIM= 16384
##$YMAX_p= 501160814
##$YMIN_p= -987034
$$ End of Bruker specific parameters
$$ ---------------------------------
##NTUPLES= NMR SPECTRUM
##VAR_NAME=  FREQUENCY,     SPECTRUM/REAL,   SPECTRUM/IMAG
##SYMBOL=    X,             R,               I
##VAR_TYPE=  INDEPENDENT,   DEPENDENT,       DEPENDENT
##VAR_FORM=  AFFN,          ASDF,            ASDF
##VAR_DIM=   16384,         16384,           16384
##UNITS=     HZ,            ARBITRARY UNITS, ARBITRARY UNITS
##FACTOR=    0.220516191357247, 1,           1
##FIRST=     3149.66206075606, 0,            0
##LAST=      -463.054702249718, 0,           0
##MIN=       -463.054702249718, -987034,     0
##MAX=       3149.66206075606, 501160814,    0
$$ Real data points
##PAGE= N=1
##DATA TABLE= (X++(R..R)), XYDATA
$$ [...]
$$ plain form
5552 24436854 27745093 33242838 40907665 50538504 61320055 68798551 66385316 54811040
5544 54811040 41750976 32201565 25875724 21236762 17988663 15597457 13696877 12463939
5536 12463939 11801490 11363962 11000075 10328076 10016078 9739847 9161384 9053437 9076964 9202426
5526 9202426 9102818 9083239 9566700 10097155 10664701 11262612 12461645 14234199 15865189
5517 15865189 16599638 15643164 13752950 12060320 10687013 10022077 9558534 9166307 8903266
5508 8903266 8512035 8296072 8510925 8935725 9329540 9774311 10429021 10704588 10221222 9298158
5498 9298158 8480734 7917764 7353532 6963115 6854988 6797007 6626153 6640096 6560992 6385745
5488 6385745 6309925 6240760 6375689 6589898 6920139 6938830 6907950 7238384 7648884 8079036
$$ packed form
5552B4436854L308239N497745P664827R630839J0781551P478496k413235j1574276
5544E4811040j3060064r549411o325841m638962l248099k391206j900580j232938
5536A2463939o62449m37528l63887o71999l11998k76231n78463j07947K3527J25462
5526I202426r9608j9579M83461N30455N67546N97911J199033J772554J630990
5517A5865189P34449r56474j890214j692630j373307o64936m63543l92227k63041
5508H903266l91231k15963K14853M24800L93815M44771O54710K75567m83366r23064
5498I298158q17424n62970n64232l90417j08127n7981j70854J3943p9104j75247
5488F385745p5820o9165J34929K14209L30241J8691l0880L30434M10500M30152
$$ plain form
5478 8079036 8663523 9051183 9897048 10914700 12178925 13870551 15813670 17930951 19867720
5469 19867720 20763099 19891359 17152763 14260859 12168855 10616559 9259956 8215259
5461 8215259 7621309 7308951 6876948 6802243 6764275 6499135 6565813 6654233 6511335 6754121
5451 6754121 7106927 7146897 7400336 7636356 8035007 8716186 9293426 9937906 11098634 12529411
5441 12529411 13963484 16040579 18308768 20221486 21032914 19560917 16441043 13654290
5433 13654290 11446032 9869310 8966352 8228565 7593571 7232066 7098993 6967735 6670103
5424 6670103 6423309 6226485 6006217 6013699 5755500 5462023 5608139 5862089 5742879 5822105
5414 5822105 6020638 6032057 6028585 6545782 6959885 7437620 8168736 8975608 9607277 9494920
$$ packed form
5478H079036N84487L87660Q45865J017652J264225J691626J943119K117281J936769
5469A9867720Q95379q71740k738596k891904k092004j552296j356603j044697
5461H215259n93950l12358m32003p4705l7968k65140O6678Q8420j42898K42786
5451F754121L52806L9970K53439K36020L98651O81179N77240O44480J160728J430777
5441A2529411J434073K077095K268189J912718Q11428j471997l119874k786753
5433A3654290k208258j576722r02958p37787o34994l61505j33073j31258k97632
5424F670103k46794j96824k20268P482k58199k93477J46116K53950j19210P9226
5414E822105J98533J1419l472N17197M14103M77735P31116Q06872O31669j12357
$$ plain form
5404 9494920 8489328 7683893 6590342 5753532 5225328 4637817 4508294 4210284 3934788
5395 3934788 3848848 3791946 3938433 3841932 3610476 3324601 3248432 3281978 3249241 3123023 2976258
5384 2976258 2906829 2928441 2899070 3144402 2974660 2767491 2608149 2652217 2604231 2721612
5374 2721612 2772954 2635878 2486073 2535207 2529735 2333811 2310094 2139495 2311493 2111262
5364 2111262 2092935 2226578 2334994 2234079 1984794 1981243 1940210 2087031 1967666 2049170
5354 2049170 2162940 2255651 2272565 1995814 2084656 2148981 2253963 2035451 1880608 2008177
5344 2008177 2058427 2097844 2026668 2207407 2333004 2232275 2147924 1907143 1911920 1928168 1960236
5333 1960236 2036201 2350635 2268119 2526843 2544122 2432679 2327123 2310375 2360598 2313593 2159362
$$ packed form
5404I494920j005592q05435j093551q36810n28204n87511j29523k98010k75496
5395C934788q5940n6902J46487r6501k31456k85875p6169L3546l2737j26218j46765
5384B976258o9429K1612k9371K45332j69742k07169j59342M4068m7986J17381
5374B721612N1342j37076j49805M9134n472j95924k3717j70599J71998k00231
5364B111262j8327J33643J08416j00915k49285l551m1033J46821j19365Q1504
5354B049170J13770R2711J6914k76751Q8842O4325J04982k18512j54843J27569
5344B008177N0250L9417p1176J80739J25597j00729q4351k40781M777J6248L2068
5333A960236P5965L14434q2516K58724J7279j11443j05556j6748N0223m7005j54231
$$ plain form
5322 2159362 1959413 2215345 2161535 2016069 2074426 2179816 2259117 2505424 2591121 2772085
5312 2772085 2958814 2774147 3043813 3311929 3317262 3060997 2783787 2906891 2928182 2799900
5302 2799900 2692068 2545406 2369975 2375286 2606838 2489395 2553779 2589328 2475129 2691822
5292 2691822 2736442 2835753 2904456 2953799 2805948 3087765 3257716 3451292 3832847 4030673
5282 4030673 4302033 4351092 4628029 4479026 4194154 4132094 4021964 3713476 3403946 3112541
5272 3112541 3071235 2762034 2683746 2716014 2693491 2762179 2853275 2760914 2394768 2889825 3070254
5261 3070254 3049092 2843210 2890695 3152008 3109498 3109365 3466644 3741223 3705078 3784318 3740623
5250 3740623 4061685 4079371 3829845 3868960 3922709 4007683 3691882 3802982 3889955 4142304
$$ packed form
5322B159362j99949K55932n3810j45466N8357J05390P9301K46307Q5697J80964
5312B772085J86729j84667K69666K68116N333k56265k77210J23104K1291j28282
5302B799900j07832j46662j75431N311K31552j17443O4384L5549j14199K16693
5292B691822M4620R9311O8703M9343j47851K81817J69951J93576L81555J97826
5282D030673K71360M9059K76937j49003k84872o2060j10130l08488l09530k91405
5272C112541m1306l09201p8288L2268k2523O8688R1096r2361l66146M95057J80429
5261C070254k1162k05882M7485K61313m2510j33L57279K74579l6145P9240m3695
5250C740623L21062J7686k49526L9115N3749Q4974l15801J11100Q6973K52349
$$ plain form
5240 4142304 4395185 4546893 4991495 4995995 5110014 5832789 6657766 7368647 8253775 9498500
5230 9498500 11493315 13674149 15272259 14874093 12323273 9711458 7652410 6015859
5222 6015859 5283885 4651165 3956731 3682769 3584248 3449425 3262129 3229410 3028753 2921136
5212 2921136 3021512 2761615 2910511 2903530 2728868 2435207 2512441 2300847 2304912 2305967 2321600
5201 2321600 2479167 2356190 2478688 2420731 2260917 2308335 2580738 2609459 2650274 2243526
5191 2243526 2187232 1893849 2100590 2172985 2126364 2290833 2110436 2079196 1950402 1918188
5181 1918188 1731612 1736713 2169080 2155441 1935109 1896071 1794494 1769510 1881576 2163799
5171 2163799 2148381 1987258 2167231 2206748 2201714 2239443 2252185 2342936 2515178 2447108 2295828
$$ packed form
5240D142304K52881J51708M44602M500J14019P22775Q24977P10881Q85128J244725
5230I498500J994815K180834J598110l98166k550820k611815k059048j636551
5222F015859p31974o32720o94434k73962r8521j34823j87296l2719k00657j07617
5212B921136J00376k59897J48896o981j74662k93661P7234k11594M065J055J5633
5201B321600J57567j22977J22498n7957j59814M7418K72403K8721M0815m06748
5191B243526n6294k93383K06741P2395m6621J64469j80397l1240j28794l2214
5181A918188j86576N101M32367j3639k20332l9038j01577k4984J12066K82223
5171B163799j5418j61123J79973L9517n034L7729J2742R0751J72242o8070j51280
$$ plain form
5160 2295828 2587418 2906978 3148950 3224175 3499244 3723528 3950549 4222804 3929428 3756840
5150 3756840 3989238 4523229 4817689 4685484 3983498 3482677 2927553 2589457 2502182 2291956
5140 2291956 2465689 2483822 2649434 2853618 2935009 2853355 2556324 2489267 2808031 2923186
5130 2923186 2854350 3049053 3038991 3046624 3247929 3612138 3754680 3849111 4056567 4038121 4393669
5119 4393669 4795359 5173338 5070109 5248271 5259200 5079488 5121897 5182829 4949967 4955923
5109 4955923 5164626 5557007 6274385 6917979 7278627 6986022 6308728 5700193 5263562 4958509
5099 4958509 5129684 5066401 4899372 4927226 5057543 5103457 5045078 4564076 4449605 4293000
5089 4293000 4339943 4434475 4154611 3985717 3987876 4067036 4368411 4468991 4646614 4903434
$$ packed form
5160B295828K91590L19560K41972P5225K75069K24284K27021K72255k93376j72588
5150C756840K32398N33991K94460j32205p01986n00821n55124l38096q7275k10226
5140B291956J73733J8133J65612K04184Q1391q1654k97031o7057L18764J15155
5130B923186o8836J94703j0062P633K01305L64209J42542R4431K07456j8446L55548
5119D393669M01690L77979j03229J78162J0929j79712M2409O0932k32862N956
5109D955923K08703L92381P17378O43594L60648k92605o77294o08535m36631l05053
5099D958509J71175o3283j67029K7854J30317M5914n8379m81002j14471j56605
5089D293000M6943R4532k79864j68894K159P9160L01375J00580J77623K56820
$$ plain form
5079 4903434 4972826 4864350 4928067 5120414 5268073 5315167 4895381 4701404 4523886 4529364
5069 4529364 4448828 4355534 4121915 4296516 4216822 4035044 4211781 4161089 4041276 4050299 4022562
5058 4022562 4078365 4247638 4287430 4279738 4055511 3934167 3756048 3743749 3337741 3046863
5048 3046863 2988639 3045185 2879683 2617327 2875513 2525223 2567578 2581042 2395073 2068480
5038 2068480 1962408 2063838 2260306 2246456 2229190 1895401 2015248 2172645 2081556 2291561
5028 2291561 2072535 1956804 2123889 2399990 2611877 2495562 2414637 2366600 2405763 2581483
5018 2581483 2428951 2542983 2312180 2349717 2455569 2507101 2823979 2929159 2780582 2598424
5008 2598424 2668255 2702169 2931581 3150357 3280803 3275670 3119369 3416822 3684759 3931955
$$ packed form
5079D903434O9392j08476O3717J92347J47659M7094m19786j93977j77518N478
5069D529364q0536r3294k33619J74601p9694j81778J76737n0692j19813R023k7737
5058D022562N5803J69273L9792p692k24227j21344j78119j2299m06008k90878
5048C046863n8224N6546j65502k62356K58186l50290M2355J3464j85969l26593
5038B068480j06072J01430J96468j3850j7266l33789J19847J57397r1089K10005
5028B291561k19026j15731J67085K76101K11887j16315q0925m8037L9163J75720
5018B581483j52532J14032k30803L7537J05852N1532L16878J05180j48577j82158
5008B598424O9831L3914K29412K18776J30446n133j56301K97453K67937K47196
$$ plain form
4998 3931955 4050818 4213232 4202753 4162076 4358949 4538424 4544866 4972716 5050442 5056725 5512872
4987 5512872 5626546 5628642 5885057 6053161 5995374 5794517 5780502 5975607 6128195 6000055
4977 6000055 5907869 6219500 6091842 6211919 6397414 6489259 6194497 6176872 6448752 6566700
4967 6566700 6877787 6702095 6634774 6601429 6830058 6831257 6948385 6943108 6956140 7061463 6972015
4956 6972015 6887547 7039198 7055660 6735997 6702011 6632507 6734872 6684458 6663888 6834837 7104233
4945 7104233 7438705 7401516 7605127 7951762 8040549 8350922 8566685 9026602 9140585 9222082
4935 9222082 9286132 9386783 9299601 9124982 9025575 9088822 9267384 9453405 9440476 9551906
4925 9551906 9795612 9826826 9882235 9887074 9750024 9838460 10019157 10117861 10019537 10029117 10143993
$$ packed form
4998C931955J18863J62414j0479m0677J96873J79475O442M27850P7726O283M56147
4987E512872J13674K096K56415J68104n7787k00857j4015J95105J52588j28140
4977F000055r2186L11631j27658J20077J85495R1845k94762j7625K71880J17948
4967F566700L11087j75692o7321l3345K28629J199J17128n277J3032J05323q9448
4956F972015q4468J51651J6462l19663l3986o9504J02365n0414k0570J70949K69396
4945G104233L34472l7189K03611L46635Q8787L10373K15763M59917J13983Q1497
4935I222082O4050J00651q7182j74619r9407O3247J78562J86021j2929J11430
4925I551906K43706L1214N5409M839j37050Q8436J80697R8704r8324R580J14876
$$ plain form
4914 10143993 10213913 10612584 10600347 10442290 10312646 10103198 9932329 10218097 10158597 10236130
4904 10236130 10103920 9994320 9985947 9841543 9959441 9790514 9566006 9424348 9515853 9492743
4894 9492743 9510536 9442551 9355032 9271377 9014581 8889528 8782467 8616234 8553661 8324961
4884 8324961 8314183 8467522 8375897 8024456 7693118 7623484 7476135 7319810 7103710 7298368
4874 7298368 7474425 7554143 7592322 7727785 7741451 7874493 8009213 7820115 7997296 8269121
4864 8269121 8726088 9092064 9532889 9735311 9786736 9842432 9948312 9814339 9809274 9701310
4854 9701310 9764002 10087960 9886735 9919792 9854082 9812545 9607714 9268228 9008102 8725323
4844 8725323 8468500 8102287 7970236 7803597 7326580 7040281 6845474 6642568 6442782 6418063
$$ packed form
4914A0143993O9920L98671j2237j58057j29644k09448j70869K85768n9500P7533
4904A0236130j32210j09600q373j44404J17898j68927k24508j41658R1505k3110
4894I492743J7793o7985q7519q3655k56796j25053j07061j66233o2573k28700
4884H324961j0778J53339r1625l51441l31338o9634j47349j56325k16100J94658
4874G298368J76057P9718L8179J35463J3666J33042J34720j89098J77181K71825
4864H269121M56967L65976M40825K02422N1425N5696J05880j33973n065j07964
4854I701310O2692L23958k01225L3057o5710m1537k04831l39486k60126k82779
4844H725323k56823l66213j32051j66639m77017k86299j94807k02906j99786k4719
$$ plain form
4834 6418063 6015358 5903855 5926699 5846586 5901015 5958411 6023772 6161669 6092930 5923418 5888975
4823 5888975 5984224 6252307 6253833 6281441 6372610 6870038 7605736 8001678 8262814 8825800
4813 8825800 8756601 7964321 7316900 6592135 6037201 5846155 5700173 5753397 5489660 5292322
4803 5292322 4997191 5030315 5173762 4800724 4632902 4791136 4688997 4793644 4781776 4764861
4793 4764861 5037584 4959248 4725613 4823386 4802058 4912900 4958722 4715733 4908484 4930059
4783 4930059 4895836 4991573 5224992 5121350 5232432 5425811 5840760 6083896 6049216 6160861
4773 6160861 6441878 6878555 7101006 7283732 7906791 8908859 10072586 11413212 12947911
4764 12947911 14581731 15879710 15970765 14878360 13209105 11204258 9487947 8356685
$$ packed form
4834F418063m02705j11503K2844q0113N4429N7396O5361J37897o8739j69512l4443
4823E888975R5249K68083J526K7608R1169M97428P35698L95942K61136N62986
4813H825800o9199p92280o47421p24765n54934j91046j45982N3224k63737j97338
4803E292322k95131L3124J43447l73038j67822J58234j02139J04647j1868j6915
4793D764861K72723p8336k33635R7773k1328J10842M5822k42989J92751K1575
4783D930059l4223R5737K33419j03642J11082J93379M14949K43136l4680J11645
4773F160861K81017M36677K22451J82726O23059J002068J163727J340626J534699
4764A2947911J633820J297979R1055j092405j669255k004847j716311j131262
$$ plain form
4756 8356685 7395352 6597761 6223252 5752574 5228483 5274859 5338785 5410844 5434678 5070432
4746 5070432 4861405 4941029 4907605 4680108 4549334 4498836 4607550 4640054 4447247 4268981
4736 4268981 4397322 4429602 4103488 4317365 4474397 4345246 4518583 4241451 4479593 4821684
4726 4821684 4868995 4730112 4872748 4818300 4823909 5040592 5177722 5362122 5507204 5634227
4716 5634227 5604053 5809691 6144901 6183011 6472304 6631133 6822323 6856472 6805103 6895231
4706 6895231 7014339 7134584 7509761 7927599 8182606 9019654 9740807 10566137 11786887
4697 11786887 13569733 14908865 15203206 15047659 14098722 12467798 10847164 9708561 8966127
4688 8966127 8379574 8165965 7778811 7866998 7586086 7143417 6672809 6539797 5794090 5200399
$$ packed form
4756H356685r61333p97591l74509m70678n24091M6376O3926P2059K3834l64246
4746E070432k09027P9624l3424k27497j30774n0498J08714L2504j92807j78266
4736D268981J28341L2280l26114K13877J57032j29151J73337k77132K38142L42091
4726D821684M7311j38883J42636n4448N609K16683J37130J84400J45082J27023
4716E634227l0174K05638L35210L8110K89293J58829J91190L4149n1369R0128
4706F895231J19108J20245L75177M17838K55007Q37048P21153Q25330J220750
4697A1786887J782846J339132K94341j55547r48937j630924j620634j138603p42434
4688H966127n86553k13609l87154Q8187k80912m42669m70608j33012p45707n93691
$$ plain form
4678 5200399 5284146 5413088 5265350 5038255 4810756 4736177 4809997 4791002 4668336 4629389
4668 4629389 4630537 4747554 4708848 4418002 4282554 4448160 4524402 4571517 4445192 4365664 4313095
4657 4313095 4091273 4282215 4165939 4107201 4279453 4480632 4373702 4481458 4549436 4459431
4647 4459431 4664409 4841328 4628565 4848902 4531185 4562596 4741122 4939339 4857083 4965193
4637 4965193 4641255 4579159 4864179 4934922 4950403 5225641 5178652 5094901 5505795 5296442
4627 5296442 5165885 5239243 5001340 4653004 4703708 4829132 4941809 4782057 4732645 4928019
4617 4928019 4983500 4892664 4842703 4990491 4951028 5186300 5382581 5198814 5168710 5184117 5181601
4606 5181601 5179756 5215630 5289337 5406097 5328875 5604571 5372109 5632672 5362360 5260794
$$ packed form
4678E200399Q3747J28942j47738k27095k27499p4579P3820j8995j22666l8947
4668D629389J148J17017l8706k90846j35448J65606P6242M7115j26325p9528n2569
4657D313095k21822J90942j16276n8738J72252K01179j06930J07756O7978r0005
4647D459431K04978J76919k12763K20337l17717L1411J78526J98217q2256J08110
4637D965193l23938o2096K85020P0743J5481K75238m6989q3751M10894k09353
4627E296442j30557P3358k37903l48336N0704J25424J12677j59752m9412J95374
4617D928019N5481r0836m9961J47788l9463K35272J96281j83767l0104J5407k516
4606E181601j845L5874P3707J16760p7222K75696k32462K60563k70312j01566
$$ plain form
4596 5260794 5597455 5555099 5582592 5384783 5183841 5421105 5579789 5551466 5462434 5103840
4586 5103840 4911256 5281547 5356121 5305880 5154545 4960095 5006235 4969965 4995340 4925211 5216770
4575 5216770 5184859 4719826 4938872 5010118 5061270 4965142 5047252 5271889 5421371 5623258
4565 5623258 5536005 5521716 5602309 5570927 5477432 5850831 5655316 5777123 5689921 5581391 5455899
4554 5455899 5115559 5033763 5312017 5070931 5145640 5406806 5472298 5454035 5607453 5555184
4544 5555184 5306525 5378144 5089246 5251918 5144008 5106531 5224837 5595548 5590193 5520575
4534 5520575 5550315 5418376 5426638 5500105 5693618 5786932 5995530 6192219 6008612 6188518
4524 6188518 5977580 5848381 6035440 6330653 6659268 6583084 6716520 6691688 6827574 6786966
$$ packed form
4596E260794L36661m2356K7493j97809k00942K37264J58684k8323q9032l58594
4586E103840j92584L70291P4574n0241j51335j94450M6140l6270K5375p0129K91559
4575E216770l1911m65033K19046P1246N1152r6128Q2110K24637J49482K01887
4565E623258q7253j4289Q0593l1382r3495L73399j95515J21807q7202j08530j25492
4554E455899l40340q1796K78254k41086P4709K61166O5492j8263J53418n2269
4544E555184k48659P1619k88898J62672j07910l7477J18306L70711n355o9618
4534E520575K9740j31939Q262P3467J93513R3314K08598J96689j83607J79906
4524F188518k10938j29199J87059K95213L28615p6184J33436k4832J35886m0608
$$ plain form
4514 6786966 6827306 6990694 7017765 7078364 7175256 7318421 7575305 7135633 7236011 7331323
4504 7331323 7365197 7463007 7547561 7518439 7673385 7952279 8181053 8182253 8096730 8359951 8358603
4493 8358603 8479628 8618717 8597444 8755468 8772796 8990391 9287753 9541515 9490658 9768273
4483 9768273 10055682 9807105 9755218 9810633 10037346 10325912 10525026 10448124 10432107 10621217
4473 10621217 11007860 10979134 11011241 11165213 11597843 11706167 12316449 12492649 12721237 13186319
4463 13186319 13548741 13768191 14148299 14469343 14753090 15117806 15414626 15810783 16153176
4454 16153176 16702750 17232160 17776590 18537497 19424486 20324077 20984506 22402444 23798740
4445 23798740 24459364 25414657 26217000 27020968 28281222 29210419 29810646 30338244 30688673
$$ packed form
4514F786966M0340J63388K7071O0599R6892J43165K56884m39672J00378R5312
4504G331323L3874R7810Q4554k9122J54946K78894K28774J200q5523K63221j348
4493H358603J21025J39089k1273J58024J7328K17595K97362K53762n0857K77615
4483I768273K87409k48577n1887N5415K26713K88566J99114p6902j6017J89110
4473A0621217L86643k8726L2107J53972M32630J08324O10282J76200K28588M65082
4463A3186319L62422K19450L80108L21044K83747L64716K96820L96157L42393
4454A6153176N49574N29410N44430P60907Q86989Q99591O60429J417938J396296
4445B3798740O60624R55293Q02343Q03968J260254R29197O00227N27598L50429
$$ plain form
4436 30688673 31078958 31389285 31368917 31408405 31413028 31459771 31823633 32581217 33316233 34164822
4426 34164822 35498177 36616888 37844688 38905102 39686637 40110274 40836126 41156840 40980890
4417 40980890 41056137 41031685 40740103 40490849 40139240 39715762 39223382 38835116 38378460 37944534
4407 37944534 37270322 36700850 36346631 36547712 37167132 37929647 38687013 39811536 41004400
4398 41004400 41853214 42367702 42959049 43106244 42932779 43047385 43038491 43180881 43528760 44390494
4388 44390494 44893581 45181407 44930728 44589014 44002126 43166464 42194010 41100080 39620969
4379 39620969 37761708 36037081 33986365 32145966 30430772 28572457 26888006 25681755
4371 25681755 24035329 22978275 22125556 21245345 20746122 20137642 19566404 19557035 19243373
$$ packed form
4436C0688673L90285L10327k0368L9488M623M6743L63862P57584P35016Q48589
4426C4164822J333355J118711J227800J060414P81535M23637P25852L20714j75950
4417D0980890P5247k4452k91582k49254l51609m23478m92380l88266m56656m33926
4407C7944534o74212n69472l54219K01081O19420P62515P57366J124523J192864
4398D1004400Q48814N14488N91347J47195j73465J14606q894J42390L47879Q61734
4388D4390494N03087K87826k50679l41714n86888q35662r72454j093930j479111
4379C9620969j859261j724627k050716j840399j715194j858315j684451j206251
4371B5681755j646426j057054q52719q80211m99223o08480n71238r369l13662
$$ plain form
4362 19243373 18850805 18815883 18561013 18533179 18511720 18489394 18573995 18705930 18981377 19346045
4352 19346045 19206213 19171838 19460753 19593854 19520577 19386876 19329733 19532325 19940178 20161341
4342 20161341 20352308 20677363 20681714 20874383 21229551 21473276 21821913 21996690 22231335 22295227
4332 22295227 22120188 22431353 22660485 22537561 22742881 23238833 23461568 23992869 24342062
4323 24342062 24548863 25165653 25710442 26527851 27375023 27900734 28847061 29628929 30182938
4314 30182938 31015366 32132555 33383703 34923184 36328801 38239705 39995128 41812812
4306 41812812 43966432 45814710 47468846 49085377 50596090 51889600 52682250 53417756
4298 53417756 54111226 54379948 54575802 54649955 54441853 54222275 54226278 54699238 55554058 56152534
$$ packed form
4362A9243373l92568l4922k54870k7834k1459k2326Q4601J31935K75447L64668
4352A9346045j39832l4375K88915J33101p3277j33701n7143K02592M07853K21163
4342B0161341J90967L25055M351J92669L55168K43725L48637J74777K34645O3892
4332B2295227j75039L11165K29132j22924K05320M95952K22735N31301L49193
4323B4342062K06801O16790N44789Q17409Q47172N25711R46327P81868N54009
4314C0182938Q32428J117189J251148J539481J405617J910904J755423J817684
4306D1812812K153620J848278J654136J616531J510713J293510P92650P35506
4298E3417756O93470K68722J95854P4153k08102k19578M003M72960Q54820N98476
$$ plain form
4288 56152534 56652713 56140882 54938038 53485168 51503878 49475811 47930715 46530560
4280 46530560 45659166 45145253 44970479 45091411 45791932 46314527 46887779 47405272 47905685
4271 47905685 48303945 48319726 48520762 48705345 48633543 48404147 48024484 47480605 46945648 46030558
4261 46030558 45233232 44144343 43458242 42472661 41235301 40343391 39755309 39180851 38711330
4252 38711330 38668217 38791809 38490662 38268319 38360517 37759373 37371959 36680239 35762666 35051987
4242 35051987 34091949 32643713 31519292 30595389 29325131 28736453 28234389 27689119 27729256
4233 27729256 27343772 27343548 27213994 27088147 26935390 26972651 27153796 27156226 27482053 27468740 27761896
4222 27761896 27645853 27592945 27727213 27530781 27342833 27472729 27801453 28090534 28446165 28802630
$$ packed form
4288E6152534N00179n11831j202844j452870j981290k028067j545096j400155
4280D6530560q71394n13913j74774J20932P00521N22595N73252N17493N00413
4271D7905685L98260J5781K01036J84583p1802k29396l79663n43879n34957r15090
4261D6030558p97326j088889o86101r85581j237360q91910n88082n74458m69521
4252C8711330m3113J23592l01147k22343R2198o01144l87414o91720r17573p10679
4242C5051987r60038j448236j124421r23903j270258n88678n02064n45270M0137
4233B7729256l85484k24j29554j25847j52757L7261J81145K430L25827j3313K93156
4222B7761896j16043n2908J34268j96432j87948J29896L28724K89081L55631L56465
$$ plain form
4212 28802630 28925663 29244972 29488777 29277557 29422767 29373616 29426498 29290261 29292505 29506839
4202 29506839 29855872 30312030 30995763 31645093 32311618 33122101 34094716 34505688 35503316
4193 35503316 36221645 36252922 35761720 34811606 34315539 33875875 33348659 33031330 33161969 33125415
4183 33125415 33092558 32994872 33011944 33335363 33367014 33609837 33974770 34210746 34775820 35128123
4173 35128123 35851805 36679010 37682206 38425726 39339842 40204973 40920260 41421611 41593673
4164 41593673 41866022 42502212 42824872 43463520 44003008 44647253 45812123 47067366 48420932
4155 48420932 50014947 51723340 53466698 54662968 55400572 55477579 55138907 54845618 54723513
4146 54723513 54475387 54046589 53614789 53443666 53015712 52641796 52597283 52793428 53375799 54039935
$$ packed form
4212B8802630J23033L19309K43805k11220J45210m9151N2882j36237K244K14334
4202B9506839L49033M56158O83733O49330O66525Q10483R72615M10972R97628
4193C5503316P18329L1277m91202r50114m96067m39664n27216l17329J30639l6554
4183C3125415l2857r7686J7072L23419L1651K42823L64933K35976N65074L52303
4173C5128123P23682Q27205J003196P43520R14116Q65131P15287N01351J72062
4164D1593673K72349O36190L22660O38648N39488O44245J164870J255243J353566
4155D8420932J594015J708393J743358J196270P37604P7007l38672k93289j22105
4146E4723513k48126m28798m31800j71123m27954l73916m4513J96145N82371O64136
$$ plain form
4136 54039935 54817519 55845451 57019648 57669123 57970269 57955437 57965742 57774764 57449743
4127 57449743 57160072 57044023 56753009 56352973 55990837 56358068 57085738 57904958 58583744
4118 58583744 59336782 59469255 58612033 57167309 55847897 54796058 53770015 53248292 52704681
4109 52704681 52268375 52496276 52855443 52768610 52997591 53843551 54596160 55346979 56646090
4100 56646090 57670757 58960131 60304879 61587402 62569643 63322270 64159626 64676534 65230042
4091 65230042 65865636 66463429 66869569 67532295 68090749 69089312 70436725 71569628 72921185
4082 72921185 74534933 76401391 78189787 79923880 81984019 84104669 86014147 88517454
4074 88517454 91558912 95239815 98733916 102967106 107563139 112416041 117802151 123522565
$$ packed form
4136E4039935P77584J027932J174197O49475L01146j4832J0305j90978l25021
4127E7449743k89671j16049k91014m00036l62136L67231P27670Q19220O78786
4118E8583744P53038J32473q57222j444724j319412j051839j026043n21723n43611
4109E2704681m36306K27901L59167q6833K28981Q45960P52609P50819J299111
4100E6646090J024667J289374J344748J282523R82241P52627Q37356N16908N53508
4091F5230042O35594N97793M06140O62726N58454R98563J347413J132903J351557
4082G2921185J613748J866458J788396J734093K060139K120650J909478K503307
4074H8517454L041458L680903L494101M233190M596033M852902N386110N720414
$$ plain form
4066 123522565 129838062 136431388 142155634 146952562 151055243 153640381 155725086 157960582
4058 157960582 161061315 166335416 173622763 182764053 194932487 209709337 227948004 249082847
4050 249082847 273316851 299969395 329631567 358791908 380321563 389737058 389594254
4043 389594254 379208284 352378280 310781956 267191243 231842537 204467498 183213000
4036 183213000 166811132 153845386 143482675 135842974 129819659 125719332 122576500 120491938
4028 120491938 119324930 118420355 117467336 116125724 114153333 111367480 108685327 105988941
4020 105988941 103694706 101098156 98632384 96514948 94916756 93538781 91847059 90681182
4012 90681182 89679663 88674785 87632513 85919836 84105346 82526371 80343843 78012706
$$ packed form
4066A23522565O315497O593326N724246M796928M102681K585138K084705K235496
4058A57960582L100733N274101P287347R141290J2168434J4776850J8238667K1134843
4050B49082847K4234004K6652544K9662172K9160341K1529655R415495j42804
4043C89594254j0385970k6830004m1596324m3590713l5348706k7375039k1254498
4036A83213000j6401868j2965746j0362711p639701o023315m100327l142832k084562
4028A20491938j167008r04575r53019j341612j972391k785853k682153k696386
4020A05988941k294235k596550k465772k117436j598192j377975j691722j165877
4012I0681182j001519j004878j042272j712677j814490j578975k182528k331137
$$ plain form
4004 78012706 76547440 75230779 73883845 72402415 71283922 70444511 69583086 68938520 67614081
3995 67614081 66416253 65000933 63250890 61582767 59737724 58429124 57355441 56217475
3987 56217475 55003991 53787026 52615099 51554675 50572179 49806381 48844827 47461431 46308509
3978 46308509 45187545 43817184 42559693 41510589 40657272 39817290 38780241 37744705
3970 37744705 37118848 36533314 35682362 35250618 34839247 34105206 33305503 32393323 31511784
3961 31511784 31349505 30693201 30334950 29816382 29307530 29383688 29293895 28896686 28579768 28285226
3951 28285226 28168839 28260945 28371098 28560170 29011756 29378054 30239873 31337530 32336037
3942 32336037 33465395 34379568 34430756 33589404 32014866 30125060 28872940 27432581 26110436
$$ packed form
4004G8012706j465266j316661j346934j481430j118493q39411q61425o44566j324439
3995F7614081j197828j415320j750043j668123j845043j308600j073683j137966
3987E6217475j213484j216965j171927j060424r82496p65798r61554j383396j152922
3978D6308509j120964j370361j257491j049104q53317q39982j037049j035536
3970C7744705o25857n85534q50952m31744m11371p34041p99703r12180q81539
3961C1511784j62279o56304l58251n18568n08852P6158q9793l97209l16918k94542
3951B8285226j16387R2106J10153J89072M51586L66298Q61819J097657R98507
3942C2336037J129358R14173N1188q41352j574538j889806j252120j440359j322145
$$ plain form
3933 26110436 25606825 24670308 23939519 23449391 23072213 23017731 22803413 22390380 22341622 22782289
3923 22782289 22776098 22783612 22678749 22858756 23323562 23820718 24252283 24955415 25465854 25498935
3913 25498935 25640204 25708669 26063084 26437771 26943532 27135002 27513019 27199913 26899761 26395390
3903 26395390 25769259 25006673 24342004 23690566 23347706 23015384 22333600 22345144 21934849 21405642
3893 21405642 21257586 21623755 21730506 21222296 20954398 20981417 20856961 20608391 20243373 19968283
3883 19968283 19652926 19758508 19419303 19343929 19498243 19453943 19379148 19399038 19288459 19387211
3873 19387211 19373386 19607312 19632716 19873656 19680001 19673977 19464629 19508930 19685702 19640933
3863 19640933 19614091 19355628 19360533 19547503 19651851 19534679 19551940 19703727 19515435 19219916
$$ packed form
3933B6110436n03611r36517p30789m90128l77178n4482k14318m13033m8758M40667
3923B2782289o191P514j04863J80007M64806M97156M31565P03132N10439L3081
3913B5498935J41269O8465L54415L74687N05761J91470L78017l13106l00152n04371
3903B6395390o26131p62586o64669o51438l42860l32322o81784J1544m10295n29207
3893B1405642j48056L66169J06751n08210k67898K7019j24456k48570l65018k75090
3883A9968283l15357J05582l39205p5374J54314m4300p4795J9890j10579R8752
3873A9387211j3825K33926K5404K40940j93655o024k09348M4301J76772m4769
3863A9640933k6842k58463M905J86970J04348j17172J7261J51787j88292k95519
$$ plain form
3853 19219916 19261188 19196288 19111263 19267081 19728530 19941206 19990471 20070722 20225181 20292007
3843 20292007 20600408 20712567 20652561 20458501 20423855 20188154 19981145 20112393 20219592 20151019
3833 20151019 20101069 20502527 20706395 21017380 21248687 21535340 21546179 22061319 22211900 22343243
3823 22343243 22527106 22640662 23222959 23350083 23551568 23975501 24332695 24227336 24548634
3814 24548634 25033506 25339751 25412209 25780806 26415773 26869221 26718267 27012875 27395392 27522358
3804 27522358 27960038 28126739 28440004 28906437 29135965 29440316 29502885 29889713 30474192 30424920
3794 30424920 30660823 30911885 31453266 31899526 32026474 32601446 33200797 33898397 34625368
3785 34625368 35256512 35921756 36878935 38268687 39464675 40382037 41348054 41924542 42662931
$$ packed form
3853A9219916M1272o4900q5025J55818M61449K12676M9265Q0251J54459O6826
3843B0292007L08401J12159o0006j94060l4646k35701k07009J31248J07199o8573
3833B0151019m9950M01458K03868L10985K31307K86653J0839N15140J50581J31343
3823B2343243J83863J13556N82297J27124K01485M23933L57194j05359L21298
3814B4548634M84872L06245P2458L68597O34967M53448j50954K94608L82517J26966
3804B7522358M37680J66701L13265M66433K29528L04351O2569L86828N84479m9272
3794C0424920K35903K51062N41381M46260J26948N74972N99351O97600P26971
3785C4625368O31144O65244R57179J389752J195988R17362R66017N76488P38389
$$ plain form
3776 42662931 43465597 43892938 43860598 44337127 45181927 46215625 47241170 48214976 49787987
3767 49787987 51158838 52308628 53303754 54483138 55287846 56337136 57876827 59425862
3759 59425862 61579269 63780908 66327954 69031758 71689734 74547859 77646081 80713534
3751 80713534 83530795 85949393 88465176 90510047 92316016 93733814 94500469 95406796
3743 95406796 96306152 96998708 97445833 98081053 98951734 99618701 100039418 100142987 100305498
3734 100305498 100327658 100067952 100147269 99911482 99014518 98053191 96756343 95340271 94082285
3725 94082285 93393523 92801181 92685993 92785503 93189190 94391813 95768644 97114347 98719994
3716 98719994 100895276 103092964 104840561 106084614 106597687 106371487 105709029 104337329 103171574
$$ packed form
3776D2662931Q02666M27341l2340M76529Q44800J033698J025545R73806J573011
3767D9787987J370851J149790R95126J179384Q04708J049290J539691J549035
3759E9425862K153407K201639K547046K703804K657976K858125L098222L067453
3751H0713534K817261K418598K515783K044871J805969J417798P66655R06327
3743I5406796Q99356O92556M47125O35220Q70681O66967M20717J03569J62511
3734A00305498K2160k59706P9317k35787q96964r61327j296848j416072j257986
3725I4082285o88762n92342j15188R9510M03687J202623J376831J345703J605647
3716I8719994K175282K197688J747597J244053N13073k26200o62458j371700j165755
$$ plain form
3707 103171574 101702310 100111916 98691333 97672501 97149469 96866302 96694006 96569740 96408017
3698 96408017 95952648 94961997 93436746 91446596 88915799 85448486 81719210 78348497
3690 78348497 74950156 71429660 68142589 65304406 62996751 61166454 59814143 58562478
3682 58562478 57308569 56245112 55127801 54071578 53064867 52243258 51427019 51038476 50568702
3673 50568702 50276625 49941122 49791432 49357216 49071777 49137693 49018617 48914942 48532269 48458537
3663 48458537 48320008 48336413 48816950 49246081 49086084 48720509 48238021 47837208 47196406 46601375
3653 46601375 45960325 45167758 44373759 43758461 43087258 42709098 41869737 41479478 41281540
3644 41281540 41054585 40769771 40185598 39900811 39591684 39207856 39111934 39276746 39334060 39139319
$$ packed form
3707A03171574j469264j590394j420583j018832n23032k83167j72296j24266j61723
3698I6408017m55369r90651j525251j990150k530797l467313l729276l370713
3690G8348497l398341l520496l287071k838183k307655j830297j352311j251665
3682E8562478j253909j063457j117311j056223j006711q21609q16239l88543m69774
3673E0568702k92077l35503j49690m34216k85439O5916j19076j03675l82673p3732
3663D8458537j38529J6405M80537M29131j59997l65575m82488m00813o40802n95031
3653D6601375o41050p92567p93999o15298o71203l78160q39361l90259j97938
3644D1281540k26955k84814n84173k84787l09127l83828r5922J64812N7314j94741
$$ plain form
3634 39139319 39238929 39577005 39790285 39745689 39917674 40235070 40251783 40653113 40921057 41157439
3624 41157439 41374229 42094498 42420548 42611085 42988077 43183170 43381261 44037679 44430341
3615 44430341 45127616 45848342 46114461 46771953 47426188 48296129 49061589 49639942 50217100
3606 50217100 51549488 52833499 53916932 54977251 56009035 57174211 58455990 59832014
3598 59832014 61491918 63455355 65366777 67546677 69963905 72581648 75083198 78174839
3590 78174839 81380408 84749342 88618148 93102052 98028205 103264223 108869216 114894271
3582 114894271 121263932 128333563 135511406 142921634 150802551 158363453 165774023 173051733
3574 173051733 179815791 185492344 190218342 193247069 194992105 194973313 193680644 190801917
$$ packed form
3634C9139319R9610L38076K13280m4596J71985L17396J6713M01330K67944K36382
3624D1157439K16790P20269L26050J90537L76992J95093J98091O56418L92662
3615D4430341O97275P20726K66119O57492O54235Q69941P65460N78353N77158
3606E0217100J332388J284011J083433J060319J031784J165176J281779J376024
3598E9832014J659904J963437J911422K179900K417228K617743K501550L091641
3590G8174839L205569L368934L868806M483904M926153N236018N604993O025055
3582A14894271O369661P069631P177843P410228P880917P560902P410570P277710
3574A73051733O764058N676553M725998L028727J745036j8792j292669k878727
$$ plain form
3566 190801917 186994822 182673115 177915162 172542378 167465981 162372369 157348924 152802527
3558 152802527 148419430 144249185 140012368 136196852 132409943 128921112 125354551 121985454
3550 121985454 119002663 116337466 114233564 112901110 111886223 111657602 111840336 112937364
3542 112937364 114641914 117168590 119942181 123748754 128617404 133774960 139166399 144981222
3534 144981222 150762120 155854000 160555233 164300012 167085547 168753521 169242729 169039983
3526 169039983 168244577 166608467 164408258 162137121 159635458 157109797 154297281 151183393
3518 151183393 148009142 144763186 141412452 137639459 133839817 129878473 125356569 120837743
3510 120837743 116224888 111832859 107589789 103389362 99676841 95913832 92801713 90271314
$$ packed form
3566A90801917l807095m321707m757953n372784n076397n093612n023445m546397
3558A52802527m383097m170245m236817l815516l786909l488831l566561l369097
3550A21985454k982791k665197k103902j332454j014887k28621J82734J097028
3542A12937364J704550K526676K773591L806573M868650N157556N391439N814823
3534A44981222N780898N091880M701233L744779K785535J667974M89208k02746
3526A69039983p95406j636110k200209k271137k501663k525661k812516l113888
3518A51183393l174251l245956l350734l772993l799642l961344m521904m518826
3510A20837743m612855m392029m243070m200427l712521l763009l112119k530399
$$ plain form
3502 90271314 87852509 85721033 84048394 82332963 80688101 79244983 77700584 75976276
3494 75976276 74079847 72393367 70439750 68551039 66634858 64682547 62763006 60904413
3486 60904413 59371248 57708785 56033551 54500513 53148535 52041953 51420368 50582882
3478 50582882 49638923 48826361 47946071 47387224 47048238 46531324 45933453 45758290 45588108
3469 45588108 45473790 45369407 45137167 44959807 44549588 44416185 44127533 43609930 43183994
3460 43183994 42564993 41483180 40690751 39682175 38746129 37990579 37065108 36034501 35174353
3451 35174353 34512080 33887541 33367380 33015019 32749724 32118101 31634586 31273415 30881681
3442 30881681 31035961 30723035 30389659 30218522 30011980 29816144 29733720 29559376 29343759 29342928
$$ packed form
3502I0271314k418805k131476j672639j715431j644862j443118j544399j724308
3494G5976276j896429j686480j953617j888711j916181j952311j919541j858593
3486F0904413j533165j662463j675234j533038j351978j106582o21585q37486
3478E0582882r43959q12562q80290n58847l38986n16914n97871j75163j70182
3469D5588108j14318j04383k32240j77360m10219j33403k88652n17603m25936
3460D3183994o19001j081813p92429j008576r36046p55550r25471j030607q60148
3451C5174353o62273o24539n20161l52361k65295o31623m83515l61171l91734
3442C0881681J54280l12926l33376j71137k06542j95836q2424j74344k15617q31
$$ plain form
3432 29342928 29179929 28947086 28604512 28527624 28406149 28204268 27876362 28001273 28153952 27856065
3422 27856065 27907565 28093800 27910074 27987958 28285965 28241001 28085855 28310894 28267141 28496075
3412 28496075 28687984 29161563 29457010 29595887 30007282 30202306 30478630 30402478 30708329 30835033
3402 30835033 31178574 31852912 32348317 32639669 32849706 33457571 34022138 34541854 35011223
3393 35011223 35433407 36014389 36450117 37011806 37800116 38434330 39041180 39943526 40834014
3384 40834014 41689911 42608643 43362261 44069275 44956183 45723898 46194547 46788088 47186088
3375 47186088 47546449 48189912 49022772 49817539 50450876 51081634 51651229 52472322 53157471
3366 53157471 53601248 54306400 54974645 55433081 55635910 56230153 56670026 57143460 57473477
$$ packed form
3432B9342928j62999k32843l42574p6888j21475k01881l27906J24911J52679k97887
3422B7856065N1500J86235j83726P7884K98007m4964j55146K25039m3753K28934
3412B8496075J91909M73579K95447J38877M11395J95024K76324p6152L05851J26704
3402C0835033L43541O74338M95405K91352K10037O07865N64567N19716M69369
3393C5011223M22184N80982M35728N61689P88310O34214O06850R02346Q90488
3384D0834014Q55897R18732P53618P07014Q86908P67715M70649N93541L98000
3375D7186088L60361O43463Q32860P94767O33337O30758N69595Q21093O85149
3366E3157471M43777P05152O68245M58436K02829N94243M39873M73434L30017
$$ plain form
3357 57473477 57601275 58081090 59098555 59908776 60616618 61271260 62132914 62507829 62978059
3348 62978059 63719635 64184905 65189039 65791131 66518301 67702511 69329612 71039177 72464441
3339 72464441 73925349 75706373 77496192 79569982 81757592 84179693 86919211 89578846
3331 89578846 92488323 95396346 97969035 100802595 103865963 107091853 109723478 112057625
3323 112057625 114436889 116553931 118371086 119989114 121913377 123654247 125220577 126626592
3315 126626592 127951321 129970782 131790731 133936766 136066545 138289240 140291688 142236560
3307 142236560 144387465 146573822 149150453 151972326 155030342 158535187 162460487 166720585
3299 166720585 170901825 175079173 179424948 183266629 186815065 189846006 192359585 194072672
$$ packed form
3357E7473477J27798M79815J017465Q10221P07842O54642Q61654L74915M70230
3348F2978059P41576M65270J004134O02092P27170J184210J627101J709565J425264
3339G2464441J460908J781024J789819K073790K187610K422101K739518K659635
3331H9578846K909477K908023K572689K833560L063368L225890K631625K334147
3323A12057625K379264K117042J817155J618028J924263J740870J566330J406015
3315A26626592J324729K019461J819949K146035K129779K222695K002448J944872
3307A42236560K150905K186357K576631K821873L058016L504845L925300M260098
3299A66720585M181240M177348M345775L841681L548436L030941K513579J713087
$$ plain form
3291 194072672 195651908 196884627 198037636 199512232 201013965 202884450 204626343 206333653
3283 206333653 207513243 208770365 209596657 209807994 209429693 208640146 207622561 205495456 203456322
3274 203456322 200962438 198159118 195347438 192417323 189467150 186403673 183331968 180725740
3266 180725740 178495177 176376516 174054606 171995029 170087887 168556094 167127105 165835120
3258 165835120 164318508 162800819 161170738 159393776 157729648 156174296 154895605 153391704
3250 153391704 152264087 151735001 151440991 151735543 152951488 155139898 158282533 162601769
3242 162601769 167225817 172351567 176710753 178355974 176724281 172861826 168442283 163055741
3234 163055741 156230946 148691633 140554581 132204501 124156400 116687473 110508455 105388259
$$ packed form
3291A94072672J579236J232719J153009J474596J501733J870485J741893J707310
3283B06333653J179590J257122Q26292K11337l78301p89547j017585k127105k039134
3274B03456322k493884k803320k811680k930115k950173l063477l071705k606228
3266A80725740k230563k118661k321910k059577j907142j531793j428989j291985
3258A65835120j516612j517689j630081j776962j664128j555352j278691j503901
3250A53391704j127617n29086k94010K94552J215945K188410L142635M319236
3242A62601769M624048N125750M359186J645221j631693l862455m419543n386542
3234A63055741o824795p539313q137052q350080q048101p468927o179018n120196
$$ plain form
3226 105388259 101031066 97393167 94434101 92019048 90166587 88604275 87356799 86363009
3218 86363009 85598247 85142398 85027579 85093393 85560639 86587862 88658445 92009552 95942488
3209 95942488 100042767 101530185 97221465 89424969 82543610 77541948 73872212 70898601
3201 70898601 68402991 66639315 64598628 62907376 61487579 60116295 58601539 57245244
3193 57245244 55994982 54881488 53775922 53156518 52566805 52039696 51851102 51525020 51404774
3184 51404774 51357589 51879788 52313923 53266881 54907521 56669840 58801769 60926306 61830134
3175 61830134 60185209 57154417 54665194 52828280 51306844 50583671 50260530 49973603 49987311
3166 49987311 50447841 50976791 51698683 52187178 53236350 54526345 55792731 57202425 58857871
$$ packed form
3226A05388259m357193l637899k959066k415053j852461j562312j247476r93790
3218H6363009p64762m55849j14819O5814M67246J027223K070583L351107L932936
3209I5942488M100279J487418m308720p796496o881359n001662l669736k973611
3201G0898601k495610j763676k040687j691252j419797j371284j514756j356295
3193E7245244j250262j113494j105566o19404n89713n27109j88594l26082j20246
3184E1404774m7185N22199M34135R52958J640640J762319K131929K124537R03828
3175F1830134j644925l030792k489223j836914j521436p23173l23141k86927J3708
3166D9987311M60530N28950P21892M88495J049172J289995J266386J409694J655446
$$ plain form
3157 58857871 60937905 63250462 65814004 68623794 71900848 75652370 79792238 83769467
3149 83769467 88173368 92477239 96522811 100778416 105205079 109442962 113385518 117115085
3141 117115085 120394157 123066465 124885190 125896422 126082900 125568917 124144850 122525832
3133 122525832 120484996 118362323 116458470 114848942 113837508 113435782 113529701 114487762 116431009
3124 116431009 118767577 121911509 125213904 128075284 131395713 134400392 136818009 138979478
3116 138979478 140462027 140868984 140345413 138635576 135763108 131797803 126820180 121238297
3108 121238297 114906088 108628487 102133161 95730054 89958956 84433726 79332743 74729038
3100 74729038 70548619 66821570 62969531 59824687 56512930 53857639 51695340 49413381
$$ packed form
3157E8857871K080034K312557K563542K809790L277054L751522M139868L977229
3149H3769467M403901M303871M045572M255605M426663M237883L942556L729567
3141A17115085L279072K672308J818725J011232J86478n13983j424067j619018
3133A22525832k040836k122673j903853j609528j011434m01726R3919R58061J943247
3124A16431009K336568L143932L302395K861380L320429L004679K417617K161469
3116A38979478J482549M06957n23571j709837k872468l965305m977623n581883
3108A21238297o332209o277601o495326o403107n771098n525230n100983m603705
3100G4729038m180419l727049l852039l144844l311757k655291k162299k281959
$$ plain form
3092 49413381 47355458 45571448 43869482 42494082 41218020 40212524 39201348 38341851
3084 38341851 37427522 36534242 35515350 34582219 33938759 33060175 32297001 31611760 30685352
3075 30685352 29730348 28864471 28158362 27680857 27217718 26420313 26053957 25583308 25222814
3066 25222814 24873777 24391852 24183112 23853303 23436356 23107579 22791599 22614914 22428832
3057 22428832 22052421 21767824 21383273 20913641 20543848 20620837 20345021 19830156 19410826 19476563
3047 19476563 19431030 18939504 18289297 18279652 18096344 18055082 17931448 17726120 17387257 17210936
3037 17210936 17395902 17166674 17016678 16769351 16520834 16534217 16543937 16310510 16135590 16168656
3027 16168656 16027634 15870099 15828119 15845340 15816152 15697628 15828200 15591576 15499916 15604926
$$ packed form
3092D9413381k057923j784010j701966j375400j276062j005496j011176q59497
3084C8341851r14329q93280j018892r33131o43460q78584p63174o85241r26408
3075C0685352r55004q65877p06109m77505m63139p97405l66356m70649l60494
3066B5222814l49037m81925k08740l29809m16947l28777l15980j76685j86082
3057B2428832l76411k84597l84551m69632l69793P6989k75816n14865m19330O5737
3047A9476563m5533m91526o50207r645j83308m1262j23634k05328l38863j76321
3037A7210936J84966k29228j49996k47327k48517J3383R720k33427j74920L3066
3027A6168656j41022j57535m1980J7221k9188j18524J30572k36624r1660J05010
$$ plain form
3017 15604926 15394595 15410655 15522065 15580527 15098165 15020637 15178831 15421127 15282589 15380660
3007 15380660 15484258 15444223 15459989 15563879 15528959 15390170 15687106 15827264 15853123 15729093
2997 15729093 15806289 15971094 16211508 16528422 16489290 16583749 16571031 16814002 16894919 16955946
2987 16955946 17105360 17225517 17363493 17364570 17627189 17660692 17858979 17724061 17663650 18122106
2977 18122106 18343237 18726676 18725176 18966273 19058573 19058287 19500170 19637834 19952218 20594058
2967 20594058 21053991 21256335 21561665 22028788 22247501 22431979 22977914 23227084 23305010 23383782
2957 23383782 23995711 24318582 24748385 24834917 25062615 25623772 25845154 26135131 26769332 27556179
2947 27556179 27875999 28084903 28364909 28967209 29361084 30071788 30922520 31868170 32550889
$$ packed form
3017A5604926k10331J6060J11410N8462m82362p7528J58194K42296j38538R8071
3007A5380660J03598m0035J5766J03890l4920j38789K96936J40158K5859j24030
2997A5729093P7196J64805K40414L16914l9132R4459j2718K42971Q0917O1027
2987A6955946J49414J20157J37976J077K62619L3503J98287j34918o0411M58456
2977A8122106K21131L83439j500K41097R2300k86M41883J37664L14384O41840
2967B0594058M59933K02344L05330M67123K18713J84478N45935K49170P7926P8772
2957B3383782O11929L22871M29803Q6532K27698N61157K21382K89977O34201P86847
2947B7556179L19820K08904K80006O02300L93875P10704Q50732R45650O82719
$$ plain form
2938 32550889 33132279 33972161 34745660 35701373 36325022 36992077 37666259 38594154 39314727
2929 39314727 40152376 40754411 41822404 42390764 43125999 43983199 45000502 46166360 47066150
2920 47066150 47767988 48937980 49952991 50828700 51744677 52921049 54007260 55287996 56694449
2911 56694449 58095376 59730254 61201381 63033972 64978563 67169276 68793853 70827634
2903 70827634 73308505 75829410 78230747 81287331 84446009 87797594 90962400 93671892
2895 93671892 96375600 99351706 102490800 105780450 109325324 112584484 116028566 119526369
2887 119526369 123539652 127709447 132120893 137595889 143743994 151044168 159801577 169749090
2879 169749090 180870066 193725911 207993520 224052656 241996692 263747175 289923412
$$ packed form
2938C2550889N81390Q39882P73499R55713O23649O67055O74182R27895P20573
2929C9314727Q37649O02035J067993N68360P35235Q57200J017303J165858Q99790
2920D7066150P01838J169992J015011Q75709R15977J176372J086211J280736J406453
2911E6694449J400927J634878J471127J832591J944591K190713J624577K033781
2903G0827634K480871K520905K401337L056584L158678L351585L164806K709492
2895I3671892K703708K976106L139094L289650L544874L259160L444082L497803
2887A19526369M013283M169795M411446N474996O148105P300174Q757409R947513
2879A69749090J1120976J2855845J4267609J6059136J7944036K1750483K6176237
$$ plain form
2872 289923412 321138911 356816772 395118121 430661978 455702192 462245320 447222675
2865 447222675 417361230 383235122 352464531 327481068 308413796 294892421 286604757
2858 286604757 282929488 283732900 288481961 295876342 305047245 313822189 320918564 326597749
2850 326597749 332389977 341330469 355021505 374641509 400301745 430432427 461815213
2843 461815213 488116567 501160814 493942823 466786499 428164989 387712857 350699760
2836 350699760 318570393 290247520 265607644 244001198 224604051 207350493 191660196
2829 191660196 177322552 164585219 153393613 143631799 134865014 127323964 120863044 114875842
2821 114875842 109966092 105282387 101069042 97694762 94556784 91327172 88281853 85006937
$$ packed form
2872B89923412L1215499L5677861L8301349L5543857K5040214O543128j5022645
2865D47222675k9861445l4126108l0770591k4983463j9067272j3521375q287664
2858B86604757l675269Q03412M749061P394381R170903Q774944P096375N679185
2850C26597749N792228Q940492J3691036J9620004K5660236L0130682L1382786
2843D61815213K6301354J3044247p217991k7156324l8621510m0452132l7013097
2836C50699760l2129367k8322873k4639876k1606446j9397147j7253558j5690297
2829A91660196j4337644j2737333j1191606r761814q766785p541050o460920n987202
2821A14875842m909750m683705m213345l374280l137978l229612l045319l274916
$$ plain form
2813 85006937 81567128 78236160 74872373 71327735 68311315 65403816 62664335 60523008
2805 60523008 58367509 56236472 54354727 52760684 51270203 49626307 47778534 46171180
2797 46171180 44726701 43619573 42365264 40652501 38957884 37551020 36401161 35195776
2789 35195776 34130511 33065549 32436041 31556006 30696373 29799143 28878380 28144432 27756847
2780 27756847 27170911 26332217 25369995 25005027 24582253 23878096 23235155 22713387 22232374
2771 22232374 21838403 21392072 21110736 20758608 20282635 19930097 19506194 18784851 18258358
2762 18258358 17878612 17471759 17099998 16797774 16243244 15675599 15405802 15049482 14654534
2753 14654534 14550906 14187792 13919400 13509473 13100227 12943586 12569684 12266071 11859475
$$ packed form
2813H5006937l439809l330968l363787l544638l016420k907499k739481k141327
2805F0523008k155499k131037j881745j594043j490481j643896j847773j607354
2797D6171180j444479j107128j254309j712763j694617j406864j149859j205385
2789C5195776j065265j064962o29508q80035q59633q97230r20763p33948l87585
2780B7756847n85936q38694r62222l64968m22774p04157o42941n21768m81013
2771B2232374l93971m46331k81336l52128m75973l52538m23903p21343n26493
2762A8258358l79746m06853l71761l02224n54530n67645k69797l56320l94948
2753A4654534j03628l63114k68392m09927m09246j56641l73902l03613m06596
$$ plain form
2744 11859475 11643728 11661814 11609034 11319663 11220669 11093011 10840013 10884432 10864305 10347201
2734 10347201 10113877 9812524 9863267 9623878 9488151 9008913 8878254 8621631 8340726 8503015
2724 8503015 8186573 8059459 8128670 8161504 8076125 7818980 7648779 7716092 7704329 7463308
2714 7463308 7314063 7409999 7163392 6896354 6977184 7187035 7166116 7093506 6790657 6317305
2704 6317305 6174559 6304344 6418370 6374216 6364826 5929292 5713187 5827260 5785641 5810964
2694 5810964 5954150 5690494 5603942 5402463 5295603 5061243 5009011 5091062 5091068 5007299 5072869
2683 5072869 5025904 4860550 4844805 4637431 4414544 4530660 4452200 4201338 4049370 4174772
2673 4174772 4286784 4085016 3772944 3826704 3782151 3981919 3941386 3726012 3796456 3715657
$$ packed form
2744A1859475k15747J8086n2780k89371r8994j27658k52998M4419k0127n17104
2734A0347201k33324l01353N0743k39389j35727m79238j30659k56623k80905J62289
2724H503015l16442j27114O9211L2834q5379k57145j70201O7313j1763k41021
2714G463308j49245R5936k46607k67038Q0830K09851k0919p2610l02849m73352
2704F317305j42746J29785J14026m4154r390m35534k16105J14073m1619K5323
2694E810964J43186k63656q6552k01479j06860k34360n2232Q2051Oq3769O5570
2683E072869m6965j65354j5745k07374k22887J16116p8460k50862j51968J25402
2673D174772J12012k01768l12072N3760m4553J99768m0533k15374P0444q0799
$$ plain form
2663 3715657 3523641 3388427 3210016 3309273 3418350 3479158 3245180 2966287 3154970 3255110
2653 3255110 3359883 3000233 3143028 3082459 3073989 2898199 2817024 2722165 2701362 2706370 2672206
2642 2672206 2656352 2726879 2686694 2710205 2756940 2711383 2755224 2470102 2347559 2368594 2422709
2631 2422709 2395691 2358049 2491758 2440406 2371136 2506064 2428507 2118844 2191827 2266408 2468253
2620 2468253 2354420 2321836 2194919 1978216 2150246 2274603 2243610 2191497 2315302 2432707
2610 2432707 2333276 2570130 2427530 2284135 2153477 1885174 2063818 2277616 2193599 2030982
2600 2030982 2297421 2381648 2086266 2009814 2231480 2399906 2448482 2421734 2606174 2715703
2590 2715703 2387950 2517398 2804481 2990499 3202611 3155255 3267909 3506382 3498646 3334843
$$ packed form
2663C715657j92016j35214j78411R9257J09077O0808k33978k78893J88683J00140
2653C255110J04773l59650J42795o0569q470j75790q1175r4859k0803N008l4164
2642B672206j5854P0527m0185K3511M6735m5557M3841k85122j22543K1035N4115
2631B422709k7018l7642J33709n1352o9270J34928p7557l09663P2983P4581K01845
2620B468253j13833l2584j26917k16703J72030J24357l0993n2113J23805J17405
2610B432707r9431K36854j42600j43395j30658k68303J78644K13798q4017j62617
2600B030982K66439Q4227k95382p6452K21666J68426M8576k6748J84440J09529
2590B715703l27753J29448K87083J86018K12112m7356J12654K38473p736j63803
$$ plain form
2580 3334843 2998810 2740515 2608132 2587437 2516591 2439127 2520623 2408211 2223946 2192815
2570 2192815 2238277 2582274 2654840 2735066 2732662 2778411 2806343 2655963 2741913 2642425 3146048
2559 3146048 3316936 3166256 2979843 2737819 2793569 2820182 2583982 2222441 2467341 2199241
2549 2199241 1771721 1766922 1639921 1513677 1533086 1507996 1296179 1482641 1115491 935702
2539 935702 1189069 1179472 1153818 1347618 1105569 927330 900109 1002375 978966 996524 1052877
2528 1052877 908326 868509 940865 895864 994580 882139 702421 916484 997701 1012650 1000586
2517 1000586 839566 1044399 1071214 788886 642855 872503 819939 789969 704375 633044
2507 633044 569742 455229 313920 197436 307919 256730 322284 266944 663600 727570 680442
$$ packed form
2580C334843l36033k58295j32383k0695p0846p7464Q1496j12412j84265l1131
2570B192815M5462L43997P2566Q0226k404M5749K7932j50380Q5950r9488N03623
2559C146048J70888j50680j86413k42024N5750K6613k36200l61541K44900k68100
2549B199241m27520m799j27001j26244J9409k5090k11817J86462l67150j79789
2539I35702K53367r597k5654J93800k42049j78239k7221J02266k3409J7558N6353
2528A052877j44551l9817P2356m5001R8716j12441j79718K14063Q1217J4949j2064
2517A000586j61020K04833K6815k82328j46031K29648n2564k9970q5594p1331
2507F33044o3302j14513j41309j16484J10483n1189O5554n5340L96656O3970m7128
$$ plain form
2496 680442 432680 337320 396559 308172 433188 546641 516637 766227 609318 460423
2486 460423 410155 581975 617995 328165 324228 317638 288029 236521 99110 168692 117698
2475 117698 168319 194050 262960 315729 -9898 137646 531182 150463 -30981 344040
2465 344040 302094 302298 195489 400546 324495 -108943 117995 456892 336961 203596 227113
2454 227113 211114 146872 185442 215130 434798 412043 258434 288493 322197 251120 207598
2443 207598 311197 245651 -53675 -135017 -199278 -145699 3391 133489 85276 -121911 -214393
2432 -214393 7911 -129474 -134998 -42769 -30281 -20957 -163365 85584 101508 -58923 68698
2421 68698 312308 25869 -43972 8060 178276 394287 137982 229908 82789 -163297
$$ packed form
2496F80442k47762r5360N9239q8387J25016J13453l0004K49590j56909j48895
2486D60423n0268J71820L6020k89830l937o590k9609n1508j37411O9582n0994
2475A17698N0621K5731O8910N2769l25627J47544L93536l80719j81444L75021
2465C44040m1946K04j06809K05057p6051m33438K26938L38897j19931j33365K3517
2454B27113j5999o4242L8570K9688K19668k2755j53609L0059L3704p1077m3522
2443B07598J03599o5546k99326q1342o4261N3579J49090J30098m8213k07187r2482
2432b14393K22304j37385n524R2229J2488R324j42408K48949J5924j60431J27621
2421F8698K43610k86439o9841N2032J70216K16011k56305R1926j47119k46086
$$ plain form
2411 -163297 -103204 -153957 42629 176899 26034 15888 142994 182361 230843 178275 -8327
2400 -8327 223750 368876 272923 276446 201575 -6199 28004 78941 75151 68802 160825 276962
2388 276962 380997 504749 581484 329211 216203 19977 56880 182135 159244 122434
2378 122434 -29621 234121 77230 158245 165002 33334 225535 271467 471236 731149
2368 731149 795718 449478 338349 283492 346882 343964 271689 279186 205484 147188 -81145
2357 -81145 -61771 -35125 23961 -105508 -40235 -90672 -108268 -108685 -46038 140963 386868 26651
2345 26651 76087 207236 41474 284082 279441 183635 183117 39408 190737 252628 132059
2334 132059 89217 13096 115643 243247 327691 264279 288313 268927 22343 119880 71803
$$ packed form
2411a63297O0093n0753J96586J34270j50865j0146J27106L9367M8482n2568j86602
2400h327K32077J45126r5953L523p4871k07774L4203N0937l790o349R2023J16137
2388B76962J04035J23752P6735k52273j13008j96226L6903J25255k2891l6810
2378A22434j52055K63742j56891Q1015O757j31668J92201M5932J99769K59913
2368G31149O4569l46240j11129n4857O3390k918p2275P497p3702n8296k28333
2357h1145J9374K6646N9086j29469O5273n0437j7596m17O2647J87001K45905l60217
2345B6651M9436J31149j65762K42608m641r5806n18j43709J51329O1891j20569
2334A32059m2842p6121J02547J27604Q4444o3412K4034j9386k46584R7537m8077
$$ plain form
2323 71803 334341 382016 281385 254765 419518 344429 290498 206094 -125707 143057 370033
2312 370033 320552 244194 266719 376556 301548 379600 342106 287843 293263 207605 204211 566792
2300 566792 705246 610628 362269 337046 183802 20381 6628 170041 112889 209896 165703
2289 165703 2117 -81382 132938 261328 -16161 45541 146156 168620 61207 209303
2279 209303 192781 342572 324473 313081 219365 459289 307177 230420 412259 245653 274342
2268 274342 623815 465639 155376 170766 465428 358664 463525 215647 313955 349982
2258 349982 105488 -100272 100305 -70728 3534 256791 288909 258053 419054 585363
2248 585363 562535 379143 496128 541172 302201 131587 256718 439504 403652 93691
$$ packed form
2323G1803K62538M7675j00631k6620J64753p5089n3931q4404l31801K68764K26976
2312C70033m9481p6358K2525J09837p5008P8052l7494n4263N420q5658l394L62581
2300E66792J38454r4618k48359k5223j53244j63421j3753J63413n7152R7007m4193
2289A65703j63586q3499K14320J28390k77489O1702J00615K2464j07413J48096
2279B09303j6522J49791j8099j1392r3716K39924j52112p6757J81839j66606K8689
2268B74342L49473j58176l10263J5390K94662j06764J04861k47878R8308L6027
2258C49982k44494k05760K00577j71033P4262K53257L2118l0856J61001J66309
2248E85363k2828j83392J16985M5044k38971j70614J25131J82786l5852l09961
$$ plain form
2238 93691 165210 442713 532608 287924 353590 509771 768234 767434 690605 460282 264138
2227 264138 358005 474340 466059 538731 263538 317357 627394 621066 510397 589287 727070
2216 727070 427743 510969 494022 603936 812164 830410 585396 716275 676562 637913 682367
2205 682367 817364 769725 717165 827051 1017576 888397 1014834 1049511 1326918 1196377
2195 1196377 1043437 1078175 1237064 1225931 1586326 1383216 1091865 1182220 1280349 1178357
2185 1178357 1262319 1371350 1517599 1670088 1619817 1441276 1340190 1295500 1292544 1455508
2175 1455508 1773557 2196460 1985084 1817247 1841158 1865973 1945086 1921236 1762486 2011251
2165 2011251 2390342 2576771 2283606 1982804 2311495 2476591 2580094 2716096 2939583 2870085
$$ packed form
2238I3691P1519K77503Q9895k44684O5666J56181K58463q00p6829k30323j96144
2227B64138R3867J16335q281P2672k75193N3819L10037o328j10669P8890J37783
2216G27070k99327Q3226j6947J09914K08228J8246k45014J30879l9713l8649M4454
2205F82367J34997m7639n2560J09886J90525j29179J26437L4677K77407j30541
2195A196377j52940L4738J58889j1133L60395k03110k91351R0355R8129j01992
2185A178357Q3962J09031J46249J52489n0271j78541j01086m4690k956J62964
2175A455508L18049M22903k11376j67837K3911K4815P9113k3850j58750K48765
2165B011251L79091J86429k93165l00802L28691J65096J03503J36002K23487o9498
$$ plain form
2155 2870085 2697445 2908453 2997902 3133326 3287274 3452158 3604798 3693203 3807077 4097348
2145 4097348 4362500 4522202 4664124 4631593 4914494 4941326 5411591 5740252 5831335 5854161
2135 5854161 6039807 6262096 6624535 6820192 6881478 7216479 7738332 8154665 8410703 8717866
2125 8717866 9309862 9611533 9767521 10330940 11161992 12128382 13046768 13808890 14942951
2116 14942951 16325206 17524565 18052031 18814261 20248702 22203818 24400973 27145335
2108 27145335 29890400 33664205 38361608 45091532 54582558 67871458 87484615 113572323
2100 113572323 122207202 102661750 77271312 57209496 45116667 36174817 29203306
2093 29203306 23662611 19687073 16796776 14754193 13738496 13450718 12686967 12041679 11396600
$$ packed form
2155B870085j72640K11008Q9449J35424J53948J64884J52640Q8405J13874K90271
2145D097348K65152J59702J41922l2531K82901K6832M70265L28661R1083K2826
2135E854161J85646K22289L62439J95657O1286L35001N21853M16333K56038L07163
2125H717866N91996L01671J55988N63419Q31052R66390R18386P62122J134061
2116A4942951J382255J199359N27466P62230J434441J955116K197155K744362
2108B7145335K745065L773805M697403O729924R491026J3288900J9613157K6087708
2100A13572323Q634879j9545452k5390438k0061816j2092829q941850o971511
2093B9203306n540695l975538k890297k042583j015697k87778p63751o45288o45079
$$ plain form
2084 11396600 10172742 8862535 7967869 7373465 6904311 6615569 6472589 5741437 5518014
2075 5518014 5189989 5096793 4867988 4325870 3915186 3859930 3814588 3830529 3357328 3231144
2065 3231144 2933123 3121845 3106153 2988923 2902080 2746200 2683335 2803343 2662546 2485826
2055 2485826 2519502 2283103 2188509 2090852 1914855 1840359 1817455 1519918 1703308 1465660
2045 1465660 1500421 1541075 1309728 1361279 1550794 1442151 1207476 1279657 1415063 1199902
2035 1199902 1229062 1334594 1451085 1347105 1274342 999846 873017 859886 1151252 939763
2025 939763 703342 790422 992073 866161 696145 829501 795729 673361 631366 650777
2015 650777 878628 650496 580692 454010 346463 449944 334259 536479 567968 482472
$$ packed form
2084A1396600j223858j310207q94666n94404m69154k88742j42980p31152k23423
2075E518014l28025r3196k28805n42118m10684n5256m5342J5941m73201j26184
2065C231144k98021J88722j5692j17230q6843j55880o2865J20008j40797j76720
2055B485826L3676k36399r4594r7657j75997p4496k2904k97537J83390k37648
2045A465660L4761M0654k31347N1551J89515j08643k34675P2181J35406k15161
2035A199902K9160J05532J16491j03980p2763k74496j26829j3131K91366k11489
2025I39763k36421Q7080K01651j25912j70016J33356l3772j22368m1995J9411
2015F50777K27851k28132o9804j26682j07547J03481j15685K02220L1489q5496
$$ plain form
2005 482472 609431 608249 464552 455547 562271 417272 428019 432704 528582 456920 580626
1994 580626 691676 674714 415244 468104 425299 539804 506057 311369 351164 303317 182519
1983 182519 144731 555963 360466 -125956 -113585 150874 21113 -15966 193985 377382
1973 377382 233489 35794 167504 -112802 681 86881 214884 254149 107870 204435
1963 204435 1291 -181970 46528 -220775 -334040 -120308 -244683 -354292 -214925 -14397
1953 -14397 -71363 33862 281205 183376 174493 211324 178895 309419 230283 55837 -466872
1942 -466872 -481238 -166195 -53844 -25019 69241 87178 27684 168803 315524 223853 20486
1931 20486 89288 70871 167037 63557 148365 -21438 -118924 -81620 -76723 -81690 -123258 28588
$$ packed form
2005D82472J26959j182j43697r005J06724j44999J0747M685R5878p1662J23706
1994E80626J11050j6962k59470N2860m2805J14505l3747j94688L9795m7847j20798
1983A82519l7788M11232j95497m86422J2371K64459j29761l7079K09951J83397
1973C77382j43893j97695J31710k80306J13483Q6200J28003L9265j46279R6565
1963B04435k03144j83261K28498k67303j13265K13732j24375j09609J39367K00528
1953a4397n6966J05225K47343r7829q883L6831l2429J30524p9136j74446n22709
1942d66872j4366L15043J12351K8825R4260J7937n9494J41119J46721r1671k03367
1931B0486O8802j8417R6166j03480Q4808j69803r7486L7304M897m967m1568J51846
$$ plain form
1919 28588 -49245 -67059 -90722 -217532 -103648 -21124 -36706 -26521 -206567 -99210 -137022
1908 -137022 -234784 -34762 190614 -22167 12836 -91117 14204 -113965 -158695 -126829
1898 -126829 49250 -111120 -108690 -18477 15522 -122556 -276250 -301105 -282018 -262318 -274036
1887 -274036 -149820 -46105 -372121 -253065 -100914 -85252 -35111 -10010 -169358 -205770
1877 -205770 -65178 -110108 -112640 -164248 -11553 139675 163849 52063 228360 119894 -216049
1866 -216049 -215097 -240691 -74805 18339 -97182 -7489 -41032 -140979 -95291 30911 89049
1855 89049 40357 -33140 -8215 17157 48132 -268859 -225544 -185365 -52645 83308 67864
1844 67864 -75247 -307864 -316463 -130013 115397 -43029 -72650 -23718 32813 238291 116625
$$ packed form
1919B8588p7833j7814k3663j26810J13884Q2524j5582J0185j80046J07357l7812
1908a37022r7762K00022K25376k12781L5003j03953J05321j28169m4730L1866
1898a26829J76079j60370K430R0213L3999j38078j53694k4855J9087J9700j1718
1887b74036J24216J03715l26016J19056J52151J5662N0141K5101j59348l6412
1877b05770J40592m4930k532n1608J52695J51228K4174j11786J76297j08466l35943
1866b16049R52k5594J65886R3144j15521Q9693l3543r9947M5688J26202N8138
1855H9049m8692p3497K4925K5372L0975l16991M3315M0179J32720J35953j5444
1844F7864j43111k32617q599J86450K45410j58426k9621M8932N6531K05478j21666
$$ plain form
1833 116625 136453 303643 752576 547626 393811 355155 68771 -206933 -231134 -262822
1823 -262822 -117190 -39800 -32127 154835 382688 439974 82 -141303 -312580 -278007 -504186
1812 -504186 -487287 -124440 -136671 -212204 -187377 -283447 -339979 -193946 -177152 -245609 -262415
1801 -262415 -337211 -347504 -249133 -403366 -544888 -348553 -51105 -163566 -345361 -268545
1791 -268545 -422723 -296908 -386252 -354237 -457461 -301554 -217667 -241399 -241608 -309297 -106978
1780 -106978 -168529 -266723 -186895 -110237 -427133 -311232 -82719 -51580 -154375 -342378 -252847
1769 -252847 -181842 -40484 -30315 -210006 -70548 -107354 -122919 -75048 -164888 71002 -76546
1758 -76546 -249155 -75921 -444337 -218526 -162568 -212620 -146990 -283819 -602152 -725408
$$ packed form
1833A16625J9828J67190M48933k04950j53815l8656k86384k75704k4201l1688
1823b62822J45632P7390P673J86962K27853N7286m39892j41385j71277L4573k26179
1812e04186J6899L62847j2231p5533K4827r6070n6532J46033J6794o8457j6806
1801b62415p4796j0293R8371j54233j41522J96335K97448j12461j81795P6816
1791b68545j54178J25815q9344L2015j03224J55907Q3887k3732k09o7689K02319
1780a06978o1551r8194P9828P6658l16896J15901K28513L1139j02795j88003Q9531
1769b52847P1005J41358J0169j79691J39458l6806j5565M7871q9840K35890j47548
1758g6546j72609J73234l68416K25811N5958n0052O5630j36829l18333j23256
$$ plain form
1748 -725408 -342407 -214179 -507984 -218412 -144329 60821 150094 -403924 -288608 -277483
1738 -277483 -426773 -349429 -210832 -218386 -64695 7342 -198694 -347742 -245924 -408112
1728 -408112 -402068 -421986 -509645 -452639 -590064 -109681 165299 119440 -210333 -161368 -190590
1717 -190590 -406601 -316003 -230125 -183608 -155339 -304501 -409320 -162171 -148636 -152640 -130198
1706 -130198 -48268 -258959 -493816 -205154 -2860 -86899 -199098 -181903 -495946 -503565 -169708
1695 -169708 -278722 60448 145027 -14608 -296336 -333883 -374184 -216335 -244300 -612468
1685 -612468 -496471 -168136 -296353 -334704 -196026 -130028 -101277 -153649 -92190 -149601 36198
1674 36198 114448 -46466 -45131 -68807 -145519 -11304 -190998 -271277 -216590 -32161 4958
$$ packed form
1748g25408L83001J28228k93805K89572P4083K05150Q9273n54018J15316J1125
1738b77483j49290P7344J38597p554J53691P2037k06036j49048J01818j62188
1728d08112O044j9918q7659N7006j37425M80383K74980m5859l29773M8965k9222
1717a90590k16011R0598Q5878M6517K8269j49162j04819K47149J3535m004K2442
1706a30198Q1930k10691k34857K88662K02294q4039j12199J7195l14043p619L33857
1695a69708j09014L39170Q4579j59635k81728l7547m0301J57849k7965l68168
1685f12468J15997L28335j28217l8351J38678O5998K8751n2372O1459n7411J85799
1674C6198P8250j60914J335k3676p6712J34215j79694q0279N4687J84429L7119
$$ plain form
1663 4958 -51056 -48950 -236897 -30995 -263418 -206971 58359 93931 -25775 -69251 -21600
1652 -21600 -1261 -289752 -221611 16399 -83005 -268581 -567209 -325606 -119870 -102549 -192596
1641 -192596 -272376 -323420 -413977 -602401 -233231 -298481 -423055 -253311 -298301 -466857 -355340
1630 -355340 -170953 -207072 -193458 -263893 -528316 -575459 -407190 -286325 -255244 -210144 -92451
1619 -92451 -208000 17384 -206836 -240115 -77247 -97198 50985 132760 -67180 -154908 -184459
1608 -184459 -199973 -101754 -62082 -273946 -183565 16480 108979 -70659 74228 -64405 -63097
1597 -63097 -106113 -265266 -94272 111036 133916 107353 24470 -352740 -442208 -323675 -213091
1586 -213091 -342901 -164854 -168058 -190954 -47927 -69119 69856 -134593 -132837 -121504 -447689
$$ packed form
1663D958n6014K106j87947K05902k32423N6447K65330L5572j19706m3476M7651
1652b1600K0339k88491O8141K38010r9404j85576k98628K41603K05736J7321r0047
1641a92596p9780n1044r0557j88424L69170o5250j24574J69744m4990j68556J11517
1630c55340J84387l6119J3614p0435k64423m7143J68269J20865L1081M5100J17693
1619i2451j15549K25384k24220l3279J62868j9951J48183Q1775j99940q7728k9551
1608a84459j5514R8219L9672k11864R0381K00045R2499j79638J44887j38633J308
1597f3097m3016j59153J70994K05308K2880k6563q2883l77210q9468J18533J10584
1586b13091j29810J78047l204k2896J43027k1192J38975k04449J756J1333l26185
$$ plain form
1575 -447689 -205436 -147916 -353825 -342700 -227093 -116477 117000 -157374 26109 68663
1565 68663 58412 252971 287762 102769 -367946 -439658 54279 -87957 -416880 -134143
1555 -134143 83523 -40541 -58247 75212 314728 175705 114776 69952 135 -167340
1545 -167340 -28163 -23017 -222618 -293767 -39969 -119395 -136408 -210512 -204260 -230345 -207269
1534 -207269 -436985 -378293 -177673 -284302 -370036 -277209 -96310 -44845 -8408 -122833 -218094
1523 -218094 -137731 -129102 -180189 -110897 -411937 -201546 -403507 -316428 -84282 -125768 -231871
1512 -231871 22581 -60661 -79148 -40026 -51206 -42168 227763 35961 -50109 100997 166241
1501 166241 18124 -95419 -309098 -332100 -233229 -96588 -172222 -134103 -295068 -337036 -220281
$$ packed form
1575d47689K42253N7520k05909J1125J15607J10616K33477k74374J83483M2554
1565F8663j0251J94559L4791j84993m70715p1712M93937j42236l28923K82737
1555a34143K17666j24064j7706J33459K39516j39023o0929m4824o9817j67475
1545a67340J39177N146j99601p1149K53798p9426j7013p4104O252k6085K3076
1534b07269k29716N8692K00620j06629q5734R2827J80899N1465L6437j14425r5261
1523b18094Q0363Q629n1087O9292l01040K10391k01961Q7079K32146m1486j06103
1512b31871K54452q3242j8487L9122j1180R038K69931j91802q6070J51106O5244
1501A66241j48117j13543k13679k3002R8871J36641p5634L8119j60965m1968J16755
$$ plain form
1490 -220281 -88037 50443 -156607 -175995 -260980 -364311 -109457 -66242 -254131 -157989
1480 -157989 -382864 -316248 -222129 5632 -190870 -391256 -28636 -9061 224189 92095
1470 92095 106655 -156820 -85645 -219824 -249149 101840 7957 -132221 -56649 26601 83663
1459 83663 46669 -250259 8210 -153615 -140969 41784 298463 236973 241208 88780 115082
1448 115082 213186 68562 -130116 67531 -107573 -288051 -50202 -83661 -8187 136278
1438 136278 25520 -120346 -394320 -256413 -112562 -237068 -107672 42712 -11532 -83537
1428 -83537 41915 65947 -222065 -140512 -177489 -73600 -199675 -127701 -87920 -169087 271187
1417 271187 463259 50332 218621 245457 -252287 -129428 -24553 -68642 -328266 -574690
$$ packed form
1490b20281J32244J38480k07050j9388q4985j03331K54854M3215j87889R6142
1480a57989k24875O6616R4119K27761j96502k00386L62620J9575K33250j32094
1470I2095J4560k63475P1175j34179k9325L50989r3883j40178P5572Q3250N7062
1459H3663l6994k96928K58469j61825J2646J82753K56679o1490M235j52428K6302
1448A15082R8104j44624j98678J97647j75104j80478K37849l3459P5474J44465
1438A36278j10758j45866k73974J37907J43851j24506J29396J50384n4244p2005
1428h3537J25452K4032k88012Q1553l6977J03889j26075P1974L9781q1167M40274
1417B71187J92072m12927J68289K6836m97744J22859J04875m4089k59624k46424
$$ plain form
1407 -574690 -345764 -86995 274006 283032 197653 147895 90716 139232 -12375 -42240 -27377
1396 -27377 -7027 -86255 -238469 -291071 -227356 -46070 60312 58675 153915 82614 83304 -143400
1384 -143400 -93605 -261244 -148443 -191854 -159974 -148608 -50486 -212901 -116297 182187 130676
1373 130676 104060 -92299 -28772 -199763 -246928 -261030 -484268 -395110 -478743 -335787 -463923
1362 -463923 -517242 -147259 -147189 -86788 94572 194260 427925 253720 325911 122993 14689
1351 14689 177520 68788 -181860 -223558 -182552 -143377 -166898 -257497 -169458 32753 176095
1340 176095 17261 81233 176310 80889 -104337 51907 174843 -14689 -124942 60756
1330 60756 336046 184435 319742 356703 51054 181196 204437 -135114 -171963 -139863 -271852
$$ packed form
1407e74690K28926K58769L61001R026q5379m9758n7179M8516j51607k9865J4863
1396b7377K0350p9228j52214n2602O3715J81286J06382j637R5240p1301O90k26704
1384a43400M9795j67639J12801m3411L1880J1366R8122j62415R6604K98484n1511
1373A30676k6616j96359O3527j70991m7165j4102k23238Q9158q3633J42956j28136
1362d63923n3319L69983P0O0401J81360R9688K33665j74205P2191k02918j08304
1351A4689J62831j08732k50648m1698M1006L9175k3521r0599Q8039K02211J43342
1340A76095j58834O3972R5077r5421j85226J56244J22936j89532j10253J85698
1330F0756K75290j51611J35307L6961l05649J30142K3241l39551l6849L2100j31989
$$ plain form
1319 -271852 -182869 -82213 -40719 -126540 184469 270614 290311 283648 179398 -20749 275614
1308 275614 326219 -169287 -148630 -34701 127144 185762 -16139 -60579 5637 38471 -3113
1297 -3113 33805 60946 -8642 24866 -49251 -165700 -49679 -185145 -29557 -112432 21741
1286 21741 296062 22889 40434 73396 122716 46441 -119321 68931 -123759 -244192 -236718
1275 -236718 190876 259581 200884 -130442 -258242 -171328 -200980 -49184 -27974 -91184 355
1264 355 -21294 247868 151061 -83232 122612 227873 73944 -101562 12319 -128151 -76434
1253 -76434 138962 198337 180328 28569 -127462 -146552 -205080 -15718 -169698 -49548 95135
1242 95135 253614 103883 71118 -50641 -40048 -187025 -134707 -53322 -115018 -140235 -108726
$$ packed form
1319b71852Q8983J00656M1494q5821L11009Q6145J9697o663j04250k00147K96363
1308B75614N0605m95506K0657J13929J61845N8618k01901m4440O6216L2834m1584
1297c113L6918K7141o9588L3508p4117j16449J16021j35466J55588q2875J34173
1286B1741K74321k73173J7545L2962M9320p6275j65762J88252j92690j20433P474
1275b36718M27594O8705n8697l31326j27800Q6914k9652J51796K1210o3210R1539
1264C55k1649K69162r6807k34293K05844J05261j53929j75506J13881j40470N1717
1253g6434K15396N9375j8009j51759j56031j9090n8528J89362j53980J20150J44683
1242I5135J58479j49731l2765j21759J0593j46977N2318Q1385o1696k5217L1509
$$ plain form
1231 -108726 27583 -121332 -3303 342058 229386 -115738 -311641 -381117 -7324 9513
1221 9513 -107402 19002 63021 -110453 -206526 -230411 -28961 39887 -221601 -301042 -147974
1210 -147974 89741 258016 59834 -75754 -4318 -104613 -56962 20233 -9788 -1131 165445
1199 165445 117853 -40733 -165826 -42972 187051 282298 385675 279164 165011 191085
1189 191085 -57578 -325458 -141436 -46757 -125702 184543 187817 87063 -29518 -121369 -72473
1178 -72473 -58702 55140 4178 -96696 47351 176998 408864 562939 234390 142964
1168 142964 339964 -86340 63919 104262 -83759 55390 -121603 15354 200044 189064
1158 189064 73023 -330177 -42937 -64222 -261189 -86472 20134 -86589 -264355 -48195
$$ packed form
1231a08726J36309j48915J18029L45361j12672l45124j95903o9476L73793J6837
1221I513j16915J26404M4019j73474r6073k3885K01450O8848k61488p9441J53068
1210a47974K37715J68275j98182j35588P1436j00295M7651P7195l0021Q657J66576
1199A65445m7592j58586j25093J22854K30023R5247J03377j06511j14153K6074
1189A91085k48663k67880J84022R4679p8945L10245L274j00754j16581r1851M8896
1178g2473J3771J13842n0962j00874J44047J29647K31866J54075l28549r1426
1168A42964J97000m26304J50259M0343j88021J39149j76993J36957J84690j0980
1158A89064j16041m03200K87240k1285j96967J74717J06606j06723j77766K16160
$$ plain form
1148 -48195 84527 74961 1534 217017 -76399 -90159 59747 52421 -81565 -60268 -68261
1137 -68261 8093 243081 54530 -8917 -30125 -21950 -120292 -167496 -4115 -86841 67753
1126 67753 186338 203142 53289 -123951 -48395 -45795 -93533 -133702 -353013 -296591 27079
1115 27079 -26781 11588 130179 -171299 -215481 82319 146738 14938 173714 287336 41939
1104 41939 -76006 -148635 -201944 -86377 -92950 20393 -199922 -367263 -478548 -250345 17637
1093 17637 -82654 -58266 102591 89724 -124938 -188573 237863 427727 238085 116028
1083 116028 49201 19174 54471 214378 23312 -32137 92490 -42757 -23417 30870 -184168
1072 -184168 -36958 92342 333312 98597 -221240 -213001 -79299 -41944 -77059 -84496 92694
$$ packed form
1148d8195J32722r566p3427K15483k93416j3760J49906p326j33986K1297p993
1137f8261P6354K34988j88551o3447k1208Q175r8342m7204J63381q2726J54594
1126F7753J18585J6804j49853j77240P5556K600m7738m0169k19311N6422L23670
1115B7079n3860L8369J18591l01478m4182K97800O4419j31800J58776J13622k45397
1104D1939j17945p2629n3309J15567o573J13343k20315j67341j11285K28203K67982
1093A7637j00291K4388J60857j2867k14662o3635M26436J89864j89642j22057
1083A16028o6827l0027L5297J59907j91066n5449J24627j35247J9340N4287k15038
1072a84168J47210J29300K40970k34715l19837Q239J33702L7355l5115p437J77190
$$ plain form
1061 92694 -4839 -118241 71458 -153402 -77755 168238 121860 81702 277506 322010 88224
1050 88224 -40991 -259135 -287281 126564 158745 14737 124360 166596 -46681 -22626 -159654
1039 -159654 -373685 -445514 -166847 -112416 -97255 -201290 -369753 31434 218698 223905 121964
1028 121964 231187 -62081 -219364 -163420 80735 300436 21044 151483 325235 51316
1018 51316 97063 38461 165524 35913 -47445 6005 -123438 27586 80252 113357 261518
1007 261518 176146 53931 -83104 -19983 -67568 -150987 -137300 -27734 121433 -261960 -280190
996 -280190 -134361 71356 -62859 -135224 18238 -88403 -296008 -81665 -77975 -203185
986 -203185 -154020 24296 -132753 -298007 -410134 -242637 -104415 -300985 -70833 -24764
$$ packed form
1061I2694r7533j13402J89699k24860P5647K45993m6378m0158J95804M4504k33786
1050H8224j29215k18144k8146M13845L2181j44008J09623M2236k13277K4055j37028
1039a59654k14031p1829K78667N4431J5161j04035j68463M01187J87264N207j01941
1028A21964J09223k93268j57283N5944K44155K19701k79392J30439J73752k73919
1018E1316M5747n8602J27063j29611q3358N3450j29443J51024N2666L3105J48161
1007B61518q5372j22215j37035O3121m7585q3419J3687J09566J49167l83393j8230
996b80190J45829K05717j34215p2365J53462j06641k07605K14343L690j25210
986b03185M9165J78316j57049j65254j12127J67497J38222j96570K30152M6069
$$ plain form
976 -24764 -85915 -33521 -8839 96642 206502 -34862 -7427 -164288 -127408 -78065 85590
965 85590 278982 19000 20040 311957 65088 19018 1249 228141 339749 106753 132909
954 132909 260648 346925 95539 -17084 31806 -64073 212138 442892 201416 94388
944 94388 -74337 10446 21371 24322 102340 7755 -48331 14501 103009 234620 87107 103572
932 103572 -115410 46949 135976 145093 -40724 -82891 137750 351893 223106 28526 -135052
921 -135052 -45857 88066 237843 100959 -181460 -218804 72755 173846 292288 -5358
911 -5358 -66961 137017 207574 243272 -11524 222403 293100 543706 78968 -24064 58324
900 58324 286871 128936 193634 239131 291136 107602 -74998 -53591 -254668 -232652 -52993
$$ packed form
976b4764o1151N2394K4682J05481J09860k41364K7435j56861L6880M9343J63655
965H5590J93392k59982J040K91917k46869m6070j7769K26892J11608k32996K6156
954A32909J27739Q6277k51386j12623M8890r5879K76211K30754k41476j07028
944I4388j68725Q4783J0925K951P8018r4585n6086O2832Q8508J31611j47513J6465
932A03572k18982J62359Q9027R117j85817m2167K20641K14143j28787j94580j63578
921a35052Q9195J33923J49777j36884k82419l7344K91559J01091J18442k97646
911e358o1603K03978P0557L5698k54796K33927P0697K50606m64738j03032Q2388
900E8324K28547j57935O4698M5497N2005j83534j82600K1407k01077K2016J79659
$$ plain form
889 -52993 -87361 -6118 13705 -37128 135723 216952 57223 46389 -167324 -126600 70612
878 70612 101553 424051 145566 77897 164636 50631 70604 309124 284135 98036 401290
867 401290 129866 237828 344986 199000 176187 165279 165572 160318 4347 -182878 -85877
856 -85877 74632 22019 -11585 14687 -78499 -70716 -133594 32223 116952 181819 -25683 130590
844 130590 191168 153525 -21801 -34334 -93308 24761 105989 188057 344197 194934 118796
833 118796 -212627 -215522 -98498 32018 -38997 -202252 3027 -48231 -210981 45633 73660
822 73660 5589 49201 -197794 -43104 -229726 -314728 -321354 -554191 -269011 -58859 -53238
811 -53238 -98401 -315495 -323861 -305505 -107209 -34142 69841 129259 56668 -142337 -235021
$$ packed form
889e2993l4368Q1243J9823n0833J72851Q1229j59729j0834k13713M0724J97212
878G0612L0941L22498k78485o7669Q6739j14005J9973K38520k4989j86099L03254
867D01290k71424J07962J07158j45986k2813j0908K93n254j55971j87225R7001
856h5877J60509n2613l3604K6272r3186P783o2878J65817Q4729O4867k07502J56273
844A30590O0578l7643j75326j2533n8974J18069Q1228Q2068J56140j49263p6138
833A18796l31423k895J17024J30516p1015j63255K05279n1258j62750K56614K8027
822G3660o8071M3612k46995J54690j86622q5002o626k32837K85180K10152N621
811e3238m5163k17094q366J8356J98296P3067J03983N9418p2591j99005r2684
$$ plain form
800 -235021 -209977 -277921 -188888 77568 124246 146591 -23364 -235530 -244993 90354 277970
789 277970 34134 49729 210422 344010 60048 -292372 -25642 -180017 -98278 9694
779 9694 -318849 -123242 -137940 -147610 -99044 -26516 75725 -71137 -91218 55599 91353
768 91353 216282 267576 228454 232355 286504 33980 -31212 37963 -215974 -295789 28821
757 28821 108054 5508 -26429 49600 265869 197022 140600 -11367 -63001 36104 6727
746 6727 5056 112745 258430 91045 160228 75070 -105653 -51313 35367 181274 143092
735 143092 -102282 115730 115179 179651 29539 151948 96061 -123114 191774 333301 213237
724 213237 161070 262800 341147 306509 116618 208246 142171 67680 -81970 56660 173990
$$ packed form
800b35021K5044o7944Q9033K66456M6678K2345j69955k12166r463L35347J87616
789B77970k43836J5595J60693J33588k83962l52420K66730j54375Q1739J07972
779I694l28543J95607j4698r670M8566P2528J02241j46862k0081J46817L5754
768I1353J24929N1294l9122L901N4149k52524o5192O9175k53937p9815L24610
757B8821P9233j02546l1937P6029K16269o8847n6422j51967n1634R9105k9377
746F727j671J07689J45685j67385O9183q5158j80723N4340Q6680J45907l8182
735A43092k45374K18012n51O4472j50112J22409n5887k19175L14888J41527j20064
724B13237n2167J01730P8347l4638j89891R1628o6075p4491j49650J38630J17330
$$ plain form
713 173990 424736 213470 -138111 142134 200545 126758 -38616 46161 71735 135409 332551
702 332551 282157 71498 214855 168056 264648 287175 215016 139041 10064 -38706 304129
691 304129 118616 -180199 -101001 -52157 -94161 -15667 -181704 185632 251720 150185 30010
680 30010 60208 272697 257990 233704 -38299 115362 135283 50068 -77156 134668 66724
669 66724 -103266 -124021 27328 -122962 -7109 -70738 -52579 -53480 69551 203993 98243
658 98243 223097 232822 47738 -201554 -123502 92914 -4924 184970 147262 52727 130252
647 130252 122492 210490 185912 -75104 -367098 -168026 240496 37110 -46301 -20287 90621
636 90621 192210 187064 273136 351600 4956 -196975 -204843 -219348 -93125 -166848 -112054 -28259
$$ packed form
713A73990K50746k11266l51581K80245N8411p3787j65374Q4777K5574O3674J97142
702C32551n0394k10659J43357m6799R6592K2527p2159p5975j28977m8770L42835
691C04129j85513k98815P9198M8844m2004P8494j66037L67336O6088j01535j20175
680C0010L0198K12489j4707k4286k72003J53661J9921q5215j27224K11824o7944
669F6724j69990k0755J51349j50290J15853o3629J8159r01J23031J34442j05750
658I8243J24854R725j85084k49292P8052K16416r7838J89894l7708r4535P7525
647A30252p760Q7998k4578k61016k91994J99072M08522k03386q3411K6014J10908
636I0621J01589n146Q6072P8464l46644k01931p868j4505J26223p3723N4794Q3795
$$ plain form
624 -28259 -90386 119144 131979 -154234 -26994 292881 141127 -43554 -142458 -56376 -56226
613 -56226 -170679 -110863 68552 94990 -32929 70284 250979 91709 16669 -70853 -61956
602 -61956 546 -146497 104546 26853 -41966 -231739 28393 148294 314674 178790 39437
591 39437 193372 246778 27250 -197191 -140503 111526 236632 274191 296326 293973 405057
580 405057 69039 87584 30157 189102 122607 91191 -44884 61800 130929 104854 -80000
569 -80000 -355712 -187455 -20983 263769 69847 94525 224889 195631 20781 -77336 231685
558 231685 11521 -28496 18157 -204060 -25471 -20158 -12991 99932 117167 70978 57403
547 57403 307512 86826 95065 146607 -206493 -74795 36510 55557 299417 257678 141891
$$ packed form
624b8259o2127K09530J2835k86213J27240L19875j51754j84681r8904Q6082J50
613e6226j14453N9816J79415K6438j27919J03213J80695j59270p5040q7522Q897
602f1956O2502j47043K51043p7693o8819j89773K60132J19901J66380j35884j39353
591C9437J53935N3406k19528k24441N6688K52029J25106L7559K2135k353J11084
580D05057l36018J8545n7427J58945o6495l1416j36075J06684O9129k6075j84854
569h0000k75712J68257J66472K84752j93922K4678J30364k9258j74850r8117L09021
558B31685k20164m0017M6653k22217J78589N313P167J12923J7235m6189j3575
547E7403K50109k20686Q239N1542l53100J31698J11305J9047K43860m1739j15787
$$ plain form
536 141891 321788 374524 192692 9886 7287 208373 287835 167926 124811 107887 -50543
525 -50543 -88622 165315 51870 175298 256924 101130 -54877 64761 55367 39210 -139523
514 -139523 13208 290851 230985 306948 52279 -227123 -14079 -108412 -73999 56166 -131352
503 -131352 -231756 -82946 -14429 -34667 -21699 -8164 -253106 -131987 -228939 -228298 40765
492 40765 -183900 -288794 -417005 -260912 -168627 -84259 216246 41563 -189640 -104984 179988
481 179988 -136090 128505 114331 80082 53954 -66324 99174 66976 4372 -11242 -226484
470 -226484 -88213 130170 128680 132561 545 -68257 18634 151029 -34200 125153 -181299
459 -181299 -276429 -107398 85451 153390 -237882 -257512 73554 -46492 103996 156991 15437
$$ packed form
536A41891J79897N2736j81832j82806k599K01086P9462j19909m3115j6924j58430
525e0543l8079K53937j13445J23428Q1626j55794j56007J19638r394j6157j78733
514a39523J52731K77643n9866P5963k54669k79402K13044r4333L4413J30165j87518
503a31352j00404J48810O8517k0238J2968J3535k44942J21119r6952O41K69063
492D0765k24665j04894j28211J56093R2285Q4368L00505j74683k31203Q4656K84972
481A79988l16078K64595j4174l4249k6128j20278J65498l2198o2604j5614k15242
470b26484J38271K18383j490L881j32016o8802Q6891J32395j85229J59353l06452
459a81299r5130J69031J92849O7939l91272j9630L31066j20046J50488N2995j41554
$$ plain form
448 15437 -102591 207121 26928 143749 172031 -62439 62477 251494 273709 211303 64219
437 64219 274612 308916 125110 -48255 -204081 -99506 6484 99148 -89757 -207447
427 -207447 16385 -35696 47001 177765 194236 286168 395221 39002 193271 288241 431570
416 431570 168869 152509 144181 167533 -8691 4928 18195 162049 299257 116714 101042
405 101042 -173807 -78593 -350552 -82196 -32450 20855 -132107 -255701 -282381 -80255 -147918
394 -147918 435 -304530 -508596 -310892 -118713 -188637 -251927 -75214 138882 167904
384 167904 301195 447431 517398 118008 134501 98714 -3233 -173780 -106219 -94316 87195
373 87195 115741 -30932 52302 -176419 -108267 -92549 132113 105683 -105635 -199586 124705
$$ packed form
448A5437j18028L09712j80193J16821K8282k34470J24916J89017K2215o2406j47084
437F4219K10393L4304j83806j73365j55826J04575J05990R2664j88905j17690
427b07447K23832n2081Q2697J30764J6471R1932J09053l56219J54269R4970J43329
416D31570k62701j6360q328K3352j76224J3619J3267J43854J37208j82543j5672
405A01042k74849R5214k71959K68356M9746N3305j52962j23594k6680K02126o7663
394a47918J48353l04965k04066J97704J92179o9924o3290J76713K14096K9022
384A67904J33291J46236O9967l99390J6493l5787j01947j70547O7561J1903J81511
373H7195K8546j46673Q3234k28721O8152J5718K24662k6430k11318r3951L24291
$$ plain form
362 124705 62660 -32313 -213720 -8505 -150912 -57780 -87954 -167069 -195036 1458 -29388
351 -29388 -273436 -195667 -204 97407 63099 165074 -39626 -225435 -48482 -55792 -142656
340 -142656 108648 277677 -30880 -132275 -84612 -7026 63250 -62391 -97180 -16058 -233882
329 -233882 -284298 -52669 -44997 -150487 94340 285911 37364 54428 39840 36457 11502
318 11502 5865 85105 3176 -217916 -305049 45164 409175 104610 -45349 3304 183657
307 183657 -52850 131335 74105 -21949 -1145 5272 -215923 -178881 -113019 -323758 -87826
296 -87826 -321415 -122817 -158181 -39683 -116611 -259103 -17084 -22900 169309 202953 139125
285 139125 -23262 198141 47591 -31849 -117011 -5801 31822 -83301 -192519 -67692
$$ packed form
362A24705o2045r4973j81407K05215j42407R3132l0174p9115k7967J96494l0846
351b9388k44048P7769J95463R7611l4308J01975k04700j85809J76953p310q6864
340a42656K51304J69029l08557j01395M7663P7586P0276j25641l4789Q1122k17824
329b33882n0416K31629P672j05490K44827J91571k48547J7064j4588l383k4955
318A1502n637P9240q1929k21092q7133L50213L64011l04565j49959M8653J80353
307A83657k36507J84185n7230r6054K0804O417k21195L7042O5862k10739K35932
296h7826k33589J98598l5364J18498p6928j42492K42019n816J92209L3644o3828
285A39125j62387K21403j50550p9440q5162J11210L7623j15123j09218J24827
$$ plain form
275 -67692 -7202 -59847 -95884 -100813 -69152 -4394 -185604 -170720 -50421 -107346 -46787 -81862
263 -81862 161478 47829 -25678 256558 -64972 -62462 14281 -60 134056 154408 83290
252 83290 258015 296309 304946 223391 113055 80516 -56149 -281437 -356349 -246521 -220404
241 -220404 -352575 -55595 183184 402571 90134 -11413 121441 -21291 -61141 -274335
231 -274335 -26896 -76781 -89676 -232479 -279287 -195244 34414 -104238 -44018 -136385 -94516
220 -94516 -368403 -270943 -171132 -15684 89032 147404 54875 26404 -52593 73110 -141502
209 -141502 -470702 -388178 -214529 -157389 -124526 45170 199075 55856 3859 -214878 -306301
198 -306301 -271695 -47560 193197 107649 -125411 219657 384749 154216 -159385 -9531
$$ packed form
275f7692O0490n2645l6037m929L1661O4758j81210J4884J20299n6925O0559l5075
263h1862K43340j13649p3507K82236l21530K510P6743j4341J34116K0352p1118
252H3290J74725L8294Q637q1555j10336l2539j36665k25288p4912J09828K6117
241b20404j32171K96980K38779K19387l12437j01547J32854j42732l9850k13194
231b74335K47439m9885j2895j42803m6808Q4043K29658j38652O0220r2367M1869
220i4516k73887R7460R9811J55448J04716N8372r2529k8471p8997J25703k14612
209a41502l29200Q2524J73649N7140L2863J69696J53905j43219n1997k18737r1423
198c06301L4606K24135K40757q5548k33060L45068J65092k30533l13601J49854
$$ plain form
188 -9531 73223 -139134 -186207 -205250 -58028 -97061 139380 22999 17767 -5144 84625 160999
176 160999 36245 -12352 -225493 -206027 -112917 -199919 -96307 -133943 78844 353742 287343
165 287343 -69967 95166 334552 30167 -179396 -118462 -35676 -149036 -115842 40570
155 40570 188258 71876 120242 179066 160547 -23041 -146158 1970 -92141 -125915 -15301
144 -15301 130128 15594 38417 -36311 -86389 19860 97242 91799 64012 -5180 188214
133 188214 300156 113284 -93249 -22480 -130555 -62278 22046 144760 41566 -134745
123 -134745 -96617 122076 122473 84953 59634 107370 144243 77471 -189592 65729 -45758
112 -45758 -104707 166323 53349 104144 100017 -106221 -248650 -227660 -80122 30056 99527
$$ packed form
188i531Q2754k12357m7073j9043J47222l9033K36441j16381n232k2911Q9769P6374
176A60999j24754m8597k13141J9466R3110q7002J03612l7636K12787K74898o6399
165B87343l57310J65133K39386l04385k09563O0934Q2786j13360L3194J56412
155D0570J47688j16382M8366N8824j8519j83588j23117J48128r4111l3774J10614
144a5301J45429j14534K2823p4728n0078J06249P7382n443k7787o9192J93394
133A88214J11942j86872k06533P0769j08075O8277Q4324J22714j03194j76311
123a34745L8128K18693L97l7520k5319M7736L6873o6772k67063K55321j11487
112d5758n8949K71030j12974N0795m127k06238j42429K0990J47538J10178O9471
$$ plain form
101 99527 131726 -26723 31463 156512 -61092 -289526 -37791 -108504 -228927 -138585 -93811
90 -93811 -58822 38961 -132936 40239 51007 -164016 -104715 36556 68564 -5805 -202571
79 -202571 -297215 -81268 -2142 -53463 -249634 -28309 -14564 -57459 100999 99421 105352 172411
67 172411 86041 61331 23125 132790 178888 109140 -29788 -300818 -173449 -68634 -80621
56 -80621 36251 73489 -61817 -93320 -87419 -86919 25479 20590 52115 36849 -169277 -219297
44 -219297 -166248 99713 121419 -20032 97546 132469 -784 75480 -68862 -55186 62418
33 62418 177623 -7990 -144012 -146927 -181258 -41382 91827 135758 340 119649 226498
22 226498 24622 -12344 -147473 -78352 96656 7198 114647 -93648 -226628 -131084 -1183
$$ packed form
101I9527L2199j58449N8186J25049k17604k28434K51735p0713j20423R0342M4774
90i3811L4989R7783j71897J73175J0768k15023N9301J41271L2008p4369j96766
79b02571r4644K15947P9126n1321j96171K21325J3745m2895J58458j578N931O7059
67A72411q6370k4710l8206J09665M6098o9748j38928k71030J27369J04815j1987
56h0621J16872L7238j35306l1503N901N00J12398m889L1525j5266k06126n0020
44b19297N3049K65961K1706j41451J17578L4923j33253P6264j44342J3676J17604
33F2418J15205j85613j36022k915l4331J39876J33209M3931j35418J19309J06849
22B26498k01876l6966j35129O9121J75008q9458J07449k08295j32980R5544J29901
$$ plain form
11 -1183 -112698 -54011 65586 -36580 -142821 -10931 172643 199513 76340 34873 71620
0 71620
$$ packed form
11a183j11515N8687J19597j02166j06241J31890J83574K6870j23173m1467L6747
0G1620
$$ Imaginary data points
##PAGE= N=2
##DATA TABLE= (X++(I..I)), XYDATA
$$ plain form
16383 -4118450 -4161545 -4190217 -4131922 -4002987 -4152345 -4059169 -3892130 -3789628 -3654861 -3512682
16373 -3512682 -3393090 -3558910 -3621794 -3441259 -3350859 -3311491 -3288928 -3168992 -3254007 -3202094
16363 -3202094 -3072351 -2979324 -2980558 -2830974 -2808789 -2562745 -2536792 -2621790 -2501718 -2245854
16353 -2245854 -2128656 -2119569 -2298312 -2280073 -2223793 -2006174 -1743077 -1962371 -2003958 -1813755
16343 -1813755 -1662241 -1848324 -1924099 -1757417 -1424476 -1279071 -1341961 -1332916 -1316495 -1187887
16333 -1187887 -1271519 -1264039 -1235484 -1226827 -1122844 -938208 -1098234 -1251262 -779360 -844095 -705439
16322 -705439 -742153 -634212 -669288 -578863 -407290 -108899 -153444 -144335 -111178 -71475 -162528
16311 -162528 15430 -75142 58260 375393 401094 214067 239563 418061 419663 382143 448698
$$ packed form
16383d118450m3095k8672N8295J28935j49358R3176J67039J02502J34767J42179
16373c512682J19592j65820o2884J80535R0400L9368K2563J19936q5015N1913
16363c202094J29743R3027j234J49584K2185K46044K5953q4998J20072K55864
16353b245854J17198R087j78743J8239N6280K17619K63097k19294m1587J90203
16343a813755J51514j86083p5775J66682L32941J45405o2890R045J6421J28608
16333a187887q3632P480K8555Q657J03983J84636j60026j53028M71902o4735J38656
16322g05439l6714J07941l5076R0425J71573K98391m4545R109L3157L9703r1053
16311a62528J77958r0572J33402L17133K5701j87027K5496J78498J602l7520O6555
$$ plain form
16300 448698 376558 537919 514232 725772 637314 575030 681991 790439 764399 708634 940871
16289 940871 1166855 1276218 1208259 1207566 1192790 1266278 1163565 1343138 1541076 1589357 1333625
16278 1333625 1498635 1659144 1530527 1476177 1632946 1720130 1711429 1618126 1616163 1673478 1804235
16267 1804235 2020756 2136273 1981392 1953037 2032744 2307239 2272647 2120181 2341449 2460536
16257 2460536 2346706 2326646 2457706 2560277 2644261 2490695 2480233 2566589 2476591 2339421
16247 2339421 2515553 2687130 2673522 2800864 2739769 2791334 2901050 3002884 3182595 3147811
16237 3147811 2831618 2982467 3213327 3207899 3255352 3323225 3338495 3230021 3264971 3207886 3273088
16226 3273088 3592460 3556610 3515174 3488740 3348887 3568420 3559699 3367187 3570807 3593742
$$ packed form
16300D48698p2140J61361k3687K11540q8458o2284J06961J08448k6040n5765K32237
16289I40871K25984J09363o7959o93j4776P3488j02713J79573J97938M8281k55732
16278A333625J65010J60509j28617n4350J56769Q7184q701r3303j963N7315J30757
16267A804235K16521J15517j54881k8355P9707K74495l4592j52466K21268J19087
16257B460536j13830k0060J31060J02571Q3984j53566j0462Q6356q9998j37170
16247B339421J76132J71577j3608J27342o1095N1565J09716J01834J79711l4784
16237C147811l16193J50849K30860n428M7453O7873J5270j08474L4950n7085O5202
16226C273088L19372l5850m1436k6434j39853K19533q721j92512K03620K2935
$$ plain form
16216 3593742 3600157 3737148 3847721 3759191 3683439 3698127 3675311 3761506 3705406 3889222 3762583
16205 3762583 3378388 3682526 3996443 3925880 3913411 4259429 4284414 4281527 4582359 4593863
16195 4593863 4465683 4460126 4334447 4322618 4296098 4360085 4508915 4689699 4389697 4612900
16185 4612900 4519360 4655192 4455320 4466229 4414252 4223672 4316345 4465482 4427811 4200574
16175 4200574 4083505 4262464 4383871 4478707 4577094 4393499 4589890 4772546 4557177 4469493
$$ packed form
16216C593742O415J36991J10573q8530p5752J4688k2816Q6195n6100J83816j26639
16205C762583l84195L04138L13917p0563j2469L46018K4985k887L00832J1504
16195D593863j28180n557j25679j1829k6520O3987J48830J80784l00002K23203
16185D612900r3540J35832j99872J0909n1977j90580R2673J49137l7671k27237
16175D200574j17069J78959J21407R4836R8387j83595J96391J82656k15369q7684
$$ [...]
##END NTUPLES=NMR SPECTRUM
##END=
