##TITLE=1H_CA-8687-3
 DMSO, 8 sc, 
 6.2.2020
##JCAMPDX= 6.0         $$ Bruker NMR JCAMP-DX V2.0
##DATA TYPE= NMR FID
##DATA CLASS= NTUPLES
##ORIGIN= UXNMR, Bruker Analytische Messtechnik GmbH
##OWNER= root
$$ XWIN-NMR		Version 3.5
$$ Thu Feb  6 14:53:59 2020 Russian Standard Time (UT+4h)  she@DPX200
##.OBSERVE FREQUENCY= 200.1315
##.OBSERVE NUCLEUS= ^1H
##.DELAY= (6, 6)
##.ACQUISITION MODE= SIMULTANEOUS
##.ACQUISITION SCHEME= undefined
##.AVERAGES= 8
##.DIGITISER RES= 18
##SPECTROMETER/DATA SYSTEM= spect
##.PULSE SEQUENCE= zg30
##.SOLVENT NAME= D2O
##.SHIFT REFERENCE= (INTERNAL, D2O, 0, 15.7039)
##AUDIT TRAIL= $$ (NUMBER, WHEN, WHO, WHERE, WHAT)
$$ ##TITLE= Audit trail, XWIN-NMR		Version 3.5
$$ ##JCAMPDX= 5.01
$$ ##ORIGIN= Bruker BioSpin GmbH
$$ ##OWNER= she
$$ F:/spectra/data/she/nmr/H-F/1/audita.txt
$$ ##AUDIT TRAIL=  $$ (NUMBER, WHEN, WHO, WHERE, WHAT)
(   1,<2020-02-06 14:53:05.70 +0400>,<she>,<DPX200>,
      <created by zg, POWCHK disabled, PULCHK disabled
       configuration hash MD5:
       00 E9 B6 7A A2 85 ED C7 34 08 36 98 17 FE 4E 26
       data hash MD5: 16K
       53 04 B0 E3 ED 2B AB 05 BD 1C 20 B8 C8 4B 26 57>)
$$ ##END=
$$ 
$$ hash MD5
$$ 3A 96 0B D4 36 86 E2 9A DA 0C 0B 2F CE 6D B6 21
##$RELAX= 
##$RELAX= 
##$RELAX= 
##$RELAX= 
##$RELAX= 
##$RELAX= 
$$ Bruker specific parameters
$$ --------------------------
##$DU= <F:/spectra>
##$EXPNO= 1
##$NAME= <H-F>
##$PROCNO= 1
##$TYPE= <nmr>
##$USER= <she>
##$AMP= (0..31)
100 100 100 100 100 100 100 100 100 100 100 100 100 100 100 100 100 100 
100 100 100 100 100 100 100 100 100 100 100 100 100 100 
##$AQSEQ= 0
##$AQ_mod= 1
##$AUNM= <au_zg>
##$AUTOPOS= <>
##$BF1= 200.13
##$BF2= 200.13
##$BF3= 200.13
##$BF4= 200.13
##$BF5= 200.13
##$BF6= 200.13
##$BF7= 200.13
##$BF8= 200.13
##$BYTORDA= 1
##$CFDGTYP= 0
##$CFRGTYP= 5
##$CHEMSTR= <none>
##$CNST= (0..31)
1 1 145 1 1 1 1 1 1 1 1 1 1 1 1 1 1 1 1 1 1 1 1 1 1 1 1 1 1 1 1 1 
##$CPDPRG= <>
##$CPDPRG1= <>
##$CPDPRG2= <>
##$CPDPRG3= <>
##$CPDPRG4= <mlev>
##$CPDPRG5= <mlev>
##$CPDPRG6= <mlev>
##$CPDPRG7= <mlev>
##$CPDPRG8= <mlev>
##$CPDPRGB= <>
##$CPDPRGT= <>
##$D= (0..31)
0 1.2 0 0 0 0 0 0 0 0.06 0 0.03 0 0 0 0 0.0002 0 0 0 0 0 0 0 0 0 0 0 0 
0 0 0 
##$DATE= 1580986384
##$DBL= (0..7)
120 120 120 120 120 120 120 120 
##$DBP= (0..7)
150 150 150 150 150 150 150 150 
##$DBP07= 0
##$DBPNAM0= <>
##$DBPNAM1= <>
##$DBPNAM2= <>
##$DBPNAM3= <>
##$DBPNAM4= <>
##$DBPNAM5= <>
##$DBPNAM6= <>
##$DBPNAM7= <>
##$DBPOAL= (0..7)
0.5 0.5 0.5 0.5 0.5 0.5 0.5 0.5 
##$DBPOFFS= (0..7)
0 0 0 0 0 0 0 0 
##$DE= 6
##$DECBNUC= <off>
##$DECIM= 24
##$DECNUC= <off>
##$DECSTAT= 4
##$DIGMOD= 1
##$DIGTYP= 9
##$DL= (0..7)
0 120 120 120 120 120 120 120 
##$DP= (0..7)
150 150 150 150 150 150 150 150 
##$DP07= 0
##$DPNAME0= <>
##$DPNAME1= <>
##$DPNAME2= <>
##$DPNAME3= <>
##$DPNAME4= <>
##$DPNAME5= <>
##$DPNAME6= <>
##$DPNAME7= <>
##$DPOAL= (0..7)
0.5 0.5 0.5 0.5 0.5 0.5 0.5 0.5 
##$DPOFFS= (0..7)
0 0 0 0 0 0 0 0 
##$DQDMODE= 0
##$DR= 18
##$DS= 0
##$DSLIST= <SSSSSSSSSSSSSSS>
##$DSPFIRM= 0
$$ [...]
##$SUBNAM2= <"">
##$SUBNAM3= <"">
##$SUBNAM4= <"">
##$SUBNAM5= <"">
##$SUBNAM6= <"">
##$SUBNAM7= <"">
##$SUBNAM8= <"">
##$SUBNAM9= <"">
##$SW= 24.9337058887773
##$SWIBOX= (0..15)
0 0 2 0 0 0 0 0 0 0 0 0 0 0 0 0 
##$SW_h= 4990.01996007984
##$TD= 16384
##$TD0= 1
##$TE= 0
##$TE2= 300
##$TE3= 300
##$TEG= 300
##$TL= (0..7)
0 120 120 120 120 120 120 120 
##$TP= (0..7)
150 150 150 150 150 150 150 150 
##$TP07= 0
##$TPNAME0= <>
##$TPNAME1= <>
##$TPNAME2= <>
##$TPNAME3= <>
##$TPNAME4= <>
##$TPNAME5= <>
##$TPNAME6= <>
##$TPNAME7= <>
##$TPOAL= (0..7)
0.5 0.5 0.5 0.5 0.5 0.5 0.5 0.5 
##$TPOFFS= (0..7)
0 0 0 0 0 0 0 0 
##$TUNHIN= 0
##$TUNHOUT= 0
##$TUNXOUT= 0
##$USERA1= <user>
##$USERA2= <user>
##$USERA3= <user>
##$USERA4= <user>
##$USERA5= <user>
##$V9= 5
##$VALIST= <valist>
##$VCLIST= <CCCCCCCCCCCCCCC>
##$VD= 0
##$VDLIST= <DDDDDDDDDDDDDDD>
##$VPLIST= <PPPPPPPPPPPPPPP>
##$VTLIST= <TTTTTTTTTTTTTTT>
##$WBST= 1024
##$WBSW= 4
##$XGAIN= (0..3)
0 0 0 0 
##$XL= 0
##$YL= 0
##$YMAX_a= 392361
##$YMIN_a= -315239
##$ZGOPTNS= <>
##$ZL1= 120
##$ZL2= 120
##$ZL3= 120
##$ZL4= 120
##$ABSF1= 10
##$ABSF2= 0
##$ABSG= 5
##$ABSL= 3
##$ALPHA= 0
##$AQORDER= 0
##$ASSFAC= 0
##$ASSFACI= 0
##$ASSFACX= 0
##$ASSWID= 0
##$AUNMP= <proc_1d>
##$AZFE= 0.1
##$AZFW= 0.1
##$BCFW= 1
##$BC_mod= 2
##$BYTORDP= 1
##$COROFFS= 0
##$CY= 11.3945322036743
##$DATMOD= 1
##$DC= 2
##$DFILT= <>
##$DTYPP= 0
##$F1P= 16.9975609425685
##$F2P= -3.02152046262296
##$FCOR= 0.5
##$FTSIZE= 0
##$FT_mod= 4
##$GAMMA= 1
##$GB= 0.15
##$INTBC= 1
##$INTSCL= 1
##$ISEN= 128
##$LB= 0.24
##$LEV0= 0
##$LPBIN= 0
##$MAXI= 10000
##$MC2= 0
##$MEAN= 0
##$ME_mod= 0
##$MI= 1.114404
##$NCOEF= 0
##$NC_proc= 0
##$NLEV= 6
##$NOISF1= 3.799351
##$NOISF2= 2.8
##$NSP= 1
##$NTH_PI= 0
##$NZP= 0
##$OFFSET= 15.70392
##$PC= 1
##$PHC0= -9797.938
##$PHC1= 29.40081
##$PH_mod= 1
##$PKNL= yes
##$PPARMOD= 0
##$PSCAL= 0
##$PSIGN= 0
##$REVERSE= no
##$SF= 200.130013532006
##$SI= 16384
##$SIGF1= 3
##$SIGF2= 2
##$SINO= 400
##$SIOLD= 16384
##$SREGLST= <1H.CDCl3>
##$SSB= 0
##$STSI= 0
##$STSR= 0
##$SW_p= 3612.71676300578
##$SYMM= 0
##$S_DEV= 0
##$TDeff= 0
##$TDoff= 0
##$TI= <>
##$TILT= no
##$TM1= 0
##$TM2= 0
##$TOPLEV= 0
##$USERP1= <user>
##$USERP2= <user>
##$USERP3= <user>
##$USERP4= <user>
##$USERP5= <user>
##$WDW= 1
##$XDIM= 8192
##$YMAX_p= 0
##$YMIN_p= 0
$$ End of Bruker specific parameters
$$ ---------------------------------
##NTUPLES= NMR FID
##VAR_NAME=  TIME,          FID/REAL,        FID/IMAG
##SYMBOL=    X,             R,               I
##VAR_TYPE=  INDEPENDENT,   DEPENDENT,       DEPENDENT
##VAR_FORM=  AFFN,          ASDF,            ASDF
##VAR_DIM=   8192,          8192,            8192
##UNITS=     SECONDS,       ARBITRARY UNITS, ARBITRARY UNITS
##FACTOR=    0.0002004,     1,               1
##FIRST=     0,             0,               0
##LAST=      1.6414764,     0,               0
##MIN=       0,             -315239,         0
##MAX=       1.6414764,     392361,          0
$$ Real data points
##PAGE= N=1
##DATA TABLE= (X++(R..R)), XYDATA
0@%%%%%%%Qj6J6j7K5l2M0m8N5o8P8r0J09j31J52j77K04k32K69l10L52m00M51n07
31b69N73o45P22q08R02j002J114j237J371j521J684j863K063k286K535k812L125
48A646l485L900m384M959n651O508p604R061j1098J4181j9460L0896j00798J31780
62E0451K29348j59439k80888j54711J48067K40291J16760j15819j88530r3218
72b07688Q8492J59363R0557o2678j31888p6261N1487J13555P6562k5178q9915
83a3592p4485J0017Q2335Q6957J1855p1707q5168j0627O7942P5123J5055l8416
95E5289m6351k1860N246L1451M9500L2720k8244p7831m7131M6349J00535M6312
107A45985o2523j07967l7593P6835J12690K8087r0169j16030j8920J00953J14003
$$ plain form
0 0 0 0 0 0 0 0 0 8 -8 8 -9 16 -16 24 -24 31 -37 41 -49 60 -71 81 -96 108 -124 145 -165 187 -213 238 -269
31 -269 304 -341 381 -427 475 -527 587 -650 721 -800 884 -979 1084 -1202 1333 -1479 1646
48 1646 -1839 2061 -2323 2636 -3015 3493 -4111 4950 -6148 8033 -11427 19469 -81329 50451
62 50451 279799 120360 -160528 -315239 -167172 73119 189879 74060 -114470 -207688
72 -207688 -119196 40167 130724 68046 -63842 -140103 -88616 24939 101501 76323 -13592
83 -13592 -88077 -78060 4275 91232 103087 31380 -53788 -64415 3527 78650 93705 55289
95 55289 8938 -12922 -7676 23775 73275 105995 77751 -80 -47211 -862 99673 145985
107 145985 83462 -24505 -62098 14737 127427 155514 65345 -50685 -69605 31348 145351
118A45351K179j11871j02612J1950J02161P6537k1841q4682n6665J3949N4776
129B9232L9501l830l9594m2979r096L2966M1222L221l9740l9527J797L7167K6261
142C6601j1578l1996j8874Q204J9401R641p105j1728k029M373m250j3349q14K4662
156A159K5918j1545m8765l1000L2715O5877K0713n3328o7222j93O6675N6289j7617
169C9676o7419l8856L1399O3149K7850l3919n8067j9574L8517N5499J4638l7451
181A5442m7678q539L4855M0265P182k6597l1449p982K0466L0801J0987k2774l2251
194a7272n233L1590L1609p953m1603k3213K5055M2669O387l7493l4362R790L9379
207A9350J8702k4656l6573k511L2975K7011j4750m0021j8691K7499M2458N174
$$ plain form
118 145351 147530 35659 -66953 -55003 47158 123695 101854 17172 -39493 -25544 29232
129 29232 68733 64903 25309 -17670 -26766 6200 47422 50643 10903 -28624 -26827 10340 36601
142 36601 25023 -6973 -25847 -17643 1758 11399 4294 -7434 -9463 -5090 -9340 -22689 -23503 1159
156 1159 27077 15532 -33233 -64233 -31518 34359 55072 1744 -65478 -65671 1004 57293 39676
169 39676 -27743 -66599 -35200 27949 55799 21880 -36187 -55761 -17244 38255 52893 15442
181 15442 -32236 -40775 -5920 34345 41527 14930 -16519 -24501 -4035 26766 37753 14979 -17272
194 -17272 -22505 9085 40694 32741 -8862 -32075 -7020 35649 42036 4543 -29819 -20029 19350
207 19350 38052 13396 -23177 -25688 7287 34298 19548 -20473 -39164 -11665 30793 35967
219C5967m0851l9822P292M4392K8128j9122m1147j6080K1754L0692N552j9367
231b612k3413n102J5664K1580O243j6171k4897p953K0422K9304N627k6129l0254
244c7691l60L0155K8038m679l1552k3151J3031L3213J5238k0456l1110l083L0462
257a945K7265j0660l5427j4109K4996L2707O81k9536k2207J2723K9471R852j9683
270D128k1660K417K1954J6110q819k2246r324J4258K1311N375j5412j8438k283
283a2629J5722J6033N86j4203j2808j08J1744J3398N61j3725j4837Q29J8383J6550
297B5496o346k5747j5705J5887K9615Q311k4981k8721R75K9396K2680j1266l1420
310a1826j3286J9582K7386L417k5572k3866O968K9554J5973j7314k8942o762K2235
$$ plain form
219 35967 -4884 -44706 -37414 6978 35106 15984 -25163 -41243 -19489 11203 16755 -2612
231 -2612 -26025 -31127 -15463 6117 12360 -3811 -28708 -36661 -16239 13065 18692 -7437 -37691
244 -37691 -38051 -7896 20142 15463 -16089 -39240 -26209 7004 22242 1786 -29324 -32407 -1945
257 -1945 25320 14660 -20767 -34876 -9880 22827 23508 -6028 -28235 -15512 13959 23811 4128
270 4128 -17532 -15115 6839 22949 14130 -8116 -17440 -3182 18129 23504 8092 -10346 -12629
283 -12629 3093 19126 19712 5509 -7299 -7407 4337 17735 18296 4571 -10266 -9437 8946 25496
297 25496 19150 -6597 -22302 -6415 23200 31511 6530 -22191 -21216 8180 30860 19594 -11826
310 -11826 -25112 -5530 21856 25273 -299 -24165 -17197 12357 28330 11016 -17926 -24688 -2453
323b453K4404j707k4229j7101Q541K0840R493j0388j7355n552J0534J4773M054
336A3854j0641j5011m290J1624J8020M079j6287j9128j042J9991J9352l346k3384
349f209j7984R402K6469J3746j6895k8111o320K4467K6615l746l0410k0171J3535
362a5612L0843J1881k0760k7752k136K3918K0860o321k3192j2553J0746J9629
374I551O240j3156j6099j068J2953J2810j366j2995j0221K941J1887Q241l099
387F619j0953q281L498J1406Q272n232j3781o511Q690J6054L187j4429j5862K661
401a4662J9240J2767q789k1239p545J4982J9753J073j9484j5366O208K0016R623
414A6577j1507j9743k810J6039J5984l533j7784j1104Q323J7123N190j1231j3940
$$ plain form
323 -2453 21951 20244 -3985 -21086 -12545 8295 17788 7400 -9955 -15507 -4973 9800 13854
336 13854 3213 -11798 -16088 -4464 13556 17635 1348 -17780 -18822 1169 20521 17175 -6209
349 -6209 -24193 -14791 11678 25424 8529 -19582 -25902 -1435 25180 21434 -8976 -29147 -15612
362 -15612 15231 27112 6352 -21400 -23536 382 21242 14921 -8271 -20824 -10078 9551
374 9551 15791 2635 -13464 -14532 -1579 11231 9865 -3130 -13351 -10410 1477 9718 6619
387 6619 -4334 -12615 -9117 2289 10561 5329 -8452 -14963 -6273 9781 12968 -1461 -17323 -14662
401 -14662 4578 17345 8556 -12683 -20228 -5246 14507 15580 -3904 -19270 -13062 6954 16577
414 16577 5070 -14673 -17483 -1444 14540 11007 -6777 -17881 -9558 7565 12755 1524 -12416
427a2416l90J1738R442k043j0071p476L281R949N613m139r522n240N242J0589
441D557M796p352j1830k811R683J2539J012j2662j2419L436J5354J0201p428j7185
455a0109o540J2745J8373J204j7357j5785N439K0495J1687j0873k0368n102J5662
468e29J7857l19j6996j3189M833J7454R556q472j6235m678J1024J3545K593j1607
482D837j1844P11J1365J0013j669j0970r026K322J2146Q749m878j3012p000O483
496a773J4067N810j0853j5282k102J4091J3936k987j6890j1698P919J7824O488
509A8550j2485j6616j561J4271J3389l710j6400r855Q137J4955M684j0749j3501
522a0891p71J1500J0216k934j1342o851L788R878M939m965r624l132N280Q219
$$ plain form
427 -12416 -12806 -1068 8374 6331 -3740 -11216 -7935 2014 7627 3488 -6034 -11274 -6032 4557
441 4557 9353 2001 -9829 -12640 -2957 9582 10594 -2068 -14487 -11051 4303 14504 7076 -10109
455 -10109 -16649 -3904 14469 15673 -1684 -17469 -12030 8465 20152 9279 -11089 -16191 -529
468 -529 17328 17009 13 -13176 -8343 9111 18667 10195 -6040 -10718 306 13851 16444 4837
482 4837 -7007 -6296 5069 15082 13413 2443 -6583 -4261 7885 16634 11756 -1256 -8256 -1773
496 -1773 12294 18104 7251 -8031 -10133 3958 17894 14907 -1983 -13681 -5762 12062 18550
509 18550 6065 -10551 -12112 2159 15548 11838 -4562 -14417 -6280 8675 13359 2610 -10891
522 -10891 -11662 -162 10054 7120 -4222 -11073 -7285 2593 7532 2567 -7057 -10189 -4909 3310
536C310K312o527p745j494P967P633p42q845o976K796J0374N807n956j0668l034
551a1788Q806J0318j38j0813q749M203J2406N727p684j1755j736J0230J0428j876
565G579j1466p517N798J1353L844p605r903j036R575P928j962r693n691M055R518
580D777L969n685r144j982O824P714M13o911p428Q73P961O616k716q619n656M031
596d963R510M500o725j0459j851Q845R498n3j1028q713L553J1969O729o815j1935
611g938m026R657J1629j70j1314r528L345J1905P015n996j2032l485Q236J0918
625H216R58r287r083J473R500P304l205r508n086M346Q829M590n824r141k424
640h342O879Q580J106p896q187N91Q977P865l282j0636n447N467J0367L758q133
$$ plain form
536 3310 5622 -905 -8650 -10144 -2177 5456 4714 -4131 -11107 -8311 2063 7870 1914 -8754 -11788
551 -11788 -2982 7336 7198 -3615 -12364 -8161 4245 9972 2288 -9467 -11203 -973 9455 7579
565 7579 -3887 -11404 -5606 5747 9591 1986 -7917 -8953 622 8550 6588 -3105 -8796 -4741 4777
580 4777 8746 3061 -6083 -8065 -1241 6473 6886 -25 -7453 -6580 1381 7997 5281 -3338 -8994 -4963
596 -4963 4547 9047 2322 -8137 -9988 -1143 8355 8302 -2726 -11439 -7886 4083 10812 3997 -7938
611 -7938 -11964 -2307 9322 9152 -2162 -11690 -8345 3560 10575 4579 -7453 -10938 -2702 8216
625 8216 9174 -113 -9196 -7723 1777 9081 5876 -3632 -8718 -4372 4457 9047 3223 -5918 -8342
640 -8342 -1463 7117 8223 327 -7860 -7269 1708 9573 6291 -4345 -9792 -4325 6042 9800 1667
655A667j0123p17R661Q104k081j0627o435M984J0378L362p755q605j022P742P446
670E979j802q156n615L593P496L358m487p173j788N547N998J97o190n454J240
685g257O451M534k438o549l420L720O752J910m641o211m79O097N978j556o826
700c935m338L391P881K568m899p139n38P082N920r14p383m502L450P847K980n261
716B210o624l96O470O117j429o713n000L445P592L048m505p081j301N508O658
731G999j41o555m983J328O581M378k865p111l001M250P058J273n941o738j04P053
747B481N824k225p125n200L104P593L546m784q123k049O253P470j00p960o763
762h058K543P974M737m151q296l181N918P516R36o497o731O92P202N344k328p555
$$ plain form
655 1667 -8456 -9173 488 8592 6511 -4116 -10551 -5567 4811 8173 418 -8187 -9209 -1467 5979
670 5979 4177 -3979 -9594 -6001 1495 4853 366 -6807 -8595 -3048 2950 3147 -3043 -8497 -7257
685 -7257 -806 3728 1290 -5259 -8679 -4959 1793 3703 -938 -7149 -7628 -1531 4447 2891 -3935
700 -3935 -8273 -4882 2999 5567 668 -6471 -7009 73 5993 5079 -2304 -6806 -3356 4491 7471 2210
716 2210 -4414 -4810 1660 7777 6348 -365 -5365 -1920 5672 8720 4215 -2866 -4167 1341 7999
731 7999 7858 1303 -3680 -2352 4229 8607 5742 -1369 -4370 -120 6938 8211 2270 -4468 -4572 2481
747 2481 8305 6080 -1045 -6245 -3141 4452 7998 3214 -4909 -6958 -705 6765 6665 -1295 -8058
762 -8058 -5515 2459 7196 3045 -5251 -8432 -2514 5002 5938 -559 -7290 -6598 604 5948 3620 -3935
778c935l844L903P640K504m788o919q52N860O493m28o251n119K062O949M196k548
794D923o846k980M528P154J416n212o007J44O616N548k289o549l850L945O645
809G186K284m421o006p47N543M962j041n616l834K114O026K454l722n549r63M554
825C224M339l27n116m278J476M736L263k579n166k265L016M379J160m596m385
840c119L20M806L103k026n489k648L445M698O70m035m578l01M473L834j415n087
856c349l223K768M737J750l942m798l68M818L839j216n268k880K140N078K720
871B806l695m880j246M399M772j82m690m567K023N405K963l034m885j849L776
886b884N330Q85m840m637N32N102M478j660n372l256L069N412K342m068n302n35
$$ plain form
778 -3935 -7779 -3876 3764 6268 1480 -5439 -6291 -431 6062 5634 -617 -5736 -3674 3275 7471 4923
794 4923 -1923 -4903 -375 6779 8195 2983 -3024 -2880 3736 9284 6995 446 -3404 541 7186
809 7186 9470 5049 -957 -1704 3839 8801 7760 2144 -1690 424 6450 8904 5182 -367 -1330 3224
825 3224 7563 7236 2120 -2158 -682 4054 7317 4738 -428 -2693 323 4702 5862 1266 -3119
840 -3119 -2799 2007 5110 3084 -2405 -5053 -1608 3090 3760 -275 -4853 -5154 -681 3153 1738 -3349
856 -3349 -6572 -3804 933 2683 -1259 -6057 -6425 -1607 2232 1016 -4252 -7132 -4992 86 2806
871 2806 -889 -5769 -7015 -2616 2156 1974 -2716 -7283 -5260 145 3108 74 -4811 -6660 -2884
886 -2884 2446 3331 -1509 -6146 -5614 -512 3966 2306 -3066 -6322 -3253 2159 4501 433 -4869 -5404
902e404M947M948q96n179l951J611O189K621k887n605k026L814N745R09m770m991
918d925O47N496M068k208n902k520L141N446J468l893n038o02M815M459n85m991
934a124l704J460N233L066k673n355j519L514M736O65m521l937P49M528L406j621
950B903m815k384K206M938J887l820m004m84L925L714q80m571k332K108M301J733
966D425k981l891o94L465L644n16l546l046J240L947K025j799m113j013K893L228
982C268N10l599k847Q09L661K274j776l933r58K218L436O02l000l526P77L397
998A313K917j599l841j802K340L825O14l189l505O59L268L110j196m356k171K061
1014a552M202J136k673l851o25L654L350m35l939k986J554M355J822k464m059
$$ plain form
902 -5404 -457 4491 3595 -1584 -5535 -3924 2265 4886 1999 -3606 -5632 -1818 3927 4836 66 -4925
918 -4925 -4278 1218 5286 3078 -2824 -5344 -2203 3243 4711 818 -4220 -4822 -7 4452 3867 -1124
934 -1124 -4828 -3368 1865 4931 2258 -3097 -4616 -1102 3634 4299 -222 -4159 -3410 1118 4524 2903
950 2903 -1912 -4296 -2090 2848 4735 915 -3089 -3573 352 4066 3186 -1385 -3717 -1609 2692 4425
966 4425 1444 -2447 -3141 324 3968 3452 -94 -3140 -1900 2047 4072 2273 -1840 -2853 40 3268
982 3268 3778 179 -2668 -1859 1802 4076 2300 -1633 -2591 -373 3063 3665 665 -2861 -2084 1313
998 1313 4230 2631 -1210 -3012 -672 3153 3767 578 -2927 -2268 1000 4110 2914 -1442 -3613 -1552
1014 -1552 2650 3786 1113 -2738 -3363 291 3641 3206 -733 -3719 -2165 2190 4012 1548 -2511
1029b511j542L475L880L34l821l755P51L968L182j480m586k050K446M187J378
1044C856l622m020K48L799L099m51m182l151J890M201K269k889l714j397L266
1059g98L546L14l681l635P80M270K946k012m164j781K464M250J192l376m000k97
1075c982L743L802j189l868k567J614L846J664k341l634p04L141L192j74l099
1090e56k895Q72L516K466j509l913j334K489L232O50k755k957J64L142K565j363
1106A814l073j533J640L114R89k171l132m29L202K338m29k858k213J461K837J360
1122B917k077k756k57K331K270m39k490j989Q22K956J367j658k863j020K271L130
1138B515j97k737k427P69L279J269j313l305p33K157K805N12k961k712Q53K972
$$ plain form
1029 -2511 -4053 -578 3302 3636 -185 -3940 -3189 779 3961 2481 -2105 -4155 -1709 2478 3856
1044 3856 234 -3786 -3538 261 3360 2909 -1273 -4424 -2534 1667 3936 1047 -2667 -4064 -798
1059 -798 2748 3062 -619 -4254 -3474 796 3742 1730 -2434 -4215 -1751 2499 3691 315 -3685 -3982
1075 -3982 -239 3563 2374 -1494 -4061 -2447 1399 3063 722 -2912 -3616 -475 2717 2543 -556
1090 -556 -3451 -2579 937 3403 1894 -2019 -3353 -864 2368 3018 263 -2694 -2530 612 3177 1814
1106 1814 -1259 -2792 -1152 1962 2951 780 -2352 -2781 421 2759 2330 -528 -2741 -1280 1557 2917
1122 2917 840 -1916 -2173 158 2428 1989 -501 -2490 -1668 1288 2655 997 -1866 -2886 -615 2515
1138 2515 2318 -419 -2846 -2077 1202 2471 1158 -2147 -2880 -723 2082 2594 -367 -3079 -2226 746
1154G46J790r55k952j833J996L022J151k517k845l72L207K416o86l403j903J514
1170a624L384J811k668l249l54K745K984q3l052k858P55L659K329j972l381j257
1186b831K604K954L89k693k882K98L136K608q94l651j953J719L537J056k171l287
1202b061l93K574K917j46l078k580R61L208K151k100l235j195K140L494R3k691
1218E9k928L18L239K257j213k749k345K061K997O75j921k793l32K523K275k71
1234A852k706k204J276K616J238j513k383o70J925K192J05k185k098O95J923K211
1250B274j320k452r91J360K526N54k117k290L49K123J858p38k301j205J138K340
1266A108O09j649k101J96J928J647n94j921j551J404K341M95j932j994l2K076
$$ plain form
1154 746 2536 1581 -1371 -3204 -1208 1814 2965 448 -2397 -2769 438 2854 2168 -1235 -3138 -1624
1170 -1624 1760 3571 903 -2346 -2700 45 3029 2946 -106 -2964 -2209 1450 3779 1807 -1574 -2831
1186 -2831 -227 2727 3116 423 -2459 -2161 975 3583 2689 -962 -2915 -1196 2341 3397 1226 -2061
1202 -2061 -2454 120 3037 2891 -187 -2767 -1806 1402 3553 1453 -1782 -2977 -837 2657 2750 59
1218 59 -2869 -2551 688 2945 1732 -1017 -3362 -1301 1696 2371 450 -2343 -2675 -152 2123 1852
1234 1852 -854 -3058 -1782 834 2072 559 -1824 -2494 -569 1623 1728 -457 -2555 -1860 63 2274
1250 2274 954 -1498 -2489 -1129 1397 1951 -166 -2456 -2107 16 1874 1136 -1165 -2370 -1232 1108
1266 1108 1717 68 -2033 -1837 91 1738 1144 -777 -2328 -924 1417 1912 -20 -2014 -2046 30
1282C0J900m56j980k108J442K052R75j364k304o67K196J823q4k210j546L95K288
1299C82J816j446k674q03J783K576M08k527j893NL201J695j337k624j267J899
1315h06K460M73j586k503k46K419K150r17k509j722J487K932P04j457k372p17
1331b210K068K432M56k624k166M87K391J856j036k362j339J388L117K02j809k304
1347a453j61K272K315r96k071k161J420K358J444j461l020o06J958K493P5k210
1363A96k034L58K451J458j035k052j159J351J953N14j605k106l92K361K022p07
1379A574k173j349N93K474O78j231j973m46J481J744k25j950j214N74J959R74
1395A490j080k103j57J445J683k77j736j093L86J750J201p66k163j96Q69J984
$$ plain form
1282 30 1930 1474 -506 -2614 -1172 880 1855 491 -1813 -2480 -284 1539 1455 -755 -2301 -1906 382
1299 382 2198 752 -1922 -2725 -942 1634 2042 -485 -2378 -2373 828 2523 1186 -1438 -2705 -806
1315 -806 1654 2127 541 -1962 -2208 211 2361 1444 -1065 -2787 -1300 1632 2336 879 -1493 -2210
1331 -2210 -142 2290 2746 122 -2044 -1557 834 2690 1654 -708 -2047 -659 2458 2660 851 -1453
1347 -1453 -1614 658 2973 1977 -94 -2255 -835 1523 2967 1506 -1514 -2120 -162 2331 2406 196
1363 196 -1838 -1480 971 2429 1394 -658 -1817 -466 1487 2001 396 -1710 -2102 259 2281 1574
1379 1574 -599 -1948 -1355 1119 1797 566 -1407 -1853 -372 1372 1147 -803 -2017 -1443 516 1490
1395 1490 410 -1693 -1850 -405 1278 1001 -735 -1828 -1442 308 1509 743 -1420 -1616 -747 1237
1411A237O28k111j321L56J845J141p92j708r71J297J455O98j526j331L55J587
1427H39P54l67j883o42Q17K198L35j428j578j81J552J601m94j743j471J114J946
1444A369R04j255k168k31J501J917j99j688j769M03J993J340r30k150q82J285
1460e60K236M32j957j870K10K180J329p81j923q48P86K113M57j371j921l84J625
1477b47J772j3j816j773L59K264J380r75k528m39J361J676M35j551j832L33J633
1494C9J445l94j963j170R28J846Q66j011j807m79J562J589l7j857j341P61J786
1511G63Q76r74j487j114J210J918J42j152j444m6J817R53n99j466q52R75J551
1528A071P8r22j393l2R48J417m2j575q05P28J202N89r44j263k43J199Q62k62q81
$$ plain form
1411 1237 1865 -246 -1567 -1211 634 1775 983 -725 -1696 -399 1056 1754 228 -1103 -748 839
1427 839 1593 1226 -657 -1299 -482 1716 2051 623 -955 -1136 416 2017 1523 -220 -1691 -577 1369
1444 1369 2273 1018 -1150 -1381 120 2037 1838 150 -1619 -1216 777 2117 1187 -963 -1845 -560
1460 -560 1676 2108 151 -1719 -1509 671 2000 1219 -704 -1552 -766 1347 1804 433 -1488 -1872 -247
1477 -247 1525 1512 -304 -2077 -1718 546 1926 951 -1577 -2016 -655 1021 1456 -95 -1927 -1594 39
1494 39 1484 1090 -873 -2043 -1115 731 1597 586 -1221 -1700 -138 1451 1414 -443 -1784 -1023 763
1511 763 1639 665 -822 -1936 -726 1192 1334 182 -1262 -1308 509 1462 863 -603 -1455 -480 1071
1528 1071 1149 227 -1166 -1198 -250 1167 1125 -450 -1255 -527 675 1264 320 -943 -1186 13 875 613 -268
1547b68r74N61Q43Q57p79j037o02J213J006j21p79j093M05J588N86r75j304m46
1565a319J189J275k19j206r66M12J318N85k68j646q85J363J373O6r92j595M04
1582a111J566R58p75j341n53M87J745O50j384j499N8J168J238J98j564j637Q99
1599h97J756O13q76j681k0O69J624M9j344j208O69J200Q22Nk130p99J000J615
1617A067M02j040j417n65J633J523m55j293j043P73J207L46q04j313k29J167J185
1634A144K04j228j480L48J467R15k45j847o76J234J104M51j349q70L0O46J432
1651A280l61j140q72L43J305O28n83j412k86J338Q83pj013j167M45J147N20k26
1669H22j452l55P50J144n5n96r77k78J171J021o95r01o22Q29K91Q77r37r06m3
$$ plain form
1547 -268 -1242 -681 162 1019 240 -797 -1399 -186 820 699 -80 -1173 -768 820 1406 431 -873 -1319
1565 -1319 -130 1145 926 -280 -1246 -834 484 1069 801 -845 -1730 -367 1006 1072 80 -1515 -1111
1582 -1111 455 1413 638 -703 -1256 -769 976 1626 242 -1257 -1199 -31 1207 1405 -159 -1796 -897
1599 -897 859 1472 596 -1085 -1105 -436 1188 1237 -107 -1315 -646 554 1376 1381 -749 -1548 -548 1067
1617 1067 1469 429 -988 -1553 80 1603 1148 -145 -1188 -415 792 1138 334 -979 -1208 -41 1144
1634 1144 1348 120 -1360 -1012 455 1370 1125 -722 -1398 -164 940 1391 42 -828 -798 -152 1280
1651 1280 919 -221 -1093 -750 555 1183 600 -812 -1098 240 1123 1116 103 -1064 -619 528 1048 822
1669 822 -630 -985 -235 909 854 258 -719 -997 174 1195 500 -401 -1023 -194 97 974 37 -869 -912
1688i12R19R42q5j122n83L64J194J97q17q62j92Q38J011l07q55p00Q00O62K41
1707G33p54q53J23Q42N03q5p05p19K95J041M39l20r76o89R61J283n27q17n72J18
1727f79Q93K73K83j441j57M52R36O00j116j081P7R85R38q6j043j168Q60J208J50
1746H84m34j410M7J026Q50k23r14r00J59J417P59q87r39p49R42J160K18j079j045
1765a118N08P51P69k62p46q30K65P64J018n74r67m22O95J106K79j386n97L48O26
1784B27R50m71j180m45Q26O01L42j034n55J12M63J346l70j329m59N53P83N55o33
1803B82q22k68N93R89j47q29m49K36Q86J64j05q71m84Q44N50J30n56q88L76Q93
1823E24ol29n08l13P18M86J8o46l61j58N79L89j0n99l63M12P49l64j24p43n4R83
$$ plain form
1688 -912 7 949 864 -258 -841 -477 717 914 97 -765 -957 -119 892 585 -270 -970 -170 492 733
1707 733 -21 -874 -751 91 594 509 -196 -915 -620 421 860 540 -436 -1125 -164 1119 592 -225 -797 -679
1727 -679 214 487 770 -671 -828 -376 560 1160 44 -1037 -960 25 963 877 -166 -1334 -474 734 884
1746 884 450 -960 -913 113 963 740 -174 -1074 -915 502 1261 374 -565 -1314 -372 788 1006 -73 -1118
1765 -1118 -610 141 910 648 -98 -928 -663 101 1119 545 -422 -844 -149 957 1236 -150 -747 -399 227
1784 227 1177 706 -474 -919 -93 508 850 -184 -739 -627 -164 1182 812 -517 -976 -423 360 915 282
1803 282 -540 -808 -215 774 627 -202 -651 -415 471 635 530 -341 -825 19 569 699 143 -745 -369 524
1823 524 518 189 -319 -632 86 572 590 -56 -417 -575 4 393 383 -216 -579 -167 582 218 94 -649 -703 280
1845B80L95k92o48l9J17M58L6n71l39l46P30P41Mp54l44L06N98M23n89m39k76
1866e49P39N17K44j080o91L76J003J8m50o29j83N42Q37J54r11o07L89L93M73j78
1886D07n06p00N40O39P1k35p74j07O30O43J8q02p29K54J054N58n68q87k30O33
1906i1J007j25r83o24K67N84Q51k90j002l30J22J064J44l60r73MO71Q76o6p80
1926c4n38J23P28L57k62q05j07L95O28L40q96o71L96L60O08m12n57j11J67O09
1946C18N33q45n27P0N36Q64l37o23q09N53O42R1m11p43J03P64%L46m44k91k93
1967e03O98O7K32j68o92K30N66j23n03k41K11N33K63k03q29k47O49M29O35q11
1987A93l90k17M54L18Op14j15J54P32J64o16m30J47M54K25J86p49l10M11O00J80
$$ plain form
1845 280 675 383 -265 -304 -187 271 307 -264 -603 -949 -219 522 526 -228 -572 -266 332 755 166 -273 -549
1866 -549 190 707 951 -129 -820 -444 559 577 127 -502 -685 -143 694 848 -63 -670 -281 112 585 407
1886 407 -99 -799 -259 380 451 216 -558 -665 -35 608 626 -176 -905 -651 403 961 393 -494 -724 -91
1906 -91 916 791 -192 -816 -549 35 886 596 -406 -736 -614 450 594 234 -739 -735 -64 812 746 -34
1926 -34 -572 -449 279 636 374 -431 -538 -143 485 825 -71 -742 -346 14 622 210 -347 -458 -291 318
1946 318 851 6 -521 -451 85 949 612 -11 -820 -267 375 466 55 -688 -585 179 179 525 81 -210 -503
1967 -503 195 262 494 326 -366 -136 430 307 -196 -437 -226 307 570 367 -462 -709 -60 369 1004 193
1987 193 -197 -414 40 358 364 -350 -465 -311 421 585 -31 -461 -314 140 365 551 -198 -508 -97 503 683
2008F83n58l19l71N64N49j05m13l77J34P51K09m33n67m85O68M43J06q44l36M25
2028b76M70K33k27n39j96N39L31L33n74q80P00J06M43Kq41l2K40N46J23j21o14
2049b34k32L79O67k7q08l64J56P48K72l19q10j52N03Q53L2n09m85j86L73N89r8
2070C48l46p04O83K91K81o07q4m18K63O88N0o58l59L52K12N04n98M7m20J36J054
2091G15l17j01o56K1M65L99k80m31LK5M95j2j88r7o07K53M81p5k17j34J54M83
2113C79J71n32o1m19L62L84j48j62o31L14L92K88l39k06L4M59L9J63n81j97K62
2134b9K63k8k73n7l77N53K25J04m16l16o5N32M9r1j36r8K13K86J05k23o19O2L20
2157a6K70J23m74m47J50J071k82p00J45j69L49J32j8k82l90J28O53J78j15n16
$$ plain form
2008 683 125 -194 -565 -1 548 443 30 -347 -213 538 747 314 -253 -738 -70 373 479 -365 -701 -276
2028 -276 194 427 200 -339 -535 4 335 668 94 -786 -86 20 463 465 -376 -408 -168 378 501 380 -234
2049 -234 -466 -87 580 553 -255 -619 -463 285 557 238 -572 -724 -221 632 664 155 -330 -516 -143 446 348
2070 348 2 -702 -19 272 553 -54 -138 -556 -293 395 445 -213 -572 -220 -8 496 -102 -55 -475 -339 715
2091 715 398 297 -359 -338 127 526 246 -185 -182 -157 338 326 138 41 -566 -313 168 93 -124 -258 -104 379
2113 379 550 18 -43 -462 -100 284 136 -26 -657 -343 49 337 -2 -208 -174 285 324 487 -94 -291 -29
2134 -29 234 206 -67 -124 -501 52 277 381 -35 -351 -416 116 165 74 -62 -160 53 339 444 221 -398 -336 -16
2157 -16 254 377 -97 -544 -394 677 395 -305 -160 -329 20 152 134 -148 -538 -410 243 421 306 -210
2177b10l40N10N60n3n29m18J65M52j2L01n38j83q1M21N30p09l02j76O03M17l6
2198C72k74o29L06L57N57m48n22m08O72M18J11n93l54J72M04N06k61m44m19R1
2218c86P23K44m39m16P5J56M98l50l23k9j86M64M18j91o38j3N93L70k44k13o06
2239d93J15M87J21j85k2k15m1L24K33k47k03Q3j43N05k42P1l24j38N38n9o9l93
2261b97RK93K68K13m83k23q4M20K0j25k28j04L67J24J95m96l38L95M36P0m97j69
2283b34K9kK72J5j97k15L78K3M52m09k75j16n9M15k32N3r3j86L77L95m40N7l11
2306c03O5O46Pm42k60P2m4Q85n38n8m09K0L53L42k87k67J82J06L77p3k80l29J62
2329g3M52j98O2k92j25J07L98J43l96P1n53M41L11K95n49l84j29L73O19l18l91
$$ plain form
2177 -210 -550 -40 520 467 -62 -480 -315 137 125 426 -112 -295 -376 45 575 -134 -436 -612 -9 408 372
2198 372 98 -531 -225 132 689 241 -281 -689 -17 401 512 -81 -435 -263 141 647 386 -58 -477 -386
2218 -386 337 581 142 -274 -199 -43 455 105 -218 -247 -433 31 449 258 -380 -393 200 570 326 113 -493
2239 -493 -378 109 230 45 23 -192 -233 91 324 77 -126 -43 -186 319 77 148 -176 -314 224 165 96 -297
2261 -297 -288 5 273 486 3 -220 -304 116 136 11 -217 -321 46 170 365 -131 -469 -74 362 432 -65 -234
2283 -234 -205 -207 65 80 -117 -332 46 69 521 112 -163 -279 -338 77 -155 -102 -195 -381 -4 391 -49 8 -303
2306 -303 -238 408 415 -27 -287 -215 -259 626 88 30 -379 -359 -6 336 49 -218 -36 70 447 374 94 -235 -73
2329 -73 379 181 243 -49 -174 -67 331 474 78 149 -404 37 348 643 94 -290 -419 -46 573 255 -136
2350a36j79K26M28k19M4l45q8L90L97n19j79l07N25j56M39l76k54J91K91K33j38
2371B68M3p36L44L27Q6j04o71K78L34J01N2m06j74K2J23K39J6j72qj00L86k52
2393dJ00m07K56JJ71L8n9r2k91N79O0l98p8p9J04L15Nn76qK31L22R0j64n38J3
2418d09M00K25j50m92L86qJ34M1k62l91K27L41R6k66j98L14k32L09L65k26n30
2439c26L38j40L44j15k22k8N7o8N10l0l80q2j47N66k62L2l14qL21L09m06pk55
2462c13K6L12J58M7p16L52J98L45k02m14N4K37L41j85j66j74j2N8L8rM5J65r2
2485I3K74j41j68k41R3j69K41L14k45q0k30N76k65J80k66J9k21M45r1k57K92n35
2507c82K48O1K89r5j58j5J66J77l21j68R1K92m9Nj56l22K80j01j8L37r4k26J82
$$ plain form
2350 -136 -315 -89 339 120 164 -181 -269 121 518 -1 -180 -487 38 -118 321 -55 -309 -118 173 406 268
2371 268 311 -425 -81 246 332 228 -443 -165 169 270 322 -84 -258 -236 -113 126 142 -30 -38 -138 248 -4
2393 -4 96 -311 -55 -54 117 155 96 4 -287 292 352 -46 -124 -203 -99 216 221 -355 -363 -132 190 280 116 -422 -409
2418 -409 -9 216 66 -426 -40 -48 86 127 -135 -526 -299 42 138 -128 -326 -12 -244 65 430 204 -326
2439 -326 12 -128 216 101 -121 -149 -92 -160 350 320 -60 -142 -289 277 15 47 -267 -275 46 355 -51 -58 -313
2462 -313 -287 25 183 230 -486 -134 64 409 207 -207 -153 84 425 240 74 -100 -112 -54 -16 -25 20 185 93
2485 93 367 226 58 -183 -90 -259 -18 296 51 -29 -259 317 52 232 -34 -15 -236 209 118 -139 153 -382
2507 -382 -134 -73 216 121 -37 -52 114 291 -30 -198 -107 185 136 141 -15 -337 -57 -158 -176 161 67 -159 23
2530B3P3j43K45l51P9k2q3K42pp8j6J09j83K38k89p3lM21J94l61R1k76n8L07K17
2555B96m14m3J15J9L81k81j01p5q8J73K74m28j05K21J83M4Q4l33k6K81J19k30
2577F6J06n25L60N7J97l27j54L79r2n7K78l93J07l34L64J25q0j70o9L34k29L41
2599B84k61k00k30M05L73m23j9m53N14L50k30Lm67K24K56J63j37P4n29K10K20
2620A27J21k52n08M85n5K96j15j74q4R2L01J5j8l96l47N16K02L61o36j88J62J31
2642C6j0l1J43j02j13j36N03j18k70j63J43K83j5p9k31OK44J06k66M6R2l37K23
2665d6K03n07L01r1N3K62J82l03k33j62N97m73P9k79M69J10j28j55J5M11j62k98
2687a55q2J46q0J23J23K02m21J0J4J29j04L14J08m94j89K85K38O3m35k7M4N37
$$ plain form
2530 23 96 -47 198 -153 -74 -96 -179 63 56 -22 -38 71 -112 126 -163 -236 -239 182 376 15 106 -170 -228 79 296
2555 296 -118 -161 -46 -27 354 73 -28 -103 -191 -18 256 -172 -277 -56 127 171 255 -78 -104 177 296 66
2577 66 172 -353 7 64 261 -66 -220 159 67 10 288 -105 2 -332 32 157 77 -93 -162 172 -57 284
2599 284 23 -177 -407 -2 371 -52 -71 -524 -10 340 110 113 -354 -130 126 289 152 226 -303 -93 127
2620 127 248 -4 -512 -27 -82 214 99 -75 -159 -67 234 249 231 -165 -512 4 206 567 -69 -257 -95 36
2642 36 26 -5 138 36 -77 -213 290 172 -98 -261 -118 165 150 71 -160 -154 90 196 -70 -24 68 -269 -46
2665 -46 157 -350 -49 -140 -87 175 357 54 -179 -341 256 -217 -138 -417 52 162 34 -121 -106 305 143 -155
2687 -155 -237 -91 -171 -48 75 277 -144 -134 -120 9 -95 219 327 -167 -356 -71 167 230 -205 -232 -188 349
2709C49k30k37Op8J73K57q4l15q9L36j95O8J75j95n0q6L38L52n20j65P0K95j57
2732A8r8P2j48j17L40Q5m4k42K05K09j98J4L1m05R4K06M5K21m87p6L08L08k85
2755E6j4m11J41N15J66j65k26l73K43J16Q1J11n11J76J90J81k04J00k42J01J21
2776A52j39J97k40k15K52J60j46N5l39K65m3O8J2L5k03JK82p0Q7n4M4m2N8R8l25
2801e0P3l63N9M68k63j77K08QL48k57r2k44J17J43K76j08j24r6J37K5J09k09M1
2824B9j26L00k15l1r7r0O19n60K83k27NL85l66O2J40j49p7o2K60j86P7M6J64j1
2848A73k47J21k21P2K26j53K77k40l8j1rL69l60K85l97j68M24k46M05m57J50N2
2870GK14j89k99K70N9J49j09m2l80J91K41N2j06o4l4O4O5j27R0j77J22k39K25
$$ plain form
2709 349 119 -118 -112 -190 -17 240 156 -159 -248 88 -107 -39 136 -59 -109 -195 143 495 -25 -190 -120 175 18
2732 18 -80 -8 -156 -273 67 152 108 -134 71 280 82 96 127 -278 -184 22 67 288 -199 -275 33 341 56
2755 56 42 -369 -228 287 453 288 62 -311 -68 48 129 240 -271 -95 95 276 72 172 -70 31 152
2776 152 13 210 -30 -245 7 167 21 76 -263 2 -41 27 39 74 -129 -128 154 84 171 117 161 119 177 275 -50
2801 -50 23 -340 -281 187 -76 -253 -45 -37 311 54 -38 -282 -165 -22 254 146 22 -74 63 88 197 -12 29
2824 29 -97 203 -12 -43 -140 -230 389 -171 112 -115 -110 275 -91 -29 111 -38 -115 -177 83 -103 -26 20 184 173
2848 173 -74 47 -174 -102 124 -29 248 8 -30 -41 -50 319 -41 244 -153 -321 103 -143 262 -195 -45 7
2870 7 221 32 -267 3 62 211 102 60 -320 -129 112 164 58 -6 -40 24 89 -38 52 -125 -3 -242 -17
2893a7J07p5J54l99K35J44N2l77J74j88Q2K53o2r5q4j86N07K30n96Q9r0J77q6
2916e1N9j08k28K7M56L2J7k22l27Q26q19J61L65k5o32M69K2O9j47j84K55K51j08
2939A58L4k41J01o7Q8K57n78O2J3K61j84L41k94q4J94J95k57m9L3K05l51L91j10
2962A18j21p2P3J69q7k12NK81O0j24N5k38m4L17Q6k97K75k27l3M04m93J65k11
2985a51n4M4J50p9m8N44n35J94K26n6m5l60J57R7K67k12j41%l92M50l39N36n02
3008b49J32K97j49l17J55n5K91o0j10R7l08K90J13Q6m14J28J50q2J96k32J67l14
3030a88J57Q1L2J38j98p4r4J89J04j27J06m58M94k46K03j51k30L39J36O2k56K75
3052B94l59J32P0N4q8j1n8j01M9L11k92j74J80r4L10k97n0J15O8R7j0l75J45J92
$$ plain form
2893 -17 90 15 169 -230 5 149 201 -176 -2 -190 -108 145 83 -12 -96 -282 225 455 -141 -52 -142 35 -51
2916 -51 8 -100 -328 -301 155 187 204 -18 -345 481 -338 -177 188 163 -469 0 22 91 -56 -240 15 266 158
2939 158 192 -49 52 -15 73 330 -248 -186 -173 88 -96 245 -49 -133 61 256 -1 -50 -17 188 -163 228 118
2962 118 -3 -75 -2 167 80 -132 -127 154 214 90 145 -93 -137 180 266 -31 244 17 -16 388 -105 60 -151
2985 -151 -205 -161 -11 -90 -138 406 -129 65 291 235 190 -170 -13 84 351 139 -2 -2 -394 56 -283 253 -249
3008 -249 -117 180 31 -286 -131 -186 105 45 -65 32 -276 14 127 213 -201 -73 77 -5 191 -41 126 -188
3030 -188 -31 50 82 220 22 -52 -146 43 147 20 126 -332 162 -84 119 -32 -262 77 213 275 19 294
3052 294 -65 67 137 191 103 92 34 -67 -18 293 1 -173 7 -87 223 -74 -124 -9 59 156 146 -229 -84 108
3076A08k3N3k29m8K70nj75J41J44k63P5j0k3N0j77K26k17Q2n8K49k77J7M87n29
3100a32K38P9k39P8q1O7k5l1J0m6J77j5j61p2K65l8k68O7L25lj16j47j05q4%J55
3126a02M5l3j9p4R8Qj32L02j91N8l04K05K66k43J17k5k7J93j90O1k77L5J35K19
3150A25rk27J02R2K8J61l37l57K22J33o8K95m41M6M09k34J56j56j10J78j13J51
3172D6J12l05L80l03L3k7q9J89k27K48M8j57Q9j03q4M53l21K76l88K30n2j02J95
3195A41n5K21l83J57J13j54J84l89K7M05m18L04k29O2O6J89k73K4j16N12l97p4
3217h3M81n29lJ94M64l04k75J83o23N37J87j90r9Q8q1m8K16m3k6k34K92l33M59
3240B30j48k34J13K3l04K61J30k84M00j87r9O1j61N71k21K4n35K96J53k57M54
$$ plain form
3076 108 85 138 -91 -139 131 126 -49 92 236 -27 48 38 15 65 -112 114 -103 -21 -79 170 -107 -90 397 -132
3100 -132 106 185 -54 24 -57 10 -15 -46 -36 -82 95 80 -81 -153 112 74 -194 -127 198 195 79 -68 -173 -257 -257 -102
3126 -102 -57 -90 -109 -183 -85 -77 -209 93 -98 -40 -344 -139 127 -116 1 -24 -51 142 -48 13 -264 -229 -94 125
3150 125 116 -111 -9 83 111 272 -65 -422 -200 -67 -135 160 -281 -235 174 -60 96 -60 -170 8 -105 46
3172 46 158 -147 233 -70 -37 -64 -153 36 -191 57 105 -52 37 -66 -150 303 -18 258 -130 100 48 -54 141
3195 141 86 307 -76 81 194 40 224 -165 -138 267 -151 153 -76 -14 52 241 -32 -8 -124 388 -9 -83
3217 -83 398 -131 -134 60 524 220 -55 128 -495 42 229 39 -60 28 -53 -101 115 72 46 -188 104 -229 230
3240 230 82 -152 -39 -16 -320 -59 71 -213 187 0 -99 -38 -199 372 151 175 -360 -64 89 -168 286
3261B86j89n6o5L02k87J10j52j28R0J15k5P3r5k37K68j73L34k45N5Oj01L54on64
3285c30K98M7j81N07p0j82p39N16L39l23M54m50L4J3J25J4K1J9l83J28N00o47
3307b90N4K97l63K20J04L5Q7m16J83L70j82K00l39j3m2L32j46j77J34j09o4M4
3329h1j8n5p0L08K98l60j55P0P6jP3k40P9j15P1L91R1l80R9k64M0j38J11P8k92
3354c84L66K56P2k83N6j6m2k7L8p8M8mL2k43K48Q1M6O5k60J32m0k95l6J93j75
3379b50jj1M19n8K22o06L9L84N3n5n2r4K22q4k69L13k28j11J4M55j62Q8l35K58
3403A51k24k8K5J87j46j91R2j81o6M51j78J19K15l16m6K7j3mM06j29j43Q0j67
3426g9NK46j15J07j35q6J44J9j16j46J89k18J78%Jk49K16J3L8J81l09OP7o4K44
$$ plain form
3261 286 97 41 -24 278 -9 101 -51 -179 -89 26 1 74 -21 -258 10 -163 171 -74 -19 -13 -114 240 234 -330
3285 -330 -32 15 -166 341 271 89 -650 -134 205 -118 336 -114 -80 -67 58 72 93 112 -271 -143 357 -290
3307 -290 -236 61 -302 -82 22 57 144 -272 -89 281 99 299 -40 -53 -95 237 91 -86 48 -61 -125 -81
3329 -81 -99 -154 -224 84 382 22 -133 -63 13 12 85 -155 -76 -191 -120 271 362 -18 81 -183 -143 -281 -170 -92 -384
3354 -384 -18 238 310 27 83 67 25 -2 36 -42 6 2 34 -209 39 120 166 231 -29 103 63 -232 -268 -75 -250
3379 -250 -251 -262 157 99 321 -285 -246 138 191 136 84 -10 212 128 -141 172 -56 -167 -153 302 140 228 -107 151
3403 151 -73 -101 -76 111 -35 -226 -134 -315 -381 70 -108 11 226 -90 -136 -109 -122 -126 280 151 8 88 -79
3426 -79 -74 172 57 164 29 -57 87 106 -10 -156 33 -185 -7 -7 -6 -255 -39 -26 12 193 -116 -110 -33 -97 147
3451A47k78p2j2R1J85R2j1j94M9J67o2J28m77M21l80J00J23o1o6J3p7J11R3J45
3475A75k08j1M10j14l23jM6J59k12J07j04J93j6k45L14k68r4L71l55R3J53k78
3497b08N4J00m1J07l2m2N6R4l44L33K10m90J02O0j0J14r9J53j99J52k1K9k51n4
3521b27N06l64K63m7l19N7R5K42k36l02N2L04j24j1K9J88k14k03M43j18m5J22
3543I1l7k68j9J51N6n0J01j97P4R0k98L24j47L11O8k42k55L32Q3L7j45m7J43j11
3567D5P2p1k4j54L28nj32l9qm48O36k78j88K02J1J33O1J21j40m9p9n2m3j96M06
3592A09j53n8J36J59m17M5K42K20k26O7j38k7P8Q3m9R0r9k79k9P4R1N9p4o4J14
3617d6j66M90m90k3lK16R2j91J54j27K69j47J49r1j27m2Q4j90P5j2J50q8J56k5
$$ plain form
3451 147 -131 -203 -215 -124 61 153 142 -52 -3 164 102 230 -247 174 -206 -106 17 -44 -110 -97 -174 -63 30 175
3475 175 -33 -44 366 252 -71 -72 -26 133 -79 28 -76 117 101 -144 170 -98 -192 179 -176 -83 70 -208
3497 -208 -154 -54 -95 12 -20 -62 -6 88 -256 77 287 -203 -101 -41 -51 63 -36 117 -82 70 49 78 -173 -227
3521 -227 279 -85 178 131 -188 -131 -36 206 -30 -332 -280 24 -100 -111 -82 106 -108 -311 132 14 -31 91
3543 91 54 -214 -233 -82 -26 -76 25 -172 -98 -8 -306 18 -129 182 250 8 -247 85 168 205 60 13 156 45
3567 45 117 46 22 -132 196 191 59 20 12 -436 200 -78 -266 -64 -53 80 141 262 122 73 -6 -58 -101 -297 109
3592 109 -44 -102 34 193 -224 -179 63 283 57 124 -14 -41 37 120 71 161 62 -217 -246 -172 -81 -22 -96 -160 -46
3617 -46 -212 278 -212 -235 -238 -22 70 -121 33 -94 175 28 177 86 -41 -83 1 -189 -114 -126 24 -64 92 67
3641F7m2j2j95K5K42j96K05M9k56K85k67O6P3QJ0k07K12l27M26l70J71mj77L68
3665A54r2j32K08Mk1l6n07N39j40L83m10k48L69k86N47n21J63J24J38q4q5K24
3687B91n4k96L27l79P0K04J65k86j52k40J01M27k56J76l42L38k48J52O7l19M43
3708A89j57j72J93m2J11n9m13N66k91K64j01k18K65j67J68Lk39j4j01O2l4L05
3730A18j09K05N5m0q3j63j89J37N1j35J03K90o7n14K3M72k29K45n7j12j24R6K03
3753A76l24M44m47O7L95m27K22J15j70J11M4l84Q8K36q2k15j29L34l44L3L51j48
3775e4J1J54j16K6q3J35j98o3K09PJ58l1k52J21K9K2k79M65k65M0N5P1J13k31
3799D4P7o4j0J01k27R7O2L1k10L56o32K91m3J62k13J74p8K94k49Q0J7r1k9QJ09
$$ plain form
3641 67 25 13 -182 -157 85 -111 94 143 -113 172 -95 -29 44 52 62 -145 67 -260 166 -204 -33 -37 -214 154
3665 154 62 -70 138 142 121 85 -422 117 -23 360 -50 -298 71 -215 332 -189 -26 98 236 152 67 291
3687 291 237 -59 268 -111 -41 163 328 42 -110 -350 -249 178 -78 98 -244 94 -154 -2 65 -254 189
3708 189 32 -140 53 11 122 63 -350 216 -75 189 88 -130 135 -32 136 139 -100 -114 -215 -153 -187 118
3730 118 9 214 269 229 146 -17 -206 -69 -18 -153 -50 240 173 -341 -318 154 -75 170 113 1 -123 -27 176
3753 176 -148 296 -151 -84 311 -116 106 221 51 162 206 -178 -90 146 64 -151 -280 54 -290 -257 94 -54
3775 -54 -43 111 -5 21 -62 73 -125 -188 21 28 186 155 -97 24 53 75 -204 261 -4 36 91 162 275 44
3799 44 121 57 47 148 -79 18 80 111 -99 257 -375 -84 -127 35 -178 -4 -82 212 -37 43 60 -31 -60 -52 57
3824E7j55J31J56j56J76k34Q4J43k96J23n1L43k52Q3N1l37J54J04j57m2j19M22
3846B28m25K8J2J23L8j38J30o7o2J6K72J9l60K0L12l22J40o2J82Pj69j15K76N7
3870A40q6k6n2r6n1J99j98K72l33K80L7k43j79L02j21J30Kl6K81j27j71N6L6j26
3894a10R9j4l5J70k16J05o0L31j42p7K17l30l8Q9J46j87j35J46J29k22J32n2p3
3917a27K17l8j19K32j16J1k05R0P2Q8k12oK19k3j3j45K38J25l12J69q3O4j45M1
3941B2O3q5j12R4LM8l16L47j33%N7L5K58k60j00K76M4j61j75N4J0o9J50j91K92
3966A51m5k07J91j15J71J1k08j09M09O5n06K76k3j10L7l2J30N5j34Q1q2J03j1
3989I8l2k20k33O01j76o3N3q3N01m57P9m4m4K89k48J58k22K92j10j36j64R6N4
$$ plain form
3824 57 -98 33 189 33 209 -25 59 202 -94 29 -22 321 69 152 203 -134 20 124 -33 -75 -194 228
3846 228 -197 -169 -157 -34 4 -134 -4 -71 -133 -117 155 174 -186 -166 146 -176 -36 -98 84 91 -78 -193 83 140
3870 140 54 28 -24 -120 -171 28 -170 102 -231 49 86 -157 -336 -34 -155 -25 -23 -59 222 95 -76 -20 16 -110
3894 -110 -11 -25 -60 110 -106 -1 -61 270 128 51 268 -62 -100 -11 135 -52 -187 -41 88 -134 -2 -54 -127
3917 -127 90 52 -67 165 49 60 -145 -55 17 105 -107 -113 106 83 70 -75 163 288 -24 145 62 126 -19 22
3941 22 85 0 -112 -18 -15 33 -283 64 -69 -69 -12 23 281 21 -79 197 241 80 -95 -41 -31 -100 50 -141 151
3966 151 106 -101 90 -25 146 157 -51 -160 249 314 -192 84 61 -49 -12 -44 86 141 7 88 6 109 98
3989 98 66 -154 -387 214 38 -25 28 -55 446 -11 68 24 -20 269 21 179 -43 249 139 3 -161 -65 -11
4012a1k22K77k1J25N1j64j10M3N9q0K03j29k1N9K20k57r0Q0j88N02l52j06K78
4035A46J52j57n40N74m7k58M90l89OO2j16M1Q2k6jj13J09J06j05j19J08L5j4o2
4059c6r9M06k81J34j19K98k59o1j40r6L20l09K20M4K3J47k1j29j01p9L25p4J88
4082C01j38k46K62m11K04k71K54r6L67k46k82M10l10R6J62j91L49j34k83M0L7
4103a26jJ78P5k10j08J66K26P1l23J95k93L51m58L27j1k56J64P2k06j3K75j56
4125f1J95Q0q6k39r5K61M2j27R9K8l0J86k07r1r2j39K24J4O6k17K82J05Nm72J43
4150a26O1J99r4k90K1L77l7k02L98k87J11j41j67R9P8L05l37k1mJ77j30k04K83
4173F9j37K94r7j18k49J97j3j30L15j61J1J73l10j68M45pk75J26P4k83L8L46j33
$$ plain form
4012 -11 -233 44 23 148 199 35 -75 -32 27 -53 150 21 0 59 279 22 -68 12 -176 326 -26 -132 146
4035 146 298 141 -399 175 128 -130 360 -29 -23 39 -77 -36 46 20 19 -94 15 121 16 -103 5 40 26 -36
4059 -36 -135 271 -10 124 5 303 44 -17 -157 -253 67 -242 -22 22 45 192 171 42 -59 -138 187 113 301
4082 301 163 -83 179 -232 -28 -299 -45 -141 226 -20 -302 108 -202 -106 56 -135 214 80 -203 -163 -126
4103 -126 -127 51 126 -84 -192 -26 200 271 -52 143 -150 201 -257 70 59 -197 -33 39 -167 -180 95 -61
4125 -61 134 214 128 -111 -206 55 97 -30 69 97 67 253 46 -45 -137 -276 -52 -38 28 -189 93 198 203 -269 -126
4150 -126 -65 134 40 -250 -229 148 111 -91 307 20 131 -10 -177 -78 0 305 -32 -53 -57 120 -10 -214 69
4173 69 -68 226 129 11 -238 -41 -54 -184 131 -30 -19 154 -156 -324 121 114 -161 -35 39 -244 -206 140 7
4196Gk5q3J57L3j88L48n03J67O6J73l87J43J17j9j23L07k35j18J35J2j56k38J97
4219b13L34Kp7l09M38J7j22J78j41k35K08j05O6Q2k59L7m6J52k30J12J12J42j45
4242bQ0k6k7n8J20n3r9j8r0L11j27j25M4N5K21Q4o10m4M26p3n1J61J13p2M2j15
4268F7J37K0j96Jr9qj50J37J20R1p3j82L21l16J9R2l6j4R0l26M65l19K64k11L04
4293A98k22J31M0j81Nm8L13n71K80l5P3l8L76k26k64K67Ln0J66j83J7J13O6l22
4317i2j40K61L6j06k16K40K3%n6m7J61N9j72l3j94K42O0K28j88k11LJ78k37K15
4341A4O5r4j02j96L36p6J53q7J71k93M2K60m45K07N2J11m92K85J15K57q7O4j40
4364A20m44L77R3l81K47J1j36L64k36k24K36Rm0M6k23o3K46j47J36j03K65r0j4
$$ plain form
4196 7 -18 -101 56 89 -99 249 -254 -87 -21 152 -235 -92 25 6 -117 190 -45 -163 -28 -16 -172 -410 -213
4219 -213 121 123 46 -263 175 192 70 248 107 -128 80 -25 41 123 -136 -99 -145 7 -223 -111 1 143 -2
4242 -2 78 52 25 -33 87 34 -65 -83 -173 138 11 -114 -70 -15 206 290 -320 -364 62 -11 -62 99 212 140 182 67
4268 67 204 224 28 29 -70 -78 -228 -91 29 120 47 -135 186 -130 -111 -19 -55 -69 21 -305 160 -159 105 -106 198
4293 198 -24 107 147 -34 -29 -77 236 -335 -55 -90 -17 -55 321 95 -169 98 101 51 217 34 51 164 230 -92
4317 -92 -232 29 65 -41 -257 -17 6 6 -50 -97 64 123 -49 -82 -276 -34 26 254 66 -145 -142 36 -201 14
4341 14 79 -15 -117 -313 23 -53 100 13 184 -109 -67 193 -252 -45 7 118 -374 -89 26 283 196 260 120
4364 120 -324 53 146 -235 12 23 -113 251 15 -209 27 36 -4 42 -181 -244 2 -145 -9 -112 153 63 49
4387D9j31k7m9P5K58m73L09m5l82K0K42j99J62K41j5k49LJ98q4j0k64N92r1j9
4411A11k83K84j68j47J69j47k07M88j17K2q8K75l04L32k42L9qm9R6r9oN5J29j6
4435A19l37L84p1k25Q1K50j95j14k1k5P8J10L6m5K13k76Q8j66j75K71J16k54n1
4458b09L36p0j00j47R1j16M12j16q2J2L0k03Q1J25j02K06l94N28k86k5n1K25l98
4481b53K46l6j5J55j62O9j7M9%O8Jk26JN3J0J78k53k2o9L56k23K46r5m5l54O22
4507B84m22K98o3k72K27N5j45k85K31n8J48j37J83j90O7J85j83L0n0J39K68l39
4529b9Q0O2k46p0K68R4j2p7O5N2l30p2L51r3K8r0PK02k16j40N7J81l1Q0j03k04
4555a86L54l60K98M4j02o5j58L59m05L67p2j20n8k2J50k64L8J96m5Q0M1m6j32
$$ plain form
4387 49 -82 -109 -158 -83 175 -298 11 -34 -416 -396 -154 -353 -191 50 35 -214 -211 -13 -97 -107 -371 221 130 111
4411 111 -172 112 -56 -203 -34 -181 -388 100 -17 5 -83 192 -112 220 -22 17 9 -40 56 -43 -49 6 135 119
4435 119 -218 166 95 -130 -49 201 6 -108 -129 -154 -76 34 70 25 238 -38 50 -116 -291 -20 96 -158 -209
4458 -209 127 57 -43 -190 -99 -215 197 81 -1 11 41 -162 -81 44 -58 148 -246 282 -4 -29 -80 145 -253
4481 -253 -7 -43 -58 97 -65 4 -13 36 36 104 105 -121 -120 -67 -57 121 -132 -154 -223 133 -90 156 61 16 -338 284
4507 284 -138 160 97 -175 52 107 -38 -323 -92 -150 -2 -139 44 -146 -79 106 -77 -47 -97 42 310 -29
4529 -29 51 113 -133 -203 65 159 147 70 135 187 -143 -215 136 43 71 -19 -12 190 -26 -166 -109 72 41 121 18 -186
4555 -186 168 -192 106 150 48 -17 -175 184 -221 146 74 -46 -104 -126 24 -240 -202 -6 -51 29 70 24 -108
4578a08M15l08R6m50N15p8j38k5J19J30j94R8j55O1L29j68j16l37J26J59M03m68
4600i4j82J81J02N5p3J6J6j09J9k35N40k00L1l84K74J88q3J44k34J63N6KM9m33
4624a91K17J59m17L26j55Q4j17j52K98j96J54j30R9p0Q9j90J65L6J92j68K28k28
4646C3J15j55J11n31J62O46l55j96K63p9J25J7Lk8K7K55m64n1J7K79k47L44m19
4669a28K09k94K58j05K84k78j12j55J57M73k27J14l85J62j33K01j36J3J70m1Q9
4690A36k2j05k33K84Q9j47j67R0K87k11M0J1k84L82j92o7L70m14K63l93L62R7
4712A76j14k39PJ19j85L48J01n01L92J48m18M41k71j15K9J64k84L71k94m0O7J25
4734B7j42J17k1p7J8N5L2p4K0M7K70n73K46M6LJ29k47n3L84j38l12K13j98M59
$$ plain form
4578 -108 307 -1 95 -355 160 82 -56 -81 38 168 -26 72 -83 -22 307 139 23 -314 -188 -29 374 -94
4600 -94 -276 -95 7 62 -11 5 21 -88 -69 -304 236 36 67 -317 -43 145 62 206 -28 135 191 193 242 -191
4624 -191 26 185 -232 94 -61 23 -94 -246 52 -144 10 -120 -21 -91 -2 -192 -27 9 201 33 261 33
4646 33 148 -7 104 -427 -265 381 26 -170 93 14 139 156 159 131 158 413 -51 -102 -85 194 -53 291 -128
4669 -128 81 -213 45 -60 224 -54 -166 -321 -164 309 82 196 -189 -27 -160 41 -95 -82 88 47 136
4690 136 114 9 -224 60 149 2 -165 -75 212 1 41 52 -232 150 -42 -109 261 -153 110 -283 79 176
4712 176 62 -177 -170 -51 -236 112 213 -288 104 252 -166 275 4 -111 -82 82 -202 169 -125 -165 -98 27
4734 27 -115 2 -19 -96 -78 -23 9 -65 -45 2 272 -301 -55 -9 -6 123 -124 -177 207 69 -243 -30 -228 231
4758B31j29l33K59jL1R0j27j00j39J48J50j17j3K00l9m72L11r3M74l62J71J1m23
4781b72J63Q1L0K06k26P9J73m32K29p3N5k51J55j60R8M0L51k1m66M29m25L07k55
4804a85%K27l5Qj90M42m89J80kP1m5rM4k51M58l01k27J70j92P5L36j66K55j4j51
4829Iq9N0P0mq4J16j74K86j8l90K09J65j58J58j15J16Q6j55j06n7M10p3O3m42
4853a27J53L1k22K92q6j73Q9J87L0j8L32m25j72m6K27j76p9N3L77o3l02R3pJ96
4877A64K8j34n2q9om2L15j45j29M39l00p0K54m4o4j66J61p9j20J05n4M5M4j09
4901d8L28l31Q4R3j98l66N73k62K78r6j56K9j28N67l57o2j36J04J40r9l8Q6J85
4924A90j61r6L39k7l23J81k15N57n85K63r8J50J55j62l11N5J07q8J9L32m60L56
$$ plain form
4758 231 102 -231 28 27 58 148 21 -79 -218 -70 80 -37 -50 150 111 -361 -50 -143 331 -31 140 151 -272
4781 -272 -109 -28 2 208 -18 61 234 -198 31 -42 13 -238 -83 -243 -145 -105 246 225 -241 188 -237 70 -185
4804 -185 -185 42 7 15 -175 267 -222 -42 -44 27 -18 -27 17 -234 224 -77 -304 -134 -326 -251 85 -81 174 160 9
4829 9 -80 -30 40 36 -48 68 -106 180 162 -228 -19 146 -12 146 31 147 233 78 -28 -85 325 252 315 -127
4853 -127 26 57 -165 127 41 -132 -43 144 174 156 488 63 -109 -155 72 -104 -183 -130 247 184 -118 -25 -32 164
4877 164 192 58 6 -83 -89 -131 184 39 -90 349 49 -21 233 189 125 -41 120 41 -79 26 -28 17 61 -48
4901 -48 280 -51 33 126 -72 -438 135 -127 151 55 -101 -72 -200 367 10 -52 -188 -84 56 -43 -81 5 190
4924 190 29 -67 272 245 -78 103 -112 445 -140 123 25 175 330 168 -143 -88 19 -69 -50 282 -178 178
4946A78k96q6L68j27m19K26K0P2O6R0j33K09j58m4P7K09k41j53L45l21J16q2J62
4969G8p8J72N1j08K1j79j2J7k69M75l69L43k28k30L13K01j84k15N18k22j93K78
4991A80J57k50j49K4M7k13K51R2N5m09L79o7N0j28J82l66K82q4J92k49J17n8J72
5014B07M2l54K28J20p4l62J43j81L04j53J40o2K19j11n5k69K07o3n6J62J14k66
5036a20l6K11j19J97l08O7M2r8M32l72J35r1o4MJ35K89n30L15q9m2R2J56k05P0
5060G1n7j12kkJ8j3K96m19M16k34Q8j14p9J15J69k40J61J74m04J09q2k2M30n89
5084c22L66q9O8OJ80n03M76j21j18m5M3M2K9j22K02o0R9j08J9p1j00J30q3J76
5108I4n5LK50l70J98l16L56N8n2j9o6j74Q5p5J14K5K14j03k08O5q7j30M12k82
$$ plain form
4946 178 -118 -204 164 37 -382 -156 -136 -64 2 92 -41 168 10 -34 43 252 11 -142 203 -118 -2 -84 78
4969 78 0 172 223 115 136 -43 -55 -38 -307 168 -201 142 -86 -316 -3 198 14 -201 317 95 -98 180
4991 180 337 87 -62 -38 9 -204 47 139 194 -215 164 97 147 19 201 -165 117 33 225 -24 93 35 207
5014 207 249 -105 123 243 169 -193 -50 -231 73 -80 60 -2 217 106 51 -218 -11 -74 -130 32 146 -120
5036 -120 -156 55 -64 133 -175 -108 -66 -164 268 -104 31 -60 -124 -120 15 304 -226 89 0 -42 50 206 1 71
5060 71 14 -98 -100 -102 -84 -97 199 -220 196 -38 50 -64 -143 -28 141 -99 62 236 -168 -59 -141 -163 267 -322
5084 -322 44 -45 23 29 209 -294 182 61 -57 -102 -59 -17 12 -110 92 32 131 23 42 -29 -129 1 -82 94
5108 94 39 42 292 -78 120 -196 160 218 166 147 81 -93 -8 -83 31 56 270 167 -41 24 -63 -193 219 -63
5132f3j3J49l42K75j58k26K38K56k00K4L0r1m6J60j63L27j24p4m8Q7J05m11K60
5155d8k8L25J3m35j9R2L65m25K64j60J80J8l4q3j22J30k6k08M19k50n9j9J47J31
5179A68l33J91k80O9j84L92j47J40J30o87M18K4K32M3k20j46J9J41j72K43J30
5200A71l5l81L06J04k64J67O8L2k65j07J54K99l95M54l85L92j51J74l64j40L79
5221B13k26J47M7k46J1m7P2o5J93K8j86J34N1k35J45J57j97r6J40m29M04J60l6
5244A39n2L7P9k28j44K6J67J2j81J39k08J94P1jk05K35j9J13l45L35j87L8J62
5267A77m43R1M7L11m82K79nO5j01m2K0K41k83L11j99m4J48j71K57j32k77N57j29
5290A96P3l78pK70l30L31j49K30k96J52p6n2K18m61M60k40m0L95m22l7K75m86
$$ plain form
5132 -63 -76 73 -269 6 -152 -378 -140 116 -84 -60 -30 -121 -167 -7 -170 157 33 -41 -89 -2 103 -308 -48
5155 -48 -76 249 262 -173 -192 -100 265 -160 104 -56 124 142 108 25 -97 33 7 -201 218 -32 -91 -110 37 168
5179 168 -165 26 -254 -185 -369 23 -124 16 146 -541 -123 -99 133 176 -44 -190 -171 -30 -202 41 171
5200 171 136 -245 61 165 -99 68 136 168 -97 -204 -50 249 -146 308 -77 315 164 338 -26 -166 213
5221 213 -13 134 181 -65 -54 -101 -29 -94 99 127 -59 75 126 -109 36 193 -4 -100 40 -389 15 175 139
5244 139 87 124 203 -25 -169 -143 24 36 -145 -6 -214 -20 51 50 -155 80 61 174 -171 164 -23 15 177
5267 177 -266 -175 -128 183 -299 -20 -25 40 -61 -103 -83 158 -125 186 -13 -57 91 -80 177 45 -232 325 196
5290 196 269 -109 -116 154 -176 155 6 236 -60 92 16 -36 182 -279 181 -59 -99 296 -126 -163 112 -374
5312c74M13J43l70J54J33j24l37K49r5L23k60J37J93p3k18K83j36k30L50k32J67
5333I6l0j83K61K2m1Q8k97K38l61J65K43m27J01K17Lj78k75M86j97K87l28K07
5355I7l02L62j23K07p2j37R7J3K06k94J96O6j50l43K29O4k91L77k50J49oo2j20
5378h7j07J20Q3J92l18J55J0J28o2N7k28k4K5J0O8J20M1l06Q1K42j53j62n1p0
5402b36M13q9M64m39l3r8j73O1N9K07j39K33m10J18L4j7J80p1k17M02j29j69K79
5425B30n44L59P5k28K77q3K41l47J86k38R3K48p4P3K8n04L74k83J7J51R7M6l65
5448a71K66k62K51J39j68k56K08K49j21k6j01j40K38j97L9pK02j49j99J96J9o8
5470e8K17q3j92L93k48K65k51Q6l03O7J57j36J17J86m72L21J96j89k65K31j0M3
$$ plain form
5312 -374 39 182 -188 -34 99 -25 -362 -113 -208 115 -145 -8 185 112 -106 177 41 -189 161 -71 96
5333 96 66 -117 144 166 125 213 -84 154 -207 -42 201 -226 -125 92 95 -83 -358 128 -69 218 -110 97
5355 97 -205 157 34 241 169 32 129 142 348 54 250 316 166 -177 52 116 -175 202 -48 101 95 33 -87
5378 -87 -194 -74 9 201 -117 38 48 176 114 171 -57 -81 -56 -46 22 142 183 -123 -42 200 47 -115 -166 -236
5402 -236 177 88 552 113 80 -18 -191 -130 -71 136 -3 230 -180 -62 -28 -45 135 64 -153 249 120 -49 230
5425 230 -314 45 120 -108 169 86 327 -20 166 -72 21 269 195 268 296 -208 166 -117 -100 51 148 194 -171
5448 -171 95 -167 84 223 55 -201 7 256 135 109 8 -132 106 -91 -52 -59 143 -6 -205 -9 10 -58
5470 -58 159 76 -116 277 29 294 43 129 -174 -107 50 -86 31 217 -255 66 262 73 -192 39 29 72
5492G2J25j82K5p8L45j12l60M0M08k37p1o9J05K6J09l62K99p9J9N4J08l73L8j41
5516b91J58N03m31L1J43k64K33j72l2L67l10p3j0K70j63K11j23r6J94N3k50J59
5538A07l7j27k2J63J23j50J50n2j01l0J48l55J71O8l04J18N2l09M52j0j77K40
5560A18j13P0Q0j85j35J7K11q3R6j4j24J70o9l53N60o63L09k11O27l33j33J72
5582A4J08k70K98%Q9k98qK80j10k56K43Q5j60k02K58J00k05J72mj48k00L00l2
5605E4k52J73N4M15o57J24K27j59K21m26J4L69j10R0k12J49L0r6k39M61k57j7
5627d4K4q7K05o3M1k58K35j50N4j38J51M7K8m7Q4j17K15m13M85l22j6j35K35o6
5651e2j02P4J29J64m12K04q7J39j45q5K80l04K27o3k73M53k74K70P4k59r3j02
$$ plain form
5492 72 197 15 40 -38 307 195 -165 -125 283 46 -25 -94 11 37 146 -216 83 4 23 77 185 -188 -150 -291
5516 -291 -133 370 -61 -30 113 -151 82 -90 -122 245 -65 -138 -148 122 -41 170 47 -49 145 198 -52 107
5538 107 70 -57 -79 84 207 57 207 155 54 24 172 -183 -12 56 -248 -130 -78 -387 65 55 -122 118
5560 118 5 75 155 -30 -165 -148 63 -20 76 62 -62 108 39 -314 246 -417 -108 -319 308 -25 -158 14
5582 14 122 -148 150 150 239 -59 -67 213 103 -153 90 175 15 -187 71 171 -34 138 134 -14 -214 86 54
5605 54 -198 -25 29 444 -213 -89 138 -21 200 -226 -212 157 47 137 -75 74 104 8 -231 230 -27 -44
5627 -44 -20 -107 98 35 76 -182 53 -97 -43 -181 -30 17 45 -2 82 -35 180 -233 252 -70 -86 -221 14 -52
5651 -52 -154 -80 49 213 -199 5 -82 57 -88 -173 107 -197 30 -33 -306 147 -127 143 217 -42 -135 -237
5673b37M85n31J41J18J11J94l09M4j09K26pj4k45K34j35o8M1J48j41O4l7J26k52
5696a53K9K44j10pK19l22K51o5k90L15j51k12N23n22L22r4L67j28m83K77J01O6
5718A77r2r6R2l5m3l36J16j26L06P3l04J59K46j55J02J48m9l48J18l7J90K3n5
5741G4l7j23L09P0l23J42k12J30o5K41k46j15j8P9O3k7r3J42J85j91P8P2l32K68
5765G1k0k26M17j50J62k10j10R4k86L63j18j3J32j73K2L34m84N2J65J97p2j08
5787C9PJ4P5j00J82m67K76j14K24j15j61J41K7J44r2j17oo1J89j54J01q9j72k3
5811b52L28l05O3R2j07M26m45K07j36J20j36O7j83J40J78JP1k19K38Ol47J87L07
5834C01j90l11k1K72l08N04j63qj07K51k93K01k33LJ38l25K41n6j7L56J82n46
$$ plain form
5673 -237 248 -283 -142 -24 87 281 -28 16 -93 133 126 112 -133 101 -34 -102 -61 87 -54 10 -27 99 -153
5696 -153 -124 120 10 3 222 -100 151 86 -204 111 -40 -252 271 -251 71 -23 344 216 -267 10 111 177
5718 177 85 -11 81 46 3 -333 -217 -343 -37 36 -268 -109 137 -18 84 232 183 -165 -47 -84 106 129 74
5741 74 37 -86 223 293 -30 112 -100 30 -35 206 -40 -155 -173 -94 -31 -58 -151 -9 176 -15 63 135 -197 71
5765 71 51 -175 242 92 254 44 -66 28 -258 105 -13 -26 106 -67 -45 289 -195 -143 22 219 147 39
5787 39 46 60 135 35 217 -250 26 -88 136 21 -140 1 28 172 80 -37 -43 -104 85 -69 32 -57 -229 -252
5811 -252 76 -229 -166 -74 -181 245 -200 7 -129 -9 -145 -78 -261 -121 57 58 129 -90 148 154 -193 -6 301
5834 301 111 -200 -221 51 -257 247 84 76 -31 220 -73 128 -105 -102 36 -289 -48 -104 -121 235 417 -129
5856a29K54k84K73j17j33j5M7K8J9JK76m96L35l55Q2K05m3K88l80P3J66m1K40
5879B94J01l39K00k58k90L68j51Q2%K19j92N1n0j0k55K35j42J42Q2j56j2J7mJ27
5903E9j52J97j99P7j83O3J26K44l98N7P6K1j06J56N0j81J80k74L21k03j36L20
5925A15kj76M70o42Q7n5L8R0J10k1k19J24J69o8m4J53k00L18m0j67K3L4k6k6J96
5950B41l89j67N14k6k11rL37l46K42R3n80J21j17K50L1j18j6o1L67l1J29k29j49
5973a24K46j32j65K04J73P5l06k5Q1j4J04j02L10m23J74l8O6M7M6k04K44k83P5
5996B9r8j72L05L9J07k82K67l62K93k25K33j38J24q1Q3l88J95K43l0L7j1m18J38
6019a12J47Q3M8j79j93J63J21j7mJ29k37j40K58j91K31k44K22m4j08J12k5q3k10
$$ plain form
5856 -129 125 -159 114 -3 -136 -151 -104 -76 -57 -56 220 -276 59 -296 -214 -9 -52 236 -144 -71 95 54 294
5879 294 395 56 256 -2 -292 76 -75 7 7 226 34 85 35 25 -230 5 -137 5 87 -69 -81 -64 -68 59
5903 59 -93 104 -95 -18 -201 -138 -12 232 -166 -109 -33 -12 -118 38 88 -93 87 -187 134 -69 -205 115
5925 115 113 -63 407 -235 -148 -203 -165 -75 35 14 -205 -81 88 20 -24 129 -71 247 207 40 63 97 71 45 241
5950 241 -148 -315 199 173 -38 -47 290 -56 186 279 -301 -180 -297 -47 -16 -134 -150 -211 156 125 254 25 -124
5973 -124 122 -10 -175 29 202 277 -29 -54 27 13 117 15 325 -98 76 38 104 151 197 -7 237 -46 29
5996 29 -69 -241 64 103 210 -72 195 -167 126 -99 134 -4 120 39 122 -266 -71 172 142 179 168 -250 -112
6019 -112 35 118 166 -13 -206 -43 78 61 57 186 -51 -191 67 -124 107 -137 85 41 -67 45 20 -63 -273
6042b73J38K50j8L6q5j14N9l78N55r1p1k90K29K81M5j90k25M37n16O7J57j40J59
6065B2k31K26J15k05J59K40p3m43J65lJ29k03j65K35J3J29Q8l02j00K63L0O1m25
6088b75L45J57l40J42P3k39O0K8J1j32K53K3k46J42M7m06N33j30J05j58r0K21
6110A24O0p4j47k40J26K7R7q7J7M51n50K37m5J29k17L47l09J53l8K45o25N3K34
6133c2rK31J21l22K1K4l9K20m68J9J43L64n72K84J18Ok29K36j83m6J29j88J99
6156B7J73l11J26J60j24j06L8J03J38k53qO2L6J40j34J61rJ6l56J68k5l37L19
6179Do3K66L5j57Lj39j08N1k15O42l93r5K14k82J64M5K10l03J69Q9j28L7q9o8
6203a11J82Ql37J62J68p0O4l74N4R8K14r4J54k20M9O7j6o3j04J94P8n4n5k4J22
$$ plain form
6042 -273 -135 115 97 133 48 -66 -7 -385 170 79 8 -282 -53 228 273 83 -142 295 -221 -154 3 -137 22
6065 22 -209 17 132 -73 86 326 253 -190 -25 -28 101 -102 -267 -32 -19 110 198 -104 -204 59 89 150 -275
6088 -275 70 227 -113 29 102 -137 -77 -49 -38 -170 83 106 -140 2 49 -357 176 46 151 -7 -97 124
6110 124 184 110 -37 -277 -151 -124 -27 -114 -97 354 -196 41 -4 125 -92 255 -54 99 61 306 -319 -266 -32
6133 -32 -41 190 311 -11 10 34 -5 215 -253 -234 -91 273 -299 -15 103 109 -120 116 -67 -113 16 -172 27
6156 27 200 -111 15 175 51 -55 -17 86 224 -29 -37 25 61 201 67 228 219 235 -121 47 22 -315 4
6179 4 -59 207 242 85 88 -51 -159 -108 -323 319 -74 -169 45 -237 -73 -28 182 -121 48 137 9 46 -43 -111
6203 -111 71 79 -258 -96 72 2 66 -308 -254 -156 58 -36 118 -102 -53 14 -2 -65 -169 25 103 49 -6 -30 92
6228I2j13j49K87l30L38M5L3k54Mk05J18J3J97%Pj22n2L19m1k52K0J56j56J58
6252A13k11p6K69jj45n1kL42m53L77j20o3n0J32j58J58Q6j55J44p4j19K24k28
6275f1P4J17n16K63j0N2K97l31k3r1K20J28l04M47l87K01j90K60j77k2k25M14
6297A36l33L48k1n21N92m53L93j07K43k57q7Q0l10L61l4j48L77l43J32j0l44O23
6319C17m67J23l26K88L89m69M07j01k62K1J40j10O2j4j48M0r3J00J21N4q3N6k55
6342b10M18l68J91NJ11L7k25J08P1j67L9K67l07M5Q9k73J31Op8O4J87k09J2Pj47
6367a96J43J08l3n8O1J25o05L60K01nl5O4l09RJ1K89k70J61o2L79j33k23J45l97
6391b70L6K80P7k71n0K04n3l70M84M0j01J30j26k18J05J90K09J1p8l02J72J40
$$ plain form
6228 92 -21 -170 117 -213 125 170 203 -51 -47 -252 -134 -121 76 76 83 -39 -91 228 187 -65 -45 111 -45 113
6252 113 -98 -174 95 94 -51 -102 -104 238 -215 162 42 -21 -71 61 -97 61 147 -8 136 62 -57 167 -61
6275 -61 13 130 -386 -123 -133 -81 216 -115 -138 -229 -9 119 -185 262 -125 76 -114 146 -31 -53 -278 136
6297 136 -197 151 130 -391 201 -252 141 34 277 20 -67 13 -297 64 30 -118 259 -84 48 38 -306 317
6319 317 -150 -27 -353 -65 324 -145 262 161 -101 -80 60 -50 12 -2 -150 -110 -203 -103 18 72 -11 45 -210
6342 -210 208 -160 31 36 147 184 -41 67 138 -29 10 277 -30 15 104 -169 -38 -32 -110 -46 141 -68 -56 -49 -196
6367 -196 -53 55 22 -36 25 150 -455 -95 106 101 66 130 -179 -170 -159 130 -140 21 -41 338 205 -18 127 -270
6391 -270 -234 46 123 -148 -198 6 -47 -417 67 107 6 136 10 -208 -103 87 296 307 229 -73 99 239
6413B39k34j35L26l06K40k19m4rM3O8k74M21k31K15q3r6o8M38j74l08n8K20l2
6436f1j49K5J62J70Rk18j19L9J04M44m56j1P3m4Q8R7k39K02j9p5M4m6j8j28P2
6461e4P6O3k4J13m20N47k03R3j89p8mP5J59j26j56k32J94J61k2o4Kj22K03J62
6485A54k34j64K47j97M12m17K02k85L40n2R7l16K82n3J45j26M8K24m47J64K9R2
6507A45kJj27L16l76L9K21k08L63n03L05n0n0J6N8J3l58K66n9O1j24K08J9l16
6531a42J60l45o1M67k07L61l16k08K57l4k59L81j62K11k13J89l16K07j4J14n8
6552A2J37j88J49j01j24o6J05J22m01L32J63J09k68j66rK04M1j18j00O4K47l44
6574b00K98O0l78K26J61n2m1r3J69r1j01m8J18r4R9M3l62K08L11j61r8K80l22
$$ plain form
6413 239 5 -130 196 -110 130 -89 -133 -142 -99 -31 -305 116 -115 100 17 -79 -147 291 117 -191 -249 -29 -61
6436 -61 -210 -185 -23 147 156 -62 -181 -142 -38 406 -50 -61 12 -32 56 153 -86 116 97 22 66 20 2 -126 -54
6461 -54 22 85 61 174 -246 301 98 191 2 -76 -80 -5 154 28 -128 -360 -166 -5 -27 -91 -89 -211 -8 154
6485 154 -80 -244 3 -194 218 -199 3 -282 58 6 103 -213 69 16 161 35 83 307 -140 24 53 145
6507 145 143 144 17 333 -43 -4 217 9 372 -131 174 124 74 90 148 161 -197 69 10 71 -53 155 174 -142
6531 -142 18 -327 -388 79 -128 233 -83 -291 -34 -68 -327 54 -108 103 -110 79 -237 -30 -44 70 12
6552 12 149 -39 110 9 -115 -181 -76 46 -355 -23 140 249 -19 -185 -194 10 51 -67 -167 -103 144 -200
6574 -200 98 158 -220 6 167 115 74 -19 150 59 -42 -90 28 -66 33 76 -286 -78 233 72 -26 254 -68
6597f8j7m7O7J1o8J98k05Q7l07L16l4j15L62m28K09K1J05j80J9K9K88l05N3L01
6621B92k48Q6J93q8k77K11j88m4j15K76L7k12qK35j50o9K3k56J93P4l1l55L14
6644a07L08l34J06N2j86K42O7Nn01L36K90j28j53J07K33n68K22P4K72l36K58k30
6666B9N5N4k08m4p8J08J5J45%r3N9O7J32l51P6r4K85l7l9j66J79m3j76J13Q7J05
6692A80k2n6j7r5j61L17Mk48L5K33k37J36K08j39j56J12l01N79l37N0j77J22k70
6715b40K22n5J02J16k88L02k16K1j06Q8J68j09J74m63K92J59j79J8O5oj59K47
6737A53l06J22R9k4M8k54R3K07o3j93q6m1L21j21O3J61k49J19m10M26j87J18J47
6760A43k27K6L88o12K74L86m32j82L05l07K41p0M5m4j34L30J43j26k00o4J16J18
$$ plain form
6597 -68 -85 -132 -65 -54 -122 76 -129 -42 -349 -33 -67 -182 180 -248 -39 -18 87 -93 -74 -45 243 -62 -9 292
6621 292 44 130 323 235 -42 169 -19 -63 -178 98 135 -77 -85 150 0 -69 -46 -302 -109 -35 -66 -421 -107
6644 -107 201 -133 -27 25 -161 81 148 153 -348 -12 278 150 -3 104 337 -231 -9 65 337 1 259 29
6666 29 84 138 -70 -114 -192 -84 -69 76 76 -17 42 109 241 -110 -34 -128 157 120 81 -85 94 51 -125 -12 75 180
6692 180 158 102 85 -10 -171 146 150 -98 -63 170 -67 69 277 138 -18 94 -207 372 35 85 -92 30 -240
6715 -240 -18 -73 29 145 -143 159 -57 -36 -142 -54 114 5 179 -284 8 167 -12 6 71 65 -94 153
6737 153 -153 -31 68 44 92 -162 -69 138 75 -118 -204 -245 76 -45 18 179 -70 49 -361 65 -122 -4 143
6760 143 -84 -58 330 -282 -8 378 -54 -236 69 -238 3 -67 -22 -66 -200 130 273 147 -53 -117 -1 117
6782A17j08j72L46j11l4N0j68P4r1O4j19J11j9K4r1L43k4lj05%j44r3J48k08R1
6807a22L11j6l21n9K3J52Q0K3j88K74k10j39P1J39j93o4L63k1j72J89JkL2m12
6831b61L97nj09l32K68k2J89m23K72L00j95j51M3j16P4k69M70l33L76mn5j26N
6854gQ8j50J41j62QL81l76L41k51j72J34KK51l02K17k36O5l01L11O2L0j37j4l24
6878d01L73R4j14Q6n8K0q6J96o5j22K65q2j90J33j53K00k00j49K30J24j38j99
6900b36M51J15k99K43p7qJ5l31M0k79K14Q9J95r4N1l96K52J2j26K83l4j2l85L04
6924a3N4Q3J8j85m8j4l7L40l66K03j67K00j07o3K02j18L24rm93J71p5m5K92p2
6948G5l81J40L15j30j51L05m9o6J1J60k04J53m03J87K3n8Q5Pk67R4K82k38J55
$$ plain form
6782 117 9 -163 183 72 38 88 -80 -6 -97 -33 -152 -41 -60 -36 -127 216 192 189 84 84 -60 -153 -5 -213 -122
6807 -122 189 173 -148 -207 -184 -32 48 71 -117 157 -53 -192 -121 18 -175 -239 124 103 -69 120 121 119 151 -261
6831 -261 136 131 22 -310 -42 -64 125 -298 -26 274 79 -72 -29 -145 -71 -340 130 -203 173 169 114 -12 -7
6854 -7 81 -69 72 -90 -82 299 -77 264 13 -159 -25 -23 228 -74 143 -93 -28 -329 -18 44 74 -63 -77 -401
6878 -401 -28 66 -48 38 -20 0 -86 110 45 -77 188 106 -84 49 -104 96 -104 -253 -23 101 -37 -236
6900 -236 215 330 31 274 197 189 204 -127 -87 -366 -152 -63 132 38 89 -307 -55 -43 -169 114 80 68 -317 -13
6924 -13 41 124 142 -43 -91 -105 -142 198 -168 35 -132 68 -39 -102 100 -18 306 297 -196 -25 -100 -145 147 75
6948 75 -306 -166 149 19 -132 173 124 58 69 229 25 178 -225 -38 -15 -73 12 19 -248 -154 128 -110 45
6971D5j47K22k35K43k59R2j4r5J25K77l03J89j53J15j32j1K25j40k39p6K67q0
6993h4J64n3j32o2K34j18J2p1J69k9J8%j55j35K36J25J01k30J48J03k93K05m5
7016A08k12k01L42j41J96j16j32M6qJ75r3L14k83K26p7K01l77K2j91k9K76M9l60
7039b65L1M99j57K3j84p8n0L48l4k5j7l2J15r6J48j79r0K63k63P2k33M7K36%j75
7064i6J57Q4j59j3J24k92Q5j22M83l43J52j11j80L84j77k91J41L21j19N1k83L7
7086a67qn7L78J05k79K51l34j38J06J11J64l66K55J26j74p0K4j21J91L2J48m0
7108A37r3LM1q8P7M9k57n8M81l93K19j94R4Np2O0k4J80j85O1%k6jK7j26J68j7
7135F8J1k28K48J73o12J65J46R5O0j23J09Oj25j32K46k43J37j9J03Lj51k45M35
$$ plain form
6971 45 -102 120 -115 128 -131 -39 -53 -148 -23 254 -49 140 -13 102 -30 -41 184 44 -195 -271 -4 -84
6993 -84 80 27 -105 -167 67 -51 -39 -110 59 30 48 48 -107 -242 -6 119 220 -10 138 241 -52 153 108
7016 108 -104 -305 37 -104 92 -24 -156 -110 -118 57 -36 278 -5 221 144 345 -32 -10 -201 -230 46 95 -265
7039 -265 -234 265 108 131 -53 -131 -181 167 133 108 91 59 174 78 226 47 -43 220 -43 29 -204 -157 79 79 -96
7064 -96 61 145 -14 -27 97 -195 -110 -232 251 -92 60 -51 -231 153 -24 -315 -174 147 28 79 -204 -167
7086 -167 -175 -232 146 251 -28 223 -111 -249 -143 -32 132 -234 21 147 -27 -97 -73 -194 -3 29 177 137
7108 137 44 47 88 0 77 126 -131 -189 292 -101 118 -76 18 23 -49 11 -13 167 -18 43 43 17 16 43 -83 85 68
7135 68 79 -149 99 272 -340 -175 -29 66 126 3 112 118 -7 -139 107 -136 1 -18 85 88 -63 -308 127
7158A27q0j79J15PJ66k14J96j26k22M53k53j70K55k83o9L38l5J68o3j43n2k12
7180b76j16M03p1L8L31k60Lj4j78L27j17m70N55P1l69J38n1P2K7p6k04K68P6K7
7204A34l85L56qj73k77L20r1O5K72l24J81o5m53N64k86K26K17m36M36k24O5Jl8
7227G7j7k60J69L15l81J12O7j33J43k31J30J58l05K85k91K66o9L24m75J97p1j20
7249a10M4k1J21p3J7j69k07K85L52j98l33M49p5J46k10L9M6l36J36j03L31m20
7271b89J50p6J52r3K31q4J81l51J87p9j9K45j99L78k86OpPj95j03K50L24l79K94
7295B45j89J69j17j08N7J4q5O9K15m94KL59j23J90l62J48k9j13K01j27J09k9k5
7318b3K63k64R7L79m53j65J75p6j27J27J47l92N69m7j19k43J01%J25Kj87j0M7
$$ plain form
7158 127 47 -132 -17 -10 156 -58 138 12 -210 243 -10 -180 75 -208 -277 61 26 194 131 -12 -64 -276
7180 -276 -392 11 -60 -22 309 49 52 38 -140 187 70 -400 155 226 -143 -5 -56 16 43 -33 -237 31 107 134
7204 134 -251 105 97 -76 -353 -33 -124 -59 213 -111 70 5 -448 116 -170 56 273 -163 273 49 114 115 77
7227 77 60 -200 -31 284 -97 15 82 -51 92 -139 -9 149 -156 129 -162 104 35 359 -116 81 10 -110
7249 -110 -66 -87 34 -39 -22 -191 -398 -113 239 41 -292 157 82 228 18 57 103 -233 -97 -200 131 -289
7271 -289 -139 -215 -63 -156 75 -9 172 -179 8 -71 -90 155 -44 334 48 54 47 54 -141 -244 6 330 -49 245
7295 245 56 225 108 0 57 71 -14 55 270 -224 -222 137 14 204 -158 -10 -39 -152 49 -78 31 2 -23
7318 -23 240 -24 73 452 -1 -166 9 -67 -194 -67 80 -312 257 210 91 -152 -51 -51 74 76 -111 -121 -74
7341g4J92n9Ml0k58L8K97j22J65l34K87j70J71k26K34oQ3k38j92m1J37o9N7K73
7365A19l1m70M13J25l06N9J14j53j20K23L16l47J68j80M07k51j89L05k65O8K24
7386B29k75q6K93o9J46l38L28O3l24qO6L2j96J95r4N8K09n01J84Q6Q0k06k11K05
7410a34L06r4o0j70M2J99k95L65k19Q4j1k65O1J5l2K53k21j06J81K47l33J24m
7433f7p5K03p4J84l25O5K77l59L3L74m35N8J73J90k08K07j43lj7J50k5j90J61
7456A54L7j99l12J01Q5J61J4k66M51k45j90J11J32r3J63Jk84M82j21m6j96nK58
7479A93k06K08j57P1m5Pq5n7K8L43k98j28J13k22J79K13k49L01l96J45ol1q7J83
7503A7m4J89k18nJ51k04n3QJ92K9M2j01J27N5j54j29j92M23k55JQ1N2J6n3j77
$$ plain form
7341 -74 118 59 63 33 -225 -187 110 -12 153 -181 106 -64 107 -119 115 109 192 -46 -238 -279 -142 -211 -154 119
7365 119 88 -382 31 156 -150 -91 23 -130 -250 -27 289 -58 110 -70 337 86 -103 202 -63 5 229
7386 229 -46 -132 161 92 238 -100 228 291 -33 -41 25 57 -139 56 -38 20 229 -272 -88 -2 78 -128 -339 -134
7410 -134 172 78 18 -152 -110 89 -206 159 -60 24 13 -252 -191 -176 -208 45 -176 -282 -101 146 -187 -63 -67
7433 -67 -142 61 -13 171 -154 -89 188 -171 -138 236 -199 -141 32 222 14 221 78 75 58 208 183 -7 154
7456 154 191 -8 -320 -219 -134 27 41 -225 226 -19 -209 -98 34 -59 104 105 -179 303 182 136 -60 -65 193
7479 193 -13 195 38 109 64 71 -14 -71 -43 300 2 -126 -13 -235 -56 157 -92 209 -187 -42 -48 -79 -166 17
7503 17 -27 162 -56 -61 90 -114 -167 -159 33 62 104 3 130 185 31 -98 -290 133 -122 -121 -40 12 28 -25 -202
7528b02J61J63k13JJ0PM03N0p18M08o2mJ37l45oj1M56j81j66K34j49R3J34j28
7552G2K0n3j4j45J57q4J58j88K61N9k96L72n02M53k60p0l3Q3M0j99M00ok13J75
7576A87k54j17J85p2N9J6J0q7n0J06O8j10K49j37k0J95n8L8k26m7k07L93k58K44
7600A07l4l51K16Mr8K19K12m45L32p7q2J30o0K1J84m18K33j20r3O6J90r6K0j47
7624h7j17P0J74j25k5J05k13M11L1k83L84p17K46J53O6Q2p3q0K89j68m8L6m00
7647b89L70j38j4M1j61L57j30O8mk81L85l90J04J4P8J30j46j17Q9J34k90p6K72
7670FJ89j51M7J93j34n5l43L09K71k96p7J53k6j4o3r0M0J76l36O6K91K59o44K07
7694b2n7J7qO8L8Q1k64jL11k27j43J51L35k97j31k32M75j79J98q3j22J10o3L25
$$ plain form
7528 -202 -41 122 -91 -90 -80 -73 330 380 -338 70 8 4 141 -204 -210 -221 235 54 -112 122 -27 66 200 72
7552 72 92 39 25 -120 37 -47 111 -77 184 243 -53 319 -183 270 10 -60 -93 -10 30 -169 231 225 12 187
7576 187 -67 -184 1 -71 -12 4 14 -73 -123 -17 51 -59 190 53 33 228 170 208 -18 -65 -272 121 -137 107
7600 107 73 -278 -62 -58 -156 63 275 -170 162 85 3 133 73 94 278 -140 93 -27 -120 -54 136 40 60 -87
7624 -87 -204 -134 40 -85 -110 -5 -218 193 224 -59 325 -392 -146 7 73 155 82 2 291 123 75 111 -289
7647 -289 81 -57 -71 -30 -191 166 36 104 100 -181 204 -186 -82 -68 10 140 -6 -123 -34 100 -190 -266 6
7670 6 195 44 91 284 150 95 -248 61 332 36 -41 112 86 72 9 -81 -41 135 -201 -135 156 415 -229 -22
7694 -22 -79 -62 -70 -2 36 117 -147 -148 163 -64 -207 -56 279 -18 -149 -381 94 -85 113 30 -92 18 -45 280
7718B80j85n0ll25K56K89p5Q2l52J12k52M63l37Q4R1O9j65J8n9l1M77j42m9l56
7742a60k75M28o9M4K45m5k19o1K27J5k45M2klJ34j63pJ01r3k3J87k52L66l9kj62
7768c1j5m0Q5o3k0J15p0l32K11j01M20O2l78M7L01k49K3n6M21k20p1J81k48K6
7792bK26k56K09k33J68Rp1PL8j42n3J86j0j12j30J09Q7j62M16l58J98m49L73m5
7816Ck42K23N6J07O8k84j57J30J42n2o2J14J29k25L1Q7K6l81J69K77j80j72K00
7839Go3K21Q3m14M44k77k03L43j73K10m74J55K58k14M26j32l9O0l52K35k88J88
7861Aq5J81j6j36L0l2l2j58K39m7k6K55K0k85J31J1m0rO0P2k06J76J07k62J27
7886G6O4j23k0n7k3J33j04l8J30p0j05J07p9j2N8j8Q1Q4J77m43M17j48j32P1j06
$$ plain form
7718 280 95 45 42 -283 -27 262 187 269 -83 29 -223 240 -97 -13 78 147 -18 0 -59 -90 387 245 196 -160
7742 -160 -435 -7 -76 -32 213 168 -51 -112 115 130 -115 -73 -75 -78 56 -107 -114 -13 -106 -129 58 -194 172 133 131 -31
7768 -31 -46 -86 -1 -64 -84 31 -39 -371 -160 -261 159 221 -157 -110 191 -58 -35 -91 330 110 39 220 -28 -2
7792 -2 224 -32 177 -56 112 121 50 57 95 -47 -100 86 76 -36 -166 -57 30 -132 284 -74 124 -325 48 3
7816 3 -239 -16 40 147 215 -69 -226 -96 46 -6 -68 46 175 -50 -19 68 94 -287 -118 159 -21 -193 7
7839 7 -56 165 248 -166 278 1 -202 141 -32 178 -296 -141 117 -97 329 197 158 218 -134 101 -187 1
7861 1 -84 97 81 -55 -25 -57 -89 -247 -8 -55 -81 174 194 -91 40 51 11 2 62 134 -72 104 211 -51 76
7886 76 140 17 -3 -60 -83 50 -54 -92 38 -32 -137 -30 -109 -121 -63 -81 0 84 261 -182 235 87 -45 26 -80
7911h0J2Q1J11m4j0J66l47Q5q9J96j28M9j12J49l57J55L07l71L84k52J51k5M5
7934G6j81l01L25J55k8o9J9r7o5K05L9r2k2J44j56M5L3r1M6K18j98k33M16k81
7958i3K03k78K23k19K36k74K12P9q9j17L70q4k65n7m3M09q4L7j43K21j70k40L53
7981A87l82K34L7l0Q1j35J22p2j3MK20k3l09r8J83J25k61J36J16l00M3L34k50
8004e1J63j92k1J69p3J66l83K96J19k55m9L82k79J14j29J13Om26O15j58J0j04
8026C3j0q1K42p3l61O28m56L16l86L42j54J32J17j62J32k98J41k1n9q8J04n8j06
8049a26j89M04M0k56K86P3o41L34K88m21K34q8K53j70n6j90J82k59L57o4l1J00
8071F0j18J11K4m8N8kLk29k21L47Q1N8k3p7k9K79j65j36J69N1m20K31K43l60N6
$$ plain form
7911 -80 -68 13 124 80 70 236 -111 -26 -115 81 -47 2 -110 39 -318 -163 144 -227 157 -95 56 31 76
7934 76 -105 -406 -81 74 46 -23 -4 -101 -166 39 78 -14 -36 108 -48 -3 30 -61 -15 203 5 -228 188 -93
7958 -93 110 -168 55 -164 72 -202 10 89 0 -117 253 169 -96 -153 -196 213 129 166 23 244 74 -166 187
7981 187 -195 39 76 46 127 -8 114 42 29 33 253 230 -79 -177 6 131 -130 6 122 -178 -135 199 -51
8004 -51 112 -80 -101 68 -5 161 -222 74 193 -62 -111 271 -8 106 -23 90 96 -330 285 127 137 33
8026 33 23 -58 184 111 -250 378 -78 238 -148 194 40 172 289 127 259 -39 102 81 22 -66 38 -20 -126
8049 -126 -315 89 129 -127 159 232 -409 -75 213 -208 26 -62 191 21 -35 -225 -43 -302 55 -9 -40 60
8071 60 -58 53 77 29 87 85 88 -141 -362 -15 66 124 101 24 -5 274 109 -27 142 193 -227 4 247 -113 -57
8096e7QK22L5j36j33k52M61p3k17L40l30J94K00o15M00K7k47L49l17L54k76q2
8118a45L59l25L19j09j45K35j41k44P1K92j88j32j22M21j48J62Q9m7K3m92M9J09
8140a09K12j90k1K18r1J36k54L40j49j03o8L05q6k85J86nM7J43k25l41K48K08
8162A16m2k39j84K86j53K46m9j19K86k16J45J54m33K49kK43l28P7l0l9M0l09K58
8185d3l7J63k57J92j22J03
$$ plain form
8096 -57 -49 173 208 72 -61 -313 148 75 -142 198 -132 62 262 -353 47 74 -173 176 -141 213 -63 -145
8118 -145 214 -111 208 99 -46 189 48 -196 -125 167 -21 -153 -275 146 -2 160 249 202 225 -267 -218 -109
8140 -109 103 -87 -108 110 19 155 -99 241 92 -11 -79 226 140 -145 41 36 83 226 1 -340 -92 116
8162 116 74 -165 -349 -63 -216 30 -19 -138 148 -68 77 231 -202 47 45 288 -40 37 7 -32 8 -301 -43
8185 -43 -80 83 -174 18 -104 -1
8191a
$$ Imaginary data points
##PAGE= N=2
##DATA TABLE= (X++(I..I)), XYDATA
0@%%%%NnQj6J6k4L2l2M0n6P2q8J04j20J44j74K03k37K75l15L63m16M74n41O13
29C25o92P82q80R86j105J236j377J532j705J893k098K323k573K850l153L493l875
46b038M303m789N346n990O746p651Q751j0127J1909j4312J7759k3155L2882n5942
60c6308K08219K20450l31212k29520j2989K51716J97138M303k02054j70094j2048
71a12399J58385J45547J4700j34728j32405j8278J07825J07771J8275q6090r8719
82c0116l4842N8200Q9346M5979m4835r3854o1588L3085Q7007N1889k9410o7967
94B894m3241M935L1246L6165K5718m220n0761o3366q009P2387Q2327l231r3636
107a0792q6554J5049J04943Q4028k8820j15392q0723M1360J23258P4760n6290
$$ plain form
0 0 0 0 0 0 5 0 8 -8 8 -16 16 -16 24 -32 40 -48 56 -64 80 -94 109 -128 147 -168 195 -221 253 -288 325
29 325 -367 415 -465 521 -584 652 -725 807 -898 995 -1103 1220 -1353 1497 -1656 1837 -2038
46 -2038 2265 -2524 2822 -3168 3578 -4073 4678 -5449 6460 -7852 9907 -13248 19634 -36308
60 -36308 171911 392361 61149 -168371 -181360 70356 267494 271797 69743 -100351 -112399
71 -112399 45986 191533 206233 71505 -60900 -79178 28647 136418 154693 68603 -30116
82 -30116 -64958 -6758 82588 128567 83732 -10122 -71710 -38625 48382 100271 70861 2894
94 2894 -40347 -35412 -4166 31999 57717 53497 2736 -60630 -68639 3748 86075 82844 -10792
107 -10792 -97346 -82297 22646 106674 77854 -37538 -118261 -76901 46357 121117 64827
118F4827j27267o0722O9085J16724L9760o7989r2275k4257N3401O6184J8229l1669
130B4031m7854k4475J7462M4276K8879j6767m5602k5380K2767M2773J4596k6432
142H274l4238n771K1658K1931K147j4196j3619J84O857j426p007L816J9716J0660
156A8986k2649m0617q700M6412N1975r223o6721m7625K9273P3121L1308m6372
168I168o8664j2431N3967N7332j315n4404m8757P778N4892M3165j2681n2257l6127
181f0334J5081M7731K9812j4327l8264k2999J0085L0649K3745m824k9914k3879
193c7438J0327L6122K0340k1523l9035p622L7117L6289j0083m2975k1842K5779
205a4544M0442N162l3385k9138J1798L7327J5631k5457l5651j004L6883L3225
$$ plain form
118 64827 -62440 -123162 -54077 62647 102407 34418 -57857 -82114 -28713 37471 55700 24031
130 24031 -23823 -48298 -30836 13440 42319 25552 -20050 -45430 -22663 20110 34706 8274
142 8274 -25964 -31735 -10077 11854 14001 -195 -13814 -13630 -6773 -8199 -15206 -11390 8326 18986
156 18986 -3663 -44280 -52980 -6568 45407 36184 -30537 -78162 -48889 24232 55540 9168
168 9168 -59496 -71927 -17960 39372 38057 -16347 -65104 -57326 -2434 40731 28050 -24207 -60334
181 -60334 -45253 2478 32290 17963 -20301 -43300 -33215 -2566 21179 16355 -13559 -37438
193 -37438 -27111 9011 29351 7828 -31207 -38829 -1712 34577 24494 -18481 -40323 -14544
205 -14544 25898 31060 -2325 -31463 -19665 17662 33293 7836 -27815 -28819 8064 41289
217D1289j2643m5999k4387K6393M6796J2028l4418l9419L65L4656K7328q234k8176
230d421j7438P726K1773J5505n603k2496j7522N367K5982K0064q386l1895k0461
243c1805J4541L3779J6109j9509l3253j0703K4235L0785J568k9142k5006R462
255a8939L2848J6652k2726l3473j770L2702K5745j2802l3871j2512K2686K8201
267B2741q10k6351j6934J1888K3497P780j6658k0402k34K0120J7231m645k0646
280c423j3275P614J9044J1245q233j7468p550P747J4082P505o333j4973q654Q988
294c684J8455P655j4498k3092m192K3029K4829m815l0383k0492J4306L1857J1470
307C0445k2427k9678j368K7205K2746q939k9552j5015J7510K9058M675k5938k4743
$$ plain form
217 41289 28646 -17353 -41740 -15347 31449 43477 9059 -30360 -29995 4661 31989 23755 -4421
230 -4421 -21859 -14133 7640 23145 17542 -4954 -22476 -17109 8873 28937 20551 -11344 -31805
243 -31805 -17264 16515 32624 13115 -20138 -30841 -6606 24179 25747 -3395 -28401 -18939
255 -18939 13909 30561 7835 -25638 -27408 5294 31039 18237 -15634 -28146 -5460 22741
267 22741 21931 -4420 -21354 -9466 14031 21811 5153 -15249 -15483 4637 21868 17223 -3423
280 -3423 -16698 -9084 9960 21205 12972 -4496 -12046 -4299 9783 17288 10955 -4018 -12672 -3684
294 -3684 14771 22426 7928 -15164 -19356 3673 28502 23687 -6696 -27188 -12882 18975 30445
307 30445 8018 -21660 -23028 4177 26923 17984 -11568 -26583 -9073 19985 24660 -1278 -26021
320b6021N333K7967J7122j2908k6845r346J7446K1202O79j7123j5266K095J5534
333a31J1672l949j4489j0876L631J5391J2482n311j9127j2743R056K2080J0850
346A8536j2962k3720p907J8552K4306K130k3716k2680N728K9278J7885j5334l1253
359b1157r018K3883K8578q45k8034k1883R858K8274J3045j6009k4009l657J7867
372c107J7710j914j7904j1814N994J6316Q169p997j4104n619R129J2434L312q168
386B437j1031k778P955J1304K924r990j1625o44J2948J2310l298j6646j0235R536
400f833J9240N479j5184j8537J081J9456J5361p641k1460q694J3818J9769K179
413A8034j7291j5905M800J9682J0399j0791j8116m154J4351J5530j397j5388j0658
$$ plain form
320 -26021 -20688 7279 24401 11493 -15352 -24698 -7252 13950 14629 -2494 -17760 -15665 -131
333 -131 11541 7592 -6897 -17773 -14142 1249 13731 8420 -10707 -23450 -14394 7686 18536
346 18536 5574 -18146 -26053 -7501 16805 18935 -4781 -27461 -21733 7545 25430 10096 -21157
359 -21157 -30175 -6292 22286 21441 -6593 -28476 -18618 9656 22701 6692 -17317 -20974 -3107
372 -3107 14603 12689 -5215 -17029 -11035 5281 13450 5453 -8651 -14270 -5141 7293 10605 2437
386 2437 -8594 -11372 -3417 7887 10811 821 -10804 -11448 1500 13810 10512 -6134 -16369 -6833
400 -6833 12407 17886 2702 -15835 -14754 4702 20063 12422 -9038 -17732 -3914 15855 18034
413 18034 743 -15162 -10362 9320 19719 8928 -9188 -13342 1009 16539 15142 -246 -10904
426a0904N913J3713N852o816j1460l289P653R799P12p503q829o70Q300R433r12
441A0992j0414q762K540J1831Q467m780j4471p422R001J5138L492j2999j5011
454a2398M51J6833J3402o987j9805q856J2323J9216L903j7018j7613K864J9469
467E784J2423q412j8791p526J1700J7347K549j4742j3719K007J4657J0644m768
480I153j3953p671O330J3105N738p375j1893m643Q238J2016L098r397j1870j457
494a0581J0919J2090n70j4176j1189M734J6506Q481r704j6886m859J3662J5974
507A4401p43j6487j2898N450J6899Q643r947j6886l683J3233J3559k017j4120
520d596j0274N291J3360N715p632j2212k691P962R361N37q362q061Q13P969O325
$$ plain form
426 -10904 -4991 8722 14574 7758 -3702 -6991 662 10461 11173 3670 -5159 -5829 2471 11904 10992
441 10992 578 -8184 -5644 6187 14654 9874 -4597 -12019 -3018 12120 15612 2613 -12398
454 -12398 -11947 4886 18288 11301 -8504 -17360 -5037 14179 18082 1064 -16549 -13685 5784
467 5784 18207 9795 -8996 -16522 -4822 12525 15074 332 -13387 -11380 3277 13921 9153
480 9153 -4800 -12471 -6141 6964 12702 5327 -6566 -11209 -2971 9045 12143 2746 -9124 -10581
494 -10581 338 12428 11858 -2318 -13507 -8773 7733 16214 6510 -10376 -15235 -1573 14401
507 14401 13658 -2829 -15727 -10277 6622 15265 5318 -11568 -15251 -2018 11541 9524 -4596
520 -4596 -14870 -9579 3781 9496 1864 -10348 -13039 -5077 4284 4821 -3541 -11602 -10789 -2820 3505
535C505j896p981o085K727Q851M945n042r233l583O881R713J614q996r192J720
550a2052J0954P278m627j1556m608Q859J1775O75j0612r045L481J1966O908o405
564B991j1602k958R821J0885p69j0468p375M016J1116N004n742r412k286P772
578I93Q471N96q087p238K334Q742N868l512q259m379M461Q716L475o348q322j875
594d364P100Q632o8q985q380K604J0042O609n242j1453m747P603J1660R33j0780
609A164j0229J219J2000Q204n638j3088n533Q143J1611J304r824j0723Q35J1068
623E13Q088m412j1335n784N735J0391L265p297r469j416P664Q561m09q429p368
638a1702J713R275O107l642r037n035N220J0005L935p145r526r96Q833R299j243
$$ plain form
535 3505 1609 -6372 -12457 -9730 -879 4066 -976 -10209 -13792 -6911 2802 4416 -4580 -13772 -12052
550 -12052 -1098 6180 1553 -10003 -14611 -5752 6023 6698 -3914 -12959 -9478 2488 9396 2991
564 2991 -8611 -11569 -1748 9137 8368 -2100 -9475 -5459 5657 10661 4919 -4493 -6779 993
578 993 9464 10060 1973 -5265 -2931 5811 11679 8167 -92 -4471 -10 8706 12181 5833 -2489 -4364
594 -4364 2736 11368 11300 2315 -6065 -3461 6581 13190 7948 -3505 -8252 -649 11011 11944 1164
609 1164 -9065 -7846 4154 12358 6720 -6368 -11901 -3758 7853 9157 -667 -11390 -10555 513
623 513 8601 4189 -7146 -12930 -7195 3196 6461 -836 -10305 -11721 -4057 4504 4095 -4334 -11702
638 -11702 -9989 -714 5393 1751 -7286 -12321 -7101 2904 6839 -306 -9832 -10828 -1995 7304 6061
653F061j0021o902M122J0868N525o528j0108j928Q552R458m80r348o774L881R744
668F122M296m974q560j801O581P443K87o932n740J447P264M686l019o662l328
683b890M143O283K109n097o055r06N747N484j031o315n011K366O696L311m326
698D508p237j835N853O244o30p089n669K598P363L842n262p238j652N668O428
713E892k39p303n866K792P360L461m061p397j918N633O576j75o641n425J696P139
729A524M362l092o938k766M475O722J530n460n935o2O602N586j499o848m705L832
745b672P182L588m484p528j433N585P213O10p101o114J849P885N305l788p786
760a689l174M834Q546J344o903p669Q91P613O048k207q263m689M087P922K707
$$ plain form
653 6061 -3960 -10862 -6740 4128 9653 3125 -6983 -8911 -359 9099 8619 -729 -7503 -3622 6122
668 6122 10418 5444 -3116 -4917 1664 9107 9394 2462 -3278 -1831 5433 10119 7100 438 -2890
683 -2890 1253 7536 9645 4548 -1507 -2413 3334 8818 7787 1472 -3539 -1173 5523 8834 4508
698 4508 -2729 -4564 1289 7533 6903 -186 -5855 -3257 4106 7948 2686 -4552 -6204 -536 5892
713 5892 5653 -1650 -7516 -4724 2636 6097 2036 -5361 -7279 -1646 4930 4755 -1886 -7311 -5615 1524
729 1524 5886 2794 -4144 -6910 -2435 4287 5817 357 -5578 -5640 962 6548 5049 -1799 -6504 -2672
745 -2672 4510 8098 3614 -3914 -5347 238 7451 8061 960 -5154 -3305 4580 9885 6097 -1689
760 -1689 -4863 -29 8517 9861 2958 -4711 -3820 3793 9841 7634 -629 -5318 -1231 6691 9398
775I398n405p273j224O146O621p26p326n193K388O734M129l759p364k428M358
790i24O519J207n485o302R7N685N607k197o726l839K807O685L125n078o672j003
806f494N617N838j025o030m798K083O263L628l916n901k126M635N578J78n448
821a918m926J742N767K876k626n362j975L247N082R93m330m217J35M267M060j526
837A289m973k616K511M989J347l636m687l34M845L928j386m796l276K484N175
852H64K115l649m890n73L936M489p94m651l759J941N827K091k919n477r72M322
868b099M698k92m557m319J744N201L324k429n226k366L555N509J270m843m469
883e299M15N361M133j782n603l073L221N109K577l587n286r36M556N259n42n205
$$ plain form
775 9398 3993 -3280 -4504 1642 8263 7537 211 -4982 -2594 4140 8269 4510 -2854 -5282 -924
790 -924 5595 6802 1317 -4985 -4888 797 6404 4207 -2519 -6358 -3551 3134 6259 1181 -5491 -6494
806 -6494 -877 4961 3936 -2094 -6892 -4809 1454 5082 1166 -4735 -6861 -2226 3352 3530 -1918
821 -1918 -6844 -5102 665 3541 915 -4447 -6422 -3175 1907 2900 -1430 -5647 -5512 -1245 2815 1289
837 1289 -3684 -6300 -3789 1200 2547 -1089 -5776 -6110 -1265 2663 1277 -3519 -6795 -4311 864
852 864 2979 -670 -5560 -6133 -2197 2292 1498 -3153 -6912 -4971 856 2947 28 -5449 -6421 -2099
868 -2099 2599 2307 -2250 -6569 -4825 376 3700 1271 -3955 -6321 -2766 2743 4013 -830 -5299
883 -5299 -4884 477 4610 2828 -2775 -5848 -2627 2482 5059 1472 -3814 -4750 -194 5065 4523 -682
899f82l910J705O028L051k812o035j746M115N568J022n008m911N42N171M537j668
915D967n582l487K822N715J999m231n492l57N070M500m03n583l982J865N923K456
931F200l059m936k048L624N139O95m696m668P85M706L548j615n174k434K732M899
947C698J094l434m681j05L794L890n82m482l250J871M464K205k850m659q85L751
963a61L654q8m057k898J105M121K498k306l748j700K746L527P70l307l401N36
979b709L784K241j376l915j534K590L499Q14l165l217QL678K626p47m087k030
995c540J702L970J388l254l165n21L845K702p37m277j918K032L690J454k737l661
1011c027p18L401L537n89l739k821J321L816K310k331m020j456L344L773M45l774
$$ plain form
899 -682 -4592 -2887 3141 6192 3380 -2655 -4401 -286 5282 6304 1296 -3615 -3073 2098 6635 4967
915 4967 -615 -4102 -1280 4435 6434 2203 -3289 -3646 1424 5924 5521 -62 -4044 -2179 3744 6200
931 6200 3141 -1795 -3843 -219 4920 5615 919 -3749 -2964 1742 5290 3675 -1499 -3933 -1201 3698
947 3698 4792 1358 -3323 -3428 366 4256 3674 -808 -4058 -2187 2277 4482 1632 -3027 -3912 -161
963 -161 3493 3405 -652 -3550 -2445 1676 4174 1868 -1880 -3580 -834 2693 3463 156 -3245 -2709
979 -2709 1075 3316 1940 -1975 -3509 -919 2580 3394 229 -2988 -2980 698 3324 2577 -1510 -3540
995 -3540 -1838 2132 3520 266 -2899 -3420 425 3127 2390 -1887 -3805 -1773 1917 3371 634 -3027
1011 -3027 -3745 -344 3193 2604 -1135 -3956 -2635 1181 3491 1160 -2860 -4316 -972 2801 3246 -528
1027e28l557O00M144K992j741m153k389K398M742J056l101m184q5L723L627n83
1043B961m408k940K007M324J841k543m156r48K873M033L77l795l658R70L891L414
1059D243j918m306k207K573M072J312l295m076o8L950L436p70m185k772J406M264
1075A659K258k631m124n88K795L573J00l579k800M15M236K220j672l953j512K244
1091a359L761O59k598l461nL271L021p77l670k105J475L511J394k310l113j39
1107b445K552K668m76l147j678R48L248J264j724k688j177K538L099m69k825j911
1123b223P68K785J603j496l074m84J919K537P36k758k384K65K940J898j285k852
1139a105j369K007K889N58k576k591K39K583K582j328l009j545J422L318J010
$$ plain form
1027 -528 -4085 -3485 659 3651 1910 -2243 -4632 -2234 2508 3564 463 -3721 -3806 -83 3544 2961
1043 2961 -1447 -4387 -2380 1944 3785 1242 -2914 -3862 -989 3044 3421 -374 -4032 -3062 829 4243
1059 4243 2325 -1981 -4188 -1615 2457 3769 474 -3602 -3670 280 3716 2946 -1239 -4011 -2605 1659
1075 1659 3917 1286 -2838 -3426 -631 2942 3042 -537 -3337 -2922 1314 3534 1862 -2091 -3603 -1359
1091 -1359 2402 3061 463 -2998 -3003 268 3289 2512 -1158 -3263 -1788 1723 3117 807 -2306 -2445
1107 -2445 107 2775 2299 -848 -2526 -1578 1670 2934 1210 -1478 -2655 -117 2982 2513 -312 -2223
1123 -2223 -1455 1330 2933 1437 -1637 -2121 -202 2335 3071 313 -2071 -1806 1134 3032 1747 -1105
1139 -1105 -2474 -467 2422 2980 404 -2187 -1948 635 3217 1889 -1120 -2665 -1243 2075 3085
1154C085k724k467o36K945K746r18l373j492J036L589J007j733l630o51K797L032
1170B613m04l027k271N40L148K449j442l819j431K336L546M80k910l062L92L147
1186B85K767j276l272j877J528L555J522k078l551o25K527L350j57l298k604J287
1202a917L242J925j556l404j372K175L540M30k774l043N82K687K946q84l503j985
1218b911J472L343Q44j728l109o98K919K355k61l053k040J236K691J496j682k797
1234a923j117K173K705n0k010k307J04K290J935r28k473j000J085K570O20j952
1250b78k152k25K267J868m88k472j253J074K507Q83j630k514j03K272J874n51
1266A079k075j806J419K314Q33j390k255m06K202J904l4k062j581N11K453J567
$$ plain form
1154 3085 361 -2106 -2742 203 2949 2031 -1342 -2834 -1798 1791 2798 1065 -2565 -3216 -419 2613
1170 2613 2209 -818 -3089 -2549 599 3048 1606 -2213 -3644 -1308 2238 2718 -192 -3254 -2862 285
1186 285 3052 1776 -1496 -3373 -1845 1710 3232 1154 -2397 -3022 -495 2855 2698 -600 -3204 -1917
1202 -1917 1325 3250 1694 -1710 -3082 -907 2633 3063 289 -2754 -2172 515 3461 2577 -926 -2911
1218 -2911 -1439 1904 2748 1020 -2089 -2787 132 2487 2226 -827 -2867 -1631 1060 2556 874 -1923
1234 -1923 -3040 -867 1838 1788 -222 -2529 -2425 -135 1800 872 -1601 -2601 -1516 1054 1674 -278
1250 -278 -2430 -2655 -388 1480 992 -1480 -2733 -1659 848 1731 101 -2413 -2516 -244 1630 1079
1266 1079 -996 -2802 -1383 931 1764 374 -1881 -2287 -85 1819 1785 -277 -1858 -1347 1106 2673
1282B673j775k046o25J733K374o8k034j917O19K366J431j040k428j207J847K479
1298B382L67j866k669O62K663J327r52k323j454J305K839O65j839k652k30K638
1314H63J999j29l183j695J130K578J272j577k623j038K390K529J74k882k054N02
1330a744K481J836j325k217j463J250K877Q37k212k440j64K495K094m46k767j536
1346b444Q96K411J441j315k684p06J986K200K90j893k500N01K638J634j017k794
1362a356r58R16L062O44k066k121K07K091J656m18k311j405R95J886J223j360
1378F85k235k00J894J552j1j962j375O80J890Q99q75k085n81J535J579M33j695
1395A28j671L49J738J331q63j770o98R82J692L24j168j714j51J861J237n84j568
$$ plain form
1282 2673 898 -1148 -1773 -40 2334 2266 232 -1685 -1066 1300 2731 1691 -737 -1944 -97 2382
1298 2382 2749 883 -1786 -1124 1539 2866 1914 -409 -1863 -558 2281 2946 1107 -1545 -1775 863
1314 863 2862 2733 -450 -2145 -1015 1563 2835 1258 -1365 -2403 -13 2516 2690 -192 -2246 -1744
1330 -1744 737 2573 1248 -969 -2432 -1182 1695 2532 320 -2120 -2284 211 2305 1859 -908 -2444
1346 -2444 -1548 863 2304 989 -1695 -2401 -415 1785 2075 182 -2318 -1817 821 2455 1438 -1356
1362 -1356 -2314 -1398 1664 2308 242 -1879 -1672 419 2075 1657 -654 -2059 -1064 822 2045 685
1378 685 -1550 -1750 144 1696 1685 -277 -1652 -972 918 1817 942 -1143 -1724 -189 1390 1823 128
1395 128 -1543 -1194 544 1875 1012 -758 -1456 -474 1218 1542 374 -1340 -1491 370 1607 1023 -545
1412e45p66N02J782N62j267j828L47J427J233k00j695j356J225J709M95j369j741
1429a485j42J941J106l48j651j194R60J477P89p50k057m04J503J564J88j666j527
1446a696L90J864J375j130j989q23J580J641L61j745j444l81K030J862p66j685
1462e56j637R77K592O94j731j953o80J876J747K31k119j229K68K191J174q74k229
1479a258r23J584J997L36j778j577k79K032J644p07k117j068J052J836R40j283
1495D31j968m48J604K135m79j708j685N71J893J296p69k047o97J325J670N42j569
1512I7j765K08J669J406m85j844j175J062J676Q15j377j661n2J447J337o88j133
1529d63q08O52J339P03p30j334n20J133J099R4j255r32M15J181N12l70j197r32
$$ plain form
1412 -545 -1311 -809 973 1535 268 -1560 -1213 214 1447 1247 -448 -1804 -579 1130 1625 256 -1485
1429 -1485 -1627 314 1420 1072 -579 -1773 -813 664 1453 703 -1354 -1758 -255 1309 1497 -169 -1696
1446 -1696 -1306 558 1933 803 -1186 -2009 -429 1212 1573 -172 -1616 -1997 33 1895 1129 -556
1462 -556 -2193 -1216 1376 2070 339 -1614 -2294 -418 1329 1560 -559 -1788 -1520 671 1845 971 -1258
1479 -1258 -2181 -597 1400 1736 -42 -1619 -1898 134 1778 1071 -1046 -2114 -1062 774 1714 431
1495 431 -1537 -1985 -381 1754 1275 -433 -2118 -1547 346 1642 873 -1174 -1871 -546 1124 1666 97
1512 97 -1668 -1460 209 1615 1130 -714 -1889 -827 849 1664 287 -1374 -1426 21 1358 670 -463
1529 -463 -1271 -619 720 1423 693 -641 -1161 -28 1071 1165 -90 -1022 -607 574 1086 716 -481 -1413
1547a413J268J209o5j016r10j3J530J073r44j277p33J170Q47L36j112q62q1J283
1565B90P50l59j439m17Q94J245K71j161j116M3J112J287n48j264p44O83J449L13
1583A289j168j155j27J432J186l32j419r69qJ968J113j340j445o39Q76K222r9
1600A385j261j614K61J810J029o64j696p70J055J418P46j623j312k8J541J349
1616A626j33k081p87N52J498R48o95j983m15J149J538j99r85j661M17J458J262
1633A509p28j517j007R96J762K00j194j179K01J019J111p2j470o89L83J313N37
1650A175q63j100n52J137J068J5j068p91j90J645O69k57j673m19R12J037L69j159
1668d5r02j90J281P72l57q96p66M99J286K75p62r52j43Q92N93o8o80q98L75J114
$$ plain form
1547 -1413 -145 1064 999 -17 -927 -940 590 1663 719 -558 -1291 -121 726 1062 -50 -912 -993 290
1565 290 1040 681 -758 -1175 -281 964 1235 74 -1042 -999 113 1400 852 -412 -1156 -473 976 1289
1583 1289 121 -1034 -1161 271 1457 1125 -294 -1263 -1271 697 1810 470 -975 -1614 -738 1484 1385
1600 1385 124 -1490 -1229 581 1610 946 -750 -1520 -465 953 1699 76 -1236 -1264 277 1626
1616 1626 1493 -588 -1375 -823 675 1623 928 -1055 -1470 -321 1217 1018 33 -1628 -1211 247 1509
1633 1509 781 -736 -1743 -747 1015 1215 21 -1158 -957 62 1173 1101 -369 -1058 -675 638 1175
1650 1175 312 -788 -1340 -203 865 880 -188 -979 -1169 476 1145 888 -785 -1204 -292 745 1114 -45
1668 -45 -947 -1137 144 916 559 -337 -1103 -604 682 957 195 -757 -900 -8 585 517 -163 -1061 -686 428
1688D28M74p94o37l85P09P44L49q66r86N09Q19N70o16r77m21R31P93J49q70r26
1708a003K06R47N65q0j210n08R00Q07J21o20j066K40R33P32k69j531j95M71J555
1727I95j25q07p51k82J138O10q3j139m62M67J040M92o93j432J60Q73R25J90j140
1746b4p35J73J148L16j62j164p06J007P51L90r49p94k35J309J202m31j342r16
1764a162P30O84Q29p80j268J19P15Q51K30j027p45N4J099O98j90j216p99J065
1782a13J177p3r56j000P5J083N97n0j222k88j1J332K06m59j119pN04J143j31n96
1802I2o38Q2Q12O01l00r95l08M71Q13k6o44p71K21J026N86p08n54m03N94N54K35
1823G40o25n14k60Q63L04L76j245j63P33J57K19k73p92l62P69N66nq35j72L45
$$ plain form
1688 428 902 108 -529 -914 -205 539 888 22 -964 -455 364 934 318 -659 -1080 -149 644 793 -77 -1003
1708 -1003 -797 150 715 635 -575 -1083 -183 624 745 125 -941 -701 232 964 695 -836 -1031 -560 995
1727 995 870 63 -688 -970 168 778 695 -444 -906 -439 601 1093 400 -1032 -872 1 926 1116 -24
1746 -24 -759 -586 562 878 716 -448 -1154 -147 604 994 45 -749 -984 325 1527 1096 -246 -1162
1764 -1162 -432 252 1081 301 -967 -848 -133 718 948 -79 -824 -770 329 1027 837 -379 -1178 -113
1782 -113 1064 991 35 -965 -890 193 790 740 -482 -770 -781 551 757 298 -821 -828 -324 819 688 92
1802 92 -546 -464 348 949 649 -346 -654 -183 630 604 -40 -811 -590 436 1022 314 -240 -643 -49 505 740
1823 740 115 -399 -659 204 508 884 -361 -524 209 366 585 312 -480 -842 -73 493 488 -347 -519 -174
1843a74N02J45l62n50N2N69M00j56m82p99M59M21O88p60m40m01P10N77Q6m66p11
1864f92Q3Q51K61m9p41o04R54L38K07m98q27J58N04P89n58m79l23J12J023J70
1884F79p82m50M6L66R92l29r68k63J1J156J96l88o00m03R73N64J38r10p31m8R92
1905B41O28l35r59l88M95P95L31p90o70j24Q26Q37j66q77m74J45Q51M24n36o97
1925d43j73M39M59J83k72j013M01Q58R7J13j007l47M15M64J55k61m89n6P21J94
1945D38j76l56k64M9L90K81m63k30QL32M98j60n30n8m16R24Kl07n74pM41O33L2
1968D87l66k83l46N16M18j18l15l47L15N32k91k06l56p2M81K54r4m31j65j26R99
1989D86m6o53j58Q9Q2O35m77L2p06M31O47L10m61p55m7O37L25J00o48k08P6P30
$$ plain form
1843 -174 328 473 111 -439 -387 182 582 426 -56 -855 -396 25 713 -47 -487 -888 -178 399 485 19 -692
1864 -692 -609 242 503 454 -287 -891 63 401 608 110 -717 -559 -55 734 176 -303 -626 -514 509 679
1884 679 -103 -553 -507 -141 851 522 -446 -709 -698 458 654 266 -334 -737 236 800 938 28 -703 -751 241
1905 241 869 534 -425 -813 -318 477 808 18 -652 -776 50 887 721 -156 -630 -485 366 790 254 -443
1925 -443 -616 -177 282 465 193 -820 -419 439 536 649 -358 -705 -290 174 329 68 -421 -477 244 438
1945 438 262 -94 -358 -309 81 362 -101 -331 -323 9 507 347 -183 -241 -657 267 269 -38 -612 -619 -178 455 487
1968 487 121 -162 -508 8 426 308 -7 -354 -39 493 202 -4 -360 -432 49 303 209 -222 -387 -513 486
1989 486 440 -213 -371 -282 -200 435 -42 -10 -716 -285 362 672 211 -544 -591 46 371 471 -177 -385 -309 421
2011D21J51m12n26n46P79O14j13n72k60r8Q38N58p28n89J59JP64r2o01l23J20
2032d55L93N16N6n81n76K14O39O40p81n82L4P54J08m6m78k06J8M66M39l00l76
2053a04m86L28O97L41n47o74j79M45R32p1p92l68k08R40L70k59p07L1L51L74p2
2074C42m27m88J71L21P19k40l66k95R9N84K92k27r60N0N22J81j07n28M0K0O70
2095C73j44J46l93l95N36L26K34p22K0k01K13N12j20o37Q2J58J88J98n30j83Q9
2116b50L11N16l62m05K07j24M28n3m8q66J69O31J15k6j15m00J97Q5K89k94l11
2137c06j61N67J32K74m76k52n8M32K15k49l77L7N3L18L48o48l98K95L93j4j25
2158@n74o5O22M12J85q79r3L30K27K18j07o67J00K79K59J22o37j23j71M97M17
$$ plain form
2011 421 572 160 -366 -912 -133 481 368 -204 -464 -562 276 834 106 -483 -324 -323 441 349 -252 -575 -455
2032 -455 -62 454 510 -71 -647 -433 206 846 65 -517 -483 271 379 333 -145 -351 -333 133 572 272 -104
2053 -104 -590 -262 435 776 229 -445 -624 -179 753 682 -110 -478 -686 254 624 365 -342 -311 40 414 342
2074 342 -85 -573 -402 -81 638 398 32 -263 -164 420 712 485 -475 -425 97 278 171 -357 -317 -297 373
2095 373 229 375 -18 -413 123 449 683 -39 -19 -220 -7 505 385 -252 -170 -12 176 374 -156 -339 -250
2116 -250 61 577 215 -190 17 -107 321 268 220 -646 -477 154 269 243 128 -272 -75 10 299 5 -306
2137 -306 -467 100 232 506 30 -222 -280 152 367 118 -259 -222 -169 149 497 -151 -549 -254 139 125 0
2158 0 -574 -639 -17 395 580 -299 -392 -62 165 383 276 -391 -291 -12 247 369 -268 -391 -562 -65 352
2179C52l19o25K75J73N27m3m24j25j69K36M60J33l85j66k7L38K03j3k48o28K04
2200b71O54L5l20l13k34N61M32k53l45j61lN24K45m55l7l48K98N68m69j11n84
2221e87J79M56L54k34l66m41M35N83l81J5j57l7J51M33l64l2k57L81R1nj28m22
2243c33j27K06N85l25m5j38J37N08m08J33l48m4J35M36m08J84o63J83N19j01J12
2264A98n43K71J23J40J07n45K20j38K72K73k51m38J17J33L98j54l97O6Q3J14M90
2285E39k40n85J00P0L24P4k14l60J93J99N10l33j87m48K02N30K9n84l8J1K49K38
2307B79K32n60m41K34N74j69P7n24n0K01Q69l83n01p6K38P6L01j48m35l9L52J67
2329B74Nn84J2m4P1P32j87m42k98K71M74K81n45j21k66L97K94j62l55Q5o52P03
$$ plain form
2179 352 33 -592 -317 -144 383 340 -84 -209 -378 -142 318 451 66 -100 -127 211 414 401 153 -475 -271
2200 -271 383 418 98 -215 -449 112 544 291 -54 -215 -218 306 551 96 59 -289 9 577 108 -3 -587
2221 -587 -408 48 402 168 -198 -639 -204 379 -2 13 -144 -181 -30 403 39 7 -250 131 222 217 89 -333
2243 -333 -460 -254 331 6 -39 -177 -40 468 60 193 -155 -199 -64 372 -36 148 -515 -332 187 86 198
2264 198 -345 -74 49 189 296 -249 -29 -167 105 378 127 -311 -194 -61 337 183 -214 -148 -65 49 539
2285 539 299 -286 -186 -116 208 282 68 -292 -99 100 610 277 90 -358 -156 374 403 -181 -219 -208 41 279
2307 279 511 -49 -490 -256 318 149 226 -298 -348 -147 722 339 -162 -238 0 76 377 229 -206 -245 107 274
2329 274 279 -305 -293 -337 -266 466 279 -163 -461 -190 284 565 20 -101 -367 30 324 162 -193 -108 -760 -57
2351e7J11J93m38J15p9N2L63J39o41k04O66Q3L4l77j81K08M13N5k86l39j14K26
2373e8J54K16j74m96L67j2K41j56j99k15L27J9L44l63k16q7L49j97J96O1l16N6
2395a59j11M21P0n72J67K38Q3J23n43K17j27L05m3n2k48o8K43J95k01L0j16j58
2417c06O05j0j99l21J82J1N67l40m08j71L56K29N1m6j29l09M85J10o2l16j11J30
2439bM0K53j57j50m57P37j36L31m04m27K76K63r8K31q50J04L58K88K31n77O1j63
2461b48K91K17rk17l88M31L38l17m38K6J95Q3L18j50j90m35M46nK94k58J00k94
2483b10K56J79K8r9k85K1L75l02k9K11k91J7L88J33l57j80J67k09N22P5o02K9
2505a63L9M08J7k86j6k93K98K2J71k36l15L12M17J2k95j03m14L22K84J16l75l15
$$ plain form
2351 -57 54 247 -191 -76 -155 -103 260 399 -242 -446 220 303 337 -40 -221 -13 400 455 169 -170 -284 -58
2373 -58 96 312 138 -358 9 -3 238 82 -117 -332 -5 14 358 -5 -221 -308 41 -156 40 101 -215 -159
2395 -159 -270 151 221 -351 -184 54 137 260 -283 -66 -193 112 69 17 -231 -299 -56 139 -62 -32 -148 -306
2417 -306 299 289 90 -231 -49 -38 529 189 -219 -390 -34 195 246 200 71 -238 247 357 295 -21 -132 -2
2439 -2 38 291 134 -16 -473 264 128 459 55 -372 -96 167 69 300 -550 -446 -88 200 431 -146 -85 -248
2461 -248 43 260 251 34 -354 77 415 98 -340 -314 -119 -36 282 132 -58 -493 -47 -52 242 -16 84 -210
2483 -210 46 225 253 154 -131 -110 265 -37 -66 145 -146 -129 259 392 35 -145 22 -187 335 410 -192 -163
2505 -163 -124 284 301 15 -1 -294 4 26 197 -39 -354 -42 375 387 92 -11 -425 -103 181 297 -78 -393
2527c93K50L33r2K43l36N5j04J17M9k39q1j56O7K18J72l30K55j2k78M84j45j97
2549a20l75J14M24N6k45j14j24Q87k86Q3m64l69P91m4j60o3m9j61K35L61l05k09
2571a37J78k07N22l53J23k76J34L58j45k17k19L7J43O6N7j22J8l46K06N05p8j50
2593I7k62RPO45l26k67q6m0N02j57J6m40K03L3L99k7m04j27J33L04K03l69l72
2616c26O0L99L07l82j93j82K53N14j72k09l35K91o4N8R7L6q7q3m8J14K13k57k70
2639b66j3M38k62J45k18K60j01o5J52q2k70K06m8L40j34j30O0j08K34O4N9p45
2661d84K12K21P3K77l24m01K59J63J60k24j25k4J83K39k7l25lj81K80K48m49M11
2683A59l36K91K32k82k31K79j11m1L22m06P4M9J39J15k90K86j02l91L06J8Q1l05
$$ plain form
2527 -393 -143 190 98 341 5 60 -44 73 122 -117 -198 -354 -287 -69 103 -227 28 16 -262 222 77 -120
2549 -120 -495 -381 43 99 -146 -260 -384 503 217 300 -164 -533 258 214 54 -9 -58 -219 16 377 72 -137
2571 -137 41 -166 356 3 126 -150 -16 342 197 -20 -239 -202 -59 7 64 -58 -40 -386 -180 325 247 97
2593 97 -165 -156 -149 496 170 -97 -183 -223 279 122 138 -302 -99 -66 333 306 -98 -225 -92 212 415 46 -326
2616 -326 -266 133 440 58 -135 -317 -64 450 278 69 -266 25 -39 19 116 152 65 -18 -66 48 261 4 -266
2639 -266 -279 159 -103 42 -176 84 -17 -82 70 -12 -282 -76 -124 216 82 -48 12 -96 138 202 261 -484
2661 -484 -272 -51 22 299 -25 -426 -167 -4 156 -68 -193 -217 -34 205 178 -147 -150 -331 -51 197 -252 159
2683 159 -177 114 346 64 -167 112 1 -40 282 -124 -50 -1 138 253 -37 249 147 -244 62 80 161 -144
2705a44J83n3K60M5k88k1n6K67j27L38k57o10K31N27r9j94k90K20J82K49j31l81
2727a49j38J40K76O9k27j10q4P9M41k78J1j46L64q7o5k97Q4q1n7N0K28j47J61
2750C7j83J83J51j1j81n04K94N5L46m19K75k67R8J55R8J58o08L26O9L16j31j56
2772A01k40N01r9j32O2l13O0M3O6l9l37K98rO5P9J79l36j55J82M2j5Pj29J57j95
2797a57J76L57k31l00M23J5r9L1k92j8l2K79N2l85M1j21L96L7l44K01j57K69K3
2820A64q1j88p1k3J91j08kJ48m4L88k45k79l2N1p9J65J18j60p2o8p9M47K21k58
2844A04l22K34j42L55L2k93k22J41O21m26j9k18J03L23l16M3k11k08L65Nq2J1
2866a22j11J46Q9M9m5k39K86l66P90l21j66j54J13J64k07L49l52r1l6K47q4K16
$$ plain form
2705 -144 39 -14 246 291 3 -18 -74 193 66 404 147 -463 -232 295 196 2 -288 -68 114 363 232 -149
2727 -149 -287 -147 129 198 -29 -139 -223 -144 297 19 30 -116 248 161 96 -201 -117 -198 -255 -205 23 -124 37
2750 37 -146 37 188 177 -4 -508 -214 -159 187 -232 43 -224 -126 29 127 285 -323 3 72 388 257 101
2772 101 -139 362 263 131 193 -120 -60 -17 49 10 -327 -29 -38 27 106 285 -51 -206 -24 18 3 10 -119 38 -157
2797 -157 19 376 145 -155 268 283 184 215 -77 -95 -127 152 204 -181 -140 -261 135 172 -172 29 -128 141 164
2820 164 83 -105 -176 -199 -8 -116 -118 30 -14 374 129 -150 -182 -131 -210 -45 73 -87 -159 -227 -306 141 362 104
2844 104 -218 16 -126 229 261 -32 -254 -113 508 82 63 -155 -52 271 -45 -2 -213 -421 -56 -51 -133 -122
2866 -122 -233 -87 2 51 6 -233 53 -313 477 156 -10 -164 -51 113 -94 255 -97 -188 -224 23 -61 155
2888A55l68L11m5L5N9m34R7J21p8M22N7km30R0J62j48j12o7K03Q3r2J31l20K0
2912a50J82K6K92l36O3k42J30q0J85j08J04j82K73N0j26j58M6O6N2J95l36Pp0
2935a17L94l25J97j48J12l6j98J19J66n1k48l1K84j62P5O4k33J54r1K91m03k1
$$ plain form
2888 155 -213 98 53 88 147 -287 -190 -69 -147 275 332 330 -100 -10 152 4 -108 -175 28 111 19 150 -170 -150
2912 -150 32 58 350 14 77 -165 -35 -115 70 -38 66 -116 157 207 81 -77 -31 35 87 282 -54 -47 -117
2935 -117 277 -48 149 1 113 77 -121 -2 164 113 -135 -166 118 -44 31 95 -138 16 -75 216 -187 -208
$$ [...]
8191A
##END NTUPLES=NMR FID
##END=
