##TITLE=C13_TG-2351x
 DMSO, 1900 sc

 3.6.2022
##JCAMPDX= 6.0         $$ Bruker NMR JCAMP-DX V2.0
##DATA TYPE= NMR SPECTRUM
##DATA CLASS= NTUPLES
##ORIGIN= UXNMR, Bruker Analytische Messtechnik GmbH
##OWNER= root
$$ XWIN-NMR		Version 3.5
$$ Fri Jun  3 16:37:50 2022 Russian Standard Time (UT+4h)  she@DPX200
##.OBSERVE FREQUENCY= 50.327896
##.OBSERVE NUCLEUS= ^13C
##.ACQUISITION MODE= SIMULTANEOUS
##.ACQUISITION SCHEME= undefined
##.AVERAGES= 1901
##.DIGITISER RES= 17
##SPECTROMETER/DATA SYSTEM= spect
##.PULSE SEQUENCE= zgpg30
##.SOLVENT NAME= CDCl3
##.SHIFT REFERENCE= (INTERNAL, CDCl3, 0, 222.089)
##AUDIT TRAIL= $$ (NUMBER, WHEN, WHO, WHERE, WHAT)
$$ ##TITLE= Audit trail, XWIN-NMR		Version 3.5
$$ ##JCAMPDX= 5.01
$$ ##ORIGIN= Bruker BioSpin GmbH
$$ ##OWNER= she
$$ F:/spectra/data/she/nmr/c13/1/pdata/1/auditp.txt
$$ ##AUDIT TRAIL=  $$ (NUMBER, WHEN, WHO, WHERE, WHAT)
(   1,<2022-06-03 16:36:33.18 +0400>,<she>,<DPX200>,
      <created by zg, POWCHK disabled, PULCHK disabled
       terminated by command 'halt'
       configuration hash MD5:
       00 E9 B6 7A A2 85 ED C7 34 08 36 98 17 FE 4E 26
       data hash MD5: 32K
       AA 04 97 2E 91 57 2E 74 6D D9 3B 10 FE 6B 7D 28>)
(   2,<2022-06-03 16:36:36.87 +0400>,<she>,<DPX200>,
      <Start of raw data processing
       efp BC_mod = 2 LB = 1 FT_mod = 6 PKNL = 1 PHC0 = -363.9546 PHC1 = 21.48472 SI = 32K 
       data hash MD5: 32K
       F3 E9 B4 F2 00 2F D9 A8 77 6A 2E E5 69 D4 0A BC>)
(   3,<2022-06-03 16:36:39.84 +0400>,<she>,<DPX200>,
      <abs ABSG = 5 
       data hash MD5: 32K
       E0 BE 15 96 1F 54 53 8E B4 E7 6F 38 CA 6E 6F 5B>)
(   4,<2022-06-03 16:37:18.92 +0400>,<she>,<DPX200>,
      <pk PHC0 = -3.851022 PHC1 = 7.199999 
       data hash MD5: 32K
       62 AA A7 39 76 B1 C1 B1 6F 11 06 7A 9D 9D D3 B1>)
(   5,<2022-06-03 16:37:22.67 +0400>,<she>,<DPX200>,
      <abs ABSG = 5 
       data hash MD5: 32K
       E6 4E 72 D2 7E 6D 1E CA A4 96 5B 32 4E C0 86 E1>)
$$ ##END=
$$ 
$$ hash MD5
$$ 1A C3 6F 0A C8 1D 80 32 19 5B E9 55 3B 53 AE 6E
##$RELAX= 
##$RELAX= 
##$RELAX= 
##$RELAX= 
##$RELAX= 
##$RELAX= 
##$RELAX= 
##$RELAX= 
$$ Bruker specific parameters
$$ --------------------------
##$DU= <F:/spectra>
##$EXPNO= 1
##$NAME= <c13>
##$PROCNO= 1
##$TYPE= <nmr>
##$USER= <she>
##$AMP= (0..31)
100 100 100 100 100 100 100 100 100 100 100 100 100 100 100 100 100 100 
100 100 100 100 100 100 100 100 100 100 100 100 100 100 
##$AQSEQ= 0
##$AQ_mod= 1
##$AUNM= <au_zg>
##$AUTOPOS= <>
##$BF1= 50.322709
##$BF2= 200.13
##$BF3= 50.322709
##$BF4= 500.13
##$BF5= 500.13
##$BF6= 500.13
##$BF7= 500.13
##$BF8= 500.13
##$BYTORDA= 1
##$CFDGTYP= 0
##$CFRGTYP= 5
##$CHEMSTR= <none>
##$CNST= (0..31)
1 1 145 1 1 1 1 1 1 1 1 1 1 1 1 1 1 1 1 1 1 1 1 1 1 1 1 1 1 1 1 1 
##$CPDPRG= <waltz16>
##$CPDPRG1= <>
##$CPDPRG2= <waltz16>
##$CPDPRG3= <>
##$CPDPRG4= <mlev>
##$CPDPRG5= <mlev>
##$CPDPRG6= <mlev>
##$CPDPRG7= <mlev>
##$CPDPRG8= <mlev>
##$CPDPRGB= <>
##$CPDPRGT= <>
##$D= (0..31)
$$ [...]
##$SUBNAM4= <"">
##$SUBNAM5= <"">
##$SUBNAM6= <"">
##$SUBNAM7= <"">
##$SUBNAM8= <"">
##$SUBNAM9= <"">
##$SW= 239.972175391363
##$SWIBOX= (0..15)
0 1 3 0 0 0 0 0 0 0 0 0 0 0 0 0 
##$SW_h= 12077.2946859903
##$TD= 32768
##$TD0= 1
##$TE= 0
##$TE2= 300
##$TE3= 300
##$TEG= 300
##$TL= (0..7)
120 120 120 120 120 120 120 120 
##$TP= (0..7)
150 150 150 150 150 150 150 150 
##$TP07= 0
##$TPNAME0= <>
##$TPNAME1= <>
##$TPNAME2= <>
##$TPNAME3= <>
##$TPNAME4= <>
##$TPNAME5= <>
##$TPNAME6= <>
##$TPNAME7= <>
##$TPOAL= (0..7)
0.5 0.5 0.5 0.5 0.5 0.5 0.5 0.5 
##$TPOFFS= (0..7)
0 0 0 0 0 0 0 0 
##$TUNHIN= 0
##$TUNHOUT= 0
##$TUNXOUT= 0
##$USERA1= <user>
##$USERA2= <user>
##$USERA3= <user>
##$USERA4= <user>
##$USERA5= <user>
##$V9= 5
##$VALIST= <valist>
##$VCLIST= <CCCCCCCCCCCCCCC>
##$VD= 0
##$VDLIST= <DDDDDDDDDDDDDDD>
##$VPLIST= <PPPPPPPPPPPPPPP>
##$VTLIST= <TTTTTTTTTTTTTTT>
##$WBST= 1024
##$WBSW= 4
##$XGAIN= (0..3)
0 0 0 0 
##$XL= 0
##$YL= 0
##$YMAX_a= 9025977
##$YMIN_a= -9856995
##$ZGOPTNS= <>
##$ZL1= 120
##$ZL2= 120
##$ZL3= 120
##$ZL4= 120
##$ABSF1= 222.0892
##$ABSF2= -17.90747
##$ABSG= 5
##$ABSL= 3
##$ALPHA= 0
##$AQORDER= 0
##$ASSFAC= 0
##$ASSFACI= 0
##$ASSFACX= 0
##$ASSWID= 0
##$AUNMP= <proc_1d>
##$AZFE= 0.1
##$AZFW= 0.5
##$BCFW= 0
##$BC_mod= 2
##$BYTORDP= 0
##$COROFFS= 0
##$CY= -3
##$DATMOD= 1
##$DC= 0
##$DFILT= <>
##$DTYPP= 0
##$F1P= 0
##$F2P= 0
##$FCOR= 0.5
##$FTSIZE= 32768
##$FT_mod= 6
##$GAMMA= 0
##$GB= 0
##$INTBC= 1
##$INTSCL= 4.134877e-10
##$ISEN= 128
##$LB= 1
##$LEV0= 0
##$LPBIN= 0
##$MAXI= 10000
##$MC2= 0
##$MEAN= 0
##$ME_mod= 0
##$MI= 0.1934396
##$NCOEF= 0
##$NC_proc= -1
##$NLEV= 6
##$NOISF1= 120.0001
##$NOISF2= 80.00006
##$NSP= 0
##$NTH_PI= 0
##$NZP= 0
##$OFFSET= 222.0892
##$PC= 1.4
##$PHC0= -367.8056
##$PHC1= 28.68472
##$PH_mod= 1
##$PKNL= yes
##$PPARMOD= 0
##$PSCAL= 0
##$PSIGN= 0
##$REVERSE= no
##$SF= 50.3227585034004
##$SI= 32768
##$SIGF1= 140
##$SIGF2= 120
##$SINO= 11.81781
##$SIOLD= 32768
##$SREGLST= <13C.CDCl3>
##$SSB= 0
##$STSI= 32768
##$STSR= 0
##$SW_p= 12077.2946859903
##$SYMM= 0
##$S_DEV= 0
##$TDeff= 32768
##$TDoff= 0
##$TI= <>
##$TILT= no
##$TM1= 0
##$TM2= 0
##$TOPLEV= 0
##$USERP1= <user>
##$USERP2= <user>
##$USERP3= <user>
##$USERP4= <user>
##$USERP5= <user>
##$WDW= 1
##$XDIM= 32768
##$YMAX_p= 517143176
##$YMIN_p= -6181244
$$ End of Bruker specific parameters
$$ ---------------------------------
##NTUPLES= NMR SPECTRUM
##VAR_NAME=  FREQUENCY,     SPECTRUM/REAL,   SPECTRUM/IMAG
##SYMBOL=    X,             R,               I
##VAR_TYPE=  INDEPENDENT,   DEPENDENT,       DEPENDENT
##VAR_FORM=  AFFN,          ASDF,            ASDF
##VAR_DIM=   32768,         32768,           32768
##UNITS=     HZ,            ARBITRARY UNITS, ARBITRARY UNITS
##FACTOR=    0.368581032318806, 1,           1
##FIRST=     11176.1413227862, 0,            0
##LAST=      -901.153363204117, 0,           0
##MIN=       -901.153363204117, -6181244,    0
##MAX=       11176.1413227862, 517143176,    0
$$ Real data points
##PAGE= N=1
##DATA TABLE= (X++(R..R)), XYDATA
$$ [...]
10614h78976p69776o09341N86480O72254J72936k34609l09264O40709R42930L26988
10604E40331R1574R66044o41993q22627J2466M56453O77939l8322n59445n36388
10594A46032K87148p59733j029372n88562Q7416K96158o81569q94277N71279P29425
10584a836055R4983l16152Q10880O54005p70473q11968k68627J64451J581581
10575f97375J296449J22187l25918p31310j28061o06757l45957R09764P81076
10566B74098n8536n03861m67680n15611n59106j91649R93700J295078p8253q83150
10556f94970j26071Q3850k45030R36830J075083N3094q87308n25285n49254k49741
10546a128802j28386m10844j402827j286387o0517R16244R79856Q64501J45942
$$ y = [-878976, -1648752, -2258093, -1671613, -999359, -826423, -1061032, -1370296, -729587, 213343, 540331, 631905, 1597949, 955956, 133329, 145795, 602248, 1280187, 1241865, 682420, 146032, 433180, -326553, -1355925, -1944487, -1857071, -1560913, -2242482, -3136759, -2565480, -1836055, -1741072, -2057224, -1246344, -592339, -1362812, -2174780, -2443407, -2278956, -697375, 599074, 721261, 395343, -335967, -464028, -1070785, -1416742, -506978, 274098, 215562, -288299, -755979, -1271590, -1830696, -2022345, -1028645, 266433, 188180, -694970, -821041, -737191, -982221, -45391, 1029692, 1082786, 195478, -329807, -879061, -1128802, -1257188, -1668032, -3070859, -4357246, -4417763, -3501519, -2521663, -1657162, -1511220]
10537a511220n01147r72544l29355O67001J779459N83025l43215J34303N9520
10528d34173J07977k46697O39633J209241L7440n94141o01105p59640m27254J43751
10518i24968R81598Q40472k28499o80915m16474K95601K96327j703J2246K18638
10508C92323l30744j69680J09156J01329M30258o51540q11684K97268Q60538M32061
10498F59285M6496J53305K590p51243q26477j78144J067809M74525p5208k09240
10488C63698o43083p36272k79053K71345o628L53854N47342N5553k0567L83829
10478B90018J018730J527240J23616r82625j323600n19696j07607j93596Q9723
10469g7797k33104J61973K16091p2210R30749k2407j576028j016959L05527R38046
$$ y = [-1511220, -2012367, -2984911, -3314266, -2647265, -867806, -284781, -627996, -493693, -434173, -326196, -572893, 66740, 1275981, 1313421, 719280, 118175, -641465, -1068719, -924968, 56630, 897102, 668603, -12312, -428786, -133185, 163142, 161439, 173685, 392323, 61579, -108101, 1055, 102384, 532642, -118898, -930582, -633314, 227224, 659285, 705781, 859086, 861676, 110433, -716044, -894188, 173621, 648146, 572938, 363698, -279385, -1015657, -1294710, -1023365, -1029993, -676139, -128797, -73244, -93811, 290018, 1308748, 2835988, 2959604, 1976979, 653379, 133683, 26076, -167520, -77797, -310901, -148928, 67163, -5047, 925702, 903295, -672733, -1689692, -1384165, -446119]
10459d46119M90529L99646N80363J75932J65400j31810q03484n00658L62354O72961
10449I65114K95193K08989n70591r81112j98447P44921L87778n23817l5265j79130
10439A13633q22151n62946N68609J58634J90487P70597P1918r10344l44679j82815
10429i49057j058164n63907J469826J122645M19212J285899R52386r25876j37922
10420A615042R41824k45035j81771L72461l67031l9918K29226j63939o09025j593681
10410d1847j875228k34729N43481J097947L83688J82865J029318O12031j3447
10401A684079k50113M53897l04644o11512l03989n61965l45649M85921L73331
10392F19356l11932j233612j19257J333968K85419j713032j413249q8085R93854
$$ y = [-446119, 44410, 444056, 1024419, 1200351, 1365751, 1233941, 430457, -70201, 292153, 965114, 1260307, 1469296, 898705, -82407, -280854, 464067, 851845, 328028, 292763, 113633, -708518, -1271464, -702855, -544221, -353734, 416863, 488781, -421563, -766242, -949057, -2007221, -2571128, -1101302, 21343, 440555, 1726454, 2678840, 1752964, 1615042, 2556866, 2311831, 2130060, 2502521, 2135490, 2095572, 2324798, 2160859, 1551834, -41847, -1917075, -2151804, -1608323, -510376, -126688, 56177, 1085495, 1697526, 1684079, 1433966, 1887863, 1583219, 971707, 667718, 105753, -239896, 246025, 619356, 307424, -926188, -1045445, 288523, 573942, -1139090, -2552339, -2640424, -1646570]
10383a646570J090786P73273O8446P4637l56890k38672N41863r2767o78735j91916
10373f56545k48690J44607M34977j78321k17332J155621J807693K42382j259566
10364A224826q51551o29722j125363j449093l41607K93479L05248L18881O24759
10355a630143O94848q36619j309776L71232M87578N98371j95535j38981J532931
10346d26094L40626j180304j120256K73903Q53140j39094P97231J401930J378181
10337B179263L10978j044274j325185q45007l19404m79291q94683R0578j75727
10328b502752n7116J148224P56130J081114P40984p28475l84224K16520L37774
10319F08179N0027L9693N8594j189913r59279n60741K8555K240518J881343J16282
$$ y = [-1646570, -555784, 217489, 285935, 360572, 3682, -234990, 306873, 214106, -464629, -656545, -905235, -760628, -325651, -503972, -721304, 434317, 2242010, 2484392, 1224826, 373275, -256447, -1381810, -2830903, -3172510, -2879031, -2573783, -2254902, -1630143, -935295, -1771914, -3081690, -2710458, -2222880, -1624509, -1820044, -1959025, -426094, -85468, -1265772, -2386028, -2112125, -1258985, -1398079, -600848, 801082, 2179263, 2490241, 1445967, 120782, -724225, -1043629, -1522920, -2417603, -2327025, -2502752, -2559868, -1411644, -655514, 425600, 1166584, 438109, 53885, 270405, 608179, 658206, 697899, 756493, -433420, -1392699, -1953440, -1924885, 315633, 2196976, 2313258]
10309B313258m93919p23044j026085K35034L68173M63135j27150j433735j568381
10300a992714k99027L59980J23714l33347K11155K6617l90871O18094M26719K78181
10290i71499k29028m3362L53095J88933N14626N37574J40708n66835p53345Q7144
10280g41989n57475m40182o19600N77626J172516Q47289j61924j582136q76347
10271b382222Q20767Q63578N91319Q5294m14876m94955K65744K36035l41214j295461
10261b065991j23934J151667J26227p67693l92551P1840Q41650j35360j504821
10252b798966o23593L17701J152186J081471J09954J11068O03390M45521j15509
10243B83223P2962K13917J3082K99034M29950m44868q13941n83715M99134R40628
$$ y = [2313258, 1819339, 1096295, 70210, 305244, 673417, 1136552, 1009402, -424333, -1992714, -2291741, -1931761, -1808047, -2141394, -1930239, -1903622, -2294493, -1676399, -1249680, -971499, -1200527, -1243889, -890794, -701861, -187235, 350339, 491047, -75788, -829133, -741989, -1299464, -1739646, -2359246, -1781620, -609104, 238185, 76261, -1505875, -2382222, -1561455, -697877, -106558, -21264, -436140, -931095, -665351, -429316, -770530, -2065991, -2189925, -1038258, -912031, -1679724, -2072275, -2000435, -1158785, -1294145, -2798966, -3422559, -3104858, -1952672, -871201, -761247, -650179, -46789, 398732, 283223, 356185, 570102, 583184, 882218, 1312168, 867300, 53359, -530356, -31222, 909406]
10233I09406k8957o33184j209866m89322O56475J001428M17467Q2376K69681Q481
10223I83985Q9537j46824m63836j51308M22978J6544l71291J27666J20148J002003
10213A629602J694402K24252j215878j015539n41907j81459N98311J330688O31209
10204C153681j185489j564668j52538N36145L32808k31805k71960L40694L38332
10195A295200k59828n30521o07831r12319o58680N38547O77716L3435o93389p05666
10185a823336K0761M72267J055727J246800K66682K58046M82217L2739k79442
10176A732461p35792l20113j07823m83032n9532P22852r8437m44061L47162P09594
10166A263279N20078K49302k33075K39174J775620M09981J75341N87727K91265
$$ y = [909406, 880449, 247265, -962601, -1451923, -795448, 205980, 623447, 705823, 975504, 983985, 1073522, 926698, 462862, 311554, 734532, 751076, 379785, 507451, 627599, 1629602, 3324004, 3548256, 2332378, 1316839, 774932, 593473, 1191784, 2522472, 3153681, 1968192, 403524, 250986, 787131, 1119939, 888134, 616174, 956868, 1295200, 1035372, 504851, -102980, -1015299, -1673979, -1135432, -457716, -424281, -1117670, -1823336, -1802575, -1330308, -274581, 972219, 1238901, 1496947, 1979164, 2011903, 1732461, 996669, 676556, 568733, 85701, 26169, 749021, 650584, 206523, 553685, 1263279, 1783357, 2032659, 1799584, 2038758, 3814378, 4224359, 4399700, 4987427, 5278692]
10157E278692P32318J916069L645996N403097O477005R180741J3624790J7327775
10149F3586483R471503j0246733j7641634j4120018q358499n334689l856223j973830
10141A1526360j211180j617592j606360o85960J99757l29076j058436j150634
10133D066879j436196j993573k579561r63143J017795L86332M310N28839Q80663
10124h7655Q92815j146r84942j069745m04350Q7957M13812k50636j36626j44268
10114a684784j20733K9230M21760Q55048K60794J18380L32587O24859J56820j33486
10104H60475J68249q23058j75361N14023k46590n30006k23508M97590K54393q49514
10094e53307j23417P71217J52391r04679l12317O60515J126178J3356r70812k71287
$$ y = [5278692, 6011010, 7927079, 11573075, 16976172, 23453177, 32633918, 46258708, 63586483, 73057986, 62811253, 45169619, 31049601, 22691102, 17356413, 13500190, 11526360, 10315180, 8697588, 7091228, 6405268, 6605025, 6275949, 5217513, 4066879, 2630683, 637110, -1942451, -2905594, -1887799, -1501467, -1497157, -968318, -87655, 805160, 804014, -180928, -1250673, -1655023, -1567066, -1153254, -1403890, -1540516, -1684784, -1805517, -1776287, -1354527, -499479, -238685, -120305, 212282, 837141, 993961, 860475, 1028724, 205666, 30305, 544328, 297738, -232268, -455776, 41814, 296207, -553307, -676724, 94493, 246884, -657795, -970112, -309597, 816581, 829937, -140875, -412162]
10084d12162L29032j69924r37834L07095N63043q1853k10917q26452p50932r8792
10074b289696K83771J45293K57353M26150J10148o0498l46362r18108l61369k03919
10064b957237N45058K180959J368369j34763j212081m53718K81883R9521n93904
10055h75913m32598J33219P00275M97619r0216k42369j42951Q80527Q80593k8259
10045A279927R8108M33094R3585N52784j019312o59502l39408j77695p3870N56512
10035G44223O71281N46950P32599k80104j012822j015779r78501j108234j320482
10026c020869Q5025R54102J189356M54191p02467q13658j68156K28040J20835
10017a673601R40880R48922j67477k46296J41092l65977O6743J37324l29614K46315
$$ y = [-412162, -83130, -253054, -1190888, -883793, -320750, -402603, -613520, -1439972, -2190904, -2289696, -2005925, -1860632, -1603279, -1177129, -1066981, -1127479, -1473841, -2391949, -2753318, -2957237, -2412179, -231220, 1137149, 1002386, -209695, -663413, -381530, -282009, -875913, -1308511, -1175292, -475017, 22602, -67614, -309983, -452934, 427593, 1308186, 1279927, 1378035, 1811129, 1904714, 2457498, 1438186, 778684, 439276, 261581, 187711, 744223, 1415504, 1962454, 2695053, 2414949, 1402127, 386348, -592153, -1700387, -3020869, -2935844, -1981742, -792386, -338195, -1040662, -1854320, -2022476, -1794436, -1673601, -732721, 216201, 48724, -197572, -56480, -422457, -355714, -218390, -548004, -301689]
10007c01689L84434j19082J21441j334l19096M48334J54237K65741J117849K62098
9997B012933n21253K17487j68515o95489J98839k86540l92773k23599J7011n3627
9987A04474M06306R44364P1947o5640Q7701m46399p96729m30004N20156L71742
9977G67918R51254O04211k02415j588373j477409j53284J075180n05648j003651
9968a532217L2567l78017p06302j9372J336087R45893K0467Q7818M87308N0099
9958C24331j98855K21038K18710l90354n56776l40198J48142O17503Q80189O59408
9948A583138o34587k14836l00967j380126k83916J417569P21763k73738r49850
9939c15550q75132k31835p13025j217474p64888P17576O33324M90688J66857K96635
$$ y = [-301689, 82745, -36337, 85104, 83770, -235326, 213008, 367245, 632986, 1750835, 2012933, 1491680, 1709167, 1540652, 845163, 1044002, 757462, 364689, 141090, 158101, 104474, 510780, 1455144, 1527091, 1461451, 1549152, 1102753, 306024, -123980, 396176, 767918, 1719172, 2323383, 2120968, 532595, -944814, -1098098, -22918, -528566, -1532217, -1499650, -1877667, -2583969, -2603341, -1267254, -321361, -300894, -213076, 274232, 324331, 125476, 346514, 565224, 174870, -381906, -722104, -573962, 43541, 923730, 1583138, 948551, 733715, 432748, -947378, -1231294, 186275, 908038, 634300, -315550, -1190682, -1422517, -2135542, -3353016, -4117904, -3400328, -2767004, -2276316, -2109459, -1812824]
9929a812824L35684P08461L90536m85360m7307M70449O18706N76650l78829K69970
9919F46136L70922r50856q46964m36240n5367m5833j88654J213475R80826J70182
9909H57627m33182j464475j638371J19243Q23253K80762O22791R03549R96846
9900A068043O69428J18982r61401p78194m5148J88740m50490j362155j62180M45727
9890a268648N64385J607809J143446m4911p54242J99043k03347j318166M5421
9881b9210k9718r46351K20337K62621N0888l7514k20857J20253K60441K64389
9871h4721k28618n29110J63655K72377P1430L32276L58415k12374J00604k99039
9861e5105l90409q04205m93399Q68598N87646N3753m00894k01889n18188n81658
$$ y = [-1812824, -1477140, -768679, -378143, -863503, -910810, -440361, 178345, 754995, 376166, 646136, 1017058, 66202, -780762, -1217002, -1272369, -1318202, -1506856, -293381, 687445, 857627, 424445, -1040030, -2678401, -2559158, -1735905, -1455143, -832352, 71197, 1068043, 1737471, 1856453, 895052, 116858, 71710, 260450, -190040, -1552195, -1714375, -1268648, -704263, 903546, 2046992, 2002081, 1247839, 1446882, 1243535, -74631, -29210, -58928, -1005279, -784942, -522321, -471433, -508947, -729804, -609551, -349110, -84721, -313339, -842449, -678794, -406417, -334987, -2711, 355704, 143330, 243934, -55105, -445514, -1249719, -1743118, -874520, -286874, -233121, -634015, -835904, -1354092, -1935750]
9851a935750o53599l04860o377j59354M20583O40602M84235Q64599L15685o38242
9841i72478L00489O29892o46279p84920M68848k20106j31663l18296k13624L482
9831a884655P84434J301874P59879M62012n61034n47305M44660l67900j645958
9822a253993n8896K040033J626656j79560q33249q77500k55260J007716R32865
9813B148812J87515j48748k71981n11489k84255r1351k81029J30150J76815K6251
9803A080690P35447m1756m11651M94789R234j153914n21123k02206o91120l57735
9793a059345m49780l21361N0190J009521Q33691K25514j59086p72645m93794l25813
9783a462908j43864k05589m14681M73668K16812P04193J088805Q06380N9892n41395
$$ y = [-1935750, -2589349, -2894209, -2900586, -3059940, -2639357, -1998755, -1514520, -649921, -334236, -972478, -671989, -42097, -688376, -1473296, -1004448, -1224554, -1356217, -1674513, -1888137, -1884655, -1100221, 201653, 961532, 1423544, 862510, 315205, 759865, 391965, -1253993, -1312889, 727144, 2353800, 2174240, 1340991, 463491, 208231, 1215947, 2148812, 2336327, 2187579, 1915598, 1404109, 1119854, 1028503, 747474, 877624, 1054439, 1080690, 1816137, 1774381, 1362730, 1857519, 1866753, 712839, 191716, -10490, -701610, -1059345, -1509125, -1830486, -1780296, -770775, 62916, 288430, 129344, -643301, -1137095, -1462908, -1606772, -1812361, -2227042, -1753374, -1536562, -832369, 256436, 1062816, 1122708, 581313]
9773E81313j02266k94910j498132r54063l65957M95915J094816M06424K40989
9764c95871P68927k01208q75817p04483o90889n24353J00736P49251K7406l8814
9754a785115Q68118J043919Q65804M16516m91567r7602J05265q83780K35285N64662
9744H41505N0701O54196L62942n40127l65974Q05658K39756q84656j125755r21305
9734h83059j432575n50887Q72935J37461J67237m3032n89441R1668J323391J363453
9724D57151K52154n86885m24661k36304k83434N5509J6869j13451L3011j32066
9714i62107O6693M55287O27004l69655j653711j383496J37894J066658P9970m91641
9704b427104R16588M39551o07768j48036J261077n2271k3137L06644q46033l99218
$$ y = [581313, 479047, 184137, -1313995, -2268058, -2634015, -2138100, -1043284, -636860, -395871, 373056, 171848, -703969, -1408452, -2099341, -2623694, -2522958, -1773707, -1746301, -1785115, -916997, 126922, 992726, 1409242, 917675, 820073, 925338, 41558, 276843, 841505, 892206, 1546402, 1909344, 1369217, 1003243, 1808901, 2048657, 1164001, 38246, -883059, -2315634, -2866521, -1993586, -1856125, -1688888, -1731920, -2321361, -2229693, -906302, 457151, 709305, 122420, -302241, -538545, -821979, -766470, -749601, -863052, -830041, -962107, -895414, -440127, 186877, -182778, -1836489, -3219985, -3082091, -2015433, -1935463, -2427104, -1510516, -1070965, -1678733, -1826769, -565692, -617963, -641100, -334456, -1180489, -1579707]
9694a579707P81008K86592n51026k43929n07675j47061R39997J752588N38648
9685A269435l1458o02784n93288l72278l15881q34967l23941N72628J187622L93868
9675C48956q57826J03882N97172P87103J598079L72091j662351p77449R70510
9666A480167L08122j017922o14294j69876l53195j03199K49528o14990n13429
9657a349088R93199j15712k41656L04259J064334K81425j235162k58480M29387
9648a27494L19482k39273j10207R30789m3640N48879J47983j402234j235339p2158
9638a283212M41260m4478K31622j9868R2357k02111l86355j009171P8442J085700
9628a015814P25591O51541k67755j336738k03295J026062N46893l77187J06826
$$ y = [-1579707, -798699, -512107, -1063133, -1307062, -1814737, -1961798, -1021801, 730787, 1269435, 1237977, 635193, 41905, -330373, -646254, -1481221, -1805162, -1232534, -44912, 348956, -508870, -404988, 192184, 979287, 2577366, 2949457, 1287106, 509657, 1480167, 1788289, 770367, 156073, -13803, -366998, -470197, -220669, -835659, -1349088, -355889, -471601, -713257, -408998, 655336, 936761, -298401, -556881, -127494, 191988, -47285, -157492, 773297, 729657, 1278536, 1426519, 24285, -1211054, -1283212, -841952, -886430, -654808, -674676, -582319, -784430, -1170785, -2179956, -2101514, -1015814, -290223, 361318, 93563, -1243175, -1446470, -420408, 126485, -250702, -143876]
9619a43876L96665j9700r5270L59026O01590K9831l93546j09221J69785j46925
9609F48359p68419j158825n55663M33928N54524p11285j648000o21279L03383
9600c523277M90911R05162Q16713O20540k28818r4130Q01426J048107j37327O76890
9590A376197M71195l06202m42762o99695r65781o75959L63033Q61028N03359p41570
9580b57157j469253K36861J955372J195355o3513j90282n08722m06025l59043
9571A33593o56800N92929P69024K09476k8372k26896n90481p97715K25269Q07959
9561D37986K10598R42330N73688m16476k24199K248j66556J43842K71624j91474
9551A583611n25508l05467k21892n57802j167778m58953J055234M73396l70899
$$ y = [-143876, 252789, 233089, 137819, 496845, 1098435, 1128266, 734720, 625499, 795284, 648359, -120060, -1278885, -1834548, -1400620, -846096, -1557381, -3205381, -3826660, -3523277, -3032366, -2127204, -1310491, -689951, -918769, -1012899, -211473, 836634, 699307, 1376197, 1847392, 1541190, 1098428, 398733, -567048, -1243007, -879974, -18946, 484413, -257157, -1726410, -1489549, 465823, 1661178, 1597665, 1407383, 898661, 492636, 133593, -523207, 69722, 838746, 1048222, 1019850, 792954, 202473, -595242, -369973, 437986, 648584, 1590914, 2164602, 1748126, 1523927, 1526175, 1359619, 1503461, 1775085, 1583611, 1058103, 752636, 530744, -27058, -1194836, -1653789, -598555, -125159, -496058]
9542d96058j025701j327912m88012K79700K73901j23618j99449O94430N60931
9533a851788J61851L15601p1988n81334m74888L7271j79337n95828j359348m83822
9523e083610N55787N36470N97325Q03868P44162P70274M15263M87425K81228N87935
9513F96127Q47188N04556o49711j243149o35257j47803J40841M07465M31349o00959
9503b49353j095328q76857L86495J045067J245033J61444q02254n66305K21727
9494e30331j00206N04167K69828J08819k10656r16109r68702n34075O90816K13446
9484a473003j66789j88336p5914O08879K70340j86051j91802j85189l69927R4970
9474a862822N96643R35497K59746k60819K14050J42370k59508O51118J068060
$$ y = [-496058, -1521759, -2849671, -3337683, -3057983, -2784082, -2907700, -3107149, -2412719, -1851788, -1689937, -1374336, -1446324, -2027658, -2502546, -2465275, -2644612, -3240440, -4599788, -5083610, -4527823, -3991353, -3394028, -2590160, -1845998, -1075724, -660461, -173036, 108192, 696127, 1543315, 2047871, 1398160, 155011, -480246, -628049, -487208, -79743, 351606, -249353, -1344681, -2221538, -1835043, -789976, 455057, 616501, -185753, -752058, -530331, -630537, -126370, 143458, 252277, 41621, -874488, -1843190, -2377265, -1686449, -1473003, -1639792, -1828128, -1904042, -1295163, -1024823, -1210874, -1402676, -1587865, -1957792, -1862822, -1266179, -330682, -70936, -331755, -117705, 24665, -234843, 416275, 1484335]
9465A484335m34304k70134K20317n53020p34297j48703K87100N17557J1896J82812
9455E63559O54449M47427L06208n21372j716960q67244J48002n80698n48393O44959
9445a470063J739783O07148p89522j899995j841254N71473J076396L24929N35545
9436a145560o02515r60835K2486N73893J083855k8324j001540O0344Q12696L10281
9426h75219M8415p3266m28707M01880J59221j064405m30565R46273J573013J181801
9416A438441O25645R9259k54567q45276r14340l27750L95920k24229m35879l16655
9406g59431N91832n1827k81605J188010Q60977m25402r00883p61999K26488M57456
9396A43616L19755m78179l38508J10405J74449O4855M91442r1957j155977n94464
$$ y = [1484335, 1050031, 779897, 1000214, 447194, -287103, -435806, -148706, 368851, 380747, 563559, 1218008, 1665435, 1971643, 1450271, -266689, -1133933, -985931, -1566629, -2115022, -1470063, 269720, 876868, 87346, -1812649, -3653903, -3082430, -2006034, -1681105, -1145560, -1748075, -2708910, -2686424, -2112531, -1028676, -1057000, -2058540, -1998196, -1185500, -875219, -826804, -900070, -1328777, -926897, -767676, -1832081, -2262646, -1316373, 256640, 1438441, 2064086, 2163345, 1908778, 1063502, 149162, -178588, 217332, -6897, -442776, -759431, -167599, -219426, -501031, 686979, 1547956, 1122554, 221671, -540328, -313840, 143616, 463371, -14808, -353316, -242911, -68462, -3607, 487835, 395878, -760099, -1354563]
9386a354563k08640Q36129P10098L59544M06786R07702J23395r30826o11755J6382
9376B54252L1403j80765k2960J35596J176593N40597j409432j913000j117319
9367b505035K65268P99027k5413j191760j111268Q58764K104704J068864K68847
9358E31998M56195J78910p02740p04288J28142J93695K64886J133910Q62093k3712
9348B319089k64666R1598L44961j63503K10273p37851j600552j33839M49335M02624
9338I17469p6552l53323L1640J87007N12808J61799k86992l53932P3377Q13279
9328A626580O63877m84124o71892j029328j280396n65450l49620l42435N45412
9319a887376Q59140l50686k13547J78777J073694O63471P4251J69208Q9710r76573
$$ y = [-1354563, -1563203, -727074, -16976, 342568, 749354, 1657056, 1780451, 849625, 237870, 254252, 285655, 104890, 81930, 217526, 1394119, 1934716, 525284, -1387716, -2505035, -2239767, -1440740, -1466153, -2657913, -3769181, -2910417, -805713, 263151, 531998, 988193, 1167103, 464363, -239925, -111783, 81912, 346798, 1480708, 2342801, 2319089, 2054423, 2146021, 2490982, 2327479, 2537752, 1799901, 199349, 65510, 514845, 917469, 840917, 487594, 519234, 706241, 1219049, 1380848, 1093856, 739924, 813301, 1626580, 2290457, 1806333, 1134441, 105113, -1175283, -1740733, -2090353, -2432788, -1887376, -1028236, -1378922, -1592469, -1413692, -339998, 323473, 397724, 566932, 656642, -319931]
9309c19931j260481j005854J76764J229985R44175M63473j81617L8152K45692
9300C30358k0339j94565J17221Q5892m60793j271128n76066R40672J446435R02687
9290A300374l8617J12925L89533r36532m68622m76465j342019r78757n69263J46688
9280b860755J367010R47556j3l65679m04241l30419N06455L76146j43275m51060
9270a358275o89687Q0689M97157M28318J301397N40760p98431r3532M31218J62658
9260E02272M35653O02848M81227l13143l56459m6320j48740j45457j6270m48412
9250E47199o38487j79994k29629k9148l21844l44987Q81631R34144J127003O17040
9240B362928r42979o96753q5808j175089j674136n87726Q94429J304281R07592
$$ y = [-319931, -1580412, -2586266, -2409502, -1179517, -235342, 228131, 46514, 84666, 330358, 310019, 115454, 232675, 318567, -142226, -1413354, -1989420, -1048748, 397687, 1300374, 1261757, 1374682, 1764215, 827683, 359061, -117404, -1459423, -2438180, -3007443, -2860755, -1493745, -546189, -546202, -911881, -1316122, -1646541, -1140086, -763940, -907215, -1358275, -2047962, -1967273, -1470116, -1041798, 259599, 800359, 1928, -91604, 339614, 502272, 937925, 1540773, 2022000, 1708857, 1352398, 1306078, 1157338, 1011881, 995611, 547199, -91288, -271282, -500911, -530059, -851903, -1196890, -315259, 618885, 1745888, 2362928, 1419949, 723196, 637388, -537701, -2211837, -2799563, -1905134, -600853, 306739]
9231C06739j23384Q562n43268k93035J389070R03117m13341q61873o0177L02667
9221F15077n1653L14305P98130R76623k52179j144225j51162j93936j20987n5558
9211G34435m07976o25587j38141O65836M68118L72179J093573M43201m59231l00316
9201A846091k38043r51985k45713M25072M23180n69028r29137R8393j27085l40759
9191f09014q84754l95813L27195N03522J10486K88723J58054r30016J31982R16867
9181c82768r4263q26836J60293P11856l90986n54723j10993k84161j26164J47061
9171a751684k0472l28167O62387J311709M89802m19776l04928M11259N25503k50316
9161C25317j68618l58636m31423K01387O72609k88763n19386k21305L72066L67006
$$ y = [306739, 183355, 191917, -351351, -644386, 744684, 1647801, 1234460, 372587, 312410, 615077, 563424, 877729, 1675859, 2652482, 2400303, 1256078, 1104916, 910980, 789993, 734435, 326459, -299128, -437269, 228567, 696685, 1068864, 2162437, 2605638, 2146407, 1846091, 1608048, 656063, 410350, 835422, 1258602, 689574, -239563, -141170, -268255, -609014, -1493768, -1889581, -1562386, -1058864, -948378, -659655, -501601, -1431617, -1299635, -382768, -477031, -1303867, -1143574, -431718, -822704, -1377427, -1488420, -1772581, -1898745, -1751684, -1772156, -2100323, -1437936, -126227, 363575, -56201, -361129, 50130, 575633, 325317, 156699, -201937, -633360, -431973, 240636, -48127, -567513, -788818, -416752, -49746]
9151d9746o6545R75531J547167K19997l22664p98941j260998q20832N36768J154036
9141A113773J253002N24751r26306j110196K10115k92864P7253K9237l90776K34092
9131G22081J523024O76397o23067o79797J00695p6222j053054n54120J24925N11253
9121F72115J429797j2103K60988K43055j328337j148885k84005J04499l41201
9112d04077M79726J72056j72243m15926P54814J700274N10694p46842j714564
9103A63912j079703m9962J41727j80585r93705j200212K13002O27306L08347J206924
9093h42949P04729j279784j285695L87298L80956l43528N5080L82764O04450O01747
9083f34932k4804N91743O97046N37381P42336K56434n57118j72885k91428l52005
$$ y = [-49746, -116291, 859240, 2406407, 2626404, 2303740, 1504799, 243801, -577031, -40263, 1113773, 2366775, 2891526, 1965220, 855024, 1065139, 772275, 849528, 878765, 487989, 722081, 2245105, 2921502, 2298435, 1618638, 1719333, 1643111, 590057, 35937, 160862, 672115, 2101912, 2089809, 2350797, 2593852, 1265515, 116630, -167375, -62876, -404077, 75649, 247705, 75462, -340464, 414350, 2114624, 2625318, 1878476, 163912, -915791, -965753, -824026, -1004611, -1998316, -3198528, -2985526, -2358220, -2049873, -842949, -138220, -1418004, -2703699, -2316401, -1935445, -2278973, -2223893, -1841129, -1236679, -634932, -659736, -67993, 629053, 1166434, 1908770, 2165204, 1608086, 1435201, 1143773, 791768]
9073G91768j012605l75516J81658K46203O97381M35224L53946K20201m22168l99629
9063G16463q82973j63955M64092M64887j51430o88951m19880J19230J1085o41273
9053a172705o49235j28580N24356R89474J22291J21564J50661l98851P39099P80264
9043A078338R57574N73811l48911l4305j12551q76580J62164q28656j418890j029032
9033a877038j33522N15510R08805l06071m20426Q23544K09352O85195N04329O1918
9023I71596q65064p76381n24227j370520k95049J337765P95327L57386j17574
9014d86741P61993N24972j012666j024997m64805j025568k69711J365509K230860
9005E98846J056058m90328k9899l52520L71812J408907J43680o59410q37984j166858
$$ y = [791768, -220837, -596353, -414695, -168492, 528889, 964113, 1318059, 1538260, 1116092, 716463, -166510, -330465, 133627, 598514, 447084, -241867, -661747, -542517, -531432, -1172705, -1821940, -1950520, -1426164, -436690, -314399, -192835, -42174, -441025, 298074, 1078338, 2035912, 2609723, 2260812, 2226507, 2113956, 1237376, 1399540, 570884, -848006, -1877038, -2010560, -1495050, -586245, -892316, -1312742, -489198, -279846, 405349, 909678, 971596, 106532, -669849, -1194076, -2564596, -2859645, -1521880, -726553, -369167, -486741, 275252, 800224, -212442, -1237439, -1702244, -2727812, -2997523, -1632014, 598846, 1654904, 1164576, 1134677, 782157, 1153969, 2562876, 2706556, 2047146, 1209162, 42304]
8995D2304j149794j292693j078599M5947k51040j066357J81761R86767Q63381
8986b718323Q62101M87883R32175Q50223m02102J06471J159214N32840j42253
8977A668229K01987M82269J94442k04515p2103K19616j042191j435082m6311O45867
8967F12208J62173j22854O38122J14855k37445k57438p20358q62508J4782M25769
8957b32694L58276K45786O18841P70420q20460j659152q37807J15226J08075J041848
8947b91641J078696N88936P09452J065363L76465j362859j946637o94304N89040
8938A12511n47895k30051J8149o05406m48704M8157J6873L33786j59857o00967
8928b063404L12124N98387J193430Q20234n09037m43941r5202j28788K48801q51
$$ y = [42304, -1107490, -2400183, -3478782, -3432835, -3683875, -4750232, -4568471, -3581704, -2718323, -1856222, -1368339, -436164, 414059, 11957, 118428, 1277642, 1810482, 1668229, 1870216, 2352485, 2546927, 2342412, 2270309, 2489925, 1447734, 12652, -33659, 612208, 774381, 651527, 1289649, 1404504, 1167059, 909621, 189263, -673245, -658463, -232694, 125582, 371368, 990209, 1760629, 940169, -718983, -1556790, -1441564, -1333489, -291641, 787055, 1375991, 2085443, 3150806, 3527271, 2164412, 217775, -476529, 112511, -435384, -665435, -647286, -1252692, -1701396, -1653239, -1636366, -1302580, -1462437, -2063404, -1751280, -1152893, 40537, 860771, 351734, -92207, -187409, -316197, -67396, -68247]
8918f8247m55462n89030O89853N07030O18754k00775q52015p78751K13936Q08784
8908a05923J11838j147653r76609n53820j22553Q23151J421039J206676L57805
8899A013951o0075j16338o82485k92160P17381j7161j138809r3010N15318l10166
8889d63554k28255j14124M44113J44390k2368n51217N12342P02594k82768n89164
8879d48011m5162K83882N66703K00379l20720n62371k79029k0271K75606n85820
8869i34814j720135l52647J98953J183535J301617M43931j235738j146525J31404
8860b130419M01184J260524J153014P1503j587683q68955J3768J147472P32307
8851A92715j016439o16656K68668K45489N1956R00808J436249N58560O00646M05204
$$ y = [-68247, -523709, -1112739, -422886, 84144, 702898, 502123, -349892, -1128643, -914707, -105923, 5915, -1141738, -2118347, -2672167, -2794720, -1971569, -550530, 656146, 1013951, 953876, 837538, 155053, -137107, 580274, 563113, -575696, -668706, -153388, -463554, -691809, -805933, -361820, -217430, -239798, -791015, -278673, 423921, 141153, -448011, -493173, -209291, 357412, 557791, 237071, -325300, -604329, -624600, -348994, -934814, -2654949, -3007596, -2808643, -1625108, -323491, 120440, -1115298, -2261823, -2130419, -1729235, -468711, 684303, 755806, -831877, -1700832, -1687064, -539592, 192715, -823724, -1440380, -1171712, -926223, -874267, 26541, 1462790, 2021350, 2621996, 3027200]
8841C027200o53434m22609k51717p14629J79806j595o58855n20872k81286O87491
8831C89500j54279j78014L44064N09894L45835p70539m94463o7400r26519l19870
8821a321791J545966J073749l11196p928l66609o18192m57489K72373N10416m83088
8811a63789l37687j25389K38014P09034J26804J09065K45749o42427o58572K94919
8801b04279J477960M26552q69035o80180k53720k0441m01117n81986j97698N2309
8791a251635R60095N57770m35522o99550j373129q08021Q07832M97460q09944
8782b554644j49345R03689R54398R06787N71452r73438q71520m72015M8722P73616
8772h62298R78693O72455M72569N91009K18457n43239n14915O1100m0642J51473
$$ y = [3027200, 2373766, 1951157, 1699440, 984811, 1164617, 1163022, 504167, -16705, -297991, 389500, 235221, 57207, 401271, 911165, 1257000, 486461, -8002, -75402, -1001921, -1321791, 224175, 1297924, 986728, 978800, 612191, -6001, -463490, -191117, 319299, -163789, -501476, -626865, -388851, 320183, 446987, 556052, 801801, 159374, -499198, -204279, 1273681, 1700233, 831198, 151018, -102702, -123143, -524260, -1106246, -1303944, -1251635, -291540, 266230, -169292, -868842, -2241971, -3049992, -2242160, -1744700, -2554644, -2703989, -1800300, -845902, 60885, 632337, -341101, -1212621, -1684636, -1635914, -862298, 116395, 788850, 1261419, 1852428, 2070885, 1527646, 1012731, 1073831, 1033189, 1184662]
8762A184662p46861o26122J64114l55008L14260M38984Q22234o6609j305959o02505
8752g78810N24390J74983K94346O38784o04225r71995l25055M38782Q0393M2939
8742d85468k74807j80491Q39822J128782M92795n98676j254120j440155n4924
8733a827242J39938J27802O95431Q04096K75465O813l39679r94161q70303l41558
8723b323398J39843M00944J22218L35494J170502Q32132P94696k08036l8631O24910
8713A850674l05938o67833l45093m7252P90130J31923r8244P30749J205566K23818
8703C468500m90816q13091j543115j355704l06755M82797N73046M60834o8066
8694D07630k84613n30116L83602L04892K24405q2177j010077K30074J698938J323347
$$ y = [1184662, 437801, -188321, -24207, -379215, -64955, 374029, 1196263, 1129654, -176305, -778810, -254420, -79437, 214909, 853693, 249468, -722527, -1047582, -608800, -528407, -485468, -760275, -940766, -100944, 1027838, 1520633, 921957, -332163, -1772318, -1827242, -1687304, -1559502, -864071, -59975, 215490, 222303, -117376, -1111537, -1981840, -2323398, -2183555, -1782611, -1660393, -1324899, -154397, 677735, 1472431, 1264395, 1225764, 1850674, 1544736, 876903, 531810, 484558, 1274688, 1406611, 1308367, 2039116, 3244682, 3468500, 2977684, 2164593, 621478, -734226, -1040981, -558184, 14862, 475696, 407630, 123017, -407099, -23497, 281395, 505800, 423623, -586454, -356380, 1342558, 2665905]
8684B665905o38480q14276j63910l93224p89311r93785k40900M96542L09491M19371
8674a42577Q7424L27156O18143P19332o4045l99680L57437j17808k1272k71127
8664A092983m50932N01774j53136n8976K23878p47989L35588J163027Q17254m21916
8654B301555j310180j331387n15006j244478o40252k34782j84320Q74106J037122
8645a247622J300277J526329M02907L90524p73488j005723j64301l41810j93924
8636a06831l79207n94849Q20680J187249m49867j054562o22883k44985k74479
8627a719734Q58159J138789M27798J54319L33135j501631j749764q46192M29289
8618b475832P68230N66819m07105j019885j076074L4801J207200J35660R5630
$$ y = [2665905, 2027425, 1213149, 1049239, 656015, -133296, -1127081, -1367981, -871439, -561948, -142577, -55153, 272003, 890146, 1609478, 1545433, 1145753, 1503190, 1385382, 1364110, 1092983, 642051, 1143825, 990689, 931713, 1155591, 407602, 743190, 1906217, 2723471, 2301555, 991375, -340012, -855018, -2099496, -2739748, -2974530, -3158850, -2284744, -1247622, 52655, 1578984, 1981891, 2372415, 1598927, 593204, 428903, 87093, -106831, -486038, -1080887, -260207, 927042, 477175, -577387, -1200270, -1445255, -1719734, -861575, 277214, 705012, 859331, 1192466, -309165, -2058929, -2905121, -2475832, -1707602, -1140783, -1547888, -2567773, -3643847, -3609046, -2401846, -2266186, -2170556]
8609b170556J297932L06081p11321J63256J442613O03814j008053L09907K39749
8600D73422j262100O5848M28088n12428j370151o57572K08349N803L54839J047967
8590a217935J094350P62282j24427m1622N37623L93441l39621q3936P4898J74479
8580A229532j97907k6074j8358K02372o5202J99876o20821n97799P70584R52785
8570A828988Q00074j165409j863366j124156K08821O89457k31893l11695K31735
8561i37444j36221R0077k30455k06107R63869K20109m21699n7838N5297P2955
8551e87457J120442J342937N33831n25327p37656p9086r55273n00773j131099
8542a519461o39737j05296N46026P66294K02711J86292K76347J314094O67007
$$ y = [-2170556, -872624, -566543, -1277864, -1114608, 328005, 931819, -76234, 233673, 473422, -788678, -722830, -294742, -807170, -2177321, -2834893, -2626544, -2620741, -2265902, -1217935, -123585, 638697, 514270, 472648, 1010271, 1403712, 1064091, 980155, 1055053, 1229532, 1031625, 1005551, 987193, 1189565, 1124363, 1324239, 703418, 105619, 876203, 1828988, 2629062, 1463653, -399713, -1523869, -1315048, -625591, -857484, -1169179, -937444, -1073665, -983588, -1214043, -1420150, -456281, -236172, -657871, -715709, -660412, -587457, 532985, 1875922, 2409753, 1884426, 1146770, 1067684, 112411, -388362, -1519461, -2159198, -2264494, -1718468, -952174, -749463, -563171, -286824, 1027270, 1694277]
8533A694277J8720N5127Q06082M91631p80392j462078k052747j138466k07515
8524b575361K25946J172884R71198K46886m69065q37775k36784L09670R46870
8515b45531K23828K61568J290139N71603P6714N4315l38101M40534J381474M43585
8505D160128j130170m99854n33645j456597j170547p62578n24413P79988J458589
8496C20901P37559O96756K69209l2132J37946p61269j010383m1944j10228p22141
8486e15726l58685N6838k38851m61335Q66486O18108p11330j53588l29856m35984
8476a663923q9320r3132J230947M99117n36300j263316j113682K81274L78294
8467b370041j0142m84492k47023l52173n74472j969K28470R34212R14998J102628
$$ y = [1694277, 1712997, 1768124, 2574206, 3065837, 2285445, 823367, -1229380, -2367846, -2575361, -2349415, -1176531, -205333, 41553, -427512, -1265287, -1502071, -1192401, -245531, -21703, 239865, 1530004, 2101607, 2178321, 2232636, 1894535, 2335069, 3716543, 4160128, 3029958, 2530104, 1996459, 539862, -630685, -1393263, -1917676, -1137688, 320901, 1058460, 1755216, 2024425, 1992293, 2130239, 1368970, 358587, 316643, 206415, -515726, -874411, -817573, -1056424, -1517759, -651273, -33165, -744495, -898083, -1227939, -1663923, -1753243, -1846375, -615428, -116311, -652611, -1915927, -3029609, -2748335, -2370041, -2380183, -2864675, -3111698, -3463871, -4038343, -4040312, -3811842, -2877630, -1962632, -860004]
8457h60004J979163R32030q55092p29444l60211O41970J082901J94805n41659
8448A484459k26260J26149l60640m32517J40531k4622J59499k82978p76010M10970
8438B18581K26222m63296j392104j346105Q01383J704097M16490q54563j586009
8429b275304o86130J77737P46773K84332k58361J38274o05127Q8318R09032R90758
8419d89698N64700J90768M00374M60574K23224J78756o39644l24306Q18066J034819
8409B417633k30276k46842m07008q18964r51083o18112k3240p20460o12261k01980
8399b412593l1955m08486n0992J072538J029787N03963l79618m95062K6058M57594
8389f88766p806m66073n67553p61578K30857J183274M92179q20721K5570L72297
$$ y = [-860004, 1119159, 2051189, 1196097, 466653, 106442, 748412, 1831313, 2026118, 1484459, 1258199, 1384348, 1023708, 591191, 731722, 707100, 866599, 583621, -192389, 218581, 444803, -18493, -1410597, -2756702, -1955319, -251222, 165268, -689295, -2275304, -2961434, -2783697, -2036924, -1752592, -2010953, -1872679, -2477806, -2389488, -1480456, -489698, 75002, 265770, 666144, 1126718, 1349942, 1528698, 889054, 564748, 1382814, 2417633, 2187357, 1940515, 1533507, 714543, -236540, -854652, -877892, -1598352, -2210613, -2412593, -2444548, -2853034, -2904026, -1831488, -801701, -297738, -677356, -1172418, -1146360, -688766, -696572, -1162645, -1730198, -2491776, -2260919, -1077645, -585466, -1406187, -1380617, -1008320]
8379a008320j96453o85064Q8421P49265K4711m33081n2548l3846N73590R27293
8369d6032N92204K88923j09705o35110q31595J19064P49518j88575o72963P0196
8359f64075J13402N18989m47343j302263M8803J554979J106332N27133r03990
8350E51967q15352k74093q6955n3444m85990k03145J20428J070881R43773N12240
8340A280310j190333j608426j04504J514034J800422P55406j021905j896305j015126
8331a486427L32340L13173Q1950j52469j26194O04587R5040L02848Q28794M47802
8321A241444K49141p00171o87684j181253q63424L15023L60076l57776j66085
8312a790709Q83247P81170K31319N42591m25828n62103j25927k92791P26174J863741
$$ y = [-1008320, -1204773, -1889837, -1801416, -1052151, -1027440, -1460521, -1513069, -1546915, -973325, -46032, 546172, 835095, 725390, 90280, -741315, -622251, 127267, -61308, -734271, -664075, -550673, -31684, -479027, -1781290, -1732487, -177508, 928824, 1455957, 551967, -263385, -537478, -624433, -677877, -1163867, -1367012, -1246584, -175703, 768070, 1280310, 89977, -1518449, -1622953, -108919, 1691503, 2446909, 1425004, -471301, -1486427, -1154087, -840914, -758964, -911433, -1037627, -433040, -338000, -35152, 793642, 1241444, 1490585, 790414, 102730, -1078523, -1941947, -1626924, -1266848, -1624624, -1790709, -907462, -126292, 105027, 647618, 221790, -340313, -466240, -759031, -32857, 1830884]
8302A830884P64703j249827j190543m61328M54037M42561o1419j79323J91670
8293E41415P46832L2297L88676K63248p87722j300550k98024M18053j38898j68319
8283c02992r04O40372R46007k43243j53412L3473n90457L14939R52275k19354
8273A376704n87148q048K12476M97181K64085K9614J023417Q10078n16099k12550
8263B889710k18522o72810J38342J380012R29669n5700m14951k18147o5110o35052
8253C057441j615241j575589j178195j40201R57786J151554J546853R56824m8693
8244C112539q58991n80999Q84873N08125p33262o80958M21240j01242o95072n23341
8234G52912k55913K43256L6523k96457K69955N72199R20694j21898p85809r24757
$$ y = [1830884, 2595587, 1345760, 155217, -306111, 147926, 590487, 529068, 349745, 541415, 1288247, 1320544, 1709220, 1972468, 1184746, -115804, -413828, 4225, -134673, -302992, -303896, 336476, 1282483, 1039240, 885828, 919301, 328844, 643783, 1596058, 1376704, 789556, 781508, 993984, 1491165, 1755250, 1784864, 2808281, 3618359, 3102260, 2889710, 2671188, 1998378, 2136720, 3516732, 4446401, 4390701, 3975750, 3757603, 3692493, 3057441, 1442200, -133389, -1311584, -1451785, -493999, 657555, 2204408, 3161232, 3112539, 2253548, 1672549, 2557422, 3065547, 2332285, 1651327, 2072567, 1971325, 1276253, 752912, 496999, 740255, 776778, 480321, 750276, 1322475, 2243169, 2121271, 1335462, 410705]
8224D10705l37917k80359o91359o9293N11973J110206J638613J547668P50921
8215D591158j75763k25717q6703j5988O8803l06194j360632n79931J91506J85771
8205B286310j92307p05656k5724k22247Q1265j71265l78280L97498J97330K41235
8195A508159J000562J254435J420684J149882j40922m47137O98509Q90412Q71166
8186H205750P35839J620213K059419L085524L422725K871428K682919K877550
8178B7561367L732229K898416K338271L81731k602597l437279l447727l089054
8170B4335357k435123k558707k222590j389160j859037k402606j761375j709824
8162G996935j376263k65263j99953q33583n88622p11186o29301j160740r12730
$$ y = [410705, 72788, -207571, -898930, -968223, -456250, 653956, 2292569, 3840237, 4591158, 4415395, 4189678, 4102975, 4086987, 4155790, 3849596, 2488964, 1909033, 2100539, 2286310, 2094003, 1388347, 1362623, 1140376, 1221641, 1050376, 672096, 1069594, 1266924, 1508159, 2508721, 3763156, 5183840, 6333722, 6192800, 5745663, 6444172, 7334584, 8205750, 8941589, 10561802, 12621221, 15706745, 19129470, 22000898, 24683817, 27561367, 31293596, 34192012, 36530283, 36912014, 34309417, 30872138, 27424411, 24335357, 21900234, 19341527, 17118937, 15729777, 13870740, 11468134, 9706759, 7996935, 6620672, 6355409, 6155456, 5321873, 4733251, 4022065, 3392764, 2232024, 1319294]
8153A319294J60263l44134o70485n6777K41211O7508L49394P31063Q27785j56122
8143B469000k34578J46685M77061J389474R56871k44409p79657N96812l01873
8134D475386l55752j67423j083392p04147J47788q11830j298466J76445L8384
8125D16993M13967M33961L24931J93069r21879q55532R44967L24238p26326m88600
8115E9789R05861J500715M56408N91976P04155n43506j30124n3604p28826o98795
8105B064049L69556l52973l86174l32190J14100k9704o7825k76171k36713k2106
8095H43849k28761j22661M01973R61893Q06442N67450j25463r85139p25903l77745
8085A015935M45409O26396m53154q6217l37768n85808M4150Q38031N51146k81407
$$ y = [1319294, 1479557, 1135423, 464938, 408161, 649372, 716880, 1066274, 1797337, 2625122, 2469000, 2234422, 2381107, 2858168, 4247642, 5204513, 4960104, 4180447, 4777259, 4475386, 4119634, 3952211, 2868819, 2164672, 2312460, 1500630, 202164, 378609, 416993, 830960, 1264921, 1589852, 1782921, 861042, 5510, 950477, 1274715, 548389, 59789, 965650, 2466365, 2922773, 3514749, 4218904, 3675398, 3545274, 3491670, 2762844, 2064049, 2433605, 2080632, 1694458, 1362268, 1476368, 1446664, 1378839, 1102668, 865955, 843849, 615088, 492427, 894400, 1856293, 2662735, 3230185, 3104722, 2119583, 1393680, 1015935, 1461344, 2087740, 1634586, 1548369, 1210601, 624793, 668943, 1506974, 2058120, 1776713]
8075A776713K05162O22497O86049m47863j359590j027397Q7343L44735k97960
8066E89689l10663L06398J158270J34764l42438m62402r13018K57699N25181L33477
8056A276957R45303J212914M66398p56251j29012L12800j251218j015369P4219
8047A136741l23889N61622R65174O780n36278p22662l03982M17770j44770j56763
8037H99743N34079P28769N23929P77435J48696j19532l47336j54740J071944J84834
8027D247821j24155L77674k43994o4948K25320k26896o4874m37221p43378J74696
8017C120045N32282M87731L68587K93312n9247m2064j19049k74939r1418R77450
8007E192690O71307P02710Q68529k70734O1362J047567J337361J374406J667359
$$ y = [1776713, 1981875, 2604372, 3290421, 2842558, 1482968, 455571, 542914, 887649, 589689, 279026, 585424, 1743694, 1878458, 1536020, 1073618, 160600, 418299, 943480, 1276957, 2222260, 3435174, 3901572, 3145321, 3016309, 3329109, 2077891, 1062522, 1136741, 812852, 1374474, 2339648, 2346428, 1810150, 1087488, 783506, 1201276, 1056506, 899743, 1433822, 2162591, 2686520, 3463955, 3612651, 3493119, 3145783, 2991043, 4062987, 4247821, 4123666, 4501340, 4257346, 4192398, 4417718, 4190822, 4125948, 3688727, 2945349, 3120045, 3652327, 4140058, 4508645, 4801957, 4742710, 4700646, 4581597, 4306658, 4215240, 5192690, 5863997, 6566707, 7435236, 7164502, 7225864, 8273431, 9610792, 10985198, 12652557]
7998A2652557K309896K999000L738942L721245L998395N198043O106199P735013
7990D8459290Q700573Q390072O033994L132341J104555j458543m698104p674289
7982F1989889q617180q267092o719516m099827k959083l623876m046429k992615
7974B0664271r97810R4063l92018J102456L68960j502028r75781l63011j151278
7965A6847824n26536l11372j125273j071081n84619O2995J48240k21253m56753
7956A2762172N93640K63807p3824q51218L03886J270653R53706J667876J682918
7947A8573616J986316K336099K758410K993498L406331M030929M377047O089103
7939D6551349Q154647J0993640J2643321J5331812J9974301K3750155K6650038
$$ y = [12652557, 14962453, 17961453, 21700395, 25421640, 29420035, 34618078, 40724277, 48459290, 57159863, 65549935, 71583929, 74716270, 75820825, 74362282, 69664178, 61989889, 53372709, 45105617, 38386101, 34286274, 31327191, 27703315, 23656886, 20664271, 19666461, 19760524, 19368506, 20470962, 20839922, 19337894, 18362113, 17999102, 16847824, 16321288, 16009916, 14884643, 13813562, 13228943, 13291938, 13440178, 13218925, 12762172, 13355812, 13619619, 13545795, 12694577, 12998463, 14269116, 15222822, 16890698, 18573616, 20559932, 22896031, 25654441, 28647939, 32054270, 36085199, 40462246, 46551349, 54705996, 65699636, 78342957, 93674769, 113649070, 137399225, 164049263]
7932A64049263K5562315J9573547J1656048K289361q592238j7639212k2852227
7925A74046857k5070962k3382891j9622495j5761380j2692323j0903308r018753
7918E7594745p559035n168737l502973l043201l136874k688334q42368J61582
7910C1814805J53948j071055j205099j078929o57394j21761R4824k90412j103270
7901B6535657j292067R9236k3593l37745k13556J0259J739811L169207K022125
7892C1709334J687659L146148L052109L494910M980302N473100O720871P657697
7884F7922130J0699816J3775970J6319557K0961660K6233598L2558411M0316511
7877B28787653M6288480M9805420M8707504M0211455K3928374K858241j7280728
$$ y = [164049263, 189611578, 209185125, 220841173, 223130534, 214538296, 196899084, 174046857, 148975895, 125593004, 105970509, 90209129, 77516806, 66613498, 57594745, 50035710, 44866973, 41364000, 38320799, 35183925, 32495591, 31653223, 31814805, 31968753, 30897698, 29692599, 28613670, 27956276, 27834515, 27929339, 27638927, 26535657, 25243590, 25342826, 25319233, 24981488, 24767932, 24778191, 26518002, 29687209, 31709334, 33396993, 36543141, 39595250, 43090160, 48070462, 53543562, 60264433, 67922130, 78621946, 92397916, 108717473, 129679133, 155912731, 188471142, 228787653, 275076133, 324881553, 373589057, 413800512, 437728886, 440587127, 423306399]
7870D23306399l3810797m4441388m9243201m6913707m0575299l3937032k8076336
7863A46308639k2119257j7402651j3778279q978648o903302o836399o414749l866578
7855F0008776j822022k156404j864341j242209j641545k084679k788735l442715
7847D2966126k578306k252222j662356j310967j105342o46339J7483R72384Q89130
7838C5289591M41864J769624L174589L173206K063749K034573L040136M915613
7830E5902945O410485Q227589J0835297J2845289J5703950J9461274K3794989
7823A53181818L0203985L7974013M6779802N4787257N9141826N6857264M6849860
7816D85775825K7362522M004829k0059370m1613370n4748098n9157444n5967651
$$ y = [423306399, 389495602, 345054214, 295811013, 248897306, 208322007, 174384975, 146308639, 124189382, 106786731, 93008452, 84029804, 77126502, 70290103, 63875354, 60008776, 58186754, 56030350, 54166009, 52923800, 51282255, 49197576, 46408841, 42966126, 40387820, 38135598, 36473242, 35162275, 34056933, 33410594, 33428077, 34400461, 35289591, 35731455, 37501079, 40675668, 43848874, 45912623, 47947196, 50987332, 55902945, 62313430, 70541019, 81376316, 94221605, 109925555, 129386829, 153181818, 183385803, 221359816, 268139618, 322926875, 382068701, 438925965, 485775825, 513138347, 517143176, 497083806, 455470436, 400722338, 341564894, 285597243]
7809B85597243m8236048l9105699l0384945k4621004k1045757j7025786j3108447
7802I2069557r564203p780083p003522n794003m544659l396346l137672k521736
7794D8327333k046491j647835j955120j721397j278612j751854j419707l60241
7786C6146076K53011r86565q80163o4290q93104k52390N19275J026792K779590
7777C7648232L684928M446594M415080M377416N196758O868176R037746J0609334
7769H6284264J2173958J5850479K0187706K5218947L1291897L9094999M6577447
7762B76679697M9967877M7166527L8548462K4220886L059506j8707503l6474633
7755C84460819m6455012m8638871m6657312m1273863l4213253k8053758k2253839
$$ y = [285597243, 237361195, 198255496, 167870551, 143249547, 122203790, 105178004, 92069557, 82505354, 74725271, 67721749, 61927746, 57383087, 53986741, 50849069, 48327333, 46280842, 44633007, 42677887, 40956490, 39677878, 37926024, 36506317, 36146076, 36399087, 35412522, 34532359, 34468069, 33574965, 33322575, 33841850, 34868642, 37648232, 41333160, 45779754, 50194834, 54572250, 59769008, 66637184, 75674930, 86284264, 98458222, 114308701, 134496407, 159715354, 191007251, 230102250, 276679697, 326647574, 373814101, 412362563, 436583449, 439642955, 420935452, 384460819, 338005807, 289366936, 242709624, 201435761, 167222508, 139168750, 116914911]
7748A16914911j7715992j4316483j0287260o862033p225190p563157n945856m791307
7740D2207633l089406k341736k130956j774967j988326k206776k307798k700223
7732B3667445k159525n04563j113357j147516o0944P61775N45208l28770n00480
7723A9159273j036416p5859J170477J634611K395609K212295J828915J832233
7715B9121138K944851M260683N654605P115691Q424269J0621723J2472055J5748136
7707I6363151J9414974K2495461K3766717K2987320K0502145J2803355J836662
7700B20169785q805413j7752683k2798984k5448914k4635421k1536052j7891464
7693H1300854j4262453j0381491q496141p175625n411822n019065m169300k689065
$$ y = [116914911, 99198919, 84882436, 74595176, 67733143, 60507953, 52944796, 46998940, 42207633, 39118227, 36776491, 34645535, 32870568, 30882242, 28675466, 26367668, 23667445, 21507920, 21003357, 19890000, 18742484, 18681540, 19443315, 19988523, 19659753, 19159273, 18122857, 18046998, 19217475, 20852086, 23247695, 25459990, 27288905, 29121138, 32065989, 36326672, 41981277, 49096968, 57521237, 68142960, 80615015, 96363151, 115778125, 138273586, 162040303, 185027623, 205529768, 218333123, 220169785, 211364372, 193611689, 170812705, 145363791, 120728370, 99192318, 81300854, 67038401, 56656910, 48160769, 40985144, 35573322, 30554257, 26384957, 23695892]
7685B3695892k903918j925771j245042j463646j310832k071238j083667j62901
7677A1528877k2298J86472M29437k60448j689953j318174k72889O58o71233p65186
7667G145263P0442L16661N49642N23286M30342Q78082J673802j5523j073975k64265
7657A0233757J390952K460346K412054J970138K929933N226511O216597O542804
7649C9383092P028999P610971Q117408N513688K741844M56597k588834m615301
7641F3648464o680049p813686p646812o927689n344215m648345m343972m139362
7633A6104334k483828j705268j740649r19393l48967l47022j613796j291937p63727
7624D889747J3182J24955m73782j393887j343768q34684k1808O54093N81684R16508
$$ y = [23695892, 20791974, 18866203, 17621161, 16157515, 14846683, 12775445, 11691778, 11528877, 11506579, 11693051, 12122488, 11862040, 10172087, 8853913, 8581024, 8581682, 7910449, 7145263, 7215705, 7532366, 8082008, 8605294, 9035636, 9913718, 11587520, 11571997, 10498022, 10233757, 11624709, 14085055, 16497109, 18467247, 21397180, 26623691, 32840288, 39383092, 46412091, 54023062, 62140470, 67654158, 70396002, 70852599, 68263765, 63648464, 56968415, 49154729, 41507917, 34580228, 29236013, 24587668, 20243696, 16104334, 13620506, 11915238, 10174589, 9255196, 8906229, 8559207, 6945411, 5653474, 4889747, 4902929, 5027884, 4554102, 3160215, 1816447, 981763, 959955, 1614048, 2195732, 3112240]
7614C112240N91748K77979M38588n62432o70852p84737r42302m75757O34977P82815
7604B402267p24603m76292N99412R57671Q04244J019150J458966N08528k89842
7595F259501n89821P4970O092r29143j020523j027956k10645l1050p16611j648997
7585A65817p36401N26294P88561O4134K18292K24146J83882l0224n25784j818366
7575i39649j127543J08601J438281J839953L96796j12116n22691J56213k32021
7566A005824j361538m51416k55282j44006J93247J141391P81755N93121R56237
7557B459333M71851K82690J23879M68589K02176k22512q02778j556107j444311
7548a7190j16567Q48716O90036K58777M06969J78542n61589K47863J044048Q9949
$$ y = [3112240, 3703988, 3981967, 4420555, 3858123, 3187271, 2402534, 1460232, 984475, 1619452, 2402267, 1677664, 1201372, 1800784, 2758455, 3562699, 4581849, 6040815, 6549343, 6259501, 5669680, 5744650, 5750742, 4821599, 3801076, 2773120, 2562475, 2531425, 1814814, 165817, -570584, -44290, 744271, 808405, 1026697, 1250843, 1434725, 1404501, 878717, -939649, -2067192, -1958591, -520310, 1319643, 1716439, 1604323, 1081632, 1237845, 1005824, -355714, -807130, -1062412, -1206418, -1013171, 128220, 909975, 1503096, 2459333, 2931184, 3213874, 3337753, 3806342, 4008518, 3786006, 2983228, 1427121, -17190, -133757, 714959, 1404995, 1663772, 2070741, 2249283, 1687694, 1935557, 2979605, 3069554]
7538C069554M12121L27533R56943J137766J248128J282171O95955M14893Q42286
7529A0387350Q96878J020938R24607J675508L235610M030177M229577L953665
7521C0354310N069392O154266P654877R545806J0986769J2192309J2409962J0014374
7513A04382065N013282k11372o260820j0457943j2595021j1810301r347280p891686
7505E0820924o254299n626939n313057n089013l841572k853096k771464k767456
7497A6304028j709044k578885l000025r36346M45588j43912n76005N41814l2994
7488H314219j000480j134730p26391o57303j229463j150368r77742j1280J66727
7479A593189q0407n5063m61691O82772J355352J228065r1535j50130k16528q10211
$$ y = [3069554, 3481675, 3809208, 4766151, 5903917, 7152045, 8434216, 9130171, 9545064, 10387350, 11284228, 12305166, 13229773, 14905281, 18140891, 22171068, 26400645, 30354310, 35423702, 41577968, 49232845, 58778651, 69765420, 81957729, 94367691, 104382065, 109395347, 109183975, 102923155, 92465212, 79870191, 68059890, 58712610, 50820924, 44566625, 38939686, 33626629, 28537616, 24696044, 21842948, 19071484, 16304028, 14594984, 12016099, 9016074, 8079728, 8525316, 8381404, 7805399, 8347213, 8314219, 7313739, 6179009, 5452618, 4795315, 3565852, 2415484, 1437742, 1426462, 1593189, 1512782, 1457719, 996028, 1678800, 3034152, 4262217, 4170682, 4020552, 3804024, 2993813]
7469B993813q90326o76685r1374J46916Q60447O82264J12426p22353n44169k55985
7459A614974l75206m15181k12353n49701m52428J353207J434575N05956N43095
7450C446938k53708j560840j99995J535557J055011J4691p13796j095194j798758
7441D29906k25530k13308m74009k5075Q2080L48653M02J47944M15550M96751o0931
7430I22433j283302j713156Q00524P01075l23654n00286L76683J36491n35536
7421a418728k28219M85548J374678J016978Q61488l51434q82836o1892p96087
7412e04j411758m15538N43637N55906Q63609N72631M8474q50959r80190o43903
7402a718595M81540J330065J07372j53066k33683L83856M05353o33896j044845
$$ y = [2993813, 2103487, 1426802, 1335428, 1482344, 2342791, 3025055, 3137481, 2415128, 1870959, 1614974, 1239768, 824587, 612234, 62533, -389895, 963312, 2397887, 2903843, 3446938, 3193230, 1632390, 1432395, 2967952, 4022963, 4037654, 3323858, 2228664, 429906, 204376, -8932, -482941, -508016, -425936, -77283, -76881, 71063, 486613, 983364, 922433, -360869, -2074025, -1273501, -572426, -896080, -1396366, -1019683, -883192, -1418728, -1646947, -1161399, 213279, 1230257, 2091745, 1740311, 857475, 795583, -504, -1412262, -1827800, -1284163, -728257, 135352, 707983, 756457, -94502, -1074692, -1718595, -1237055, 93010, 200382, 47316, -186367, 197489, 602842, -31054, -1075899]
7393a075899R555O69653j7028n40598O65511J077356O69928N66653m35164l16353
7383A273614M03553K16817L72035R1119r15357l20294Q17252L83445m73625K90146
7373B138705r56960K07059K08480n77353l35219J2071N27236L48751J42080r55394
7363G59456m66372K78559M52193J99393o8538k52529M1830J25529k78812M7422
7353H38131m06417n2721M12842K23872n9799q5011m09297o4475J14485J016349
7343A527959R35980n010k44228j012482j839118n95563J510604J498156N56537
7334B332835Q16530J062209M46102o49055j521597k04706k22645q08837q04838
7325D45998m86598n2704R1820L00650j0046k97076k9332O65744K20141k03109
$$ y = [-1075899, -1066344, -396691, -413719, -954317, -288806, 788550, 1458478, 2025131, 1589967, 1273614, 1677167, 1893984, 2266019, 2357138, 1441781, 1121487, 1938739, 2322184, 1848559, 2138705, 1181745, 1388804, 1597284, 1019931, 684712, 696783, 1224019, 1572770, 1714850, 759456, 293084, 571643, 1023836, 1223229, 1154691, 902162, 943992, 1069521, 790709, 838131, 431714, 378993, 791835, 1015707, 955908, 870897, 461600, 397125, 511610, 1527959, 2463939, 2458929, 2214701, 1202219, -636899, -1232462, 278142, 1776298, 2332835, 3149365, 4211574, 4657676, 4008621, 2487024, 2282318, 2059673, 1250836, 445998, -40600, -93304, -1484, 299166, 289120, -7956, -37288, 628456, 848597, 645488]
7315F45488M10930o25011r30498m98910K637o39904M61936R23750L30062J001473
7305A081953J214002k2335p61642j296641j61571K83569R0392m99360r10994P01958
7295b80669Q96183J99428j75557P92265j6102p24781n69748k34460P23787J073840
7285A684186K69318N20036M51300n58415K45999J608385K042198J55077j472418
7276D945666p17770L10181j7075J43713j26734m51720N55215J030841l26757n68785
7266D776775O8074k16276L7353J884154J706486N29182l99020j74599N47142R43300
7256I702571J596665Q65622l41250L60264J014816P78017K204807K575813J993032
7247B0750357K402112L441853L766326M736371N438382P305349Q742847R575229
$$ y = [645488, 1056418, 431407, -499091, -998001, -995364, -1635268, -1173332, -249582, 80480, 1081953, 2295955, 2273620, 1511978, 215337, 53766, 337335, 427727, -71633, -982627, -280669, 615514, 814942, 639385, 1431650, 1415548, 690767, 121019, -113441, 610346, 1684186, 1953504, 2473540, 2924840, 2366425, 2612424, 4220809, 6263007, 6418084, 4945666, 4227896, 4538077, 4521002, 4664715, 4537981, 4086261, 4641476, 5672317, 5345560, 4776775, 4844849, 4628573, 4665926, 6550080, 8256566, 8785748, 8386728, 8212129, 8759271, 9702571, 11299236, 12164858, 11823608, 12183872, 13198688, 13976705, 16181512, 18757325, 20750357, 23152469, 26594322, 30360648, 35097019, 40535401, 47840750, 56583597, 66158826]
7239F6158826J0750018J1665449R979248N402976J233073l429259o985055j0060718
7231H4714558j2342451j1134899q889520o611706n462718n547630m585797l252513
7223B6887324k870826k970745j861832j321825j301794j606951k402418k530572
7215A0020361j239418m45715j639177j284898k94554m50972K900L86855M91472
7206E546854L11511J207375Q54268j88916p57932n85132p78096n84565n21711
7197D503656l52775P2820l0412J9113l65197p0866N05898Q15900P54036m76418
7187E375755o61678k29152j172J2203o36654j164279k47805M70438j39880P88463
7177C566239k86378j180709j83998L05836o73634O98539K404557O34304p20026
$$ y = [66158826, 76908844, 88574293, 98553541, 103956517, 105189590, 101760331, 94775276, 84714558, 72372107, 61237208, 52347688, 45735982, 40273264, 34725634, 30139837, 26887324, 24016498, 21045753, 19183921, 17862096, 16560302, 14953351, 12550933, 10020361, 8780943, 8335228, 6696051, 5411153, 5116599, 4665627, 4668527, 5055382, 5546854, 5858365, 7065740, 7920008, 7731092, 6973160, 6388028, 5609932, 5025367, 4503656, 4150881, 4223701, 4193289, 4212402, 3847205, 3776339, 4282237, 5098137, 5852173, 5375755, 4714077, 4484925, 4483753, 4495956, 3859302, 2695023, 2447218, 2917656, 2777776, 3566239, 3279861, 2099152, 1915154, 2220990, 1547356, 2245895, 4650452, 5284756, 4564730]
7168D564730p01819K80965O68974k13264q56133q79867q43269j015004j186452
7159a81139j01465J437944J355005J95843p62957l83556J28029l27362j49127
7150A211215k53048j400699n14388Q10883J54480L24874k76528O119K02396M4027
7140C09331l87502j90911N32231K50498K09715j061805q69561J21037Q17859J684361
7130A415253Q61693j22015m85336q66767j768112j257551p16783q46593K63301
7121c522910O14936O73177P31974L28025j53980l44399J43942j09691l5202O50963
7111a023165K61535J08673N5142K29553L9935n15899N01780M64993p42626o76398
7101a296477M49129J187332M44257r96911j369628j092420L23170Q31925L11442
$$ y = [4564730, 3862911, 4143876, 4812850, 4599586, 3743453, 2863586, 2020317, 1005313, -181139, -282604, 1155340, 2510345, 2706188, 1943231, 1559675, 1687704, 1360342, 1211215, 958167, -442532, -956920, -146037, 8443, 333317, 56789, 62908, 265304, 309331, -78171, -269082, 263149, 513647, 723362, -338443, -1208004, -1086967, -269108, 1415253, 2276946, 2154931, 1669595, 802828, -965284, -2222835, -2939618, -3786211, -3522910, -2907974, -2234797, -1502823, -1174798, -1328778, -1673177, -1529235, -1638926, -1674128, -1023165, -761630, -652957, -597815, -368262, -328327, -844226, -342446, 122547, -620079, -1296477, -847348, 339984, 784241, -212670, -1582298, -2674718, -2351548, -1519623, -1208181]
7092a208181J230988P35716j67789n76511K1037j99862k92406r61060q52643l11755
7082b582466n14867l18332Q68682Q71156N52560K80378l02106J62812J177617
7073A95434R13663K73355j045995j135859j35233m21071Q0673O62604L98527k86669
7063e00571r02050L83750J85553l95894L06355m00623p18855m32766j01417J16721
7053b459797n08847m41465K10335J284495J445726L0044m58149M77450N84764
7044A64556K69205M02203M4562j010433j406219j53498j85179k71786j108835
7035c255424j111188L86682J251435P01366J34480O23138L61359K06912n05187
7026a206427n85770m30679m07245q8842J180443J293732r787n95974o78800k0834
$$ y = [-1208181, 22807, 758523, 590734, 14223, 35260, -164602, -457008, -1418068, -2270711, -2582466, -3097333, -3415665, -2546983, -1675827, -1123267, -842889, -1144995, -982183, 195434, 1109097, 1382452, 336457, -799402, -934635, -1355706, -1275033, -612429, -213902, -500571, -1402621, -1018871, -833318, -1229212, -922857, -1323480, -2042335, -2475101, -2576518, -2459797, -2968644, -3410109, -3199774, -1915279, -469553, -439509, -897658, -420208, 164556, 433761, 835964, 880526, -129907, -1536126, -1689624, -1874803, -2146589, -3255424, -4366612, -3979930, -2728495, -2027129, -1892649, -1269511, -908152, -701240, -1206427, -1792197, -2222876, -2630121, -2718963, -1538520, -244788, -254575, -850549, -1529349, -1550183]
7016a550183J71622m82855m14656j14799O765M69071J005989O74765J34049N67563
7006D67331m54297j462300j242953o9301J072969M50336o2316J127007P64782
6997E91258k89280n93486m05321l20059N38717L26037K45397o00570p3011R28665
6987C48347J53915L80391m48630j189034k58779Q5722p9168j96991P92790K65626
6977a45811j10218M43461L73308m71350n8652k28251j021431p90884J02825R59736
6967i47267O63167M79863l40049r58341J8504K24345K93425Q26315j26570k15640
6957h2248j58240L79535L02178q69177r64568o66119m98353R33170J755562J414318
6947A546058K12085o54951n84852p17056m93405K04844J20535J37220L43515J03726
$$ y = [-1550183, -1378561, -1861416, -2276072, -2390871, -2384106, -1915035, -909046, -234281, -100232, 467331, 13034, -1449266, -2692219, -2761520, -1688551, -1238215, -1300531, -173524, 591258, 301978, -291508, -696829, -1016888, -478171, -152134, 93263, -507307, -580318, 348347, 502262, 882653, 434023, -755011, -1013790, -928068, -1007236, -1204227, -411437, -145811, -256029, 187432, 560740, 89390, 30738, -197513, -1218944, -2009828, -1907003, -947267, -284100, 195763, -144286, -1102627, -1084123, -859778, -566353, 259962, 133392, -82248, -240488, 139047, 441225, -427952, -1392520, -2058639, -2556992, -1623822, 131740, 1546058, 1758143, 1103192, 518340, -198716, -692121, -487277, -366742, -229522, 113993, 217719]
6937B17719M59583K28390P3459j44615M12063P2086p43435o16373l50753J17005
6927b74871J471627Q02768k42543N2580o58573j000217o73290P80768j14197r66493
6917h22441q24102q83621j105369m32789O39920J575714J375499J42497j29405
6908d64097P96674O90653J6696p34667r08768o68737m51383J14304m6071k31397
6898a886793L40723K52689O56887M27686L88923n3446q34311J86529R39601R06742
6888A325230J089001L85721q02321j267653j601046q56669L69534J58929l57844
6879a557118J48073P56820J280753N47021j078146j310785j41417M45528K4012
6870h85259L78252P9347K18093O67772j11171r10041J17356J225933J082610o04193
$$ y = [217719, 677302, 905692, 979151, 834536, 1246599, 1318685, 575250, -41123, -391876, -274871, 1196756, 1999524, 1756981, 1809561, 1150988, 150771, -522519, 258249, 144052, -822441, -1646543, -2530164, -3635533, -4068322, -3428402, -1852688, -477189, -334692, -464097, 332577, 1023230, 1039926, 305259, -603509, -1272246, -1723629, -1609325, -1655396, -1886793, -1546070, -1293381, -636494, -208808, 180115, 126669, -707642, -521113, 418488, 1325230, 2414231, 2799952, 1997631, 729978, -871068, -1727737, -1358203, -1199274, -1557118, -1409045, -652225, 628528, 1175549, 97403, -1213382, -1354799, -909271, -885259, -507007, -427660, -209567, 458205, 347034, -563007, -445651, 780282, 1862892, 1258699]
6860A258699j161806p86904p72236j09587J5937n25000l31311O23241K51107O89884
6850h47976K82946m43030j29509P83158O59429O47835K42087n68051j43379N42571
6840A026081K35725J4828p5997l81606k91743L12067J65566K39154O83981J71689
6830B099745p97806j80887O03242k37270r23381n86751j51576P02425Q8809k97841
6820C18709K4019K53817O56092R33538l52711k53053N63067l27375J64974L87727
6810B368804l71607j258207j057921q3554j22762m35999P02387K045459J193522
6801B980122p20232l92279P60382L31267j045927m58964Q73322L63286o21315
6792B069662j421648j052090q06407K36396O69519n91515n55852j00205R46614
$$ y = [1258699, 96893, -690011, -1462247, -1571834, -1555897, -2080897, -2412208, -1788967, -1537860, -847976, -565030, -1008060, -1137569, -354411, 305018, 952853, 1194940, 626889, 483510, 1026081, 1261806, 1276634, 1200637, 819031, 527288, 839355, 1004921, 1244075, 1928056, 2099745, 1301939, 1121052, 1724294, 1487024, 563643, -23108, -174684, 527741, 616550, 318709, 342728, 596545, 1252637, 2186175, 1833464, 1580411, 2143478, 1816103, 1981077, 2368804, 1997197, 738990, -318931, -402485, -525247, -961246, -258859, 1786600, 2980122, 2259890, 1867611, 2627993, 2959260, 1913333, 1454369, 2327691, 2690977, 2069662, 648014, -404076, -1210483, -974087, -304568, -896083, -1451935, -1552140, -605526]
6783f05526N06480n30465o87627M29346J044182Q36100K83267m02713M42159J99344
6773A514547p23710j172677q01460k02316m77617l01984M42360J333826O98403
6764C09372K75659o47945q23091l66658Q9197m62533j195994M13968J000725N51022
6754h56278K75772R87638P22942l45914k72656o19911R7210p3204l992L27815
6744B39422N87577Q2936m60600M45159O24402o12073l06444m86297p93399J153288
6734D73971P50192m92034m64475j5458P78032N41675l99819j452130o56781R88146
6724E1319J427923J368476o3987m27604l08111j36723r33475j822573o23350R55165
6714e12940J521226O03782q44532n35032N81903J54291m34778n04410J11670L40116
$$ y = [-605526, -99046, -629511, -1317138, -887792, 156390, 992490, 1275757, 873044, 1315203, 1514547, 790837, -381840, -1183300, -1385616, -1863233, -2165217, -1722857, -389031, 309372, 585031, -62914, -886005, -1252663, -1163466, -1625999, -2821993, -2408025, -1407300, -856278, -580506, 407132, 1130074, 784160, 511504, -108407, -11197, -84401, -88393, 239422, 826999, 909935, 449335, 894494, 1518896, 906823, 600379, 114082, -679317, 473971, 1224163, 732129, 267654, 252196, 1030228, 1571903, 1172084, -280046, -936827, 51319, 1479242, 2847718, 2783731, 2356127, 2048016, 1911293, 977818, -844755, -1468105, -512940, 1008286, 1612068, 767536, 232504, 814407, 968698, 533920, 29510, 141180, 481296]
6704D81296p29177o18647R6122K06323j96246n02477j36575r3342k89374j70707
6694a952804l46195K95156M20158J604279R99368J41189l17111m85440l83097
6685b4497n39579O45350J158397P90478N26193m37230j045817n42247l8699n94379
6675a02030p89042N9682n66699j91703P45933M58353R97490Q28172L97973m53195
6665A384934k29051L93520K94377j89791k87144O47043k98426p50595p65355l90242
6655a90730K82847J34036o91593o58963r21444j67104J136173N94269J73241k7282
6645c36550n67517k08506Q30544P03661k05199o16469p47881N4281Q99069M97589
6635C03022M20327N87386l60298k47047K08551N96629R88220N21852M96515K48936
$$ y = [481296, -247881, -866528, -770406, -564083, -760329, -1262806, -1399381, -1492723, -1782097, -1952804, -2298999, -2003843, -1583685, 20594, 1019962, 1161151, 844040, 358600, -24497, -564076, 81274, 1239671, 2030149, 2556342, 2119112, 1073295, 531048, 492349, -102030, -891072, -831390, -1398089, -1589792, -843859, -385506, 611984, 1440156, 1838129, 1384934, 1155883, 1549403, 1843780, 1653989, 1366845, 2013888, 1715462, 964867, 199512, -190730, 92117, 226153, -465440, -1124403, -2045847, -2212951, -1076778, -482509, -309268, -336550, -904067, -1112573, -282029, 421632, 216433, -400036, -1147917, -1093636, -194567, 303022, 723349, 1310735, 950437, 703390, 911941, 1508570, 2496790, 3018642, 3515157, 3764093]
6625C764093J018266K303811J599932K124225J780122r56712k781922l434872
6617E416943k637677n53525J73389J32784J200300J059504J9488r77511o89291
6608C144404m89202j181676p02555J17069j08641j41628N48048M52599R48476
6599B586894O09171l15237j668896j770363o44515M88484J165318J207936J03785
6590A762577r51930r36676M45307K55913J63072j43886j244905m97565J05239
6581a042854m4223j011357k24667N12711K63179m5123P74067J326442O79886o61780
6571E26281j163309p19763p5138k4124j70129M04627J295519K99734J87813M1650
6561F03161m41512n98157j027025l5452K46364Q03586P16012l96595l82108Q4358
$$ y = [3764093, 4782359, 7086170, 8686102, 10810327, 12590449, 11633737, 8851815, 5416943, 2779266, 2225741, 2399130, 2531914, 3732214, 4791718, 4811206, 3833695, 3144404, 2655202, 1473526, 770971, 888040, 779399, 637771, 1185819, 1638418, 2586894, 3196065, 2880828, 1211932, -558431, -1202946, -714462, 450856, 1658792, 1762577, 810647, -126029, 319278, 575191, 738263, 594377, -650528, -1148093, -1042854, -1087077, -2098434, -2323101, -1810390, -1547211, -1592334, -818267, 508175, 1188061, 526281, -637028, -1356791, -1431929, -1456053, -1626182, -1221555, 73964, 373698, 561511, 603161, 161649, -436508, -1463533, -1498985, -1252621, -449035, 266977, -129618, -511726, -427368]
6551d27368M11277M16039o36466o61035l18675L09562p003m41451n08131n06161
6541b369412L23364J075511K74747J06113k37106p19819j85706n90278p97478
6532c120064o68567N42542Q47563r526n45151j77832L757M57559P86615J34462
6522a748642J9541O56565o2543m50529m763M17762N43668O28685O785M86418O07907
6511A100854l42337p06993j99400q63207l22941J015304J072423J053026l96367
6502A410362k393552j094703K39528n94979N7700N65702J58279l12401o57393
6493b621457l92402J295635R76432j56674J76128R29180k07274j141571j22419
6484a264422J050541J669253q620K73559J457676L25993Q5029O6591p32304m58777
$$ y = [-427368, -16091, 399948, -236518, -897553, -1216228, -906666, -913669, -1355120, -1863251, -2369412, -2046048, -970537, -695790, -589677, -826783, -1546602, -1732308, -2322586, -3120064, -3788631, -3246089, -2398526, -2408052, -2953203, -3131035, -3127278, -2669719, -1883104, -1748642, -1729101, -1072536, -1135079, -1585608, -1590371, -1172609, -628941, -256, 6529, 492947, 1100854, 758517, 51524, -147876, -1011083, -1334024, -318720, 753703, 1806729, 1410362, -983190, -2077893, -1838365, -2433344, -2375644, -1809942, -1651663, -1964064, -2621457, -3013859, -1718224, -741792, -898466, -722338, 206842, -432, -1142003, -1264422, -213881, 1455372, 1446752, 1720311, 3177987, 3503980, 3589009, 3655600, 2923296, 2464519]
6474B464519p34480r96284n37597j98884O21598Q40707Q63159K53477l1255j29777
6464B415183o73648M56328J71206m79120k42860q86456j025739q11457N07999
6455e68564Q07110J028628P31031L44891p42642j404157j101187o01746j53604
6446a660240Q42979J326818J38625m67684m37176L03382m14364j58133O96527
6437A70734K90106K54075M90933k25l24719n34961p65278r6589L35249k42583
6427d23258N38801m70140m63419Q69179M79974l91045j020154Q1766L8502R8088
6417f61706J160613J614299N39987l55961o03968O96823Q66435J08228k74681
6408C090069q26014l17910R40545J35540j290603l23710K29547R743M20351l32907
$$ y = [2464519, 1730039, 733755, 196158, -2726, 618872, 1459579, 2322738, 2576215, 2544960, 2415183, 1741535, 2197863, 2369069, 1889949, 1647089, 760633, -265106, -1076563, -568564, 238546, 1267174, 1998205, 2343096, 1600454, 196297, -904890, -1506636, -1660240, -817261, 509557, 648182, 180498, -256678, 46704, -367660, -525793, 170734, 460840, 714915, 1205848, 1205623, 880904, 345943, -419335, -515924, -180675, -423258, 115543, -354597, -818016, 51163, 531137, 140092, -880062, -798296, -759794, -661706, 498907, 2113206, 2653193, 2297232, 1693264, 2390087, 3256522, 3364750, 3090069, 2264055, 1946145, 2886690, 3022230, 1731627, 1407917, 1637464, 1647207, 2067558, 1734651]
6398A734651q92355m9969J461018J362521L24246O1489j72096l25469O6638J254289
6388D824963J010356j128972j696690j363003j820518r57904Q49431K219743J568127
6379C505533O68626p54682j664612q52561K68890J54104q04248r7654O66256J27229
6369A216881R27288N20412n36258j820828k72685J032062J31204K61549J217086
6360B676711J520577O77222k22643n69695n58032K47127M62680o38739q89731
6351B705477l16174N56039J005403O71450r17502o54715o96103r80334k14801
6342A158740j45435m27925m2425Q93309J322969J126713J320334J029600L16573
6333F552453O91354J010739J121807R27706P88813K99782m7399L67691J497129
$$ y = [1734651, 842296, 792327, 2253345, 3615866, 3940112, 4001601, 3829505, 3504036, 3570674, 4824963, 5835319, 4706347, 3009657, 1646654, -173864, -1131768, -282337, 1937406, 3505533, 4174159, 3419477, 1754865, 902304, 1171194, 1325298, 521050, 423396, 1089652, 1216881, 2144169, 2664581, 2128323, 307495, 34810, 1066872, 1198076, 1459625, 2676711, 4197288, 4874510, 4651867, 4082172, 3524140, 3771267, 4233947, 3595208, 2705477, 2389303, 2945342, 3950745, 4622195, 3704693, 3049978, 2353875, 1373541, 1158740, 1013305, 585380, 542955, 1436264, 2759233, 3885946, 5206280, 6235880, 6552453, 7243807, 8254546, 9376353, 10304059, 11092872, 11392654, 11345255, 11712946, 13210075]
6324A3210075L120011M416406N526979O121018P618515Q927878J1098871J3761085
6316G3800838J7454710K1053041K1805622J3633929k161799j6179581k2021303
6309A07385457k0593995j6948948j3568772j0952717q695727n994390l870013
6302B6760895l191611l362816k916230k143934k472473j754434r15648o31503
6294I372246q18156j075614q09689r69166q85459P3016N8681o01688l45498N10972
6284D509645N35056o82277j98930j049844j301871P34909J64152p50221m50511
6275A510108L78124J000270R91054P6699p00879m21465m41567m51062q32934k40274
6265H68074L7054p07938m83417L506O74560J266187O3220n95149K37342O61704
$$ y = [13210075, 16330086, 20746492, 26273471, 32394489, 40013004, 48940882, 60039753, 73800838, 91255548, 112308589, 134114211, 147748140, 145586341, 129406760, 107385457, 86791462, 69842514, 56273742, 45321025, 36625298, 30630908, 26760895, 23569284, 20206468, 17290238, 15146304, 12673831, 10919397, 10003749, 9372246, 8554090, 7478476, 6668787, 5699621, 4814162, 4887178, 4945859, 4344171, 3998673, 4509645, 5044701, 4362424, 4163494, 3113650, 1811779, 2546688, 2710840, 1960619, 1510108, 1888232, 2888502, 3879556, 3956255, 3255376, 2833911, 2392344, 1941282, 1108348, 868074, 905128, 197190, -286227, -282721, 391839, 1658026, 1721246, 1126097, 1363439, 2025143]
6255B025143M22833q6837n83870k18396L02687m15217k82957M15095K37551p51631
6245A064401k53182L24327L75859N15855j32512r87918l04562P14132j15926j119190
6235H1284r08743j308423k74135J377684J239462Q14671J85363r23479k50518
6226C3166M54098K09731K09260j021953p17130l66820j9760J01173M79281P55380
6216A16426R56344R83237M93478N21540j71135j101528k44300l70935l91101j85700
6206F06326r3424j41341P76371O10776m09859p44921j295394m26507M73494L73227
6196b71252L30383L60733o7492r6474k65640M670m55209L12646L72665P3298n98603
6185c00275l69174K24464k85014n6710j61913M48517J109233K70090k24516N63904
$$ y = [2025143, 2447976, 2361139, 1777269, 1558873, 1861560, 1446343, 1163386, 1578481, 1816032, 1064401, 811219, 1135546, 1511405, 2027260, 1894748, 906830, 602268, 1316400, 1200474, 81284, -827459, -2135882, -2410017, -1032333, 207129, 1021800, 1207163, 283684, 33166, 487264, 696995, 906255, -115698, -832828, -1199648, -1219408, -1118235, -638954, 116426, 1072770, 2056007, 2549485, 3071025, 2899890, 1798362, 1554062, 1183127, 792026, 606326, 512902, 371561, 1147932, 1758708, 1348849, 603928, -691466, -1117973, -644479, -271252, 59131, 419864, 352372, 255898, -9742, -5072, -460281, -147635, 225030, 298328, -300275, -669449, -444985, -729999, -786709, -948622, -500105, 609128, 879218, 654702, 1218606]
6175A218606m85023j022481J33056o3488K89202J136388J091418n47430k10159
6166A540089J2305p78220r02800j115027o01650L78921N27305N77491M81642O18532
6156G38588N07762p33704r93599p15351O54878Q76283r93275j163679p07605l01209
6146b830911k13712Q07878R87941l05291o15999N12120Q87944L6701m85677n74294
6136a793300k62420M39178p1430p26586M0547O00275J318905M58807k27908m54112
6126f78044r48911m27434Q45507J015588m5515O30537R83384k45086J65401P2921
6116A368348q9329j78834r30174p37138O92269R14173K73714k60054m25766R8959
6106G26168J83138o46011k86203N22058K06858M47102m8468k96189N35501K81201
$$ y = [1218606, 733583, -288898, -155842, -219330, 69872, 1206260, 2297678, 1750248, 1540089, 1552394, 774174, -128626, -1243653, -1845303, -1466382, -939077, -361586, 120056, 738588, 1246350, 512646, -480953, -1196304, -541426, 334857, -658418, -1822097, -2529702, -2830911, -3044623, -2236745, -1248804, -1554095, -2170094, -1657974, -770030, -733329, -1219006, -1793300, -2055720, -1616542, -1687972, -2414558, -2374011, -1773736, -454831, 3976, -223932, -678044, -1626955, -2054389, -1208882, -193294, -238809, 391728, 1375112, 1130026, 1295427, 1368348, 1279019, 1100185, 170011, -567127, 125142, 1039315, 1313029, 1052975, 627209, 726168, 909306, 263295, -22908, 499150, 706008, 1153110, 1104642, 808453, 1343954, 1625155]
6096A625155m46252m26308m11099M77073N89516j507592j825173k27595P49465
6087a402810J196601Q03671L64233J28021k37059m65370l82186k77263M53797
6078A81635N16090q43663q43311O50209k86901q43941J78676L15713j67022K34792
6068i07723N55021l31515k61136J021282O91179n23529p79547o12995n64692M3742
6058a669913k4468J2947Q98762Q23954j22132O7075J39581j170197r00685k5956
6048a971032L23679N54956J22757o11600k17253L2264o3197O81989J505406O80174
6038A038143n41648p30281l59658K02960J62943J81477M04055L18405k16012j001110
6028e40726l84963j3065n97234N32212J202699J218027J78811q81008r7832K77679
$$ y = [1625155, 1178903, 752595, 341496, 818569, 1408085, -99507, -1924680, -2152275, -1402810, -206209, 597462, 961695, 1089716, 852657, 387287, 5101, -272162, 181635, 697725, -145938, -989249, -339040, -625941, -1469882, -1291206, -975493, -1142515, -907723, -352702, -684217, -945353, 75929, 767108, 243579, -535968, -1148963, -1713655, -1669913, -1694381, -1681434, -782672, 41282, -80850, -13775, 125806, -1044391, -1945076, -1971032, -1647353, -1092397, -969640, -1581240, -1798493, -1766229, -1829426, -1147437, 357969, 1038143, 496495, -233786, -593444, -390484, -227541, -46064, 357991, 676396, 460384, -540726, -925689, -938754, -1535988, -1003776, 198923, 1416950, 1595761, 714753, 616921, 894600]
6018H94600L0547L41016o3982K16000Q6679o04995j017485n64871j001605o03807
6008b287903R56300O29757j83241m89480J22232O31923O60480O7190q2465J15057
5998A39850L6746l02182P2412K38766p6206j65743k79497j69710K76022N38623
5988C09081K10588o71562k57362k64963p80384J58966L74853P34905p72509n30278
5978a488665M57169p6302p38706p38054P24514J432684J163451o0530k81735J283573
5968A677399J620855n46052q95629q87512q43025j46684N5285M97381O78569m3623
5958A166964n72900j159535o73674M09604R91195K76059J50657M20438r9247j146662
5948b37101n38940M41895J313022J097019K22320n85029j229331j28454N57043
$$ y = [894600, 925147, 1266163, 1202181, 1418181, 1504860, 899865, -117620, -682491, -1684096, -2287903, -1331603, -701846, -885087, -1374567, -1252335, -620412, 40068, 107258, 24793, 139850, 176596, -125586, -53174, 185592, 109386, -56357, -335854, -505564, -229542, 309081, 519669, -151893, -409255, -674218, -1454602, -1295636, -920783, -185878, -958387, -1488665, -1031496, -1107798, -1846504, -2584558, -1860044, -427360, 736091, 675561, 393826, 1677399, 3298254, 2752202, 1856573, 969061, 126036, -20648, 34637, 532018, 1210587, 1166964, 594064, -565471, -1239145, -829541, 161654, 437713, 588370, 1008808, 909561, -237101, -776041, -334146, 978876, 2075895, 2298215, 1713186, 483855, 355401, 912444]
5939I12444K36646L90535J485794R94786p76737n95536o42687P6244p80595m3633
5929A257261O84289n79880m14726L28722K24944Q40468R75161j363381k128022
5920a75164k368569p78758P96196M9642j39290O46488J81580O997J91909m60071
5910b049040o9301k03623n47959O30060M78405n9582q11034r48307k25336j94011
5900c999728m02281R69353J846314P72272n33185o99497m65771P08139R51175
5891h53209R7550l53266k23668O22913J158815P61583r88369j708928j059111
5882b545690J76975k36261p77754r24926l90943J154288J708654j25653p06872
5873b668182J050941J355784Q15373m57414j001937m58127l55254j21604J54190
$$ y = [912444, 1149090, 1539625, 3025419, 4020205, 3243468, 2647932, 2005245, 2081489, 1300894, 1257261, 1941550, 1361670, 946944, 1275666, 1500610, 2341078, 3316239, 1952858, -175164, -2543733, -3322491, -2526295, -2476653, -2615943, -1969455, -1787875, -1780878, -1588969, -2049040, -2118341, -2321964, -2869923, -2239863, -1761458, -1821040, -2632074, -3580381, -3805717, -3999728, -4402009, -3432656, -1586342, -814070, -1347255, -2046752, -2512523, -1804384, -853209, -755659, -1108925, -1332593, -709680, 449135, 1210718, 222349, -1486579, -2545690, -2368715, -2604976, -3382730, -4307656, -4698599, -3544311, -1835657, -1961310, -2668182, -1617241, -261457, 553916, 96502, -905435, -1363562, -1718816, -1840420, -1686230]
5864a686230Q06304J111785q0459p67669N1503P97454L02580o47342l2855P20607
5854E75678k84791o71489j76614L03543K97530L9707j2157n8048n14692n42556
5844a043889R2766O80243Q08054K14900L14942N05203k69874o35925p53345l20673
5834d07598Q48726J31669l92658k536K89547j54309o21960k9485R6239L08184
5824F5819O18910J248523J370406L65538k28263j385145j507443k84419n71299
5815c07373q26666j76615k6868J018528R73205n17075o59470m19946O54705M44876
5805A57301q85157j236944J18304K02052m12886j26882p63334l46850J425231
5796a869165J054945k27847j18278k55690J92386M60242J23224L46353k2052l89884
$$ y = [-1686230, -879926, 231859, 151400, -616269, -564766, 232688, 535268, -112074, -144929, 575678, 290887, -380602, -557216, -253673, 43857, 83564, 71407, 13359, -501333, -1043889, -951123, -270880, 537174, 752074, 1067016, 1572219, 1302345, 666420, -86925, -407598, 441128, 572797, 180139, 177603, 467150, 312841, -309119, -338604, -242365, 65819, 684729, 1933252, 3303658, 3669196, 3440933, 2055788, 548345, 263926, -307373, -1134039, -1310654, -1337522, -318994, 654211, 137136, -522334, -942280, -287575, 157301, -727856, -1964800, -1846496, -1644444, -2057330, -2184212, -2947546, -3294396, -1869165, -814220, -1042067, -1160345, -1416035, -1223649, -763407, -640183, -293830, -315882, -705766]
5786g05766L02306N85130Q52974R8169j939106j767184O8599N57644Q22340j89705
5776a314599n39494K89727L57911J199061n9699o61694n44654P4876O95055R55392
5766D51882J021944K60762j283024j480365O0379M05527m45779j732228j389611
5757d130513N61228J439016J435128J413818M94154k13616n97169p92002J85599
5748b04357J174077J100640M33573o04329r42462k80110m669J86284j81049p33754
5738e6156q64735m98202J33462O84910P12413R68901P11803q10806j475345n99057
5728a092812O57673R83063P14231N381m72779j112609q87527J12273P43312L98608
5718D8814K03131m17219O05242M73131q00959q30405o60151R43641J315257J52016
$$ y = [-705766, -403460, 181670, 1034644, 1132813, -806293, -2573477, -2504878, -1947234, -1124894, -1314599, -1854093, -1564366, -1206455, -7394, -67093, -728787, -1273441, -1198565, -503510, 451882, 1473826, 1734588, 451564, -1028801, -968422, -562895, -1008674, -2740902, -4130513, -3569285, -2130269, -695141, 718677, 1212831, 999215, 402046, -389956, -204357, 969720, 2070360, 2503933, 1899604, 957142, 677032, 672363, 858647, 677598, -56156, -920891, -1419093, -1285631, -600721, 111692, 1080593, 1792396, 981590, -493755, -1092812, -435139, 547924, 1262155, 1267536, 794757, -317852, -1205379, -1093106, -349794, 48814, 251945, -165274, 439968, 913099, 112140, -718265, -1378416, -434775, 880482, 1032498]
5708A032498k73704N8746l1454N63356j27291p35061j740385j367655P31036J560491
5698c29423O72595K02068N98646O65561j90305q5946N21851m30666n92436r82156
5688D9789j335471j72773m56255q64083L86483N35711J41491M32350J50757n51829
5678a683830J1366J200919J129409M05577p17470j402233j275377q55239j87043
5669c373921k07794R37726J989669J590502p5300l01687R91190K83294k84778
5660A548901l27062q10709n91925R8661O54694J330077k95612j241873l17177
5651D7975K07292J063146R27576r70094k384714j638675n07321k12805j86741
5642c654361k93577L00800K350149J768838Q60494m19279l30746k31167J36338
$$ y = [1032498, 758794, 817540, 786086, 1349442, 1222151, 487090, -1253295, -2620950, -1889914, -329423, 343172, 545240, 1143886, 1809447, 1619142, 1533196, 2055047, 1624381, 1031945, 49789, -1285682, -1458455, -1914710, -2778793, -2392310, -1856599, -1715108, -1282758, -1132001, -1683830, -1672464, -471545, 657864, 1063441, 345971, -1056262, -2331639, -3186878, -3373921, -3581715, -2643989, -654320, 936182, 860882, 559195, 1550385, 1833679, 1548901, 1221839, 411130, -180795, -82134, 572560, 1902637, 1607025, 365152, 47975, 255267, 1318413, 2245989, 1275895, -1108819, -2747494, -3254815, -3467620, -3654361, -3947938, -3647138, -1296989, 471849, 1332343, 913064, 582318, 351151, 487489]
5633D87489M35979M9082L2098m59387L10260L26353l49338n36248p18679m72820
5623h95211O31712Q18577Q45835L43771j21919J33547L910n74000p67233r48397
5613e29408o74546K96559Q62938K43124l75351l2501N01406P85661L71150N57260
5603B006292P73319Q50411M62628q9948n86876p94459r10818p06439r01707l23387
5593b20984M18032M37189n2758l02031P231j35317l19566M84498N32313M96760
5583A345367n89586o6388J70604L5356N91598N05028L69940J57181R3325m98745
5573B113680o89194m66630l16780P45857Q69001p1614j95314j000377j44517Q4691
5563I28803p00809j093723o25980K49450J109578J209331J171837k50301j623780
$$ y = [487489, 923468, 972550, 1004648, 545261, 855521, 1181874, 832536, 296288, -422391, -895211, -263499, 555078, 1400913, 1744684, 1622765, 1756312, 1760222, 1186222, 418989, -529408, -1203954, -907395, -44457, 198667, -176684, -209185, 292221, 1077882, 1449032, 2006292, 2779611, 3630022, 4092650, 4002702, 3415826, 2621367, 1710549, 1004110, 102403, -220984, 197048, 634237, 581479, 279448, 286679, 151362, -168204, 316294, 848607, 1345367, 755781, 689393, 859997, 895353, 1486951, 1991979, 2361919, 2519100, 2612425, 2113680, 1424486, 957856, 641076, 1386933, 2255934, 2184320, 1989006, 988629, 844112, 928803, 227994, -865729, -1491709, -1242259, -132681, 1076650, 2248487, 1998186, 374406]
5554C74406m37714Q6117m72509o37189K5919k44863Q0850Q05158K33802k24607
5544d10630L83206P51113r2372J12174L44140l19044J29098O78423J81263o81121
5534A076250j203828j328008l37879L65599P97575P37516P12752L79503n77983
5525F21497j007094j405713q17933M80128L48608k53378k61751o7721K09570J315358
5515h38429O31483o70973l21977m19436L72456n04541R00363J595077R75469o38924
5505A080568o06880j72905m81108j256304n86225J058335P58556M8305L84474
5496B26816R52132R59348N51528q34557k193395j93343J359717J291468J380518
5487C500232J269483k32443r15845j147355j619704p56130j07217l36722r94966
$$ y = [374406, -63308, 22809, -449700, -1086889, -1060970, -1305833, -1224983, -419825, -186023, -410630, -27424, 723689, 631317, 743491, 1087631, 768587, 897685, 1576108, 1757371, 1076250, -127578, -1455586, -1793465, -1427866, -630291, 107225, 819977, 1199480, 621497, -385597, -1791310, -2609243, -2129115, -1780507, -2033885, -2295636, -2363357, -2153787, -838429, -206946, -877919, -1199896, -1619332, -1246876, -1751417, -851054, 744023, 1719492, 1080568, 473688, 300783, -180325, -1436629, -2022854, -964519, -205963, -157658, 226816, 1178948, 2138296, 2689824, 1855267, -338128, -531471, 828246, 2119714, 3500232, 4769715, 4537272, 3621427, 2474072, 854368, 98238, -8979, -345701, -1340667]
5478a340667j85512P39090Q27874j5355J75700K29279O04275p34741p84502j10597
5468e95156l67090J47312M82661K67215p95111j383752N74954Q73995r47255j028472
5458b770699k8102M178M6736Q89694Q53764o79057j272111r0458J94314O13361
5448b238380P11326K05580j10119l82601r8542J165544J105272j60590o40374
5439d42884M10172L16790o37802l38335P23204k37323r50948K78268N41181k96972
5429f34649k96755K30951K25199P03536L08724n39874m05548o49873p46878N83485
5419a221682N89470L99260N45771K29000J68146m22401P6009K28116L36327N70391
5409A498407q89511j104961o43723j3364J149493m9102r16181k27075k20426L22589
$$ y = [-1340667, -1526179, -787089, 40785, 25430, 201130, 430409, 1034684, 299943, -484559, -595156, -962246, -814934, -332273, -65058, -860169, -2243921, -1668967, -794972, -1742227, -2770699, -2798801, -2794623, -2747887, -1858193, -1004429, -1683486, -2955597, -3046055, -2851741, -2238380, -1527054, -1321474, -1431593, -1814194, -1912736, -747192, 358080, 197490, -442884, -32712, 284078, -353724, -692059, 31145, -206178, -1157126, -878858, -337677, -634649, -931404, -700453, -475254, 228282, 537006, -2868, -408416, -1058289, -1805167, -1221682, -632212, -232952, 312819, 541819, 709965, 287564, 363573, 591689, 928016, 1498407, 608896, -496065, -1139788, -1153152, -3659, -52761, -968942, -1196017, -1416443, -1093854]
5399a093854J100093L42352l65884M9071K79920O24916M23700L38430j69330K08052
5389A737466R9276k44406m52339k53147J39363j074088r86415K09603M37883l3945
5379d20749q41954n0984R60354Q60784J83961j088969r32985O53642Q10819k61818
5369a27899O2515K52724o94179l33977O53400L31727r83771k93109O28422l67673
5359h71820k05686M15674P19258j01544j846594j517635j92451J330180K174428
5350i6190J808798P23305r49544q36053L4646o05168r51545K22451O64849j024864
5340a009315j988939p82160J133415J539168L500j581178l90984J786527J156919
5331a33047p79008o45404J102025j34911q67104L09955k14644k56442q39260j197264
$$ y = [-1093854, 6239, 348591, -17293, 31778, 311698, 936614, 1360314, 1698744, 1529414, 1737466, 1836742, 1592336, 1139997, 886850, 1026213, -47875, -1034290, -824687, -386804, -420749, -1262703, -1313687, -353333, 507451, 691412, -397557, -1330542, -676900, 133919, -127899, -65384, 187340, -506839, -840816, -187416, 144311, -839460, -1132569, -504147, -871820, -1077506, -661832, 57426, -44118, -1890712, -3408347, -3600798, -2270618, -96190, 1712608, 2435913, 1486369, 650316, 684962, 79794, -871751, -649300, 15549, -1009315, -2998254, -3780414, -2646999, -1107831, -1104331, -2685509, -3076493, -1289966, -133047, -912055, -1557459, -455434, -590345, -1457449, -1147494, -1362138, -1618580, -2457840, -3655104]
5321c655104j85763J392750J426384j67963q13453r9492o18097k94306J725313
5312a289731J385733L09633k39350m86878L86947P04511k71520j90790M94704
5303H03259J46898n55269r03062O19650J507869Q46135n14533p63479j76044L37826
5293A349250R5770j37995l768l51692M54990k67873p15391k15464O66655O06669
5283A481151P54249M07640o56916r81875q91709l81035R08653O14237L23055k43357
5273A334093O727m76400r99558K90381L65859k8621j30948n89300k29170J386592
5263I29655R66831N90919l65301M94750J026215n0586m47730p03394q2782J53514
5253B512091r4239q128o1646P4598o20758J8045k85759n70416m91408m78694m7725
$$ y = [-3655104, -3840867, -2448117, -1021733, -1189696, -2003149, -2102641, -2720738, -3015044, -1289731, 96002, 405635, 166285, -320593, 66354, 770865, 499345, 308555, 803259, 950157, 394888, -508174, 111476, 1619345, 2465480, 1950947, 1187468, 1011424, 1349250, 1445020, 1307025, 1303257, 951565, 1406555, 1138682, 423291, 207827, 874482, 1481151, 2235400, 2643040, 1986124, 1004249, 112540, -268495, 640158, 1254395, 1577450, 1334093, 1340820, 864420, -135138, 155243, 521102, 492481, 361533, -227767, -456937, 929655, 1896486, 2487405, 2122104, 2616854, 3643069, 3592483, 3144753, 2441359, 2358577, 2512091, 2417852, 2409724, 2348078, 2422676, 1801918, 1819963, 1534204, 963788, 472380, -6314, -54039]
5242e4039J89516J688135K263101P57364Q48834K302143M196526N397376N478554
5233B3067510O823114R000934J1541675J4215856P599253r546106j6129080j2914074
5225C3659082q749577m995001l231562k812452j796063k018204j470695j213955
5217G371573r34643p09246q88384q18353o27854K80985K77717M943k89642j084162
5207B582934j170600j117446j78790L2877m54455m83644l46947L6544m08017K91299
5197a216245M20600J057176J593845Q35586J12811j291925j306702o7467M85339
5188F23018L78516m06677O8517J158381J615776L22470j535259j128466l00573
5179G95703j88773j75033q51336M78329P79174J4872O63147j7423j40695l3908
$$ y = [-54039, 135477, 1823612, 4086713, 4844077, 5692911, 7995054, 12191580, 17588956, 23067510, 29890624, 38891558, 50433233, 64649089, 72248342, 62702236, 46573156, 33659082, 24909505, 19914504, 16682942, 13870490, 12074427, 10056223, 8585528, 7371573, 6436930, 5727684, 4839300, 4020947, 3393093, 3674078, 3951795, 3956738, 3667096, 2582934, 1412334, 294888, 116098, 148975, -305480, -789124, -1136071, -1099527, -1507544, -1216245, -795645, 261531, 1855376, 2690962, 2803773, 1511848, 205146, 137679, 623018, 1001534, 594857, 663374, 1821755, 3437531, 3760001, 2224742, 1096276, 795703, 606930, 431897, -419439, 58890, 838064, 852936, 1516083, 1498660, 1357965, 1324057]
5169A324057j02445O78312M00500p16874j284966j16463J315259J952965M76764
5160C927109o98268m72398l64522q88106j57946j213234j955965q32786m26599
5151c082715K58092J275779J155883j48724l69261j59574j81677j7450Q06982
5142d62665L78243o52338m91160L27289R2679k21346p29665p90006N27814J112895
5132i08260J598517O34999n54757r99837j666451n02563P43247Q82690J291987
5123E19572J440071J79900p77702p85579M29599J120430K40096q94195o90249
5114G81943j59532M85971o03283o06739o40688j9523j3694J76750O41562K04722
5104B47489O76124N60469k29470j069860j358799K04511K081818J57547p06834
$$ y = [1324057, 1221612, 1899924, 2300424, 1583550, 298584, 182121, 1497380, 3450345, 3927109, 3228841, 2756443, 2391921, 1503815, 1345869, 132635, -1823330, -2656116, -3082715, -2824623, -1548844, -392961, -541685, -910946, -1070520, -1252197, -1269647, -462665, -84422, -736760, -1227920, -900631, -807952, -1029298, -1758963, -2548969, -2021155, -908260, 690257, 1325256, 770499, -229338, -1895789, -2398352, -1655105, -772415, 519572, 1959643, 2139543, 1361841, 576262, 1005861, 2126291, 2366387, 1472192, 781943, 622411, 1108382, 505099, -101640, -742328, -761851, -775545, -598795, 42767, 247489, 923613, 1484082, 1254612, 184752, -1174047, -969536, 1112282, 1269829, 562995]
5095E62995n36873l82365l97754j083166M39930J617950K27311N69872n64319
5086D53581p79603M2300j84113k74675m6207N18102J41091k0133P12584J707610
5076B270537J729323j019060j595728m70805J34593j63391r69682p95320m07704
5067a287237k97606K47638K47679m4951O06057J298423O78394L56041j002181
5058H02257k94662O79622K232o38321j004587k16953N31512j93762j448951O1703
5048a719910N27554J6625m29859L35888J215699K9518p77004j90688l21791O56818
5038f57150J136056J09489j65291N37819l2954j218707j377697l54127L59455
5029a663107M11221j55104o3540L62019j94958m40638j21083O79285L72570L5816
$$ y = [562995, 26122, -356243, -753997, -1837163, -1397233, 220717, 448028, 1017900, 453581, -326022, -283722, -467835, -742510, -788717, -270615, -129524, -149657, 562927, 2270537, 3999860, 2980800, 1385072, 914267, 1048860, 885469, -84213, -879533, -1287237, -1584843, -1337205, -1089526, -1134477, -528420, 770003, 1448397, 1804438, 802257, 507595, 1187217, 1189449, 551128, -453459, -670412, -138900, -332662, -1781613, -1719910, -1192356, -1175731, -1605590, -1269702, -54003, -24485, -801489, -992177, -1313968, -657150, 478906, 588395, 423104, 960923, 927969, -290738, -1668435, -2022562, -1663107, -1251886, -1406990, -1470530, -1108511, -1303469, -1744107, -1865190, -1185905, -813335, -777519]
$$ [...]
##END NTUPLES=NMR SPECTRUM
##END=
