##TITLE=C13_EC-3268x
 DMSO-d6, 1500 sc

 31.5.2022
##JCAMPDX= 6.0         $$ Bruker NMR JCAMP-DX V2.0
##DATA TYPE= NMR SPECTRUM
##DATA CLASS= NTUPLES
##ORIGIN= UXNMR, Bruker Analytische Messtechnik GmbH
##OWNER= root
$$ XWIN-NMR		Version 3.5
$$ Tue May 31 15:56:42 2022 Russian Standard Time (UT+4h)  she@DPX200
##.OBSERVE FREQUENCY= 50.327896
##.OBSERVE NUCLEUS= ^13C
##.ACQUISITION MODE= SIMULTANEOUS
##.ACQUISITION SCHEME= undefined
##.AVERAGES= 1501
##.DIGITISER RES= 17
##SPECTROMETER/DATA SYSTEM= spect
##.PULSE SEQUENCE= zgpg30
##.SOLVENT NAME= CDCl3
##.SHIFT REFERENCE= (INTERNAL, CDCl3, 0, 222.111)
##AUDIT TRAIL= $$ (NUMBER, WHEN, WHO, WHERE, WHAT)
$$ ##TITLE= Audit trail, XWIN-NMR		Version 3.5
$$ ##JCAMPDX= 5.01
$$ ##ORIGIN= Bruker BioSpin GmbH
$$ ##OWNER= she
$$ F:/spectra/data/she/nmr/c13/1/pdata/1/auditp.txt
$$ ##AUDIT TRAIL=  $$ (NUMBER, WHEN, WHO, WHERE, WHAT)
(   1,<2022-05-31 15:55:03.03 +0400>,<she>,<DPX200>,
      <created by zg, POWCHK disabled, PULCHK disabled
       terminated by command 'halt'
       configuration hash MD5:
       00 E9 B6 7A A2 85 ED C7 34 08 36 98 17 FE 4E 26
       data hash MD5: 32K
       FE 83 60 5B 82 2D F9 0E B4 0C AE 75 B3 A4 D1 AD>)
(   2,<2022-05-31 15:55:05.50 +0400>,<she>,<DPX200>,
      <Start of raw data processing
       efp BC_mod = 2 LB = 1 FT_mod = 6 PKNL = 1 PHC0 = -367.9794 PHC1 = 28.36232 SI = 32K 
       data hash MD5: 32K
       72 89 53 B6 95 0E E0 21 2A 80 93 D3 C7 96 1C E3>)
(   3,<2022-05-31 15:55:08.89 +0400>,<she>,<DPX200>,
      <abs ABSG = 5 
       data hash MD5: 32K
       E9 6F 76 BE 83 C3 5F 7A 11 60 F8 86 68 61 48 8A>)
(   4,<2022-05-31 15:55:54.45 +0400>,<she>,<DPX200>,
      <pk PHC0 = -1.783904 PHC1 = 0 
       data hash MD5: 32K
       9A 72 B3 87 27 AF FF BB B3 69 D0 CC 13 13 E5 32>)
$$ ##END=
$$ 
$$ hash MD5
$$ BC 98 3E 71 FE EB DD 88 DC 24 27 65 96 EE 37 96
##$RELAX= 
##$RELAX= 
##$RELAX= 
##$RELAX= 
##$RELAX= 
##$RELAX= 
##$RELAX= 
##$RELAX= 
$$ Bruker specific parameters
$$ --------------------------
##$DU= <F:/spectra>
##$EXPNO= 1
##$NAME= <c13>
##$PROCNO= 1
##$TYPE= <nmr>
##$USER= <she>
##$AMP= (0..31)
100 100 100 100 100 100 100 100 100 100 100 100 100 100 100 100 100 100 
100 100 100 100 100 100 100 100 100 100 100 100 100 100 
##$AQSEQ= 0
##$AQ_mod= 1
##$AUNM= <au_zg>
##$AUTOPOS= <>
##$BF1= 50.322709
##$BF2= 200.13
##$BF3= 50.322709
##$BF4= 500.13
##$BF5= 500.13
##$BF6= 500.13
##$BF7= 500.13
##$BF8= 500.13
##$BYTORDA= 1
##$CFDGTYP= 0
##$CFRGTYP= 5
##$CHEMSTR= <none>
##$CNST= (0..31)
1 1 145 1 1 1 1 1 1 1 1 1 1 1 1 1 1 1 1 1 1 1 1 1 1 1 1 1 1 1 1 1 
##$CPDPRG= <waltz16>
##$CPDPRG1= <>
##$CPDPRG2= <waltz16>
##$CPDPRG3= <>
##$CPDPRG4= <mlev>
##$CPDPRG5= <mlev>
##$CPDPRG6= <mlev>
##$CPDPRG7= <mlev>
##$CPDPRG8= <mlev>
##$CPDPRGB= <>
##$CPDPRGT= <>
##$D= (0..31)
0 2 0.00345 0 0 0 0 0 0 0 0 0.03 2e-05 3e-06 0 0 0 0 0 0 0 0 0 0 0 0 0 
0 0 0 0 0 
##$DATE= 1653993041
##$DBL= (0..7)
120 120 120 120 120 120 120 120 
##$DBP= (0..7)
150 150 150 150 150 150 150 150 
##$DBP07= 0
$$ [...]
##$SUBNAM4= <"">
##$SUBNAM5= <"">
##$SUBNAM6= <"">
##$SUBNAM7= <"">
##$SUBNAM8= <"">
##$SUBNAM9= <"">
##$SW= 239.972175391363
##$SWIBOX= (0..15)
0 1 3 0 0 0 0 0 0 0 0 0 0 0 0 0 
##$SW_h= 12077.2946859903
##$TD= 32768
##$TD0= 1
##$TE= 0
##$TE2= 300
##$TE3= 300
##$TEG= 300
##$TL= (0..7)
120 120 120 120 120 120 120 120 
##$TP= (0..7)
150 150 150 150 150 150 150 150 
##$TP07= 0
##$TPNAME0= <>
##$TPNAME1= <>
##$TPNAME2= <>
##$TPNAME3= <>
##$TPNAME4= <>
##$TPNAME5= <>
##$TPNAME6= <>
##$TPNAME7= <>
##$TPOAL= (0..7)
0.5 0.5 0.5 0.5 0.5 0.5 0.5 0.5 
##$TPOFFS= (0..7)
0 0 0 0 0 0 0 0 
##$TUNHIN= 0
##$TUNHOUT= 0
##$TUNXOUT= 0
##$USERA1= <user>
##$USERA2= <user>
##$USERA3= <user>
##$USERA4= <user>
##$USERA5= <user>
##$V9= 5
##$VALIST= <valist>
##$VCLIST= <CCCCCCCCCCCCCCC>
##$VD= 0
##$VDLIST= <DDDDDDDDDDDDDDD>
##$VPLIST= <PPPPPPPPPPPPPPP>
##$VTLIST= <TTTTTTTTTTTTTTT>
##$WBST= 1024
##$WBSW= 4
##$XGAIN= (0..3)
0 0 0 0 
##$XL= 0
##$YL= 0
##$YMAX_a= 9210207
##$YMIN_a= -7532209
##$ZGOPTNS= <>
##$ZL1= 120
##$ZL2= 120
##$ZL3= 120
##$ZL4= 120
##$ABSF1= 222.6533
##$ABSF2= -17.34351
##$ABSG= 5
##$ABSL= 3
##$ALPHA= 0
##$AQORDER= 0
##$ASSFAC= 0
##$ASSFACI= 0
##$ASSFACX= 0
##$ASSWID= 0
##$AUNMP= <proc_1d>
##$AZFE= 0.1
##$AZFW= 0.5
##$BCFW= 0
##$BC_mod= 2
##$BYTORDP= 0
##$COROFFS= 0
##$CY= -3
##$DATMOD= 1
##$DC= 0
##$DFILT= <>
##$DTYPP= 0
##$F1P= 0
##$F2P= 0
##$FCOR= 0.5
##$FTSIZE= 32768
##$FT_mod= 6
##$GAMMA= 0
##$GB= 0
##$INTBC= 1
##$INTSCL= 4.134877e-10
##$ISEN= 128
##$LB= 1
##$LEV0= 0
##$LPBIN= 0
##$MAXI= 10000
##$MC2= 0
##$MEAN= 0
##$ME_mod= 0
##$MI= 0.1934396
##$NCOEF= 0
##$NC_proc= -1
##$NLEV= 6
##$NOISF1= 120.0001
##$NOISF2= 80.00006
##$NSP= 0
##$NTH_PI= 0
##$NZP= 0
##$OFFSET= 222.1112
##$PC= 1.4
##$PHC0= -369.7633
##$PHC1= 28.36232
##$PH_mod= 1
##$PKNL= yes
##$PPARMOD= 0
##$PSCAL= 0
##$PSIGN= 0
##$REVERSE= no
##$SF= 50.3227574020007
##$SI= 32768
##$SIGF1= 140
##$SIGF2= 120
##$SINO= 11.81781
##$SIOLD= 32768
##$SREGLST= <13C.CDCl3>
##$SSB= 0
##$STSI= 32768
##$STSR= 0
##$SW_p= 12077.2946859903
##$SYMM= 0
##$S_DEV= 0
##$TDeff= 32768
##$TDoff= 0
##$TI= <>
##$TILT= no
##$TM1= 0
##$TM2= 0
##$TOPLEV= 0
##$USERP1= <user>
##$USERP2= <user>
##$USERP3= <user>
##$USERP4= <user>
##$USERP5= <user>
##$WDW= 1
##$XDIM= 32768
##$YMAX_p= 476020174
##$YMIN_p= -4669730
$$ End of Bruker specific parameters
$$ ---------------------------------
##NTUPLES= NMR SPECTRUM
##VAR_NAME=  FREQUENCY,     SPECTRUM/REAL,   SPECTRUM/IMAG
##SYMBOL=    X,             R,               I
##VAR_TYPE=  INDEPENDENT,   DEPENDENT,       DEPENDENT
##VAR_FORM=  AFFN,          ASDF,            ASDF
##VAR_DIM=   32768,         32768,           32768
##UNITS=     HZ,            ARBITRARY UNITS, ARBITRARY UNITS
##FACTOR=    0.368581032318806, 1,           1
##FIRST=     11177.2483385558, 0,            0
##LAST=      -900.046347434472, 0,           0
##MIN=       -900.046347434472, -4669730,    0
##MAX=       11177.2483385558, 476020174,    0
$$ Real data points
##PAGE= N=1
##DATA TABLE= (X++(R..R)), XYDATA
$$ [...]
10639a867880q15074Q95851J425355O56435o02230j400847j86566P11289R27291
10630b56376n7373k84735P7418O2465L49373M09118R18714N82772l38209m68895
10620I94272l17813O98665J01308r31439m62748Q36001J172724O82665j09008
10611B664627r01715r05155k22244j11283m35166m36599l48943J63921M76557
10602e6000l04732m94753n2631K36414N35405P12375k81594q25077o65964m84371
10592a680928L6516O19749L59691K12008J33776L44504N02468J320524J030350
10583B878658k24897m50200j241106r66836m07083o97369l9148J672258J382867
10574A907144k74880l63600P9845r4002k4835R9244n29153n52169n33232j11726
$$ y = [-1867880, -2682954, -1787103, -361748, 294687, -307543, -1708390, -1894956, -1183667, -256376, -313749, -598484, -521066, -458601, -109228, 299890, 1218604, 1801376, 1463167, 994272, 676459, 1375124, 1476432, 544993, 82245, 918246, 2090970, 2773635, 2664627, 1762912, 857757, 635513, 524230, 89064, -347535, -696478, -532557, -56000, -360732, -855485, -908116, -671702, -136297, 576078, 294484, -530593, -1196557, -1680928, -1644412, -1024663, -664972, -452964, -319188, 25316, 527784, 1848308, 2878658, 2653761, 2203561, 962455, -4381, -411464, -1108833, -1147981, 524277, 1907144, 1632264, 1268664, 1348509, 1254507, 1229672, 1328916, 799763, 247594, -285638, -397364]
10564c97364J06071N2888P92838k17328J00700L58430M19786J78457O7140o0781
10554A400837J20268L29460n89982J71475o8905p2045k62713p61711l90732J008040
10544H83992R10574M9069M24017N74927M71369J080154j8572n86389j37286N7660
10534C709515L01674L1362r71323j271716m86065J54961N36979N18427o22258
10525A901556j500676j110876j050508J16766N19344J73632m09827l6363N27920
10516h69032P34202M01805j00589n66352p30866l23615L31711n610L7512N19099
10506e71735M29175N86615P04986L21368l24521J4544m96991j020320k00099O65118
10496A08140J011535K93906J002134J134837P31050k95690j643280m96602O12491
$$ y = [-397364, -291293, -238405, 554433, 337105, 437805, 796235, 1216021, 1394478, 1461618, 1400837, 1521105, 1850565, 1260583, 1432058, 1363153, 1291108, 1028395, 266684, -124048, 883992, 1794566, 1843635, 2267652, 2842579, 3313948, 4394102, 4375530, 3789141, 3651855, 3709515, 4011189, 4042551, 3071228, 1799512, 1313447, 1468408, 2005387, 2523814, 1901556, 400880, -709996, -1760504, -1643738, -1124394, -950762, -1360589, -1396952, -869032, -134830, 266975, 166386, -399966, -1130832, -1454447, -1122736, -1128346, -1090834, -571735, -142560, 444055, 1149041, 1470409, 1145888, 1160432, 663441, -356879, -556978, 108140, 1119675, 1413581, 2415715, 3550552, 4281602, 3985912, 2342632, 1846030, 2458521]
10487B458521l61762o71815K61015k25742r74400r63735N23804J105157j77610
10478I73433l39203r687m36132o58113J09337l7517O7396L73592M95035k53302
10468B84839o28891k08102M91230J489261P15284k18317r61988m27316O29588
10459A165588L66319p25417l14143m38652r85693m05714j48102K94638K00548
10450i90628K05603R96380J12626J96346P09370P21697K14323p26322j042203
10441C97192n35735k56976J17583R8772K45079N27974k36205K0355j87298o64344
10431d73603l32767R63538J027610N66201k90174l28161M03368J321095N88425
10422C445532m62677m63416l0150l58799r21356o31240l90948m825O18522Q90904
$$ y = [2458521, 2096759, 1424944, 1685959, 1460217, 485817, -477918, 45886, 1151043, 973433, 634230, 624543, 188411, -469702, -360365, -397882, -330486, 43106, 538141, 284839, -344052, -552154, -60924, 1428337, 2143621, 1925304, 963316, 536000, 1165588, 1531907, 806490, 492347, 53695, -931998, -1337712, -1485814, -1191176, -990628, -785025, 211355, 323981, 520327, 1229697, 1951394, 2165717, 1439395, 397192, -138543, -395519, -277936, -179164, 65915, 593889, 357684, 378039, 190741, -473603, -806370, 157168, 1184778, 1750979, 1460805, 1132644, 1536012, 2857107, 3445532, 2982855, 2519439, 2489289, 2130490, 1209134, 577894, 186946, 182121, 800643, 1691547]
10412A691547L94183j84780N98989J039783r9984p13134r71615l22595j70962
10403A261432j158371o60578J17098L16200m99735l9366J035932R13593O38704
10394A924909P12851J99235r12208k91912m53411l46957L40170O08720J48774
10385A930171j03153q66570k203867j510003P3406R73104M68936O146O11153K51421
10375c69256o93774j247183m79953J066030Q91557K34300L41556J88470l92363
10366d60616N03478J268126n5748J48669k13875o22153M7469L37622j79123q96604
10356a22755m09326j81567K00850P84606N07370k54831m09611K87727k65266o63978
10346e26781n22709m35000L38470L82455M74754R1557l20158J50183J69606l94871
$$ y = [1691547, 2085730, 1900950, 2499939, 3539722, 3439738, 2726604, 1754989, 1432394, 1261432, 103061, -557517, -440419, -124219, -623954, -663320, 372612, 1286205, 1924909, 2637760, 2836995, 1924787, 1632875, 1179464, 832507, 1172677, 1781397, 1930171, 1827018, 960448, -1243419, -2753422, -2680016, -1706912, -1237976, -1231830, -620677, -369256, -1063030, -2310213, -2790166, -1724136, -832579, -598279, -256723, -68253, -460616, 42862, 1310988, 1255240, 1403909, 1190034, 567881, 615350, 952972, 773849, -122755, -532081, -713648, -512798, 271808, 779178, 524347, 114736, 402463, 137197, -526781, -1049490, -1484490, -1146020, -763565, -288811, -197254, -517412, -367229, -197623, -592494]
10336e92494m79104N03848J303643R61071o20308k12444L06777O6164Q83416N00232
10326B620801K19005o89553j555229r76758l29317Q968O5312n0681n03990n71581
10316a763023N21943J038613N45942N96274P9203o94093j15005M18932j065070
10307d36284j061891j98313M77051R34483O46300N2103L4639O17507P69281M8294
10297A883170j91397k12944l46942p71968n79406P38237K14062j183245q78941
10288a329374N90216R85670j336046r82679K3110r084O97578J099859J082426
10279H21676L63766k91779m89735N93696N40149L61006K55263K57418o0653K49287
10269B600094R41681K41058n18065m57006j55158k87518j217905n97341j47727
$$ y = [-592494, -1071598, -567750, 735893, 1696964, 1076656, 864212, 1170989, 1237153, 2120569, 2620801, 2839806, 2150253, 595024, -381734, -711051, -702083, -636771, -687452, -1191442, -1763023, -1241080, -202467, 343475, 939749, 1018952, 324859, 209854, 628786, -436284, -1498175, -1696488, -1219437, -284954, 361346, 413449, 448088, 1065595, 1834876, 1883170, 1691773, 1478829, 1131887, 359919, -219487, 518750, 732812, -450433, -1329374, -739158, 246512, -1089534, -2072213, -2049103, -2058187, -1360609, -260750, 821676, 1185442, 893663, 403928, 997624, 1537773, 1898779, 2154042, 2411460, 2350807, 2600094, 3541775, 3782833, 3264768, 2807762, 2652604, 2365086, 1147181, 549840, 402113]
10260D02113o55703l25811M21343P48911L93124j67427k74869k39537l70875r9699
10250a68430R0862l15236n943m25676Q2337J144539P67799p44001j413031j54202
10240a140982R69212K14805L41839L80656O07256M25017o99351n90470l04272
10231B03710P75350J352816Q43646n66055j079942q72818j45136Q77452P00787
10222B089810K1775k35339j89973n73619k73509n29366m20706l89166n60668L13534
10212g47227J53836j05697O3477K70692K90958L62706l10781m68765j92198L10681
10202c72318R79170J010552R124r97614j068123m64351R9828L59741J335631J646669
10192B538309J56575r03053n06259n76507p23620m87865J11264Q92190J583185
$$ y = [402113, -253590, -579401, -158058, 590853, 983977, 816550, 541681, 302144, -68731, -168430, -77568, -392804, -398747, -824423, -742086, 402453, 1170252, 426251, -986780, -1140982, -171770, 43035, 384874, 765530, 1372786, 1797803, 1098452, 507982, 203710, 979060, 2331876, 3175522, 2609467, 1529525, 656707, 511571, 1389023, 2089810, 2111585, 1876246, 1686273, 1112654, 839145, 309779, -110927, -500093, -1060761, -747227, -593391, -699088, -635611, -364919, -73961, 288745, -22036, -490801, -682999, -372318, 606852, 1617404, 1626528, 628914, -439209, -903560, -803732, -443991, 891640, 2538309, 2694884, 1791831, 1285572, 709065, -14555, -502420, -391156, 501034, 2084219]
10183B084219J166733o41772m27035k31012n34213j692597j845815j96295L5709
10174b282078K41016Q65372R62659Q40494J486268M58597r45864j754497r81706
10165a109739Q80158J068008r8934p86122o84488K35147O30071O4893L50940j08184
10155D41750n14989k95996k52585j38575K06374l64543l89180j06277n48651N28516
10145a434156J064017L1940l8547J02553J16031M06716L57486Q7349N81898M51722
10135A727009N28113L81749p7382o4613l93735n13729J58519J66560N69594O33237
10125C115322Q28592k39875j314700p60755j318693m13296R22540Q51336J44634
10116A815105l08528l0879o20273m87573K30554O52922J290647J910208J678921
$$ y = [2084219, 3250952, 2609180, 2182145, 1951133, 1416920, -275677, -2121492, -2317787, -2282078, -2041062, -1175690, -213031, 627463, 2113731, 2572328, 1626464, -128033, -1109739, -229581, 838427, 739493, -46629, -731117, -495970, 134101, 198994, 549934, 441750, -73239, -369235, -621820, -760395, -554021, -918564, -1307744, -1414021, -1962672, -1434156, -370139, -338199, -376746, -274193, -158162, 248554, 606040, 693389, 1275287, 1727009, 2255122, 2636871, 2559489, 2494876, 2101141, 1587412, 1745931, 1912491, 2482085, 3115322, 3943914, 3704039, 2389339, 1628584, 309891, -103405, 819135, 1670471, 1815105, 1506577, 1475698, 855425, 367852, 598406, 1251328, 2541975, 4452183, 6131104]
10107F131104P65967R8169Q18885J095296R81020K630052L987937M310226N027813
10098B5846469P232479J1266460J6221652J8273541K779140j6269107j7175605
10091D8175029j3216346r071568o079676m182771k034540r58520j574983j804625
10083I252000j059017o48547j60750j17186l26035j95293K37062J04951l16126
10074F771059r74420q42970j373775j692663r38190n28422j03783K37193Q25764
10065A379793L47674N797L09228m5810n61647j307953q83143P16755J122558p2489
10055A010763n53447k81938o87363p61883K49572P27576K81021L94836k36612
10046A42525o39844J13899L20867p40671j070770l19377J65831L80070K27312
$$ y = [6131104, 6897071, 6995240, 7814125, 8909421, 9890441, 12520493, 16508430, 20818656, 25846469, 33078948, 44345408, 60567060, 78840601, 81619741, 65350634, 48175029, 34958683, 25887115, 19807439, 15624668, 13590128, 12631608, 11056625, 9252000, 8192983, 7544436, 7383686, 7266500, 6940465, 6745172, 6982234, 7087185, 6771059, 5796639, 4953669, 3579894, 1887231, 949041, 420619, 316836, 554029, 1379793, 1727467, 1733264, 2042492, 1996682, 1435035, 127082, -756061, -39306, 1083252, 1010763, 457316, 175378, -511985, -1273868, -1024296, -296720, -15699, 379137, 142525, -497319, -383420, -62553, -803224, -1873994, -2193371, -2027540, -1647470, -1420158]
10037a420158K22062p54621o23649n3096L35167P10880L12297m97706L53644J453833
10027C8653M45374o39263r56468K48183J59842n41276j49959R71572P94057J28503
10017D99218j86801j92679J87054L11095M63197L2792l69999k77690O3674J23418
10007F53279L64515k6482n03377O77451N57429o9957j003522r19247l5883M92261
9997A86467M97395M80159N49315R54508J56807o72646q82339q36162m50518k07556
9987b24570J15353J40999j58394j00200j82943k03401n63034q7864J225944O27290
9977E89180j96705p08120n83207q24675q15820M51343J147083J24017K91287J019506
9967D93889J197263M99371N1473O6640m23775j203284j512206k68840p11424n40563
$$ y = [-1420158, -1198096, -1952717, -2576366, -2629462, -2294295, -1583415, -1271118, -1768824, -1415180, 38653, 484027, -155236, -1111704, -863521, -703679, -1244955, -1394914, -423342, 370715, 499218, 312417, 119738, 306792, 617887, 1081084, 1113876, 743877, 466187, 529861, 653279, 1017794, 991312, 487935, 1165386, 1722815, 1652858, 649336, -269911, -305794, 186467, 683862, 1164021, 1713336, 2667844, 2824651, 2152005, 1269666, 433504, -17014, -224570, -109217, 31782, -126612, -226812, -409755, -613156, -1176190, -1264054, -38110, 589180, 392475, -315645, -898852, -1723527, -2539347, -2088004, -940921, -816904, -525617, 493889, 1691152, 2190523, 2241996, 2308636, 1884861, 681577, -830629, -1099469, -1810893, -2351456]
9957b351456O700j03862K84696P70175n1976o89145N5205J069285J275378N55184
9947H20184k72767q08762k92132R51580J486021J193550N74133n92299r10940
9938B148568q09566r11352k98500K79932k52733M09416J048575J018280K67589
9929B900209m48766p86013p92750M00783J47657R6730L17264J46508J16427j91563
9919A906486n72155J17023K23055o8002n10991n03459n16271p5150N89783J078189
9909A668508J052283N97185n9219l27824O63745N71218j360680j790636q67517
9900A47063K37386R03843O30038M29934p66230j222869k01466P53948R22489j75239
9890A658897q87439n21810o62732o14153l27582J065242J158667j06454l40170
$$ y = [-2351456, -2344756, -2448618, -2163922, -1393747, -1445723, -2134868, -2079663, -1010378, 265000, 820184, 547417, -261345, -553477, 398103, 1884124, 3077674, 3651807, 3059508, 2148568, 1339002, 427650, 129150, 409082, 156349, 565765, 1614340, 2632620, 2900209, 2451443, 1665430, 872680, 1273463, 1421120, 1517850, 1835114, 1981622, 2098049, 1906486, 1334331, 1451354, 1674409, 1606407, 1095416, 591957, 75686, 536, 590319, 1668508, 2720791, 3317976, 3258757, 2930933, 3594678, 4165896, 2805216, 1014580, 147063, 384449, 1288292, 1918330, 2348264, 1582034, 359165, 157699, 911647, 1834136, 1658897, 771458, 249648, -413084, -1027237, -1354819, -289577, 869090, 762636, 422466]
9881D22466p5637N27950P63102n1168o98654j275029l19594J284631J219387R5866
9871A893320o56065j386851k77981J070263N39941m70667n4458m14704k49835
9862g037J061567R13522o99154q4867M11392j28191q23581P07857J083338n28364
9852A906482q65089J09756L6183r98223m20271j26830J80505N44257J01557M4774
9842E13101m77710o25243k04195O21166n720o15486j4763L14946m89233p3573
9832a056710N33506L83599N14569R68570P55042m73380m54611J101761L72142
9823B644488j458532j765357p25973J451947R15464k87907n12552J41237N29837
9814I32652q8253m41666J99451P05937l75844o13899P4454P34982Q56905m04305
$$ y = [422466, 346829, 874779, 1637881, 1586713, 888059, -386970, -706564, 578067, 1797454, 1893320, 1237255, -149596, -427577, 642686, 1182627, 711960, 657502, 242798, -7037, 1054530, 1968052, 1268898, 1184031, 1595423, 1467232, 643651, 1351508, 2434846, 1906482, 1041393, 1151149, 1187332, 189109, -231162, -357992, -177487, 366770, 468327, 513101, 35391, -589852, -794047, -172881, -178601, -794087, -808850, -493904, -983137, -1056710, -523204, -139605, 374964, 1343534, 2098576, 1625196, 1170585, 2272346, 2644488, 1185956, -579401, -1305374, 146573, 1062037, 774130, 261578, 402815, 932652, 844399, 402733, 602184, 1308121, 932277, 318378, 392832, 1127814, 1984719, 1580414]
9804A580414j79935j79232O7644O07146O19058N187k9777q07944p33662o10699
9794C38200K176m62906q74657r13055q03322J50657O81714Q86455K42062K00508
9784e52168R6696O43521R43736N13076L71299n36697p9713M47484N97135N19332
9774B963701k41246k16818L19925R61788r1054j441409j100946K0183P76027p3564
9764A876587K83098M98014l08326q83184p00006M02259M87566J69001P27603J100792
9754C653404P88921L60468m68341j350840o48738k92767j16350l19405j556462
9745D9890n67486Q14089L26982J80396k60269r86043J62759J356339K78872o52459
9735G03070j354705p24640q66978q72328P81481R85502J240317O28959N947O58299
$$ y = [1580414, 1400479, 1221247, 1288891, 1896037, 2515095, 2520282, 2490505, 1682561, 948899, 338200, 340376, -122530, -997187, -1910242, -2713564, -2562907, -1881193, -994738, -752676, -552168, -455472, 188049, 1131785, 1644861, 2016160, 1479463, 1399750, 1847234, 2444369, 2963701, 2722455, 2505637, 2825562, 3787350, 3696296, 2254887, 1153941, 1174124, 1950151, 1876587, 2159685, 2657699, 2349373, 1466189, 766183, 1168442, 1656008, 1825009, 2552612, 3653404, 4442325, 4802793, 4334452, 2983612, 2334874, 2042107, 1925757, 1606352, 49890, -517596, 296493, 623475, 803871, 543602, -442441, -279682, 1076657, 1355529, 703070, -651635, -1376275, -2243253, -3115581, -2334100, -1348598, -108281, 520678, 526625, 1184924]
9725A184924R60298N40407J4518p89202j314407j246953O21927O68941j18055
9716E22398O7580P35374L39387l72345k23148J12658l22055j15955M51007J22157
9706A317058O15896L8891j21448p63750j507915k00354M10455M47642L88067O52057
9696A276599l30737q36840p55354k36230N34091J91514o95784n9698J7568L69953
9686e24918Q97649R9051J16067J09746l59236m37633n62810j144024l63350J238389
9676i31069O08455q64436j223434n43418j80547P68352J371144N49521n56756
9667a002188o61919n35373j85325J65831m11705R9124M45273l26332j5436l28339
9657b756389o12778P30991P49404K31620r9227N03794R85325O18320O90410l50042
$$ y = [1184924, 2145222, 2685629, 2700147, 1910945, 596538, -650415, -28488, 640453, 522398, 589978, 1325352, 1664739, 1292394, 1069246, 1181904, 859849, 743894, 1194901, 1317058, 1932954, 1971845, 1850397, 1086647, -421268, -621622, -211167, 236475, 624542, 1276599, 945862, 109022, -646332, -882562, -348471, -156957, -852741, -912439, -894871, -524918, 372731, 471782, 587849, 697595, 338359, -99274, -662084, -1806108, -2169458, -931069, -322614, -1187050, -2410484, -2953902, -3134449, -2366097, -994953, -445432, -1002188, -1664107, -2199480, -2384805, -2218974, -2630679, -2531555, -2086282, -2412614, -2428050, -2756389, -3369167, -2638176, -1888772, -1657152, -1756379, -1252585, -267260, 351060, 1041470, 691428]
9647F91428p99825j56940k67661J93420J052208N43164l3815J16837J128k34240
9637A105704k27329m97210p02542o41662j070522l96267N01994L12947M60882
9628a154005J050930N38151J04342n4104J124801J330005p9588k9937L76843j87276
9618C020162r61734j442891o99143L86806J235040N33747k5864J87882p36156
9609A497849r00991n60906o01676l67604j55472P74204P52321J54539j67068j05435
9599C19761r1600o19713l93690N18210R6847J259321J220409m35507o08852l96501
9589H68685j42173O42086O5910k78853m60968j101048n13241l9281M87013P82699
9579C10829O23991m44065j060099p47792N28561J068871M26179K72832Q14268
$$ y = [691428, -108397, -265337, -532998, -339578, 712630, 1255794, 1221979, 1338816, 1339944, 1105704, 878375, 381165, -321377, -963039, -2033561, -2429828, -1927834, -1614887, -1154005, -103075, 435076, 539418, 485314, 1610115, 2940120, 2860532, 2830595, 3207438, 3020162, 2058428, 615537, -83606, 303200, 1538240, 2071987, 2046123, 2234005, 1497849, 596858, 35952, -565724, -933328, -1088800, -314596, 437725, 592264, 425196, 319761, 228161, -391552, -785242, -267032, -170185, 1089136, 2309545, 1874038, 1265186, 868685, 726512, 1368598, 1434508, 1155655, 694687, -406361, -919602, -958883, -471870, 310829, 934820, 490755, -569344, -1317136, -788575, 280296, 706475, 979307, 1793575]
9570A793575M35144j80122o18307n83497K91806l11345k31125J2045r64722Q8194
9560b68354L91421J36199L57417N36257K98103k06921p27293q43203k80393L79834
9550b26933m52344q65921J227013J123128l11682m0827O40399N25277l31332j188971
9540I7807q87695J17544J25548o30288p2059Q17204L41278K99945k23817K11022
9530A96489J057094K71365p09206q04257k8798P15915J031253O68972M08l43607
9520B055628l87396J17788J16319o58266m18681o42609n84972n60743N5733Q67723
9510c9476L49946o90074k74572k930k12427q22269q42957K73173j88197k80850
9500b730633O37874j17236N709M08475R55709P91216O60936M28793l19235Q17984
$$ y = [1793575, 2228719, 2048597, 1430290, 846793, 1138599, 827254, 596129, 608174, -356548, -268354, 123067, 259266, 616683, 1152940, 1451043, 1244122, 516829, -326374, -606767, -226933, -679277, -1545198, -318185, 804943, 493261, 452434, 1092833, 1618110, 1286778, 97807, -789888, -672344, -546796, -1177084, -1249143, -431939, -90661, 209284, -14533, 196489, 1253583, 1524948, 815742, 11485, -17313, 698602, 1729855, 2398827, 2399235, 2055628, 1668232, 1786020, 1902339, 1244073, 825392, 182783, -402189, -962932, -907199, -39476, 310470, -379604, -654176, -657106, -869533, -1691802, -2534759, -2261586, -2449783, -2730633, -2092759, -2209995, -2204286, -1795811, -840102, -48886, 612050, 1040843, 721608, 1539592]
9490A539592J426573l16589o74074M7050L21496P2433r73121j071241Q5668L08657
9480G66444R4760r4617p87518m95630J22931M83293n9328r56387l91925L55703
9470i62274Q6994k38986l32358r5602R5069L92802P28175J213795O08084P58956
9460B254655J226626K36880j155044q52799o04504M5355K64669K36218P04593
9451B356649M92464k74599n75130p58439m80564k98428L4792N97300L81076k17684
9441A257437O195M7068m13420m03685q40188L58841O27276m1169J16652L27997
9431A043004J63682K10932M88858P47J74545m71589p81733N48729R71575K30980
9421B579730j057959j566255j094009p0484J270502N33602N0000N37252j01998
$$ y = [1539592, 2966165, 2649576, 1975502, 2022552, 2344048, 2416481, 1443360, 372119, 457787, 766444, 861204, 766587, -20931, -516561, -393630, 89663, 30335, -926052, -1317977, -962274, -875280, -1114266, -1446624, -1542226, -1447157, -1054355, -326180, 887615, 1495699, 2254655, 3481281, 3718161, 2563117, 1710318, 1105814, 1151169, 1415838, 1652056, 2356649, 2849113, 2574514, 1999384, 1240945, 760381, 461953, 496745, 1094045, 1475121, 1257437, 1263632, 1310700, 897280, 493595, -346593, 12248, 639524, 598355, 715007, 1043004, 1206686, 1417618, 1906476, 1907223, 2081768, 1610179, 828446, 1377175, 2348750, 2579730, 1521771, -44484, -1138493, -1208977, 61525, 595127, 645127, 1182379, 1080381]
9412A080381L83364M50422J88429n6331o68698n70443p78808n98089J451230Q24359
9402A705816o04736r45150r70044K08057P14101K67985l50998n0340l08454j2718
9392c46481J59000j7274j50794p60251j334811P7973J158721P9458m43720K87548
9382a290631J185339N74666L00547J097236Q87471k41200j58076L38479L19430
9373C013261m80940k76234N33099K64470q83921j455800p23922M25379O48546
9364A063938n19355q46318r13438q7752J445666N77688l84501K7343K80871m77128
9354A67014m03878M35500J042271O75516l00437m25196k57413M68756k2423j127460
9344B52250j340565q24609J66740O01705L92754L05181L04913O96322N36228l15492
$$ y = [1080381, 1463745, 1914167, 2102596, 2046265, 1377567, 807124, 28316, -569773, 881457, 1705816, 1101080, 155930, -814114, -606057, 108044, 376029, 25031, -25309, -333763, -346481, -187481, -204755, -355549, -1115800, -2450611, -2372638, -1213917, -1134459, -1578179, -1290631, -105292, 469374, 769921, 1867157, 2754628, 2513428, 2355352, 2693831, 3013261, 2532321, 2256087, 2789186, 3053656, 2169735, 713935, -9987, 415392, 1063938, 544583, -301735, -1215173, -1302925, 142741, 720429, 335928, 363271, 644142, 167014, -236864, 198636, 1240907, 1916423, 1615986, 1190790, 933377, 1402133, 1379710, 252250, -1088315, -1912924, -1746184, -1144479, -751725, -446544, -141631, 554691, 1090919, 775427]
9334G75427j176546r32818L14975l38857o27454Q86809J109849K80249l00963
9325i329P7379K54128N34694k16703n99787k51972J34765o5217l02185k85536
9315g29763L00473R25707J350620M22532m65396l8008k37326l65407q51851k057132
9305a745551j192982m68580p2230P10525O3402L34974J438944J047616M08143
9296E24261L67421J68274J37423j9496j77560J15371k11101m07446m44276Q460
9286F1331N20342K42619k47655n83761l01596N07768M32879k97026m60117R28272
9276H03056R49391j54632J43892N94115n63309j002827Q438J15336P28367M23106
9266B044933k05198k31525n51812q91941q0921Q98419N07957J0790o8101k75681
$$ y = [775427, -401119, -1333937, -1018962, -1357819, -1985273, -1098464, 11385, 291634, -9329, 68050, 322178, 856872, 640169, 40382, -211590, -76825, -142042, -444227, -729763, -429290, 496417, 1847037, 2269569, 1804173, 1766165, 1528839, 1163432, 311581, -1745551, -2938533, -3407113, -3479343, -2768818, -2705416, -2370442, -931498, 116118, 524261, 891682, 1059956, 1197379, 1177883, 1000323, 1115694, 904593, 497147, 52871, 61331, 581673, 824292, 576637, -7124, -308720, 199048, 631927, 334901, -125216, 803056, 1752447, 1597815, 1741707, 2335822, 1772513, 769686, 778124, 893460, 1621827, 2044933, 1839735, 1608210, 1056398, 164457, 83536, 981955, 1489912, 1500702, 1432601, 1156920]
9256A156920r24548l48310J83328l9557j07530n09767k98435j6545K58027M66252
9246a80165Q08649k89494l04194P91151J154030l0366p40899J03639n93935q56959
9236a38543n25572N97967J055630N05537m65237l28199m71916j336416l66555
9227a473304R45512P91124O33156M4834K14823L85637q8985l38616m97409m7920
9217E68852o75728p80503m99085J82183Q54302Q81022J090288Q34558o38715j012392
9207H04782l00438J69385j82043l96156n16902J94175j71250j331650j59412J182353
9197g07156R80089J68219j60255m21279n19981o07185n27636o05571m52114Q43553
9187b009316J306554K33074k10835k16901k85366l19989K88686M9053j72866N06682
$$ y = [1156920, 232372, -115938, 67390, 27833, -79697, -589464, -887899, -904444, -646417, -180165, 628484, 338990, 34796, 825947, 1979977, 1949611, 1208712, 1312351, 718416, -138543, -664115, -66148, 989482, 1495019, 1029782, 701583, 229667, -1106749, -1473304, -527792, 263332, 896488, 941322, 1156145, 1541782, 1452797, 1114181, 616772, 568852, -106876, -887379, -1386464, -1204281, -349979, 531043, 1621331, 2455889, 1817174, 804782, 504344, 673729, 491686, 95530, -421372, -227197, -398447, -1730097, -1889509, -707156, 272933, 441152, 280897, -140382, -660363, -1267548, -1795184, -2400755, -2852869, -2009316, -702762, -469688, -680523, -897424, -1182790, -1502779, -1214093, -1165040, -1337906, -831224]
9177h31224o43908q16442L16727P46827p57308p18255O83878Q59917N65962R6544
9167d97282J83591N29023M48036r42022q55169K64358r207m0369l01167m73099
9157a693307k68654J01298L23531K38176K48260M51931J6042K52315K99038O061
9147b5309P39602R81023J58055j31504J21706k89k97288j69979o19809n54392
9137B01816J4940p5107k13003J97932j94111j57056j02015n61663k12390l5868
9127a136525O22340M99563K73504J027595L36715k70222l06175j46333m06218
9118D94244o03792n32569r30464l51875J241037J022429j60497j215500j003135
9109b040122L45249Q39683q2470o5062L01303k30791M27429J71471n41571J52091
$$ y = [-831224, -1475132, -2291574, -1974847, -1228020, -1985328, -2703583, -2019705, -1159788, -593826, -497282, -313691, 215332, 663368, -278654, -1133823, -869465, -878672, -919041, -1220208, -1693307, -1961961, -1860663, -1537132, -1298956, -1050696, -598765, -582723, -330408, -31370, -25309, 714293, 1695316, 1853371, 1721867, 1843573, 1843284, 1545996, 1376017, 756208, 201816, 216756, 141649, -71354, 126578, -67533, -224589, -326604, -888267, -1100657, -1136525, -514185, -14622, 258882, 1286477, 1623192, 1352970, 1046795, 900462, 494244, -109548, -642117, -1572581, -1924456, -683419, 339010, 178513, -1036987, -2040122, -1694873, -855190, -937660, -1002722, -701419, -932210, -504781, -333310, -874881, -722790]
9099g22790K68753J22984n13731j021632j029516o65159O30563P84866j65080
9090b310742l75892O64569O03178N27904R03800k36167r46139m34836k70451k0358
9080a895134k81126O8848j05117l5636L84450o73122Q3819J155483O10681n39670
9070a226524L01422J134952m09911n10324r745j06198P18771R51467M00284K84503
9060A528697n65160j761787q13872J007852R47816l22597j74591O81230K11546
9051G39134p90543m11181l61908P83169J175345P61920k9298K76901p0523n61525
9041A511491k00836n5394O09333L84085j88411q99580r91932q35520j60497L3356
9031g93905q1744j30294l95095o5124M36319J554751Q13344l69282p17470j02725
$$ y = [-722790, -454037, -331053, -844784, -1866416, -2895932, -3561091, -2930528, -2145662, -2310742, -2686634, -2022065, -1418887, -890983, 12817, -223350, -1169489, -1604325, -1874776, -1895134, -2176260, -2107412, -2212529, -2248165, -1863715, -2536837, -2453018, -1297535, -686854, -1226524, -925102, 209850, -200061, -710385, -720130, -826328, -107557, 843910, 1244194, 1528697, 963537, -798250, -1612122, -604270, 343546, 20949, -153642, 527588, 739134, -51409, -462590, -824498, -41329, 1134016, 1895936, 1866638, 2143539, 2073016, 1511491, 1310655, 1255261, 1864594, 2248679, 2060268, 1160688, 168756, -666764, -827261, -793905, -875649, -1005943, -1401038, -1466162, -1029843, 524908, 1338252, 968970, 251500, 148775]
9021A48775O18113N40966L65984R8452J0058m05023l80533k5668L01696r0956
9011A181864l96623N90813J202233j0502j125985j434609n9073M36965M81867
9002H66950J15457O1259J38867n04273m91124P69010N09247o53576j23106L81849
8992A070560M42933K03794l32309j70649N73329L81825l26617l11745K31073L0462
8982A792656M45860Q82675l61959q76347n51794M07778J266080J274347K50124
8973D529420j045403j072612k89025K7642m72859J78772K42929m06011k91383
8964A401470q00440j160901q82500j82240K41145J144303R92089k98738r28051
8955d73863n0716N88010K17528Q1633n68781j330013J61517N28429m98162r55569
$$ y = [148775, 766888, 1307854, 1673838, 1772290, 1782348, 1377325, 996792, 971124, 1272820, 1181864, 785241, 1376054, 2578287, 2567785, 1441800, 7191, -51882, 385083, 866950, 982407, 1043666, 1182533, 678260, 187136, 956146, 1465393, 811817, 688711, 1070560, 1513493, 1717287, 1384978, 1214329, 1787658, 2169483, 1842866, 1531121, 1762194, 1792656, 2238516, 3121191, 2759232, 1882885, 1331091, 1738869, 3004949, 4279296, 4529420, 3484017, 2411405, 2122380, 2150022, 1677163, 1855935, 2098864, 1692853, 1401470, 601030, -559871, -1442371, -1624611, -1383466, -239163, 752926, 454188, -473863, -524579, 63431, 280959, 362592, -206189, -1536202, -1374685, -846256, -1344418, -2299987]
8945b299987K16716J260332J386730N12827J62129K29217O28544m86195q24728
8936G85585q132L18090q2815r29852q5655M64853O57847J76765j097057o05372
8926d05743q01383q17591m93848P2957J094823J024549L57322j11674k01207K34716
8916d7079j62693k34228Q53960J050775L56233n59373p84474m28790p79511J5009
8906g20171O86540M33631p07916j165196k55332J91497N86750N32864N22685l4475
8896G0877o3462k20285J08083L77584O5576L36496l38357k68267Q9938j73983
8886a5800K05960M07073p0924p5301K33524L41407R8989j227999j051555L19681
8876h34945J26453j66777K55207O31749R32060J112454K68418p09452J83254M22726
$$ y = [-2299987, -2083271, -822939, 563791, 1076618, 1238747, 1467964, 2096508, 1610313, 785585, 777453, 1095543, 1012728, 82876, -2779, 462074, 1119921, 1296686, 199629, -405743, -1207126, -2024717, -2518565, -2445608, -1350785, -326236, 31086, -80588, -281795, -47079, -209772, -444000, 409960, 1460735, 1816968, 1257595, 473121, 44331, -735180, -720171, -33631, 400000, -307916, -1473112, -1728444, -1536947, -950197, -417333, 105352, 70877, 7415, -212870, -104787, 272797, 338373, 674869, 336512, 68245, 158183, -15800, 190160, 597233, 526309, 451008, 684532, 1025939, 1124928, -103071, -1154626, -834945, -708492, -875269, -620062, 11687, 943747, 2056201, 2324619, 1615167, 1798421, 2221147]
8866B221147N15534M2564m10810p69628r10435p68506n69107m34457k37430N01840
8856h19288O56681J90303m50955N08856P64660k43628J6419M89582K46663j018486
8846C40807j606335l14655J896718K231757J430912R6460m28008j80139j321225
8837B146292j502688j92046P26562N73440L62468j81558n36988m21818m59184
8828E14480L82651J07717j60091k39690m77445k43743l04253l79876k82278o15096
8818a697624r67933M53885P96808P78553P24706L53079M27484k09656J79763p3693
8808G65372j65968R02946l92405o45863R516p39963r63234O6010O77753k0800
8798e06636q8455L65005N74335J3096m76560N48667Q6370j203492j037460l56691
$$ y = [2221147, 2736681, 2779245, 2368435, 1598807, 688372, -80134, -649241, -1083698, -1321128, -819288, -162607, 27696, -423259, 85597, 850257, 606629, 623048, 1112630, 1359293, 340807, -1265528, -1580183, 316535, 2548292, 3979204, 4075664, 3647656, 3467517, 2146292, 643604, 451558, 1178120, 1751560, 2114028, 1932470, 1395482, 973664, 514480, 897131, 1004848, 844757, 605067, 127622, -116121, -420374, -800250, -1082528, -1697624, -2665557, -2211672, -1414864, -636311, 88395, 441474, 868958, 659302, 839065, 765372, 599404, 1502350, 1109945, 464082, 473598, -266365, -1229599, -1163589, -485836, -506636, -595091, -230086, 344249, 357345, -119215, 429452, 515822, -687670, -1725130, -2081821]
8788b081821M23673N97043Q52646J477647P61010K59910J68207K48058L73091
8779C079464n99878m13413N6227K6232k19353L3291J26059m64078N557m86188
8769A143920m3865R1738j031717r1670J237236K21487j027996l76700p2013n43922
8759d93502j025956M9636K11299L41271L87004o5369m73345L08324M41846J72697
8749a46095N38692J57504m90367r57275j118594j84490P14168j10847l94433q7881
8739b079618N01553J523653L51133k09136o27752J50839O18275l3150J69489k5924
8729C39362j08431K85111m16337m68821O1721l13896R44560J066375q28996r31896
8719c71248p32080m4793M22176L06917P15642K31139J85777j2719k8465O0810
$$ y = [-2081821, -1658148, -1061105, -208459, 1269188, 2030198, 2290108, 2458315, 2706373, 3079464, 2479586, 2066173, 2122400, 2148632, 1929279, 1962570, 2088629, 1624551, 1630108, 1143920, 1100055, 1191793, 160076, 68406, 1305642, 1527129, 499133, 122433, 50420, -493502, -1519458, -1469822, -1258523, -917252, -530248, -595617, -1068962, -760638, -318792, -146095, 392597, 550101, 59734, -897541, -2016135, -2200625, -1486457, -1597304, -1991737, -2079618, -1578065, -54412, 296721, 87585, -540167, -389328, 228947, 195797, 365286, 339362, 230931, 516042, 99705, -369116, -307395, -621291, 323269, 1389644, 560648, -371248, -1103328, -1148121, -725945, -419028, 296614, 527753, 713530, 700811, 672346, 733156]
8709G33156K3762k44697j314784j011017j37672j30421K7838M19959O79247P06453
8699b48176j08666j286464j103797R00618O61710J27175M63720O1491l13014J84107
8689f61296L9780L56007N09869O71799m9522p25743n59490M03327J85514k83444
8679a13199R6212J157860M13031n65578K83338M30217l97477k50191k94223n25065
8669B34925O24862J282839J89722Q1415N10075j61530o72113j079267j003626
8660G302j636817j027471k38031M92829L40782Q58653J95397O61156J259198O03143
8650A516141m9713m37974n79485N13624J293002J22470r48072n00989O6857K88517
8640A284378k33475o12997r64615n65899N38411M55449m1796m15088o61587k76657
$$ y = [733156, 756918, 512221, -802563, -1813580, -1951252, -2081673, -2053835, -1633876, -954629, -248176, -356842, -1643306, -2747103, -1846485, -1184775, -1057600, -593880, -532389, -845403, -661296, -621516, -265509, 244360, 916159, 866637, 140894, -418596, -15269, 170245, -113199, -16987, 1140873, 1553904, 988326, 1271664, 1701881, 1304404, 1054213, 759990, 234925, 859787, 2142626, 2332348, 2413763, 2923838, 2762308, 2090195, 1010928, 7302, -1629515, -2656986, -2895017, -2402188, -2061406, -1202753, -1007356, -346200, 912998, 1516141, 1466428, 1028454, 448969, 962593, 2255595, 2378065, 1429993, 929004, 995861, 1284378, 1050903, 437906, -526709, -1092608, -554197, -98748, -140544, -555632, -1217219, -1493876]
8630a493876q576j05771L9096L84013K17751J006818N65650M30481j49934k38826
8620F46826j34714K9608M13196M9369r26003j020962j00947J335288R65959l06836
8610I50784j42358L50153l37785o55308o52167M3484N43915j43842j53397N66669
8600C70148Q40328n69220n84460N01873L09392k79976n93146k22853j68383M64478
8590F8181K38238o52116o64475n05736k31769Q1177M13723L78716P51010Q75940
8580G52889N3063m31520L22696N14707n85738j123930K89768N83658J30911j06276
8570D00228m00817L49514L96012q48024q39301n7804j1196J09789j12084k7250
8560a040933O51375R74065M81770O62053Q81769l17201m26963L70890L91931j8216
$$ y = [-1493876, -1502452, -1608223, -1569127, -1185114, -967363, 39455, 605105, 1035586, 885652, 646826, 512112, 541720, 954916, 1004285, 78282, -942680, -1043627, 291661, 1257620, 950784, 808426, 1158579, 820794, 165486, -486681, -443197, 100718, -43124, -196521, 370148, 1210476, 641256, 56796, 558669, 868061, 588085, -5061, -227914, -396297, 68181, 306419, -345697, -1010172, -1515908, -1747677, -1666500, -1252777, -874061, -123051, 752889, 805952, 374432, 697128, 1211835, 626097, -497833, -208065, 375593, 506504, 400228, -589, 348925, 744937, -103087, -942388, -1000192, -1011388, -901599, -1013683, -1040933, -389558, 584507, 1066277, 1728330, 2610099, 2292898, 1865935, 2236825, 2628756, 2610540]
8550B610540o66164n23775N53406M48133R6764j98179n83648o71966l76707r76513
8540b88109p63431l88282N83374J046064l10249j437779K32978J349884P31537
8531G55987j43607K09006J285772Q31791l77985J09368R54481J89683j052560
8522B761936j068183j045212j826385j044733k53470K08337J244345O91630k58108
8513e89843k83074M09868P98681N81860O05464L76573j127348j033025p99733
8504a060577p09709J33003Q15443J441551N49441o42214r25733J46245J158623
8495I06073R64533J93536j41480n69034o01832l81760m59917m99340J13431k61499
8485g37289p14720p37744L94203Q77728L02403L61074M76361N58655N73941K78088
$$ y = [2610540, 1944376, 1420601, 1974007, 2422140, 2518904, 2320725, 1737077, 1065111, 688404, -288109, -1051540, -1439822, -856448, 189616, -120633, -1558412, -1325434, 24450, 755987, 612380, 821386, 2107158, 2938949, 2560964, 2670332, 3624813, 3814496, 2761936, 1693753, 648541, -1177844, -2222577, -2476047, -2267710, -1023365, -331735, -589843, -872917, -463049, 335632, 917492, 1522956, 1899529, 772181, -260844, -1060577, -1770286, -1637283, -821840, 619711, 1169152, 526938, -398795, -252550, 906073, 1870606, 2064142, 1922662, 1353628, 751796, 370036, -89881, -589221, -475790, -737289, -1452009, -2189753, -1795550, -917822, -615419, -254345, 222016, 780671, 1354612, 1632700]
8475A632700j80696k2825p10527j243310r0271j49144L48169O96138L39539L36104
8465I55877k73779k84772j39524J257442N49974n42295j150530o59886L78519
8456I1026j46814j289128j635936p75510K88465L78212J000945O62279m25324
8447a851785j258804l302J069309Q31736J025261N63368j29362m56889l21758
8438e32226K32799L2288J75686J593689J339990m13894j848957j518509k51312
8429a190446R9732L93219k46765J22286R58959L17502J22525p27850l80149K5548
8419e05439M75747J528354J115576j51132o93598l70369q70573j435728q07187
8410a714349J71375P99880P25966L52941L32159J3301o87608L80113P23642L13641
$$ y = [1632700, 1452004, 1429179, 718652, -524658, -614929, -764073, -415904, 280234, 619773, 955877, 682098, 397326, 257802, 1515244, 2065218, 1522923, 372393, -287493, 91026, -55788, -1344916, -2980852, -3756362, -3467897, -3089685, -2088740, -1426461, -1851785, -3110589, -3113891, -2044582, -1212846, -187585, 375783, 246421, -210468, -532226, -299427, -267139, -91453, 1502236, 2842226, 2428332, 579375, -939134, -1190446, -1090714, -697495, -944260, -821974, 136985, 454487, 577012, -150838, -530987, -505439, -29692, 1498662, 2614238, 2463106, 1769508, 1399139, 528566, -907162, -1714349, -1542974, -743094, -17128, 335813, 667972, 681273, -6335, 373778, 1097420, 1411061]
8400A411061m11818j202746m13596Q82708j29827p69682N65168J498007N06795
8391A936070m04434q57254j503931j005008J14948J039629O11383K5972M62245
8382D19620R51533M69729J22855m99414l21274M62295k7599r28256j121855o13835
8372a086201P77044Q80367K82276n5616j40148J58187n58416j033360k84153Q42706
8362b17314R12770O47356M21130Q3299J14093M15267o19492j571910j114004p02143
8352a630948k01102Q37811P51658m8285k32176L70712M0043j49717L00527K71219
8342C09742q2936j73347j54997R09520P18260K07397L44376M8052r69109l75250
8332G81708K89142R03808M45226m81739p44560q5475L23040K5418m1104p03419
$$ y = [1411061, 999243, -203503, -617099, 265609, 135782, -633900, -68732, 1429275, 1936070, 1531636, 674382, -829549, -1834557, -1719609, -679980, -68597, -42625, 419620, 1371153, 1840882, 1963737, 1464323, 1143049, 1605344, 1577745, 649489, -472366, -1086201, -309157, 571210, 853486, 797870, 657722, 815909, 257493, -775867, -1060020, -217314, 695456, 1342812, 1763942, 1847241, 1961334, 2376601, 1757109, 185199, -928805, -1630948, -1832050, -994239, -242581, -290866, -523042, -152330, -112287, -262004, 38523, 309742, 226806, 53459, -101538, 807982, 1526242, 1733639, 2078015, 2126067, 1156958, 781708, 1070850, 1974658, 2419884, 1938145, 1193585, 1108110, 1431150, 1456568, 1415464, 712045]
8322G12045q43080l33846J14176K42847j91500l38405O11912J091044N07020n75360
8312I96853o71237L48342L27026l3987L14025J288292M60690j036562j309548
8303F83894q33870J3320k00138n36857J81537O77633N97005N75921L25838P76586
8293B260869Q07910L55197p90856j658624q59435j41561l3524K87681J29344K52789
8283F09790O41401N10826P6736K4853n73485k30826l24847M49711o8781j363006
8273b47628l75037J161839O47821n88594p02371j90273J176394Q53998j69609
8264A566540o8067J43027N11807L85105K738r59148j385556o41521P22987Q66668
8254A144580o82049p73999m02241j68262J33170M22190K35204N74263L87441N21598
$$ y = [712045, -131035, -464881, -350705, -107858, -299358, -637763, -25851, 1065193, 1572213, 996853, 325616, 673958, 1000984, 966997, 1281022, 2569314, 3030004, 1993442, 683894, -149976, -136656, -336794, -873651, -692114, -14481, 582524, 1158445, 1484283, 2260869, 3068779, 3423976, 2633120, 974496, 115061, -26500, -60024, 227657, 357001, 609790, 1251191, 1762017, 1838753, 1863606, 1290121, 1059295, 734448, 1184159, 1115378, -247628, -622665, 539174, 1186995, 598401, -103970, -294243, 882151, 1736149, 1566540, 1498473, 1641500, 2153307, 2538412, 2541150, 1582002, 196446, -445075, 277912, 1144580, 462531, -311468, -713709, -881971, -748801, -326611, -91407, 482856, 870297, 1391895]
8244A391895Q78860m44502r10978P08645L75810k85332j05285j33042k81208J31901
8234A326764K77934Q2005j97111N74615J170377N56261k28279m16370k07308n37560
8224B401328q31290o91221J23616n50328j152628p19034L32667L42571P08248
8215c6071R64912O25730J794924N41022j719087j446989m5921Q2604J42259L56713
8205A260096P31864Q00841j58432j092350j165062j74892O48662J043258j66292
8196A727693o05722J16635O11360O89310n60851r09286n2023o85990j089260m67998
8186a226132Q49031J165264M66167Q54697R44450M86074J08104O02351J56752
8177D406758l93934l86721k15695k09670m04550j1762J22194J12640K59390p4476
$$ y = [1391895, 2270755, 1826253, 915275, 1623920, 1999730, 1714398, 1609113, 1476071, 1194863, 1326764, 1604698, 1686703, 1489592, 2064207, 3234584, 3790845, 3562566, 3146196, 2938888, 2401328, 1570038, 878817, 1002433, 452105, -700523, -1419557, -1086890, -744319, -36071, 928841, 1554571, 3349495, 3890517, 2171430, 724441, 678520, 761124, 903383, 1260096, 1991960, 2792801, 2634369, 1542019, 376957, 202065, 850727, 1893985, 1727693, 1121971, 1238606, 1849966, 2539276, 1978425, 1069139, 1017116, 331126, -758134, -1226132, -377101, 788163, 1254330, 2109027, 3053477, 3539551, 3647655, 4250006, 4406758, 4012824, 3626103, 3410408, 3200738, 2796188, 2784426, 2906620, 3019260, 3278650, 3204174]
8167C204174j014071n17903j77559l30907L47896J019728m25653j190487M43050
8158A358268R57324n74019n32789j3643q92256p73865K71608J450237J520808
8149B771673P86463m63422j063638j68371O8969L47167O19142j93744l68083j072726
8139A263430n12382P72936O47623j09189o88199p30428K07025P79623K09412k37336
8129A602515l95717K80945j70191o19165J9769L79194N05943J075655J040674
8120C719622K31466l46734j139512j178507m02926r99366m79093L89304J91532
8111a4214L0886J56745J8648K20847J39263M64222P48209N43721k75899k7297
8101B005131Q68438K50642l77320o3387o77450p68082l67431J74269J356935J107635
$$ y = [3204174, 2190103, 1672200, 1494641, 1163734, 1511630, 2531358, 2105705, 915218, 1358268, 2315592, 1741573, 1208784, 1195141, 302885, -470980, -199372, 1250865, 2771673, 3558136, 3094714, 2031076, 1862705, 1931674, 2278841, 2897983, 2704239, 2336156, 1263430, 751048, 1523984, 2171607, 2062418, 1374219, 643791, 850816, 1630439, 1839851, 1602515, 1206798, 1487743, 1317552, 698387, 718156, 1097350, 1603293, 2678948, 3719622, 3951088, 3604354, 2464842, 1286335, 883409, -115957, -595050, -205746, -14214, 16672, 173417, 192065, 412912, 552175, 1016397, 1764606, 2308327, 2032428, 2005131, 2873569, 3124211, 2746891, 2683504, 2006054, 1237972, 870541, 1044810, 2401745, 3509380]
8091C509380k55424j083024r36251K93563J171681j37349j612519p58961k81446
8082i0350k0807J93548J043862J441559N30640L58145m10250q62324l29287l51309
8072A503427K8329O95993K079250J997035l09153k755330j746348P18929J625667
8063C837799N72251l3250o76674k38309P22438M60668k68802o53084p74539j148733
8053A799765j37203K44878N77848M35762k15404p3170j8982m01745m57000J11613
8043A866362k47528q9652M48494N29007n57621L07340J262350M96656k2762j62758
8033C829888M05437n77774q55748n07618n20146J18668N48286K46398j01466o5813
8023B520112k77138L44631J299438J282280J177598P4330o02715n49242n13299
$$ y = [3509380, 3253956, 2170932, 1234681, 1528244, 2699925, 2562576, 950057, 191096, -90350, -111157, 82391, 1126253, 2567812, 3098452, 3456597, 3046347, 2184023, 1854736, 1503427, 1531756, 2227749, 4306999, 6304034, 5994881, 3239551, 1493203, 2212132, 3837799, 4410050, 4376800, 3700126, 3461817, 4184255, 4644923, 4376121, 3723037, 2948498, 1799765, 1662562, 1907440, 2485288, 2921050, 2705646, 2632476, 2613494, 2211749, 1754749, 1866362, 1618834, 1529182, 1977676, 2506683, 1949062, 2256402, 3518752, 4015408, 3992646, 3829888, 4235325, 3657551, 2801803, 2294185, 1774039, 1892707, 2440993, 2687391, 2585925, 2520112, 2242974, 2587605, 3887043, 5169323, 6346921, 6421251, 5818536, 5269294, 4755995]
8014D755995o96299p86767M03255J189789M33670l23521N38754R83949Q93817
8005G392642N83526j94474k501K62969K64968J024771J237025J529103J220322
7996A3318351O63221J635338K500121L631613L989716L619883N699193P618500
7988D2675936P515448O405670N392846M629690K134788j377489m696095n656051
7980E7024743o009785o319678o793108o002064l870167k140365j693514j876163
7972B2319899k447307j674716j125994j517513r29243k06050o5351l63357p11147
7963A3279221j47575r11604n74985k78173k19012K50463K81826K12404K70383
7954A2162948K94882n22139q17151K10270J141638J654321J551066J603320J832331
$$ y = [4755995, 4059696, 3272929, 3676184, 4865973, 5299643, 4976122, 5514876, 6498825, 7392642, 7976168, 7781694, 7779193, 8042162, 8307130, 9331901, 10568926, 12098029, 13318351, 13981572, 15616910, 18117031, 21748644, 25738360, 29358243, 35057436, 42675936, 50191384, 56597054, 61989900, 66619590, 68754378, 67376889, 62680794, 57024743, 51014958, 44695280, 37902172, 31900108, 28029941, 25889576, 24196062, 22319899, 19872592, 18197876, 17071882, 15554369, 14625126, 14419076, 14353725, 13990368, 13279221, 13131646, 12220042, 11645057, 11366884, 11147872, 11398335, 11680161, 11892565, 12162948, 12457830, 11935691, 11118540, 11328810, 12470448, 14124769, 15675835, 17279155, 19111486]
7945A9111486J749119J386300J266040L036708M498030M683481N059132N605492
7937D6395788O110532Q717351J1251333J3130322J6616437K0279753K2533626
7930A45035142K2610446J9299973J2695251L706266o031354j4154101j9589398
7923A63572225k0471136j9905420j8112162j4206531j1915589j1033905q940050
7916E8987432o509313m604272m283223m598390l925300k343706j587506o36485
7908C0499237o51508k35494k46631o21818o02126k01785L77497R00038l33523
7899B8883887k500033j136686K78097J3258n19376n82655R00896K619659K621917
7890C0578964K070233K597014L190394L808656M144116M645274O224591P773685
$$ y = [19111486, 20860605, 22246905, 23512945, 26549653, 31047683, 35731164, 40790296, 46395788, 52506320, 61223671, 72475004, 85605326, 102221763, 122501516, 145035142, 167645588, 186945561, 199640812, 203347078, 197315724, 183161623, 163572225, 143101089, 123195669, 105083507, 90876976, 78961387, 67927482, 58987432, 52478119, 47873847, 43590624, 38992234, 35066934, 32723228, 31135722, 30499237, 29847729, 29612235, 29365604, 28743786, 28141660, 27939875, 28317372, 29217410, 28883887, 26383854, 25247168, 25525265, 25538523, 25019147, 24436492, 25337388, 27957047, 30578964, 32649197, 35246211, 38436605, 42245261, 46389377, 51034651, 57259242, 65032927]
7882F5032927Q912284J2113318J4706953J7583825K1821167K9012184L5612356
7875B04795014M0060747M4299097M4518504L8515130K6931655Q773851j0740558
7868C97153440k8348593m0224533m3673797m2418029l8274177l2972002k7128673
7861A44113636k0439050j5922537j3267923j0728979q474983p454009o620807
7854F1205348m825674l346934k370881j009601p98709j627683k354787k292457
7846D2578622j629390j146009j164242j698614k350133j303770j42305m0252P69066
7837C3872973P58916J406344J840880J199406J600645J602604K400576L767269
7829D8449613M252208O430246Q397350R896169J1257892J3755183J6777355K1413707
$$ y = [65032927, 73945211, 86058529, 100765482, 118349307, 140170474, 169182658, 204795014, 244855761, 289154858, 333673362, 372188492, 399120147, 407893998, 397153440, 368804847, 328580314, 284906517, 242488488, 204214311, 171242309, 144113636, 123674586, 107752049, 94484126, 83755147, 75280164, 67826155, 61205348, 56379674, 53032740, 50661859, 49652258, 48853549, 47225866, 44871079, 42578622, 40949232, 39803223, 38638981, 36940367, 34590234, 33286464, 33144159, 33103907, 33872973, 34631889, 36038233, 37879113, 39078519, 40679164, 42281768, 44682344, 48449613, 52701821, 59132067, 67529417, 77425586, 88683478, 102438661, 119216016, 140629723]
7821A40629723K6441591L3010458L9835837M7199132N2596515N1222216M4797306
7814D35732778L0589921R697475j3031596l3187611m6452580n1860256n0889664
7807B80598467m5904093l8225209l1473859k6371770k1363447j6562762j1862531
7800H8834796r821278q498441o671979n181698m428249m315250l900623k213144
7792D3804134j169527j212831q12383j216463j835462j773764j437781q72888
7784C3473035j908099j197060M71232J46386k35507j58572J324850K332690K431433
7775C6680388J762348K317062L641018M389036N102805O487498Q570070J0252459
7767G9202684J2004175J4064982J7141393K1985365K7784844L4388807M0031177
$$ y = [140629723, 167071314, 200081772, 239917609, 287116741, 339713256, 390935472, 435732778, 466322699, 476020174, 462988578, 429800967, 383348387, 331488131, 280598467, 234694374, 196469165, 164995306, 138623536, 117260089, 100697327, 88834796, 79013518, 70515077, 63843098, 58661400, 54233151, 49917901, 46017278, 43804134, 42634607, 41421776, 40609393, 39392930, 37557468, 35783704, 34345923, 33473035, 31564936, 30367876, 30839108, 30985494, 30749987, 30591415, 31916265, 34248955, 36680388, 38442736, 40759798, 44400816, 48789852, 53892657, 60380155, 68950225, 79202684, 91206859, 105271841, 122413234, 144398599, 172183443, 206572250, 246603427]
7760B46603427M3544233M3776762L8238915K5000963P906707j1012142k7980658
7753C66078207l9801085m4245981m3736652m0646127l5091521k7388317k1358475
7746A13810049j6306595j2657191j0221658q927553q113043n834119m523453l968608
7738D3257829k999981k582997k627572k590700j626192j259443q16271j947671
7730B6807002k028617j188841q79075j753440j073227m52330P06450J083185L72041
7721B1593148m72009q31409M37676J458911J295980J000096K313171L260829M170195
7712C4226588L522786M369884O263153P977372R337891J0499606J1969081J5531430
7704A03697791K0198263K3066726K3068276J8227114J2024514L638044o115558
$$ y = [246603427, 290147660, 333924422, 372163337, 397164300, 405071007, 394058865, 366078207, 326277122, 282031141, 238294489, 197648362, 162556841, 135168524, 113810049, 97503454, 84846263, 74624605, 65697052, 57584009, 51749890, 47226437, 43257829, 40257848, 37674851, 35047279, 32456579, 30830387, 29570944, 28754673, 26807002, 24778385, 23589544, 22710469, 20957029, 19883802, 19431472, 20137922, 21221107, 21593148, 21121139, 20289730, 20727406, 22186317, 23482297, 24482393, 26795564, 30056393, 34226588, 37749374, 42119258, 48382411, 56359783, 65697674, 76197280, 88166361, 103697791, 123896054, 146962780, 170031056, 188258170, 200282684, 203920728, 197805170]
7697A97805170j4728862j9989987k2185136k2005054j9680183j6632040j3454468
7690F9129440j0324667p973867o899169o289336n559982m998834m045331k542618
7682B0495636j065769q13044j895318j527683p80216l51793q75574n06513p27622
7673A1952104o49622n62951n80856k71199k21594o50615j161621j120837o18011
7664F114798L33749M95980L29157J04444J70115N80425J434146J778437K262807
7655A3604058J853794N28384O69044J853993K553504L931147N300136O578027
7647C6872087O415524O067043O008013N214201M811130J908320k171244m896045
7639F0229029p018571q041883p100545n673055m707031m256610m105471l732387
$$ y = [197805170, 183076308, 163086321, 140901185, 118896131, 99215948, 82583908, 69129440, 58804773, 50830906, 43931737, 37642401, 32082419, 27083585, 23038254, 20495636, 19429867, 18616823, 16721505, 15193822, 14413606, 14061813, 13186239, 12679726, 11952104, 11302482, 10739531, 10158675, 9887476, 9665882, 9015267, 7853646, 6732809, 6114798, 6448547, 6944527, 7273684, 7378128, 7548243, 8128668, 9562814, 11341251, 13604058, 15457852, 15986236, 16655280, 18509273, 21062777, 24993924, 30294060, 36872087, 43287611, 49354654, 55362667, 60576868, 65387998, 67296318, 65125074, 60229029, 53210458, 45168575, 38068030, 32394975, 27687944, 23431334, 19325863, 15593476]
7631A5593476k963064j549849o82378q22729j812768p58185M44708j2082n31196
7622F905933l65494m60689j836533j310350j86164k29515l73802j03695L85803
7613B425494k74619n42415K56499N88570K54557o92202p58726J38394M62036O48508
7603B506096J19451m09550l85144m24897M15695M12566p85273n40600N48144M98872
7593A955360R5576K87917J01013M36339J13617j002728j022402m26550Q88613
7584A426755K38677l99904l3668O39136J505105J005707Q90303J79504o70428
7575D781187n98178q59621q6299J4024n45715l36874O5341j09525O20217R94935
7565C939492N27145j38641n76577J35900J741364J287713k63519m45752O65916
$$ y = [15593476, 12630412, 11080563, 10398185, 9575456, 7762688, 7004503, 7449211, 7437129, 6905933, 6540439, 6079750, 4243217, 2932867, 2746703, 2517188, 2143386, 2039691, 2425494, 2150875, 1608460, 1864959, 2453529, 2708086, 2015884, 1257158, 1395552, 1857588, 2506096, 2625547, 2215997, 1830853, 1405956, 1821651, 2234217, 1448944, 908344, 1456488, 1955360, 2050936, 2338853, 2439866, 2876205, 2989822, 1987094, 964692, 538142, 1426755, 1665432, 1265528, 1231860, 1870996, 3376101, 4381808, 5272111, 5451615, 4781187, 4183009, 3323388, 3237089, 3251113, 2705398, 2368524, 2433865, 2324340, 2944557, 3939492, 4466637, 4327996, 3751419, 3887319, 5628683, 6916396, 6652877, 6207125, 6873041]
7556F873041J077786N64912L51084L10517J035313J927655J716400J073141N99353
7547A5529202Q57778J696984K517576L772458N650780O266915N983462O127346
7539D8402501Q239575R930983R998664J1944474J3879372J3537699J1840518O846545
7531A34620331j389752r414966j3542687j4957235j4176423j2649417j0792689
7524E7697162q514313p419586n545143l764239l685286l492046l283308k626969
7516A9366272j436999q08640j700380k379064k406884j448060k98939n04607r31172
7507G451527q49101o72901r24013n53681q633N39629J268319J97694j045948o16743
7497D786149J33554j140360j469785j145872n59216P53218Q19597L89258O52302
$$ y = [6873041, 7950827, 8515739, 8866823, 9177340, 10212653, 12140308, 13856708, 14929849, 15529202, 16386980, 18083964, 20601540, 24373998, 30024778, 36291693, 42275155, 48402501, 56642076, 66573059, 76571723, 88516197, 102395569, 115933268, 127773786, 134620331, 133230579, 123815613, 110272926, 95315691, 81139268, 68489851, 57697162, 49182849, 41763263, 36218120, 32453881, 28768595, 25276549, 21993241, 19366272, 17929273, 17120633, 15420253, 13041189, 10634305, 9186245, 8887306, 8382699, 7451527, 6602426, 5929525, 5005512, 4451831, 4443198, 4982827, 6251146, 6448840, 5402892, 4786149, 4919703, 3779343, 2309558, 1163686, 604470, 1357688, 2177285, 2566543, 3218845]
7488C218845l95576r71439l08323J52135O34899o0562J01120M64815o34116r45823
7478A255975l48610l84293l15148j003675l77288Q14150J38486n09597j66465
7469h96465J353334J618224N53456K8793l14441j068992k57094J60865n61510
7460F16170j69524K45263M99678P17716j08690k29992L16409k59511j134371n96516
7450a03368J99053N29169K77051j261851o23677P89490N59515M10489M89194J270112
7440B535177R21757l78818L633o02892m26370j21780k35822o05227j178432p4002
7430a62776J906534J074081n91285n39856p0191l10244m05475j36903J84440O5335
7420A013660J80364O42865n82647p66628m62779l44669m8323J31238J037685J418450
$$ y = [3218845, 2823269, 1851830, 1543507, 1695642, 2330541, 2269979, 2371099, 2835914, 2201798, 1255975, 907365, 523072, 207924, -795751, -1173039, -358889, -220403, -730000, -896465, 456869, 2075093, 2628549, 2657342, 2342901, 1273909, 1016815, 1177680, 616170, 446646, 691909, 1191587, 1909303, 1800613, 1570621, 1887030, 1627519, 493148, -103368, 95685, 624854, 901905, -359946, -983623, -194133, 365382, 775871, 1265065, 2535177, 3456934, 3078116, 3081749, 2478857, 2052487, 1930707, 1694885, 1089658, -88774, -162776, 1743758, 2817839, 2226554, 1686698, 1616507, 1306263, 900788, 763885, 948325, 1013660, 1194024, 1836889, 1254242, 487614, 24835, -319834, -368157, -236919, 800766, 2219216]
7410B219216P96902J01706m68658n68198q7236m8106M37856P90927M83745j71222
7400C486932r38234o32605m76151r41635m22706L98003O74728J008566r6984j16964
7390A942950Q29545K86615r94991j438528r42790M49049R74311N56700K35090
7381A897951p28977j130372k80961k4792J79707N35240M81163j88385k86632M45395
7371H99337p1684n74827l58835j47166k8638L28355L22389m28810m99953M97151
7361f2681L20908j49231J59801l242m90783l05291R7547K92768k81575j93556
7351f15335N50956J010657K17789l53855K06728k52636N5478N84334P37022R68990
7341C110128Q73935j30641k2014M86818O11577k94156j7750J026475M75434j11403
$$ y = [2219216, 3016118, 3117824, 2649166, 2080968, 1993732, 1945626, 2383482, 3174409, 3658154, 3486932, 2548698, 1916093, 1439942, 498307, 75601, 473604, 1148332, 2156898, 2059914, 1942950, 2772495, 3059110, 2064119, 625591, -317199, 131850, 1106161, 1662861, 1897951, 1168974, 38602, -242359, -267151, -87444, 447796, 928959, 740574, 453942, 899337, 827653, 252826, -106009, -253175, -281813, 46542, 368931, -59879, -559832, -62681, 258227, 108996, 268797, 265555, -225228, -530519, -432972, -140204, -421779, -615335, -64379, 946278, 1164067, 810212, 1016940, 764304, 819782, 1404116, 2141138, 3110128, 3984063, 3853422, 3831408, 4318226, 4929803, 4635647, 4617897, 5644372, 6119806, 6008403]
7331F008403p35304j040491K11965P6345j061077r14449l24487Q83411P18903
7322C823219J235356J496365M03731P28895J422409K031505J942854J368353K164569
7313A6617256K514308L330101L564374L206639M671409N068846M616663M198127
7305D7787723P96712k062484m757224o398770o050863m071028k226732k630999
7297B0386335k612366k460247k518099k210881j586262j234366j036788o44391
7289F082935K98616R82238Q83588K70346k35804K74489m54768j168845k14710
7280F718085k17589l06924K14246J0690O17973N57191k76319p75611r98802p19668
7270D823272j50370O59875J144388L62522m76380N62653J363228J204119R19444
$$ y = [6008403, 5273099, 4232608, 4444573, 4520918, 3459841, 2545392, 2220905, 3104316, 3823219, 5058575, 6554940, 6958671, 7687566, 9109975, 11141480, 13084334, 14452687, 16617256, 19131564, 22461665, 26026039, 29232678, 33904087, 38972933, 43589596, 47787723, 48584435, 46521951, 41764727, 35365957, 29315094, 25244066, 23017334, 20386335, 17773969, 15313722, 12795623, 10584742, 8998480, 7764114, 6727326, 6082935, 6381551, 7363789, 8247377, 8517723, 8281919, 8556408, 8101640, 6932795, 6718085, 6500496, 6193572, 6407818, 6418508, 7036481, 7593672, 7317353, 6541742, 5542940, 4823272, 4672902, 5332777, 6477165, 6839687, 6363307, 6925960, 8289188, 9493307, 10412751]
7261A0412751Q07860J079443J278719Q88937J361275J770983J688858K286298
7253B1575124L003869L014553K991392M754145O256713Q085287Q765742R560316
7245F8007141J1212890J2795653J4462061J3689608R235899J753644n132097j0820774
7237A15204025j3443967j3732899j2971407j0086719q286232p852128p201299
7230D1629374o394573n545785l915342k828895j792283j742886j696005j614469
7222A6099136k483955k327969r30501o50565j461933j201685q28529n86785k186
7213E625028N64941J91415l25825m33044q57317j425476J77625K96389j61028
7204C652708J56018N688J29363l10358k75148m96848l20256l09111N31442M41916
$$ y = [10412751, 11220611, 12300054, 13578773, 14467710, 15828985, 17599968, 19288826, 21575124, 24578993, 27593546, 30584938, 35339083, 41595796, 49681083, 58446825, 68007141, 79220031, 92015684, 106477745, 120167353, 129403252, 131156896, 126024799, 115204025, 101760058, 88027159, 75055752, 64969033, 56682801, 48830673, 41629374, 35234801, 29689016, 25773674, 22944779, 21152496, 19409610, 17713605, 16099136, 13615181, 11287212, 10356711, 9706146, 8244213, 7042528, 6213999, 5627214, 5625028, 6189969, 6381384, 6055559, 5622515, 4765198, 3339722, 3517347, 3813736, 3652708, 3808726, 3814414, 3943777, 3633419, 3358271, 2861423, 2541167, 2232056, 2763498, 3205414]
7194C205414N18571P73275n03067l37950j01163k78183j92169r64367m42776Q02816
7184B480401K07520l93696M54963K34702l62131j041920p10931L08062O56502
7175A833472P9738m72810M40428L69506r43739n73628O76602Q54880M56806n525
7165B715730j30900j10926o74899l39561o08240p08540j41682K48253o1205l73776
7155a85746l56961k24887r59393j150639J41916J989762J909729R95297N40675
7146B699753N0876k59573m38929L73690O60251M69049k43044j225056j056141
7137A030876l69928O86776O61701n15290n01457l44043j06981K11518k79753r01993
7127d28574l2370L77106N50894K44959n37105j80668M40527J26175m21260j87099
$$ y = [3205414, 3723985, 4497260, 3994193, 3656243, 3555080, 3276897, 3084728, 2120361, 1677585, 2480401, 2687921, 2294225, 2749188, 2983890, 2621759, 1579839, 868908, 1176970, 1833472, 1913210, 1440400, 1880828, 2250334, 1306595, 732967, 1409569, 2264449, 2721255, 2715730, 2584830, 2473904, 1799005, 1459444, 851204, 142664, 982, 249235, 188030, -185746, -542707, -767594, -1726987, -2877626, -2735710, -745948, 1163781, 2159078, 2699753, 2750629, 2491056, 2052127, 2425817, 3086068, 3555117, 3312073, 2087017, 1030876, 660948, 1347724, 2009425, 1494135, 992678, 648635, 541654, 753172, 473419, -428574, -460944, -83838, 467056, 712015, 174910, -5758, 434769, 560944, 139684, -47415]
7117d7415Q5663l83829j96428O4838k32684o0785L14199k03151M5890j54660o44895
7106a413257J1535N9726l67307N80885J026113j51527m61489j61099P14595L86400
7096B24575m85700k3554N46699R31813L07660m74763k75387J95118m15004l80439
7086A51018l46494m98188n0890N46630M41253k1400J79610j00189O19020N71192
7076A491562j012528m58991j56929j230199j355774K67297P39499J304371Q97574
7067D85882p03610r33080p18952Q83549J469050Q5571l06263k6698O71461J03450
7057A010360l01667n08926n1036J64122o91517m74931L54113Q88855J277n49290
7047a58640N93658O07521j98682K97590j95114k89076K91146l1487k98950m23765
$$ y = [-47415, 38248, -345581, -542009, -477171, -709855, -770640, -456441, -659592, -613702, -768362, -1413257, -1401722, -1341996, -1709303, -1128418, -102305, -253832, -715321, -876420, -161825, 224575, -261125, -284679, 262020, 1193833, 1501493, 1026730, 751343, 946461, 531457, 151018, -195476, -693664, -744554, -197924, 243329, 221929, 401539, 301350, 920370, 1491562, 479034, 20043, -136886, -1367085, -2722859, -2455562, -1716063, -411692, 485882, -217728, -1150808, -1869760, -986211, 482839, 568410, 262147, 235449, 906910, 1010360, 708693, 199767, 148731, 312853, -378664, -853595, -499482, 389373, 390650, -158640, 435018, 1042539, 843857, 1141447, 946333, 657257, 948403, 916916, 617966, 194201]
7037A94201o06911j3960J00228k25588J62865n02517j09346J075759P31452L23104
7027A129287j58765l97759n7718j9513L44095P983J8196J069911Q1602r51938
7017A065381J16129j56951j063366m18246l0257n3068k34327n93452J91761L55311
7007h21085l60717j645507n78605O96320R57655Q52853M75727M8214m91007m06922
6997a273074N91678M15164Q78881R72270L13224m8150j69439p75698k04771J72641
6987H72726Q255L05341K3899n85402n29819j97749l33172M88450L37565m97190
6977a07096j14149J122346J010440J1728q20621n04285j142223j091384j96548
6968a831792N54037L7940O3058N49067n9979m95394l64435J73244J150213M33584
$$ y = [194201, -412710, -426670, -326442, -552030, -389165, -891682, -1001028, 74731, 806183, 1129287, 970522, 572763, 515045, 495532, 839627, 847610, 865806, 1935717, 2017319, 1065381, 1181510, 1024559, -38807, -457053, -487310, -540378, -774705, -1368157, -1176396, -821085, -1181802, -2827309, -3405914, -2709594, -1751939, -899086, -423359, -375145, -866152, -1273074, -681396, -266232, 612649, 1584919, 1898143, 1849993, 1680554, 904856, 700085, 872726, 880981, 1186322, 1210221, 624819, 95000, -102749, -435921, 52529, 390094, -107096, -221245, 901101, 1911541, 1923269, 1102648, 598363, -543860, -1635244, -1831792, -1277755, -1239815, -1176757, -627690, -687669, -1183063, -1547498, -1374254, -224041, 209543]
6958B09543M85497J255043M6515r11894l98555M89729Q82570l84305j110609p17888
6948a54354q01389n73033k10054m9341J233785P44616n78293o69445q81461m78838
6938b417807M31044J172404M61010m0006J21385p23217J86443P34971k04191k70392
6928e48356o19835o22006o78674O29898J906544N50713O9538p5536p05688o1095
6918a54497P66375j95202q60975k34095J083511J090460J92199r3668L21823N09872
6908B425803j405132j496813L87937P76405O92676N67113k77259q25417k89913
6899E55400m17950l35947K49533q5828k45658n26821l83233O14838P54911J06184
6889B85429k30078n2247m99983j59095O6795m92855K0285L79683K01124N01040
$$ y = [209543, 695040, 1950083, 1996598, 1084704, 686149, 1175878, 2058448, 1674143, 563534, -154354, -955743, -1528776, -1738830, -1788171, -554386, 190230, -388063, -1057508, -1938969, -2417807, -1986763, -814359, -353349, -393355, -271970, -995187, -808744, -73773, -277964, -548356, -1168191, -1790197, -2468871, -1838973, 67571, 618284, 687822, 612286, -93402, -154497, 611878, 416676, -444299, -678394, 405117, 1495577, 1687776, 1594108, 1915931, 2425803, 1020671, -476142, -88205, 688200, 1380876, 1947989, 1670730, 845313, 555400, 137450, -198497, 51036, -34792, -280450, -807271, -1190504, -575666, 179245, 285429, 55351, 3104, -496879, -655974, -589179, -1082034, -1061749, -682066, -480942, 20098]
6879B0098N13474m1857P94358J603899Q2387j251857n20546R35135P92003k31601
6869B695493J55952r25366j452785o97024l05177m71688j67370m48810n72220
6860b188995m18332l69938K14473L76285L08280N14819Q04547Q82537K33416J60544
6850E17636j60844J92933p7245Q8415l36352j190881j76491N52741O09208K97090
6840C16210m16962o50686l20802k46386j29400Q25553J323196K71460j29225M67992
6830A310950N11645p40804j582503n90961L8409j1040j26139L8445J76516L44800
6820f30682j97149m32967j10135M73760P76514J24000q01394j3447R60798P56107
6810I05405O82669p83362q24451M50235O96151q0977m84008p20877j88360N32592
$$ y = [20098, 533572, 491715, 1286073, 2889972, 2972359, 1720502, 1199956, 2135091, 2927094, 2695493, 2851445, 1926079, 473294, -223730, -528907, -1000595, -1167965, -1616775, -2188995, -2607327, -2977265, -2762792, -2386507, -2078227, -1563408, -758861, 123676, 357092, 517636, 356792, 549725, 472480, 560895, 224543, -966338, -1142829, -590088, 19120, 316210, -100752, -751438, -1072240, -1318626, -1448026, -622473, 700723, 972183, 842958, 1310950, 1822595, 1081791, -500712, -1091673, -1053264, -1064304, -1190443, -1151998, -975482, -630682, -827831, -1260798, -1370933, -897173, -120659, 3341, -798053, -811500, 149298, 905405, 1588074, 804712, -19739, 430496, 1126647, 1045670, 561662, -159215, -347575, 185017]
6800A85017K99902o11873p48236j20265P13626Q72400m5622M410o836j209272
6790f66749p35195l02625l5405N07616J284948O38886j8395n5463P04742K15977
6780A538337m04720o6928J97248J79326j23470m05315j03793M84823O5812p82282
6770E79038j285058Q6378Q17143Q05275Q49978J48102j276053j57330J575575
6761B143048K43924m65478L58047J00214o47786l75767m62807m15496m93354J4640
6751h15L1941M42189K88309k30963j367315j314334l67774k99164N27842M27290
6741a862794P32721R33215N38668J072178Q40553o28601q63231m29942l87436
6732e4669L73886J540624P30807k6037o43942o44690J25273L97720K29076K54691
$$ y = [185017, 484919, -126954, -875190, -995455, -281829, 590571, 544949, 549359, 542523, -666749, -1401944, -1704569, -1739974, -1232358, 52590, 691476, 673081, 617618, 1322360, 1538337, 1133617, 1066689, 1263937, 1443263, 1319793, 914478, 810685, 1295508, 1361320, 579038, -706020, -619642, 197501, 1002776, 1852754, 2000856, 724803, 567473, 2143048, 2386972, 1921494, 2279541, 2379755, 1731969, 1356202, 893395, 477899, -15455, -815, 31126, 473315, 761624, 530661, -836654, -2150988, -2518762, -2817926, -2290084, -1862794, -1130073, -196858, 341810, 1413988, 2254541, 1625940, 762709, 332767, -54669, 319217, 1859841, 2590648, 2564611, 1920669, 1275979, 1401252, 1798972, 2028048, 2282739]
6722B282739o56203j058147m36741L21870Q03678Q21632K68573J2392k69333q08790
6712A281670m60236n3554p20720j389625j167215Q0175J470813O05806j943j20733
6702d75562N73562J106443M54966O34239K57498n25667j013254r12115m54407
6693c54297j57967N8488L27206J68016N76499m25695r69985P73550J517062Q13888
6683B326765J18560n47512n19347J32474J45143j28266j16071q5138J09145o14023
6673H21730r98168l19301J151132O72144o62140q90862m62746j15600j62098N51451
6663d14458R91295P00828l14098p53375k39778P10518J46920l97519P01581M65049
6653A596963j89250j73607l90061k10879j84184Q7184N7654k09726O55032M73939
$$ y = [2282739, 1626536, 568389, 131648, 453518, 1257196, 2078828, 2347401, 2359793, 2090460, 1281670, 821434, 767880, 47160, -1342465, -2509680, -2429505, -958692, -352886, -354829, -475562, 98000, 1204443, 1659409, 2293648, 2551146, 2025479, 1012225, 100110, -354297, -512264, -453776, -126570, 41446, 617945, 192250, -777735, -4185, 1512877, 2326765, 2445325, 1897813, 1378466, 1510940, 1656083, 1527817, 1411746, 1326608, 1435753, 821730, -176438, -495739, 655393, 1327537, 665397, -225465, -688211, -803811, -965909, -414458, 576837, 1277665, 963567, 210192, -29586, 680932, 827852, 430333, 1131914, 1596963, 1407713, 1234106, 844045, 633166, 448982, 536166, 593820, 384094, 1039126, 1513065]
6643A513065q4846j28141p17310q38663p11469N04823J418685J425520M05932
6634B787596n94651j482995j353059j43575R80878J005621P1325n17458j63007
6625E90675O50994J48959L33755P00742n56758m38236p06555k34140q42720r62079
6615a315363p5425K23798N85993M65112k39985q255K70513J89839L63589M83922
6605I43738m98988k58123L31952j18816k52372j38696p6822L15112J7208Q4237
6595C48430k44622M6677O75338M38254n80356n42463j88134q51153l92309J3201
6585a277137Q63298P13389Q0897J24113K24678J041206M04672l95359j50557k94442
6575A334758J21151l15905q9521K14646r580o29452r17601o62505L3527K75445
$$ y = [1513065, 1428219, 1300078, 582768, -255895, -967364, -462541, 956144, 2381664, 2787596, 2192945, 709950, -643109, -786684, 194194, 1199815, 1271140, 753682, 590675, 1241669, 1390628, 1724383, 2425125, 1868367, 1430131, 723576, 489436, -353284, -1315363, -1390788, -1166990, -580997, -115885, -355870, -364125, -93612, 96227, 459816, 943738, 444750, 186627, 518579, 399763, 147391, 8695, -68127, 246985, 264193, 348430, 103808, 150485, 825823, 1264077, 683721, 141258, -46876, -898029, -1290338, -1277137, -413839, 299550, 380447, 504560, 729238, 1770444, 2175116, 1779757, 1629200, 1334758, 1455909, 1140004, 1050483, 1265129, 1255549, 626097, -291504, -954009, -920482, -645037]
6565f45037n12801L68016J191248Q12854k89689k03703n8889m40814n14226J04160
6555a88881n92664l15067M25730l42834j10374r1863l51944Q8793N56979K54430
6545f67695R6071L98382N95493J66404J65590L7435l97941k59662M74638K21824
6535H30539M7660m85048l45742R54278J134774J56428q93579n86073q56503r42413
6525i85679L12733K84713n08319r2272N7726M09642L03203L10836O84788M51576
6515A228947j71353q15156o66458n22577q74988l68222P56311J681946M98747
6506G47197l97284j17541J93101L65367k53806Q7161M58757L15743p76859j349267
6496g27431p21157O50683R07980K53319r56028P791O20026l62562J14917M86622
$$ y = [-645037, -1157838, -789822, 401426, 1214280, 924591, 720888, 661999, 221185, -293041, -188881, -781545, -1096612, -670882, -1013716, -1124090, -1215953, -1567897, -1479104, -922125, -667695, -571624, -173242, 422251, 588655, 754245, 791680, 393739, 134077, 608715, 830539, 878199, 393151, 47409, 1001687, 2136461, 2292889, 1399310, 813237, -43266, -985679, -672946, -388233, -896552, -988824, -931098, -521456, -218253, 92583, 777371, 1228947, 1057594, 242438, -424020, -946597, -1821585, -2189807, -1433496, 248450, 747197, 349913, 232372, 425473, 790840, 537034, 624195, 1082952, 1398695, 621836, -727431, -1448588, -797905, 110075, 363394, -592634, -584843, 35183, -327379, -212462, 274160]
6486B74160L85410M71745j31207k02874L47220J086218N25140J51847m76544r25385
6476A505730N7442M97940j27116n48149j519319j499641m77584L36425R06505
6467h67767J114642L72396K31250j56078j90027m29319L92825O22799J8868j24534
6457I85055L20646N81505Q49520O31423P16598m04782j382801r51962N82782K69861
6447B197845p76501M9034P55102L27286N3384j17428J24414o08121o94042n58600
6437G52373p62982p88028J88337N55891M17557K61955k11596n02271j434248l44434
6427a867446R59189J057285J201296k55052j204638O9338L29391l58661n8201
6418a27499O54923J84112M5331N45878P6037n15242N28576O8242o37138m47976
$$ y = [274160, 659570, 1131315, 1000108, 797234, 1144454, 2230672, 2755812, 2907659, 2431115, 1505730, 1563172, 2061112, 1933996, 1385847, -133472, -1633113, -2110697, -1774272, -867767, 246875, 619271, 850521, 694443, 504416, 75097, 467922, 1090721, 1109589, 985055, 1305701, 1887206, 2736726, 3368149, 4084747, 3679965, 2297164, 1345202, 1927984, 2197845, 1421344, 1470378, 2225480, 2552766, 2606150, 2488722, 2613136, 2005015, 1310973, 752373, -10609, -798637, -610300, -54409, 363148, 625103, 413507, -88764, -1523012, -1867446, -908257, 149028, 1350324, 1095272, -109366, -40028, 289363, -69298, -127499, 527424, 711536, 756867, 1302745, 1378782, 863540, 1392116, 1460358, 823220, 375244]
6408C75244J26599j03230q90670l79666N04671J249259K16396K22092J336144
6399B656839J227979J273731K17517j135935j460598j264514j090697l90474l15282
6390b81434n35339n43205L35461O65249L39550K52545J581046J339699o91675
6381B461897j289521m61950o52156l44047J87471j95082K94385o5221m31893N58941
6371F2824Q99042j65150J23486L06506k71866n05646j063386r8595M13397M36645
6361A37257J151796M65341p10854k99859Q74616j16069q88450n52737Q32345J379703
6351B273089J349397N77123m0813P7308P21858N81376j113319p40396J02700J08816
6341C897139k34504m35856L69285r8608o81605p46134M1891O87565J25607Q26352
$$ y = [375244, 501843, 398613, -492057, -871723, -367052, 882207, 1098603, 1320695, 2656839, 3884818, 5158549, 5376066, 4240131, 2779533, 1515019, 424322, 33848, -281434, -816773, -1359978, -1024517, -359268, -19718, 232827, 1813873, 3153572, 2461897, 1172376, 710426, 58270, -285777, -98306, -293388, 997, -64224, -496117, 62824, 961866, 796716, 920202, 1226708, 954842, 449196, -614190, -712785, -299388, 137257, 1289053, 1754394, 1043540, 743681, 1618297, 1502228, 613778, 61041, 893386, 2273089, 3622486, 4199609, 4158796, 4236104, 4957962, 5539338, 4426019, 3685623, 3788323, 3897139, 3662635, 3226779, 3596064, 3497456, 2815851, 2069717, 2111608, 2799173, 2924780, 3751132]
6331C751132N94566M84358K97610l36456Q38171K363023K403841J698357J862399
6322A3957001K310119K212286K730870K355940L405333N244698O848041P674647
6314D6738935J0053656J3608243J8018911K2485599K6338694K6761735J8683226
6307A82688999j087487k0688398k8099859k6674596k1912380j6347713j2383353
6300E5495213j0140925o834535m826680m328253l357600k999548k451130k477350
6292A8079192k733048k035659j185408j564589j354743r67820j988456j707145
6284D542324j44949j40579o94370q41854N1289O99836J3152o30962p52861k71709
6274A829317n98586L10718Q96122j13677J49185O31655J65539k24141L6173o26001
$$ y = [3751132, 4345698, 4830056, 5127666, 4791210, 5629381, 7992404, 10396245, 12094602, 13957001, 16267120, 18479406, 21210276, 23566216, 26971549, 32216247, 39064288, 46738935, 56792591, 70400834, 88419745, 110905344, 137244038, 164005773, 182688999, 181601512, 160913114, 132813255, 106138659, 84226279, 67878566, 55495213, 45354288, 38519753, 33693073, 29364820, 26007220, 23007672, 20556542, 18079192, 15346144, 13310485, 12125077, 10560488, 9205745, 8237925, 6249469, 4542324, 4397375, 4256796, 3562426, 2720572, 2771861, 3471697, 3484849, 2853887, 2101026, 1829317, 1230731, 1541449, 2437571, 2323894, 2473079, 3104734, 3270273, 3046132, 3082305, 2456304]
6264B456304p62386N23232R03543l5639q11000r41907o78326J96573P36831M96869
6254B084094K67143j44975n65471p00613j39053M88497J55481q67032j38771P67589
6244A206889N51678L51480m68781p62267m52627o47052L81272m52565j249291
6235a541264n60366J45633O09605N21884k50348N4754N72244m57319o14112O75706
6225h43583P56257M99256O47027J75522P4393l14463J61048J02486j071148j450004
6215a263209k01350Q37679J33943L5376J88343L31906N10590K82827J27317j19758
6205H63664J88424P42235K26165q52269p90863j005358j121944o03764J22994
6196b230716M67090J154811J452628P96821q7576j63035o29257m82486M45612
$$ y = [2456304, 1693918, 2217150, 3120693, 3085054, 2274054, 1332147, 653821, 850394, 1587225, 2084094, 2351237, 2206262, 1640791, 940178, 801125, 1289622, 1445103, 578071, 439300, 1206889, 1758567, 2110047, 1641266, 878999, 426372, -220680, 160592, -291973, -1541264, -2101630, -1955997, -1346392, -824508, -1074856, -1020102, -447858, -905177, -1519289, -843583, -87326, 411930, 1058957, 1234479, 1308872, 994409, 1155457, 1257943, 186795, -1263209, -1464559, -626880, -492937, -457561, -269218, 62688, 573278, 856105, 983422, 863664, 1052088, 1794323, 2020488, 1168219, 377356, -628002, -1749946, -2353710, -2230716, -1763626, -608815, 843813, 1640634, 1553058, 1390023, 760766, 278280, 723892]
6187G23892N59437Q19083k42488r11884L66069N19656m18456j054195l87108O14917
6177E88923J21806r34131l53948L13810n8398K25377j01831j85776K80021L26378
6167B22231l64046k12192O14595J5667k32597m1864j23980l55019M07387j95787
6157b65605o41270L65060J223201P84430m36042q48748n92533L21678j09602K31272
6147C1841Q07018Q7983K9264M41110J56396p66132q70917n90772R76513J622366
6137A924670Q20562L04114n36071j048805o45538q44087l07151N35299K94858
6128D97851J42364L15421Q97216m8090n55107j33457q35587r66767j37878M65034
6118c59000O30302O61100M930j76728n99595q15289p8825O47105J53271j055791
$$ y = [723892, 1283329, 2102412, 1859924, 948040, 1314109, 1833765, 1415309, 361114, -25994, 588923, 710729, -223402, -577350, -263540, -321938, -96561, -198392, -384168, -104147, 222231, -141815, -354007, 260588, 276255, 43658, 1794, -122186, -477205, -69818, -265605, -906875, -541815, 681386, 1465816, 1029774, 181026, -411507, -89829, -199431, 31841, 838859, 926842, 956106, 1397216, 1553612, 787480, -83437, -674209, 302304, 1924670, 2745232, 3049346, 2513275, 1464470, 818932, -25155, -332306, 202993, 497851, 640215, 955636, 1852852, 1804762, 1249655, 1116198, 280611, -686156, -824034, -359000, 271302, 932402, 937332, 760604, 161009, -654280, -733105, -86000, 67271, -988520]
6108i88520o28811L71254J5865J9778J172436J330966O93294l29879P1202j69858
6098A557727l28860n51400r3899J335181J421985p87535j615396q04340K56471
6089C89934k49298p26987M77866J87617j78361o52483j81162M1378M73885O35300
6079B17689O73444J83614j48320q18778j145116m25539m92711m31573l20945K86163
6069b422072P51320J008590L48213m34332K29398Q03650P72347L74402j10546
6060A320970j339032j014535P02593M36648l23031K10524O73557Q02364o70608
6051G99450r48584P08137R89033j45307J01603L72554n65510r33433L60553P62420
6041A500916O28930o94169j167283n78903q78629l35861N90243M34876j12270
$$ y = [-988520, -1617331, -1246077, -1230212, -1210434, -37998, 1292968, 1986262, 1656383, 1727585, 1557727, 1228867, 677467, 583568, 1918749, 3340734, 2553199, 937803, 133463, 389934, 140636, -586351, -108485, 79132, -99229, -751712, -932874, -891496, -417611, 217689, 891133, 1074747, 926427, 107649, -1037467, -1463006, -1955717, -2387290, -2708235, -2422072, -1670752, -662162, -313949, -748281, -518883, 284767, 1057114, 1431516, 1320970, -18062, -1032597, -330004, 106644, -216387, -5863, 667694, 1470058, 799450, -149134, 559003, 1548036, 1402729, 1504332, 1876886, 1311376, 377943, 738496, 1500916, 2129846, 1435677, 268394, -310509, -1189138, -1524999, -934756, -499880, -612150]
6032f12150M3410Q1403K63842J337741J389698J51148J03477l22960j174980j241354
6022A9275n76845p17433K85907J658741R36261l73082m12510l51941j42091l08449
6012A7833r3749M60913o2225o29603j366916R154J002292N57871O56695N36284
6002A088549P7463O77643L04228m9275N63051l99272j058027l01311m23107j22480
5992C57462M73768P81678L77501p32321p58718J98452K29127M8920j46044m16737
5982D13088K93070K69350L25735j43454r2396L69251N62240J68572k25040m59676
5972A480740O08596N06589K06989M20371K83894k40943j214073j415164m75499
5963A61500J216066J668161J345879r5254j47431P30803J049641J668519K942747
$$ y = [-612150, -568740, -487337, -223495, 1114246, 2503944, 2655092, 2758569, 2435609, 1260629, 19275, -557570, -1275003, -989096, 669645, 1605906, 1232824, 820314, 468373, 326282, 17833, -75916, 384997, 322772, -306831, -1673747, -1664593, -662301, -104430, 552265, 1088549, 1166012, 1843655, 2147883, 2098608, 2661659, 2262387, 1204360, 903049, 479942, 357462, 831230, 1612908, 1990409, 1258088, 499370, 697822, 926949, 975869, 829825, 413088, 706158, 975508, 1301243, 1157789, 1065393, 1434644, 1996884, 2165456, 1940416, 1480740, 2089336, 2595925, 2802914, 3223285, 3507179, 3266236, 2052163, 636999, 161500, 1377566, 3045727, 4391606, 4296352, 4148921, 4879724, 5929365, 7597884, 10540631]
5954A0540631K653676K417427K911300L017377L517247N671852O280839N888269
5946D2898618M227969L88852k958905m393698o043741o081793l971903l178817
5938B0886582k744103k473631k914672k664372j389383j704852j449231n21643
5930E024695M10323K23494O94347L20615q51835q09441q60530j169303n1560J69094
5920C099899l36772r8078K00521M8129l25808n16678j94245J72830P5497j102214
5910A023081o43442j68797J4132M34351Q09924N69929j29889j291058l72621J228197
5900A473807M83758j75047j22996m85366j81940N28812N54813J273295L20818
5891C669954j073811j542665o05638k12228O08077K38983l1191J01405j84164
$$ y = [10540631, 13194307, 15611734, 18523034, 21540411, 25057658, 30729510, 37010349, 42898618, 47126587, 47515439, 44556534, 40162836, 34119095, 28037302, 24065399, 20886582, 18142479, 15668848, 12754176, 10089804, 8700421, 6995569, 5546338, 5024695, 5435018, 5658512, 6352859, 6673474, 5821639, 5012198, 4151668, 2982365, 2930805, 3099899, 2763127, 2665049, 2865570, 2913699, 2587891, 2071213, 1876968, 2049798, 2125295, 1023081, 379639, 210842, 224974, 659325, 1469249, 2039178, 1909289, 618231, 245610, 1473807, 1957565, 1782518, 1659522, 1174156, 992216, 1521028, 2075841, 3349136, 3669954, 2596143, 1053478, 447840, 235612, 843689, 1082672, 1051481, 1152886, 968722]
5882I68722K9413L81119N65950O70325J156934L24048p68693m80029n23225m39367
5872A885197J28909k80791m35963k78402L39507N16814l46054q03111l28024n5392
5862C42690L81512P26782l84389m31675l62799q03804r8007K58144J31497l56323
5852e96372j682O91091J054013Q15196j066636q25691K11079P17149L60205R24788
5842B283140M82892M52640M05624q75766j078335j385592r08712n33440j47097
5833a304646j97845K9949l4792J90428K7135O39173J001807q0139m44505l1358
5823b04793q4197N94240R07552Q1910o50216L2994l83696j52825l13364K02473
5813C0078O56535J12721Q75448R85146j30789m87227l82935k15129n2695j3456
$$ y = [968722, 998135, 1379254, 1945204, 2615529, 3772463, 4096511, 3327818, 2847789, 2324564, 1885197, 2014106, 1733315, 1297352, 1018950, 1358457, 1875271, 1529217, 726106, 398082, 342690, 724202, 1450984, 1066595, 634920, 272121, -531683, -629690, -371546, -240049, -596372, -598054, 93037, 1147050, 1962246, 895610, 69919, 280998, 998147, 1358352, 2283140, 2766032, 3218672, 3624296, 2748530, 1670195, 284603, -624109, -1157549, -1304646, -1502491, -1472542, -1507334, -1316906, -1289771, -650598, 351209, 271070, -173435, -204793, -288990, 305250, 1212802, 1294712, 644496, 677490, 293794, 140969, -172395, 30078, 686613, 799334, 1674782, 2659928, 2529139, 2041912, 1658977, 1443848, 1391153, 1377697]
5803A377697k81754q20488L96928J25370L80440P45271l83892j434258j145535
5794a040221j52645J1982N61123J64505K99188K06783j333648r84727N18524K038943
5784B89807J595514N52155J90801J4836J78413n02455j065543q39293j241765
5775h27530p46956O16337R79414J135898n26021j512388K55086J006125O0349
5766D40314r11105m46131K14609Q85412N23294j37306L6381j44831l86043j60340
5756h5746l1739K44128o27742M19810J929654J564222M15446M0917N14130m98860
5746C884220j064571j123397j316917r86137l62376j49874n17778K25120J405217
5737f493M19478l32991k34175r3482P78902O60175L11398M14641r7074q50407
$$ y = [1377697, 1095943, 275455, 672383, 797753, 1178193, 1923464, 1539572, 105314, -1040221, -1192866, -1180884, -619761, -455256, -156068, 50715, -1282933, -2267660, -1749136, 289807, 1885321, 2437476, 2628277, 2643113, 2821526, 2319071, 1253528, 414235, -827530, -1574486, -958149, 21265, 1157163, 631142, -881246, -626160, 379965, 440314, -470791, -916922, -702313, 183099, 706393, 569087, 605468, 460637, 74594, -85746, -117485, 126643, -501099, -81289, 1848365, 3412587, 3828033, 3868950, 4383080, 3884220, 2819649, 1696252, 379335, -606802, -969178, -1119052, -1636830, -1411710, -6493, 412985, 79994, -154181, -247663, 531239, 1191414, 1502812, 1917453, 1820379, 969972]
5727I69972p12192q53852q71348k76809P74971M07615q5204l35251j4810k19807
5717a216715l12280p92395k12453P10867Q95550J54617J85427J422201J107064
5708A941883P6411J90870M42330k59674l53434K63453k48516r90506q16438j90665
5698E5714P65424Q78396L98418J9871J42920l21449k54088O41482L8755q36739
5688A528704j3953J72478M1552R1152K67844M88621J032865O98712j55750r63785
5678C188440p75855k85021M4812J34200l08201N8493O96340j2968o39733j095395
5668A005112j035873n12456k45544M24402J259137P18953k46643l99988j74719
5659G92381k8841j51687k36166J057101P4587j826438r51476P34897P98853j438597
$$ y = [969972, 257780, -596072, -1467420, -1744229, -969258, -561643, -646847, -982098, -996908, -1216715, -1528995, -2321390, -2533843, -1822976, -927426, -772809, -587382, 834819, 1941883, 2018294, 2209164, 2651494, 2391820, 2038386, 2301839, 2053323, 1062817, 246379, 55714, 821138, 1699534, 2097952, 2117823, 2260743, 1939294, 1685206, 2326688, 2365443, 1528704, 1514751, 1687229, 1728781, 1819933, 2087777, 2576398, 3609263, 4307975, 4152225, 3188440, 2412585, 2127564, 2172376, 2306576, 1998375, 2056868, 2753208, 2740240, 2100507, 1005112, -30761, -543217, -788761, -364359, 894778, 1613731, 1367088, 967100, 792381, 763540, 611853, 375687, 1432788, 1507375, -319063, -1270539, -535642, 263211, -1175386]
5649a175386j321582N53089J611814P76497q41705R1764J292404L71175j72846
5640A185224j18044j04966N49493n20643p88495K20184Q7335J20617K69070K98155
5630A197930P35334Q82034P98348o46081n83745m30315q08024K04495P7340k90205
5620A137111J69092j76685j160101p00047K73793N13568L59150k28888n52225
5611c65232p21492n53823m5077r2323n06020p06789M97894Q52400M6478p1636
5601a665620k76277J07072J112710L97665M29403M86749k25292l2022K22326K14616
5591G71330j66735p3268L52921L78710K86256n13784j068490j379267j000117
5582b412444j56377P90747R47774m81N01379K50779m32761q4692J97807J97280
$$ y = [-1175386, -2496968, -1943879, -332065, 444432, -397273, -305509, 986895, 1358070, 1185224, 1067180, 962214, 1511707, 991064, 202569, 422753, 510088, 630705, 899775, 1197930, 1933264, 2815298, 3613646, 2967565, 2383820, 1953505, 1145481, 1349976, 1427316, 1137111, 1306203, 1129518, -30583, -730630, -456837, 56731, 415881, 186993, -365232, -1086724, -1640547, -1685624, -1777947, -2283967, -2990756, -2492862, -1640462, -1593984, -1665620, -1941897, -1834825, -722115, -324450, 104953, 591702, 366410, 334388, 556714, 771330, 604595, 531327, 884248, 1262958, 1549214, 1035430, -33060, -1412327, -2412444, -2568821, -1778074, -830300, -830781, -329402, -78623, -511384, -596076, -398269, -200989]
5572b00989p07657m50757O12689Q93815O1276n93893L22956L39494J175709p316
5562A445327l17499P621m87102n79791k95445m92532R85492J260828P93416J22147
5552B442462p44007j388207j053171l41435M31705P59410L34275Q05552O93590
5543A940174m78877j586766l64674Q12483Q16787K44611n2347K81179n76547j493518
5533d57495o84053J28252L73276L23534P2829o11616q95167K35238P08696k62943
5523a069449j89587J22878o38062j0354K31954P4032M78360N00677N43497p5262
5513c1316L12795k17449p85920J9662N23891J135889N03786j354737j703986L73878
5503a223507R43548m0914J16681Q0334l18168K18576J406738J185094Q15757l03302
$$ y = [-200989, -908646, -1359403, -746714, 147101, 208377, -385516, -62560, 276934, 1452643, 1445327, 1127828, 1135449, 648347, 68556, -226889, -719421, 266071, 1526899, 2320315, 2442462, 1698455, 310248, -742923, -1084358, -652653, 106757, 441032, 1246584, 1940174, 1461297, -125469, -490143, 322340, 1139127, 1383738, 1331391, 1612570, 1036023, -457495, -1141548, -1013296, -640020, -316486, -243657, -855273, -1750440, -1515202, -806506, -1069449, -1259036, -1136158, -1774220, -1784574, -1552620, -1478588, -1000228, -499551, 43946, -31316, 281479, 64030, -721890, -702228, -178337, 957552, 1461338, 106601, -1597385, -1223507, -279959, -320873, -204192, -123858, -442026, -223450, 1183288, 2368382, 3184139, 2880837]
5493B880837j657674j467484J96996O28130L69695m23732m74592j21633M58548
5484C89091J355975P50428j164389p87625k81920K75892N77727l76103q22404
5475h3328o91383l02229K80730P41531O47459M33098m16201j060108j25514N36805
5465c9140l1981n6391j56634j210574j235284K8770J270829R58261p20641j635620
5455b828405p00783M79858O14630L08137L57668Q05682L93109l03077k24600Q84348
5445b13433M65483K47388o74627L36942J618509K4125n45064j34350J12011l24893
5435I12091m39119l31998k81035k62286L65581m30212k71162R63424J067878M8625
5425A341787p73185r2849Q73129l77159n50435N23041J077777L41299q90400j052981
$$ y = [2880837, 1223163, -244321, -47325, 580805, 950500, 526768, 52176, -69457, 389091, 1745066, 2495494, 1331105, 543480, 261560, 537452, 1115179, 739076, -83328, -774711, -1076940, -796210, -54679, 592780, 1025878, 609677, -450431, -575945, -39140, -71121, -127512, -284146, -1494720, -2730004, -2701234, -1430405, -472144, -1192785, -2828405, -3529188, -3049330, -2434700, -2126563, -1768895, -963213, -570104, -873181, -1097781, -213433, 252050, 499438, -175189, 161753, 1780262, 1804387, 1259323, 1124973, 1236984, 912091, 472972, 140974, -140061, -402347, -36766, -466978, -738140, 225284, 1293162, 1341787, 568602, 475753, 1348882, 971723, 421288, 944329, 2022106, 2363405, 1473005, 420024]
5415D20024m23680K89499j13283n40523N9794K54405l08599N9535r5338l08916
5405g07082M80266L17383p70992p59534N1767L88985l71305q91577j02275Q66131
5395a498233J512047J376231M38654p56084m72945k75539o17328r31313r98342
5386b222852M49716R95525p3919r62960m3382M10571M97638P09375M10947P7285
5376B47944n66491p63812j49481K76675J93378J83561J62501n62909l92427k51203
5366a622264j30669P22399j48970Q8571R02882J154625P77761L95100o14835p76986
5356G47614r18505n59512O33234P76348m19577k147308j034112M66485O31057
5347a824276n57585o37296Q43999J120255J108513J090045K70712n908Q11742
$$ y = [420024, -3656, 285843, 172560, -367963, -308169, -53764, -362363, -302828, -398166, -707082, -226816, 90567, -680425, -1439959, -1388192, -999207, -1370512, -2262089, -2364364, -1498233, 13814, 1390045, 1828699, 1072615, 599670, 324131, -293197, -1224510, -2222852, -1773136, -777611, -851530, -1814490, -1857872, -1447301, -949663, -240288, 170659, 247944, -318547, -1082359, -1231840, -955165, -761787, -578226, -415725, -978634, -1371061, -1622264, -1752933, -1030534, -1179504, -1090933, -188051, 966574, 1744335, 2139435, 1524600, 747614, -170891, -730403, -97169, 679179, 259602, -1887706, -2921818, -2455333, -1824276, -2381861, -3019157, -2175158, -1054903, 53610, 1143655, 1414367, 1408459, 2220201]
5338B220201P14815M0667L7872j001996j107149r99481j642470l90026J290915
5329h36652R00947K93133N386j479539p5751R64456R34105J350471k9307j274950
5319G52299m92531r81682M4848Q66953J220429Q25328q35871m42194k78656K26337
5309I05260J18769J62113L31822P32946J038136O36372o31337n91770J1568K09773
5299B923652k58576q43549j123959p99790l64335m39472k00998Q94334P57218
5290E44525n42390n25150j5278Q062M78724J004779K20537o13793j187229j056246
5280a683459k35754L70324Q42628J04426q1001l45677p21719L57426J267057Q14411
5270F88662m59399r47283k76845O73371J510022K75372r28773q72710n22065j7479
$$ y = [2220201, 2935016, 2975683, 3013555, 2011559, 904410, -95071, -1737541, -2127567, -836652, 64295, 357428, 362814, -1116725, -1192476, -228020, 706085, 2056556, 2027249, 752299, 259768, -721914, -677066, 189887, 1410316, 2235644, 1399773, 957579, 678923, 905260, 1024029, 1186142, 1517964, 2250910, 3289046, 3925418, 3294081, 2702311, 2713879, 2923652, 2665076, 1821527, 697568, -102222, -466557, -906029, -1107027, -212693, 544525, 2135, -523015, -538293, -530231, -51507, 953272, 1173809, 560016, -627213, -1683459, -1919213, -1548889, -706261, -601835, -682836, -1028513, -1750232, -1392806, -125749, 688662, 229263, -718020, -994865, -321494, 1188528, 1463900, 535127, -337583, -859648, -877127]
5260h77127N38846n0588o37261M35577J188994J211913N3231j028982n11558J86105
5250E09150j023043r02058j02083M58476J18789l8843m52390n13494k39630k55339
5240b440465N44713J143937J106250Q74878J4708k53729j66011k93116o8657j85318
5230B77190M38486j73610j95817L66668R8054p1347L68021J30357m34279r13716
5220a09993p31725L89404N63399J02787M26162M71450l95937p19591j26788N8823
5210g2009k90816J444j13254l11151K69133Q88132P42193Q68924M70233p92753
5200A660076L05789P74199j591260j702476p61481P6334P70059M34770J09407
5191G5417l94589O49924O47644k6615L84401l29894j352531q86591q73126r8476
$$ y = [-877127, -338281, -388869, -1026130, -590553, 598441, 1810354, 1863585, 834603, 323045, 509150, -513893, -1415951, -1518034, -1059558, -940769, -979612, -1432002, -1945496, -2185126, -2440465, -1895752, -751815, 354435, 1229313, 1244021, 990292, 824281, 531165, 462508, 277190, 715676, 542066, 346249, 712917, 810971, 739624, 1107645, 1238002, 803723, -109993, -841718, -452314, 111085, 213872, 640034, 1111484, 715547, -4044, -130832, -72009, -362825, -361381, -474635, -785786, -516653, 371479, 1113672, 1982596, 2452829, 1660076, 1965865, 2740064, 1148804, -553672, -1315153, -1238819, -468760, -33990, 75417, -319172, 330752, 978396, 951781, 1336182, 1006288, -346243, -1232834, -2105960, -2204436]
5181b204436O07930O32400K05225l38331R2942q0139J69946j67632k23794k08962
5171a514851m7308O2594k12328M43931O55271L14616q3342n42812m34690J020237
5161c38682J538350N73502O58175j96027q11148q86102o97369k77429K01553J182466
5151I47289L7607j281613l22951K04368Q1614R28952L0349n31712m93753n68334
5141i68184n1316M9201m09104q96276k00110N15125L31605P1699L9323N73005
5131i45032J67141K45843J038861J178639k838L34890P69575q9551o65810j396631
5121F35087j143715q49329m16799m08909n9291N83216L45430p15799q11875J55464
5111b686520O99986n10111j66563O83861M87479L94775N47786M64839L13660O39067
$$ y = [-2204436, -1596506, -964106, -758881, -1097212, -1004270, -1084409, -914463, -1082095, -1305889, -1514851, -1562159, -1499565, -1711893, -1267962, -612691, -298075, -381417, -924229, -1358919, -338682, 1199668, 1773170, 2431345, 2235318, 1424170, 538068, -159301, -436730, -235177, 947289, 984896, -296717, -619668, -415300, -333686, 595266, 625615, 93903, -399850, -968184, -1019500, -970299, -1379403, -2275679, -2475789, -1960664, -1629059, -1557360, -1518037, -945032, -777891, -532048, 506813, 1685452, 1682614, 2017504, 2787079, 2697528, 2031718, 635087, -508628, -1357957, -1774756, -2183665, -2242956, -1659740, -1314310, -2030109, -2841984, -2686520, -1986534, -2496645, -2663208, -1979347, -1491868, -1097093, -549307, -84468, 229192, 868259]
5101H68259N53135m09355n38156j48135l83798j75302p7049P29478M25085o52421
5091A91741r30045k45512k2973N05656J093771K017k78337k23889k14047n18997
5081f40615j47913P25664J76938J82722O68495P26650j16586j051019j295952
5072g71616p50206j46881L20595Q9449l59671p79175N34480M93550L03010Q40307
5062b26158K00226L6326L24866o23017m77590L22904l6950L4791L6769j255273
5052a663106o18381O90226J094712Q13530L5280l81276l65268N99055J43955l85279
5042c6552j77693k65061O75804K86719l41389m89949q04636n30609O47409Q83141
5032a52816J03884j169670j049870k85027q23418m8274K22944P50372R74439L06190
$$ y = [868259, 1421394, 1012039, 473883, 325748, -58050, -233352, -310401, 419077, 844162, 191741, -738304, -983816, -1006789, -501133, 592638, 594655, 316318, 92429, -121618, -640615, -788528, -62864, 114074, 296796, 965291, 1691941, 1575355, 524336, -771616, -1521822, -1668703, -1348108, -1258659, -1618330, -2397505, -1863025, -1369475, -1066465, -226158, -25932, 10394, 335260, -287757, -765347, -442443, -479393, -444602, -407833, -1663106, -2281487, -1591261, -496549, 316981, 352261, -29015, -394283, 204772, 348727, -36552, -214245, -479306, 196498, 483217, 141828, -348121, -1152757, -1683366, -1035957, -152816, -48932, -1218602, -2268472, -2553499, -3376917, -3425191, -3202247, -2451875, -1477436, -1171246]
5022a171246O2007n49480m29339L97282M14575Q46201J682885J057194l47405
5013A962674J23806J019616n78146j582198j988219j144321P23821O64310M06564
5004c92093q72972j161643N58985k61275j008880K08632O88674N08191O80106
$$ y = [-1171246, -1109239, -1658719, -2088058, -1690776, -1276201, -430000, 1252885, 2310079, 1962674, 2086480, 3106096, 2527950, 945752, -1042467, -2186788, -1462967, -798657, -392093, -1265065, -2426708, -1867723, -2128998, -3137878, -2929246, -2240572, -1732381, -1052275]
$$ [...]
##END NTUPLES=NMR SPECTRUM
##END=
