##TITLE=C13_EC-3254x
 DMSO-d6, 2000 sc

 19.7.2024
##JCAMPDX= 6.0         $$ Bruker NMR JCAMP-DX V2.0
##DATA TYPE= NMR SPECTRUM
##DATA CLASS= NTUPLES
##ORIGIN= UXNMR, Bruker Analytische Messtechnik GmbH
##OWNER= root
$$ XWIN-NMR		Version 3.5
$$ Fri Jul 19 16:12:22 2024 Russian Standard Time (UT+4h)  she@DPX200
##.OBSERVE FREQUENCY= 50.327896
##.OBSERVE NUCLEUS= ^13C
##.ACQUISITION MODE= SIMULTANEOUS
##.ACQUISITION SCHEME= undefined
##.AVERAGES= 2004
##.DIGITISER RES= 17
##SPECTROMETER/DATA SYSTEM= spect
##.PULSE SEQUENCE= zgpg30
##.SOLVENT NAME= D2O
##.SHIFT REFERENCE= (INTERNAL, D2O, 0, 222.565)
##AUDIT TRAIL= $$ (NUMBER, WHEN, WHO, WHERE, WHAT)
$$ ##TITLE= Audit trail, XWIN-NMR		Version 3.5
$$ ##JCAMPDX= 5.01
$$ ##ORIGIN= Bruker BioSpin GmbH
$$ ##OWNER= she
$$ F:/spectra/data/she/nmr/c13/1/pdata/1/auditp.txt
$$ ##AUDIT TRAIL=  $$ (NUMBER, WHEN, WHO, WHERE, WHAT)
(   1,<2024-07-19 16:10:30.26 +0400>,<she>,<DPX200>,
      <created by zg, POWCHK disabled, PULCHK disabled
       terminated by command 'halt'
       configuration hash MD5:
       00 E9 B6 7A A2 85 ED C7 34 08 36 98 17 FE 4E 26
       data hash MD5: 32K
       39 D2 E8 78 8A 4C 91 B0 C7 BA 0C FC E4 F5 2D C1>)
(   2,<2024-07-19 16:10:35.39 +0400>,<she>,<DPX200>,
      <Start of raw data processing
       efp BC_mod = 2 LB = 2 FT_mod = 6 PKNL = 1 PHC0 = -558.0498 PHC1 = 52.38844 SI = 32K 
       data hash MD5: 32K
       D8 71 21 55 67 CC 57 CF 6D BE 3F DD D5 7E F2 3B>)
(   3,<2024-07-19 16:10:38.32 +0400>,<she>,<DPX200>,
      <abs ABSG = 5 
       data hash MD5: 32K
       8E 8B 07 9E DA 09 9C ED 70 70 F3 1D 2D 15 82 5F>)
(   4,<2024-07-19 16:11:03.54 +0400>,<she>,<DPX200>,
      <pk PHC0 = -13.8272 PHC1 = 19.8 
       data hash MD5: 32K
       07 C8 BE 92 0D E8 22 47 B5 A4 13 62 4E 8A 8E 01>)
(   5,<2024-07-19 16:11:07.23 +0400>,<she>,<DPX200>,
      <abs ABSG = 5 
       data hash MD5: 32K
       4B 37 2E 81 1C B9 43 99 22 B7 C7 1F 9C F2 B4 F9>)
(   6,<2024-07-19 16:11:46.98 +0400>,<she>,<DPX200>,
      <pk PHC0 = 12.00907 PHC1 = -18.4 
       data hash MD5: 32K
       FC 47 12 AA 6F 54 4A F3 8C 56 45 7A 33 16 4C F6>)
$$ ##END=
$$ 
$$ hash MD5
$$ 50 3E 0E 82 3A 0B 72 C1 B5 4E 76 31 9F DE 87 F1
##$RELAX= 
##$RELAX= 
##$RELAX= 
##$RELAX= 
##$RELAX= 
##$RELAX= 
##$RELAX= 
##$RELAX= 
$$ Bruker specific parameters
$$ --------------------------
##$DU= <F:/spectra>
##$EXPNO= 1
##$NAME= <c13>
##$PROCNO= 1
##$TYPE= <nmr>
##$USER= <she>
##$AMP= (0..31)
100 100 100 100 100 100 100 100 100 100 100 100 100 100 100 100 100 100 
100 100 100 100 100 100 100 100 100 100 100 100 100 100 
##$AQSEQ= 0
##$AQ_mod= 1
##$AUNM= <au_zg>
##$AUTOPOS= <>
##$BF1= 50.322709
##$BF2= 200.13
##$BF3= 50.322709
##$BF4= 500.13
##$BF5= 500.13
##$BF6= 500.13
##$BF7= 500.13
##$BF8= 500.13
##$BYTORDA= 1
##$CFDGTYP= 0
##$CFRGTYP= 5
##$CHEMSTR= <none>
##$CNST= (0..31)
1 1 145 1 1 1 1 1 1 1 1 1 1 1 1 1 1 1 1 1 1 1 1 1 1 1 1 1 1 1 1 1 
##$CPDPRG= <waltz16>
##$CPDPRG1= <>
##$CPDPRG2= <waltz16>
##$CPDPRG3= <>
##$CPDPRG4= <mlev>
$$ [...]
##$SUBNAM4= <"">
##$SUBNAM5= <"">
##$SUBNAM6= <"">
##$SUBNAM7= <"">
##$SUBNAM8= <"">
##$SUBNAM9= <"">
##$SW= 239.972175391363
##$SWIBOX= (0..15)
0 1 3 0 0 0 0 0 0 0 0 0 0 0 0 0 
##$SW_h= 12077.2946859903
##$TD= 32768
##$TD0= 1
##$TE= 0
##$TE2= 300
##$TE3= 300
##$TEG= 300
##$TL= (0..7)
120 120 120 120 120 120 120 120 
##$TP= (0..7)
150 150 150 150 150 150 150 150 
##$TP07= 0
##$TPNAME0= <>
##$TPNAME1= <>
##$TPNAME2= <>
##$TPNAME3= <>
##$TPNAME4= <>
##$TPNAME5= <>
##$TPNAME6= <>
##$TPNAME7= <>
##$TPOAL= (0..7)
0.5 0.5 0.5 0.5 0.5 0.5 0.5 0.5 
##$TPOFFS= (0..7)
0 0 0 0 0 0 0 0 
##$TUNHIN= 0
##$TUNHOUT= 0
##$TUNXOUT= 0
##$USERA1= <user>
##$USERA2= <user>
##$USERA3= <user>
##$USERA4= <user>
##$USERA5= <user>
##$V9= 5
##$VALIST= <valist>
##$VCLIST= <CCCCCCCCCCCCCCC>
##$VD= 0
##$VDLIST= <DDDDDDDDDDDDDDD>
##$VPLIST= <PPPPPPPPPPPPPPP>
##$VTLIST= <TTTTTTTTTTTTTTT>
##$WBST= 1024
##$WBSW= 4
##$XGAIN= (0..3)
0 0 0 0 
##$XL= 0
##$YL= 0
##$YMAX_a= 6805410
##$YMIN_a= -12510043
##$ZGOPTNS= <>
##$ZL1= 120
##$ZL2= 120
##$ZL3= 120
##$ZL4= 120
##$ABSF1= 222.5654
##$ABSF2= -17.4314
##$ABSG= 5
##$ABSL= 3
##$ALPHA= 0
##$AQORDER= 0
##$ASSFAC= 0
##$ASSFACI= 0
##$ASSFACX= 0
##$ASSWID= 0
##$AUNMP= <proc_1d>
##$AZFE= 0.1
##$AZFW= 0.5
##$BCFW= 0
##$BC_mod= 2
##$BYTORDP= 0
##$COROFFS= 0
##$CY= -3
##$DATMOD= 1
##$DC= 0
##$DFILT= <>
##$DTYPP= 0
##$F1P= 0
##$F2P= 0
##$FCOR= 0.5
##$FTSIZE= 32768
##$FT_mod= 6
##$GAMMA= 0
##$GB= 0
##$INTBC= 1
##$INTSCL= 4.134877e-10
##$ISEN= 128
##$LB= 2
##$LEV0= 0
##$LPBIN= 0
##$MAXI= 10000
##$MC2= 0
##$MEAN= 0
##$ME_mod= 0
##$MI= 0.1934396
##$NCOEF= 0
##$NC_proc= 0
##$NLEV= 6
##$NOISF1= 120.0001
##$NOISF2= 80.00006
##$NSP= 0
##$NTH_PI= 0
##$NZP= 0
##$OFFSET= 222.5654
##$PC= 1.4
##$PHC0= -559.8679
##$PHC1= 53.78844
##$PH_mod= 1
##$PKNL= yes
##$PPARMOD= 0
##$PSCAL= 0
##$PSIGN= 0
##$REVERSE= no
##$SF= 50.3227345484362
##$SI= 32768
##$SIGF1= 140
##$SIGF2= 120
##$SINO= 11.81781
##$SIOLD= 32768
##$SREGLST= <13C.CDCl3>
##$SSB= 0
##$STSI= 32768
##$STSR= 0
##$SW_p= 12077.2946859903
##$SYMM= 0
##$S_DEV= 0
##$TDeff= 32768
##$TDoff= 0
##$TI= <>
##$TILT= no
##$TM1= 0
##$TM2= 0
##$TOPLEV= 0
##$USERP1= <user>
##$USERP2= <user>
##$USERP3= <user>
##$USERP4= <user>
##$USERP5= <user>
##$WDW= 1
##$XDIM= 32768
##$YMAX_p= 324887205
##$YMIN_p= -3025880
$$ End of Bruker specific parameters
$$ ---------------------------------
##NTUPLES= NMR SPECTRUM
##VAR_NAME=  FREQUENCY,     SPECTRUM/REAL,   SPECTRUM/IMAG
##SYMBOL=    X,             R,               I
##VAR_TYPE=  INDEPENDENT,   DEPENDENT,       DEPENDENT
##VAR_FORM=  AFFN,          ASDF,            ASDF
##VAR_DIM=   32768,         32768,           32768
##UNITS=     HZ,            ARBITRARY UNITS, ARBITRARY UNITS
##FACTOR=    0.368581032318806, 1,           1
##FIRST=     11200.0995020947, 0,            0
##LAST=      -877.195183895579, 0,           0
##MIN=       -877.195183895579, -3025880,    0
##MAX=       11200.0995020947, 324887205,    0
$$ Real data points
##PAGE= N=1
##DATA TABLE= (X++(R..R)), XYDATA
$$ [...]
10839d3069j39229J8068J13528Q3057K632j7733J2427J2959k3547N7816K13308
10828B90217K89641K45802J41004L6452j05767k36218k29384k07357k83526l50730
10818d09866k18549N0453J92000J52688O3263k7208n6084J279Q4664M6386j23472
10807b44446k54450l08165k66350j62821j36382j26990j2707J35243K59119K91289
10797h26660K29499J58475J14452J07450P6421O049r0204j68522j17276j1366
10787e21682N0612K6878p110Q0539J38434N9644o8908j07494n5471k820L7136
10776c70242J21258K00428J45902o810j06690j02898o8801j6297M4857N0737K8107
10765h0449N5167J47528J81568R2006M362N1417P9188j0867p5833r3821j39740
$$ y = [-43069, -182298, -164230, -50702, 32355, 34987, 17254, 29681, 42640, 19093, 76909, 290217, 579858, 825660, 966664, 1003116, 897349, 661131, 431747, 224390, -59136, -409866, -628415, -577962, -385962, -233274, -170011, -197219, -253303, -252024, -167360, -120974, -244446, -498896, -807061, -1073411, -1236232, -1372614, -1499604, -1512311, -1377068, -1117949, -826660, -597161, -438686, -324234, -216784, -140363, -134314, -224518, -393040, -510316, -521682, -471070, -444192, -451302, -370763, -232329, -172685, -241593, -349087, -404558, -407378, -370242, -248984, -48556, 97346, 90536, -16154, -119052, -187853, -204150, -159293, -108556, -80449, -25282, 122246, 303814, 395820, 400182, 451599, 530787, 519920, 444087, 350266, 210526]
10754B10526j67756r1532P32J8998R2821K58971L40674K97147K00012Q8023j4423
10743A234193j13162j71430j06785m213k2291r2349j34702j38659m7667O0749
10733D63684N5165p4668k07961k56571k52756k21918j76160j01369k3854M0273
10723g56135O2761O7012Q2516N4631M1082J29602K05341J67191L1577j19987q5486
10712a19895J10577K04916J48068L4489q4873j59843j76730j45697n6286P7026
10702a68248J67339K37299K74922K17293J57892J18574Q709j39389k34869k36424
10692D03098j40674K5300J07818J3466j34446k30993k54858j42286P2264K12406
10682f8905J24194p1163j12201p74M8530o0486j88830k16444j32631l739P0861
$$ y = [210526, 42770, -48762, -48030, -29032, 63789, 322760, 663434, 960581, 1160593, 1248616, 1234193, 1121031, 949601, 842816, 838603, 816312, 723963, 589261, 450602, 402935, 463684, 518849, 444181, 236220, -20351, -273107, -495025, -671185, -772554, -796408, -756135, -693374, -626362, -543846, -489215, -448133, -318531, -113190, 54001, 85578, -34409, -119895, -9318, 195598, 343666, 378155, 293282, 133439, -43291, -188988, -245274, -168248, -909, 236390, 511312, 728605, 886497, 1005071, 1013780, 874391, 639522, 403098, 262424, 287724, 395542, 409008, 274562, 43569, -211289, -353575, -281311, -68905, 55289, -15874, -128075, -128849, -80319, -140805, -329635, -546079, -678710, -682449, -611588]
10671f11588Q0157O6884N1529J5763J7400O6027Q6433L4292l7971m1028K2429
10660b49673M0253j6521n1167K5859J32743J79863J56218M5899j21671k46612
10650a04809k37937r9664L7847Q1132K8345r7501j69534j31925q4227p7232p5077
10639i30582p6481q6065l8426R9117K41304K75870K00877R5719L8210K371m9024
10628b27110p1007l2941L5440J06963J61674J46458K9483j56108l20532l50779
10618f78459k34101k6569J31427J13618j3920q0692k2860N8952Q0850J4741l5083
10607f92096k3585L106K3411O1973J05117J47734K03770K12472J20817j6064j02921
10596D3734j15620o3176J879L5843M0990J7962K7398P8526Q1111L9935O613K2345
$$ y = [-611588, -531431, -464547, -413018, -397255, -379855, -313828, -227395, -193103, -231074, -272102, -249673, -209420, -225941, -277108, -251249, -118506, 61357, 217575, 263474, 141803, -104809, -342746, -442410, -404563, -323431, -295086, -392587, -562121, -694046, -778273, -855505, -930582, -1007063, -1093128, -1131554, -1032437, -791133, -515263, -314386, -218667, -180457, -178086, -227110, -298117, -331058, -295618, -188655, -26981, 119477, 148960, -7148, -327680, -678459, -912560, -939129, -807702, -694084, -708004, -788696, -811556, -752604, -671754, -657013, -692096, -715681, -712575, -689164, -627191, -522074, -374340, -170570, 41902, 162719, 146655, 43734, -71886, -135062, -133183, -97340, -56350, -38388, -10990, 67536, 148647, 188582, 195195, 217540]
10584B17540J12554J79584J52074R7366Q0933J18646K03256J79713k7539j96697
10574A117430k19568j16494M6583J03867L6373l7757j38810k37334k12627j22290
10564B19373o6805l9053Q33L1997K957k5453k2455m9354q7537j01657j03022l5632
10552b75808J03420J82265J57041J02055R6979J59356K36807K37306J13612o7971
10542A045062k16546k16800o3978J29373K28235J41736O946p4946q2652l5901
10532H60529k6784k0916J1729m4603j90535k41759j81958p9948Q345K0568j2358
10521A02310M022Q5780J80950K13955J47287J18287J36559Q1011j7659j13857
10511I38645j97604j86644j07916m6510P100K1817J4023J5491n7192j34163j28291
$$ y = [217540, 330094, 509678, 661752, 759118, 840051, 958697, 1161953, 1341666, 1314127, 1117430, 897862, 781368, 827951, 931818, 968191, 930434, 791624, 554290, 341663, 219373, 152568, 113515, 114348, 146345, 149302, 123849, 101394, 52040, -35497, -137154, -240176, -275808, -172388, 9877, 166918, 268973, 365952, 525308, 762115, 999421, 1113033, 1045062, 828516, 611716, 547738, 677111, 905346, 1047082, 1054028, 979082, 896430, 860529, 833745, 812829, 824558, 779955, 589420, 347661, 165703, 85755, 94100, 114668, 102310, 106332, 192112, 373062, 587017, 734304, 852591, 989150, 1070161, 1052502, 938645, 741041, 554397, 446481, 399971, 407071, 428888, 442911, 458402, 401210, 267047, 138756]
10500A38756k3195J64965K12534Q1884o3233j40810j69526j34760r036P8577P6131
10489B12287N2708J8967j6504K8805J03052Q2336J0244l4729n7124m4407L1083
10478C86718R7667R7931P2510O9700Q9612J08137P6030L0030J8226J766Q026K823
10466A059176r2856k31271k80169j81931n3914O1379J27656N0717j33447k43375
10456H1965k27288j27750l3341l084j5282q7759j63296j56279p8538j096L6695
10445g75053N5382P5528J07688J30442R3963N0745Q2174J08392K7441o8525p8926
10434a90749m1068K873L7404K405n5853m3651k1632m2460r1892j45872j40756
10423g31251r1579j0161K6320k9731n0164l0640q727Q4383K23537K83058K27796
$$ y = [138756, 115561, 280526, 493060, 574944, 511711, 370901, 201375, 66615, 57579, 136156, 212287, 264995, 283962, 267458, 296263, 399315, 481651, 491895, 457166, 400042, 355635, 386718, 484385, 582316, 654826, 724526, 814138, 922275, 998305, 1028335, 1046561, 1048327, 1056353, 1059176, 966320, 735049, 454880, 272949, 219035, 280414, 408070, 458787, 325340, 81965, -145323, -273073, -306414, -309498, -324780, -412539, -575835, -732114, -810652, -811748, -775053, -719671, -644143, -536455, -406013, -312050, -261305, -179131, -70739, -43298, -111823, -190749, -231817, -228944, -191540, -189135, -244988, -288639, -310271, -352731, -444623, -590495, -731251, -822830, -832991, -806671, -836402, -886566, -917206, -925933, -841550, -618013, -334955, -107159]
10412a07159J13777R686j6326J8104M5945O4197M2020k5203p0611k6751M8315
10401I5994O7397P4581P5873m153j30703j62999r3020N7050J96408K19955J80745
10390E77128J14254M493j34465k12141k35592k01558p2637K4713L2666L3501N7881
10379a1757m270j25733j66362j53543j27730o3947l4146n3802q4956j04999p0143
10368a001388m2513j3207J07163K53023K35017O7741k2264N5744J60868J41359
10358e8457J3351n6638l1120L5825J25070J99317K14935J52216P7357M1318J1856
10347G25030r5484k02446j79162r5102k1691J9409K1114L4741P6579P8474K9549
10336C91011J8005K5600n0788j66625k16463j81038j11639j4089R4735J31945
$$ y = [-107159, 6618, 16304, -22, 18082, 64027, 128224, 170244, 145041, 74430, 47679, 95994, 163391, 237972, 313845, 309692, 178989, 15990, -77030, -19980, 176428, 396383, 577128, 691382, 695875, 561410, 349269, 113677, -87881, -160518, -135805, -103139, -69638, -11757, -16027, -141760, -308122, -461665, -589395, -653342, -687488, -741290, -826246, -931245, -1001388, -1043901, -1057108, -949945, -696922, -461905, -394164, -416428, -360684, -199816, -58457, -45106, -101744, -132864, -97039, 28031, 227348, 442283, 594499, 671856, 713174, 725030, 629546, 427100, 247938, 152836, 131145, 150554, 171668, 206409, 282988, 361462, 391011, 409016, 434616, 383828, 217203, 740, -180298, -291937, -306026, -211291, -79346]
10326g9346J33198J63120K18185J93573N6513r6706j13005N8491K49174K86323
10316A069520J74460L6043o7721j52630j89186j43082p1279m5046j6714l3704
10306E60661j19157j33706q6278o9159p9481j06044j14714j17661j25621l8057
10296d29217R2913J14015O183p7008J7978K15883L18735K45877J56130J43987
10286H05476R0106k7860q0267j02312j49373j46436o7402L5878J04312K9059j02049
10275C89132j66278k19222k63384k90441l53243l20142r3904J87121L55003L95997
10265c79361L07527R2659p9606r5239m1759o4972j39680j90690j44181K4693J51655
10254e58954J93585K37992K23467L9973j82249k86798k12641P017J68124J71124
$$ y = [-79346, 53852, 216972, 435157, 628730, 685243, 588537, 475532, 534023, 783197, 1069520, 1243980, 1280023, 1212302, 1059672, 870486, 727404, 656125, 611079, 594365, 560661, 441504, 307798, 221520, 152361, 72880, -33164, -147878, -265539, -391160, -429217, -336304, -222289, -216106, -293114, -275136, -59253, 259482, 505359, 661489, 805476, 895582, 867722, 787455, 685143, 535770, 389334, 321932, 357810, 462122, 491181, 389132, 222854, 3632, -259752, -550193, -903436, -1223578, -1317482, -1130361, -775358, -379361, -71834, 20825, -58781, -154020, -195779, -260751, -400431, -591121, -735302, -710609, -558954, -365369, -127377, 96090, 136063, -46186, -332984, -545625, -538608, -370484, -199360]
10244a99360K0956k01423k75766j14326R2846J71417J40313J71521K00692J14314
10234A21184L7581J2118o759n721J105j7057k9798l1263j9944j458n178j7065
10222C7745K5174P3759O7169N9122J8008p7754j36812o7642R0959J89356J49746
10211D28830L9328n3953p0758j16859j81585j47804o0821L5968P2080M1682J3784
10200a08J7272L6219M5103J12492K32193K81409K20964R1416k4155m6782o0709
10189I05314n7130k6177K161L9457j1978j28598j57510j26031p9248Q506R7185
10178D65951M9833q5973j62623j62377j27380k3731J22251J70014O6153j23198
10168A88920k22065j48100M6333J77714J19157l5328j61395j83776p2706J16053
$$ y = [-199360, -178404, -379827, -655593, -769919, -677073, -505656, -365343, -193822, 6870, 121184, 158765, 170883, 164124, 158403, 159508, 142451, 112653, 81390, 61446, 59988, 54810, 37745, 62919, 136678, 203847, 262969, 280977, 203223, 66411, -1231, 89728, 279084, 428830, 468158, 414205, 343447, 226588, 45003, -102801, -163622, -127654, -55574, -13892, -108, 17164, 53383, 98486, 210978, 443171, 724580, 945544, 1036960, 1012805, 966023, 905314, 848184, 822007, 824168, 863625, 851647, 723049, 565539, 439508, 360260, 368766, 465951, 515784, 429811, 267188, 104811, -22569, -46300, 75951, 245965, 312118, 188920, -33145, -181245, -134912, 42802, 161959, 126631, -34764, -218540, -291246, -175193]
10158a75193K55595K49834J58393N9799M155K7476O3979O7830J6718m8899l4727
10147F44960O1068J35989J23627Q2204N1343N7942K8039l5169o4474p2302k9252
10136I83975K1117l2844j22047r1016K577N7615J21653K19788L50936M95614N20354
10125B527722M71207M87254M91863M67150M62385N34797P02423R10858J197631
10116H253290J631089K084439K192694J700724P20284k48454q08190r57864p70411
10107A3797601l94686l7822K30672M89337Q31926J305052J885090K469444K727710
10098B3304324K161876N41012j513465k945598l417269l245271k733514k103972
10090A0048123j573176j196419r54274p97467o51978m68170l14585k78552l64912
$$ y = [-175193, 80402, 330236, 488629, 548428, 552583, 580059, 644038, 711868, 728586, 679687, 644960, 706028, 842017, 965644, 1047848, 1099191, 1157133, 1185172, 1150003, 1085529, 1013227, 983975, 1005092, 972248, 850201, 759185, 761762, 819377, 941030, 1160818, 1511754, 2007368, 2527722, 2998929, 3486183, 3978046, 4445196, 4907581, 5442378, 6144801, 7055659, 8253290, 9884379, 11968818, 14161512, 15862236, 16582520, 16334066, 15525876, 14568012, 13797601, 13402915, 13365093, 13595765, 14085102, 14917028, 16222080, 18107170, 20576614, 23304324, 25466200, 26007212, 24493747, 21548149, 18130880, 14885609, 12152095, 10048123, 8474947, 7278528, 6324254, 5526787, 4874809, 4406639, 4092054, 3813502, 3448590]
10081C448590n51696o59183n90241m08969j87969l9959m7018j10196j11739R835
10071G51455K48253L97301L38727J92684O3671o375j6781l5868o7076r4918j52228
10060A618845j80611j20965q2749j37679j73106n8803R7575J32155O3642j7891
10050A140413n4259n4944k3127j400k9513l0729j0858k7837q3291j02466o0316
10039F61673k7024j4168k5039m7335o0109q8787q7599n4410j1499Q181k3723n1954
10027A78207k6216M0097M8610Q884K0593M9049J3430l8563k2510M5348P8167J01748
10015D96844J40989R9262K126j56201l33898m03194l62861k58994q3389J77633
10005f81683L77502L19696R0664j22583k31894j99044m7769J19592J58820R0103
$$ y = [3448590, 2896894, 2237711, 1647470, 1238501, 1050532, 1010573, 963555, 853359, 741620, 751455, 999708, 1397009, 1735736, 1928420, 1992091, 1985716, 1968935, 1933067, 1865991, 1771073, 1618845, 1438234, 1317269, 1234520, 1096841, 923735, 864932, 962507, 1094662, 1158304, 1140413, 1086154, 1031210, 1008083, 1006683, 977170, 946441, 935583, 907746, 824455, 721989, 661673, 634649, 620481, 595442, 548107, 487998, 399211, 311612, 257202, 245703, 253884, 230161, 178207, 151991, 192088, 240698, 249582, 270175, 319224, 332654, 294091, 271581, 316929, 395096, 496844, 637833, 737095, 739221, 583020, 249122, -154072, -516933, -775927, -859316, -681683, -304181, 15515, 106179, -16404, -248298, -447342, -495111, -375519, -216699, -126596]
9995a26596K0939l2389r4261j16404p9808m8037l9020p9599j05848j05051j32807
9984i38881j15930L2148K28980L09901K53329J19440K6435j2600o6318j41664
9974c05160j95705j32625L4645J50432K02482K65206K44934J73415Q3484q9120
9964D31988j93127r3905M5342N4021J2831N7732J38094R0491r6592j40060R4739
9953D01554K80933J40833q8096j27195l4511K2717K649j2524j5673o2852j39801
9942C68034j63897j34348m0224O6862J15510Q4561o543l9413K9839J56534K08120
9931F45035J09909j3265o3849l3740m2757j83326k88854k61260j53266j8115Q1525
9920b21963J46217J77018J17687j3725j07034j17586r6259j06445j20671j02225
$$ y = [-126596, -105657, -138046, -232307, -348711, -428519, -476556, -515576, -595175, -701023, -806074, -938881, -1054811, -1022663, -793683, -483782, -230453, -111013, -84578, -97178, -163496, -305160, -500865, -633490, -598845, -448413, -245931, 19275, 264209, 437624, 521108, 431988, 238861, 144956, 190298, 244319, 257150, 314882, 452976, 543467, 446875, 306815, 401554, 682487, 823320, 735224, 608029, 573518, 596235, 598884, 586360, 570687, 507835, 368034, 204137, 69789, 29565, 96427, 211937, 296498, 289955, 250542, 280381, 436915, 645035, 754944, 741679, 677830, 644090, 601333, 418007, 129153, -132107, -285373, -303488, -221963, -75746, 101272, 218959, 205234, 98200, -19386, -115645, -222090, -342761, -444986]
9910d44986Q302J49700J95146J46591J04982Q9978Q3436J04982R8217O7705R0754
9899F94807R6484O579j03932j43009j04082q6352j11946j04552n1340m0495n6908
9888d746l203O2667P7386P5931P4499Q6671P2267K5085m1370j51592k26874j94915
9876a48194j17493p0458o3817p8662j24418j54989q7792L1660J51180K32584K12078
9865b18321J17698O9420P2234O7391M8973L3517J0771j4187o6244j96367l02082
9854c77197k60188j29138k6843o044K7057R5725J20833J08461J14075J06661P0826
9843a55772P5105Q5844M4133m349J0933R4753J43353J12916R9154J11714K5096
9832F42880j13317j66898j36816j07106k1574J07958J71714J92479J67984P5669
$$ y = [-444986, -436684, -286984, -91838, 54753, 159735, 249713, 333149, 438131, 536348, 604053, 694807, 791291, 797870, 693938, 550929, 446847, 360495, 248549, 143997, 92657, 52162, -4746, -7949, 54718, 132104, 208035, 282534, 369205, 441472, 466557, 425187, 273595, 46721, -148194, -265687, -336145, -399962, -478624, -603042, -758031, -845823, -814163, -662983, -430399, -218321, -100623, -31203, 41031, 108422, 157395, 190912, 201683, 187496, 121252, -75115, -377197, -637385, -766523, -793366, -799410, -772353, -676628, -555795, -447334, -333259, -226598, -155772, -80667, 5177, 49310, 44961, 55894, 150647, 294000, 406916, 506070, 617784, 642880, 529563, 362665, 225849, 118743, 97169, 205127, 376841, 569320, 737304, 812973]
9822H12973J0548j119r879r6095k21118k42224j65713n0867K2716N9728R4786
9811B13736O2248K7122J5745o4194j79006k14957j42036o5931j6655K5372O5001
9800b73555J08337J40195J02151J4704J3884J02012J24519N3100j7614o0190j14095
9789A93448j41369q9816J2272J27744K07860J85917J00568N9672J15543J47150
9779I18989Q4039K3436o092j592R4339J80236J95739J81952K31894M00759O03782
9768B907481P00062O76400O44641O36320P23932Q16335O89907L92608N5289l28855
9758G914120o77807q39279q41609p79625p23495o67719n67513n08685n15080n30388
9748A262920m88543l56580j91061l1721N4615J2173p8632j08718j11800j43685
$$ y = [812973, 823521, 822402, 812523, 716428, 495310, 253086, 87373, 36506, 59222, 118950, 213736, 275984, 303106, 318851, 254657, 75651, -139306, -281342, -347273, -363928, -338556, -273555, -165218, -25023, 77128, 91832, 105716, 207728, 332247, 385347, 367733, 307543, 193448, 52079, -37737, -25465, 102279, 310139, 496056, 596624, 656296, 771839, 918989, 1003028, 1026464, 1020372, 1018780, 1113119, 1293355, 1489094, 1671046, 1902940, 2303699, 2907481, 3607543, 4283943, 4928584, 5564904, 6288836, 7105171, 7795078, 8187686, 8242975, 7914120, 7236313, 6397034, 5555425, 4775800, 4052305, 3384586, 2817073, 2308388, 1793308, 1262920, 774377, 417797, 226736, 195015, 249630, 261803, 183171, 74453, -37347, -181032]
9738a81032j22764N1026K30682K48529J55722P276j08018r9165M037P4830N2311
9727C13434n8612j79588j62985l9066J5087n1657j06579o6807J9519P8481K8874
9716b09899p6260q1065M5877J89267K35282J49641j9749j63180k17968j41226
9706b89280M9304K04411K43529J75459K7549j30560k72738l16562j84947j3380
9696e07215O6100J08631J41484J35150Q9386O4726N5449m8396j71372k34554k79212
9685e79823k83359j48034q486r575j1586L5971O2433N2029L4648N5374J56142
9674f44266L08179L39359J57551o0463j47427j17439p0165l9273k982Q000P793
9663b61133M108j8465k7370k4026j0782M552K0756Q9348J92872K17816J31105
$$ y = [-181032, -303796, -252770, -22088, 226441, 382163, 389439, 281421, 182256, 186293, 261123, 313434, 254822, 75234, -87751, -126817, -111730, -163387, -269966, -336773, -317254, -238773, -209899, -286159, -367224, -321347, -132080, 103202, 252843, 233094, 69914, -148054, -289280, -239976, -35565, 207964, 383423, 410972, 280412, 7674, -308888, -493835, -507215, -441115, -332484, -191000, -55850, 33536, 98262, 153711, 105315, -66057, -300611, -579823, -863182, -1011216, -1019702, -1029277, -1040863, -1004892, -942459, -890430, -855782, -800408, -644266, -336087, 3272, 160823, 100360, -47067, -164506, -234671, -273944, -276926, -268926, -261133, -257025, -275490, -302860, -326886, -337668, -333116, -312360, -223012, -30140, 187676, 318781]
9652C18781j8217j01670m3560Q4520J75139J57004K7395q2376j29873j33756j08406
9641A44981j07028j18552j23468j52151j80717q4441J41172K94237K09315L9079
9631F2427n9189j16679j79181j80503q0812O3149J61414J83684J65721P7695p2940
9620B4786j96549k58501k13540q9706L3462J42798J88687J55681J49954J67926
9610A04998Q1905O466P733k2372p0284k5931Q7161J80581K11988J70076N9865
9599G92186p3182j28097j22011j81641k79324k57392j48325l7159P7742J22141
9589b35062L1730j00966j24740r3842j18821j37666n4978M8982N0323O067l0671
9578g59644n3936Q681J27265K15983K11462J54799J45562J58149J38120Q8922
$$ y = [318781, 300564, 198894, 155334, 239854, 414993, 571997, 599392, 517016, 387143, 253387, 144981, 37953, -80599, -204067, -356218, -536935, -621376, -480204, -185967, 23348, 62427, 3238, -113441, -292622, -473125, -553937, -490788, -329374, -145690, 20031, 97726, 24786, -171763, -430264, -643804, -733510, -700048, -557250, -368563, -212882, -62928, 104998, 186903, 193369, 201102, 178730, 108446, 82515, 169676, 350257, 562245, 732321, 792186, 719004, 590907, 468896, 287255, 7931, -249461, -397786, -434945, -357203, -235062, -203332, -304298, -429038, -522880, -641701, -779367, -834345, -785363, -735040, -728973, -759644, -813580, -804899, -677634, -461651, -250189, -95390, 50172, 208321, 346441, 435363]
9568D35363M8229k4432j13478q9472j0429J374k8631o6227p0737n2895n1199k6417
9556d8951j1827l7158j5921Q0347J16788R6843N6448J1030j7186p7725j56182
9545c494j95396k06359k26371k39968k13028j00592M2211R3184J03873R9173Q9550
9534g57217R2969Q7260Q2825Q0772J13080J41305J46720J15338K0692o2407q4264
9523b2927n4513P961N2486M2348l557O504P4128Q5328N0803N4730P2665N0177
9511D16133J9005J3050L8894P5803R1653R8408Q3097N086j01726j15296j0420
9500F13687Q8567P9751k7791o6827k6044m9059j09283j32003q3117j0910J8451
9489B95422K8284P6057J00490M9464O606N1539O4658k3611o6092l459M2278L9633
$$ y = [435363, 483592, 459160, 345682, 256210, 245781, 247155, 218524, 152297, 81560, 28665, -22534, -48951, -60778, -97936, -113857, -33510, 83278, 180121, 236569, 247599, 230413, 152688, -3494, -198890, -405249, -631620, -871588, -1084616, -1185208, -1142997, -1049813, -945940, -846767, -757217, -664248, -576988, -494163, -413391, -300311, -159006, -12286, 103052, 123744, 61337, -22927, -77440, -69479, -16993, 25355, 21798, 28302, 102430, 187758, 238561, 293291, 365956, 416133, 435138, 448188, 487082, 562885, 654538, 752946, 836043, 841129, 739403, 624107, 613687, 702254, 782005, 754214, 687387, 661343, 612284, 503001, 370998, 287881, 276971, 295422, 323706, 399763, 500253, 549717, 556323, 607862, 672520, 648909, 582817, 579358, 621636, 661269]
9477F61269K3584K5827N6626L6269m1054p5002l7325L5040J03179J40833J23404
9466A052650O5671k3350j05707j68117j75579j20758l2377J08148K30684K42968
9456A074233J42534j2652j37099k03330j83890j53882j50944r9769q2863j62350
9446B9988j91445j30171q6851m7977N3759J68266K17280J78588Q4469J0896J0194
9435B96996M5876J07036J46280J08385J1238q2692j13528o7954k9145p0475r2490
9424B59527n4900k8451J0822J34554K11031J28434N9706M7207k275m5347l7552
9413F82756k0035l1937o1424o0851j8004M701O957q377j4748R4922J91487J45170
9401I10617J35367J79099J63547J07916J07504J98635L56547M88676N69791O90980
$$ y = [661269, 684853, 710680, 767306, 803575, 762521, 687519, 650194, 685234, 788413, 929246, 1052650, 1118321, 1094971, 989264, 821147, 645568, 524810, 492433, 600581, 831265, 1074233, 1216767, 1204115, 1067016, 863686, 679796, 525914, 374970, 275201, 192338, 29988, -161457, -291628, -378479, -426456, -372697, -204431, 12849, 191437, 275906, 286802, 296996, 342872, 449908, 596188, 704573, 715811, 633119, 519591, 451637, 422492, 352017, 259527, 204627, 176176, 186998, 321552, 532583, 661017, 720723, 767930, 765655, 720308, 682756, 662721, 630784, 569360, 508509, 490505, 495206, 502163, 493786, 479038, 573960, 765447, 910617, 1045984, 1225083, 1388630, 1496546, 1604050, 1802685, 2159232, 2647908, 3217699, 3908679]
9391C908679Q74017Q89952N40221l7153n75024r11184r74791q90466p82569n50849
9381A490833k21421L9146J52132J33649J9631q2525q9117n2955r7712k65546l18603
9370G07512j02301J63219K15551J08116J6063j4481o3320j12954l7689J05623
9360I85339J75852J47515P8399j7792j66102l05652l50917k59858j53493q8069
9350D5222J9857J38740K41904L01221K47064J15249n5023k23259k80041j75499
9340C75435J0870J96799K93645K67982J58345Q3106O0807j5432q7759q5263q8046
9329A170489o9004j2985Q203m373k9998q0949j19532k8909J47241K44106K55872
9318A480161K30907J32000k9072j21850p1872m4787j17432j98089j68714O742
$$ y = [3908679, 4782696, 5672648, 6212869, 6175716, 5600692, 4689508, 3714717, 2824251, 2041682, 1490833, 1269412, 1308558, 1460690, 1594339, 1613970, 1531445, 1442328, 1389373, 1291661, 1026115, 707512, 605211, 768430, 983981, 1092097, 1108160, 1093679, 1030359, 917405, 879716, 985339, 1161191, 1308706, 1387105, 1369313, 1203211, 897559, 546642, 286784, 133291, 45222, 65079, 203819, 445723, 746944, 994008, 1109257, 1054234, 830975, 550934, 375435, 386305, 583104, 876749, 1144731, 1303076, 1386182, 1446989, 1431557, 1343798, 1258535, 1170489, 1101485, 1088500, 1096703, 1092330, 1062332, 981383, 861851, 832942, 980183, 1224289, 1480161, 1711068, 1843068, 1813996, 1692146, 1620274, 1575487, 1458055, 1259966, 1091252, 1097994]
9308A097994J43240J14153L3273R511j0760j01127j83817j64254n7817N8327J41206
9297A079929J93057K56833K95715K18848J37228J00039J27098K70183L87190L68449
9287C434569K35740J10588J00883J31158J33448J41363Q1276J8163N9776K06046
9277D653010L40974L80918M23598M65489N45648O90723Q16019Q34912O39160L49475
9267A0139926J75332J30666J14581J08100J10419k455j92576l57601m66018n18764
9257I241610n43765n29311n44310n73060n63414n15270m53663m26741m74630n32637
9247D084809m87868l38385k02894j64302j99916k14068j59787j09953r8486j09436
9237A999714j25746j39150j13485p1238K7476J71155K21143J83896L6691j51558
$$ y = [1097994, 1241234, 1355387, 1388660, 1398171, 1387411, 1286284, 1102467, 938213, 880396, 938723, 1079929, 1272986, 1529819, 1825534, 2044382, 2181610, 2281649, 2408747, 2678930, 3066120, 3434569, 3670309, 3780897, 3881780, 4012938, 4146386, 4287749, 4369025, 4387188, 4446964, 4653010, 4993984, 5374902, 5798500, 6263989, 6809637, 7500360, 8316379, 9151291, 9790451, 10139926, 10315258, 10445924, 10560505, 10668605, 10779024, 10776569, 10583993, 10226392, 9760374, 9241610, 8697845, 8168534, 7624224, 7051164, 6487750, 5972480, 5518817, 5092076, 4617446, 4084809, 3596941, 3258556, 3055662, 2891360, 2691444, 2477376, 2317589, 2207636, 2109150, 1999714, 1873968, 1734818, 1621333, 1550095, 1577571, 1748726, 1969869, 2153765, 2190456, 2038898]
9227B038898k09569j63421j53287k02791j41221K8951J57331J78523O8532p3654
9217A528292q2377M8634J83695J95086Q4001r91Q652P9492J57587K32251L67267
9206B801589N08006M95418K84977N961j50783j18804L5360J58776J76598J75950
9196D373048J94768K15173K70615L79440M64645M46084M27471M42065M33939M02242
9186H049490L90593M42884M63759L91475K44673Q3024p8536k76878m61520n44166
9176H704798n54235n81336o17348o36228n98873m83980k94907j46915j41504k06587
9166D442885k48390k55754k67852k56110k19422k09577k45398k52663j97346j23233
9156B167140m3979J993J7662M4820M2524m742n3632r7680j58727k73387l66166
$$ y = [2038898, 1829329, 1665908, 1512621, 1309830, 1168609, 1197560, 1354891, 1533414, 1601946, 1528292, 1445915, 1494549, 1678244, 1873330, 1957331, 1956340, 1964992, 2044484, 2202071, 2434322, 2801589, 3309595, 3805013, 4089990, 4095951, 3945168, 3826364, 3861724, 4020500, 4197098, 4373048, 4567816, 4782989, 5053604, 5433044, 5897689, 6343773, 6771244, 7213309, 7647248, 8049490, 8440083, 8882967, 9346726, 9738201, 9982874, 10065898, 9987362, 9710484, 9248964, 8704798, 8150563, 7569227, 6951879, 6315651, 5716778, 5232798, 4937891, 4790976, 4649472, 4442885, 4194495, 3938741, 3670889, 3414779, 3195357, 2985780, 2740382, 2487719, 2290373, 2167140, 2123161, 2125154, 2142816, 2187636, 2230160, 2225418, 2171786, 2074106, 1915379, 1641992, 1275826]
9145A275826l63753k69003o9207Q3165P0305J5966m2118p1993k0698O6400J38047
9134H12937J28683L0512o2595j18972k25602l43341l34866j89694q8749l3231
9124d24918J00962K60833L17678L32319L38824K73810J49869j9548j35118j30095
9114A064616r0026j32522k28770k48451j73428r3307n2800n9861p2986j8084M8658
9103e6961J04013J75220K37866K23217J13372r712j21595j70219j52391r0010
9093B52800K7566J30846J58512J02200J1202r8327j66963j84169j99284j58691
9083a24308k8365R4233J21435R5895J40576K52636L22902K34628N4440p1896j07393
9072I84783p2111k1971M3817Q5218M0680k4096r215K9053L0799N7010Q9065J8639
$$ y = [1275826, 912073, 643070, 573863, 657028, 727333, 743299, 701181, 629188, 608490, 674890, 812937, 941620, 972132, 909537, 790565, 564963, 221622, -113244, -302938, -391687, -424918, -323956, -63123, 254555, 586874, 925698, 1199508, 1349377, 1329829, 1194711, 1064616, 974590, 842068, 613298, 364847, 191419, 98112, 45312, -14549, -87535, -105619, -56961, 47052, 222272, 460138, 683355, 796727, 787015, 665420, 495201, 342810, 252800, 280366, 411212, 569724, 671924, 683126, 584799, 417836, 233667, 34383, -124308, -152673, -58440, 62995, 158890, 299466, 552102, 875004, 1109632, 1164072, 1092176, 984783, 912672, 890701, 934518, 1019736, 1060416, 1036320, 1027105, 1056158, 1086957, 1143967, 1233032, 1251671]
9060A251671j09666j79479j92022j76167j74112k03344j96745q3025K4794P836
9050c0259o5622n8833j8252l2653L653J05349J61232J15624J8535q7014j29389
9039a7629p1985J1754R3612J44524R6131r209j40973k59119k87272k16623j11016
9028g67805m3620K2230J28434J86976J68443J37416J06213K7817k2534l7413j14559
9017b08402k02419k27068k20826j92005r4421Q0378K45334K79816J93453J35994
9007b10166R4770l2309j66621k56185k67175j91362o7447J11073K85506L25811
8997c74105K17954J53163J80117J94246J45002J04872Q1264k5625j58381j26978
8987C91529n0219r9846j86615k03647j34318j4901O5486J7587j24914k04807j47877
$$ y = [1251671, 1142005, 962526, 770504, 594337, 420225, 216881, 20136, -62889, -38095, -30259, -95881, -154714, -172966, -205619, -201966, -96617, 64615, 180239, 198774, 111760, -17629, -89614, -77860, 15752, 160276, 256407, 247198, 106225, -152894, -440166, -656789, -767805, -811425, -789195, -660761, -473785, -305342, -167926, -61713, -33896, -56430, -93843, -208402, -410821, -637889, -858715, -1050720, -1145141, -1064763, -819429, -539613, -346160, -210166, -115396, -147705, -314326, -570511, -837686, -1029048, -1096495, -985422, -699916, -374105, -156151, -2988, 177129, 371375, 516377, 621249, 702513, 676888, 518507, 391529, 341310, 241464, 54849, -148798, -283116, -298017, -232531, -214944, -339858, -544665, -692542]
8976f92542l3921m963j060O6219J33885J99394J94593Q3335J6918L6043M1799
8965C9700l1754j36586j00908K6003N2255K1555L8239M7192M8705O6734N9247
8954A30382L5231P2111R4598R7444J30285J53827J56949J60137K39564L46523
8944A617051L54383K34899K9791j52757k79350l79784m50543l83301j83392m3078
8934C63919k8717p5024j09848n7536M9954R7426M4004j4158K5034P5930P443r1244
8922B87183j52663j73836q7724M4721J00868P8237O8108J16980J61352R4516m8370
8911D89372p2085K4983Q4735R8027J15654O9682o2647j65295j60888j26833j20862
8900A73843j38058j16434l551R2375L9594q3676j38348r9316l4745J3010M6448
$$ y = [-692542, -726463, -731426, -732486, -666267, -532382, -332988, -138395, -55060, -38142, -2099, 39700, 7946, -128640, -229548, -203545, -151290, -129735, -91496, -44304, 4401, 71135, 130382, 165613, 237724, 332322, 429766, 560051, 713878, 870827, 1030964, 1270528, 1617051, 1971434, 2206333, 2236124, 2083367, 1804017, 1424233, 973690, 590389, 406997, 363919, 335202, 260178, 150330, 92794, 142748, 240174, 284178, 270020, 295054, 370984, 378427, 287183, 134520, -39316, -127040, -82319, 18549, 96786, 164894, 281874, 443226, 537742, 489372, 417287, 442270, 527005, 625032, 740686, 810368, 747721, 582426, 421538, 294705, 173843, 35785, -80649, -84200, 8175, 47769, -35907, -174255, -273571, -308316, -295306, -248858]
8889b48858J06134J73187J47467O6278M0221M3322J49r9515j86616j45297n700
8878a09228P2383P5137J30945K39526K53916J83752N6355r9808j80727j54918
8868D67333m6972N8131R6683M5326n8960j05837q9692j03705j11381j05441j15496
8857g0011j16318j34260j67808j26416J835R9058J35212J45129J55207J65047
8847H6675J08352K9420p777k0269p937L9288J31547J79193J13815j5444q5150
8836E51713r9593j25367q9944r154L2796M0392K4674j258P329J4957q1751k02847
8824F1947j38727K3691O1395J1560P363M4005P0463L8423J6902J7700j9474o1484
8812A33764n6428P326M2604p145p1976q3839j1718Q2963J59662J70341N3354n9925
$$ y = [-248858, -142724, 30463, 177930, 244208, 284429, 327751, 327900, 228385, 41769, -103528, -109228, -36845, 38292, 169237, 408763, 662679, 846431, 902786, 802978, 622251, 467333, 420361, 478492, 575175, 620501, 561541, 455704, 366012, 262307, 150926, 45485, -70011, -186329, -320589, -488397, -614813, -612978, -513920, -378708, -233579, -78372, 86675, 195027, 224447, 216670, 196401, 188464, 227752, 359299, 538492, 652307, 636863, 551713, 452120, 326753, 236809, 227655, 260451, 300843, 325517, 324259, 331588, 346545, 264794, 61947, -76780, -53089, 8306, 19866, 27229, 71234, 141697, 180120, 197022, 214722, 195248, 133764, 77336, 84662, 127266, 120121, 48145, -35694, -47412, 35551, 195213, 365554, 418908, 358983]
8800C58983n9876l8424j9464O4144J77909K14695J31525j5386j31949k22489l04415
8789A55253l27206k50045j71526j39719q9137Q956J30558K08951J60969L5061
8779b77885o7403j08275r3764m5078m6106j19157j20123K8650K12086K95033K62913
8768g9109J82836J14392J9657n5595p423M3879j6002j03433j37482p0336Q9334
8757a9282K27926K70416K06778K8221k05207l06984k67831k29309j74888r6280
8747e66440n0940j2570P3650J75212J77163N6316l1465Q63J8357j0265L4387J33466
8735b266K32612K82968J69402j00621k87860k95178k02776o0570Q0770J44237
8725c9282J18333Q5314O0283O8053J39315J71459J46318J47987P0694p2207j40457
$$ y = [358983, 299107, 260683, 241219, 305363, 483272, 697967, 829492, 814106, 682157, 459668, 155253, -171953, -421998, -593524, -733243, -822380, -813424, -682866, -473915, -312946, -277885, -345288, -453563, -547327, -592405, -638511, -757668, -877791, -849141, -637055, -342022, -79109, 103727, 218119, 237776, 182181, 174758, 218637, 202635, 99202, -38280, -108616, -19282, 208644, 479060, 685838, 714059, 508852, 201868, -65963, -295272, -470160, -566440, -617380, -629950, -556300, -381088, -203925, -147609, -179074, -178211, -159854, -170119, -135732, -2266, 230346, 513314, 682716, 582095, 294235, -943, -203719, -264289, -183519, -39282, 79051, 164365, 224648, 292701, 432016, 603475, 749793, 897780, 968474, 896267, 755810]
8714G55810j60450j71275j33277p7584o8929o7360n8842j6332Q244j9758m1134
8703e0887m8535l7219M5969K02437K42481J01354m4878j01517r4879l5668N8982
8692B37640J51378K06134J23030O522J6438Q4183O7561k1203o9850r0523n4647
8681F56663P2751J24476J9932r7946q5548O171M6900k5305j34054k07681k02095
8670A74264j40175q5637m5157l0358m9519n1031J8433J24235K49647L35825K96769
8659G97296K24180K20776J74370j0844j81638k09842j37321l84Q9945P3211M7329
8648A087078M1688P59m6933n1421l2847k4973o1646q3969r1932j24825j27861
8637D83118p5531n4680r9435q8239P2819L34842N12128M78633K85236J04589M1552
$$ y = [755810, 595360, 424085, 290808, 213224, 144295, 76935, 18093, 1761, 10005, -9753, -50887, -99422, -136641, -90672, 111765, 354246, 455600, 410722, 309205, 214326, 178658, 237640, 389018, 595152, 718182, 724704, 741142, 825325, 892886, 871683, 801833, 711310, 656663, 729414, 853890, 873822, 775876, 690328, 696499, 743399, 718094, 584040, 376359, 174264, 34089, -51548, -96705, -127063, -176582, -227613, -209180, -84945, 164702, 500527, 797296, 1021476, 1242252, 1416622, 1405778, 1224140, 1014298, 876977, 876593, 966538, 1039749, 1087078, 1128766, 1129525, 1082592, 1031171, 998324, 973351, 911705, 827736, 735804, 610979, 483118, 407587, 352907, 253472, 165233, 238052, 572894, 1085022, 1563655, 1848891, 1953480, 1995032]
8626A995032k265j24154k24930k51456k42535j44345K3855J79695K52170K18056
8616A679123J53004N6449r2719k13856k34111j60400j07534j65485k12236j33275
8606E68960N036N6629N458j13636j97796j46782K7181J79630J74219R4600P4409
8595G27908N1215n9332r1725j083R6957J46121J66073J16183m9329j17187K7190
8584A012991J17176N0712R93m438p5014j67475k11645j91318n9774K2824o6519
8573D28513j48307r9513K355K8449n320n932l766k5583n1179L1534K38178L45821
8561G35250K89123J57419k5336j98215k54772j39520J8038O5101N8266N4015K4977
8550G84346k7705k6281K166m8151j27662j14299m3686p656m2216r9368o5420M8448
$$ y = [1995032, 1992767, 1868613, 1643683, 1392227, 1149692, 1005347, 1029202, 1208897, 1461067, 1679123, 1832127, 1888576, 1795857, 1582001, 1347890, 1187490, 1079956, 914471, 702235, 568960, 573996, 630625, 636083, 522447, 324651, 177869, 205050, 384680, 558899, 653499, 727908, 779123, 719791, 628066, 626983, 723940, 870061, 1036134, 1152317, 1102988, 985801, 1012991, 1130167, 1180879, 1181872, 1177434, 1102420, 934945, 723300, 531982, 472208, 495032, 428513, 280206, 180693, 183048, 211497, 206177, 200245, 196479, 170896, 119717, 151251, 389429, 735250, 1024373, 1181792, 1156456, 958241, 703469, 563949, 581987, 647088, 705354, 759369, 784346, 756641, 730360, 732526, 684375, 556713, 442414, 398728, 391072, 348856, 249488, 184068, 232516]
8538B32516J49990K04918K10303J39842J330j71124k97061k79065j53654K4671
8528F2666J77674K23421K24538K15792J41612N9025k4060j17566j28442r6079
8518G38581p5005l9421n6511j52047j60233n8963k393K392O1710J46915J45729
8507E50754P3406N7510R8693J11386M9764m8862q0398k9118j4681l1219j5160
8496G22075J2092J7407j864m0270p2422r6087l9729J29638K38985J80484N1830
8485A102139n0j6730j12052j91237j42985l2421J01475K03869J31309o5312j27326
8474H50679l6654L8706J401j17273k09302k47494j75990K7630K40869L06253K37472
8463I16297R9811m7308j04923r6043n1960J8j5597j09563j51799q8965l1039n0213
$$ y = [232516, 382506, 587424, 797727, 937569, 938899, 767775, 470714, 191649, 37995, 62666, 240340, 463761, 688299, 904091, 1045703, 1104728, 1080668, 963102, 834660, 738581, 663576, 624155, 567644, 415597, 255364, 196401, 194008, 196400, 258110, 405025, 550754, 624160, 681670, 780363, 891749, 941513, 892651, 812253, 783135, 768454, 737235, 722075, 734167, 751574, 749710, 709440, 637018, 540931, 501202, 630840, 869825, 1050309, 1102139, 1102089, 1085359, 973307, 782070, 639085, 606664, 708139, 912008, 1043317, 978005, 850679, 814025, 852731, 854132, 736859, 527557, 280063, 104073, 131703, 372572, 678825, 916297, 1016108, 968800, 863877, 767834, 715874, 715892, 700295, 590732, 438933, 349968, 318929, 268716]
8451B68716n8462N148j2042j40086j43189J3183J51606K17579K26701J25843m9646
8440F05351k10693l07643k77116j36978K7399J22348J08450J31125K27034L12292
8430F01569L35877L04926K75615K16355J04747K2280n267k1699l8629j1093O5232
8419A849913R7315N0383k6333p3040j08297j50199j49110j07240j05807j61987
8409A115598j99516j29859K0922J73850K61430J97223L9197m7415m5628L0262
8399A416064J93711K17870k8374k64259l34610l12106k82768k74124k01115q4744
8389D5545j2504L2492N7972J42672K63933K59065J12786P835M3310Q9612K1460
8378A064178k0853j5737m2069J3233J05714J33895J41388J52077J23922R6137
$$ y = [268716, 210254, 215402, 203360, 63274, -79915, -66732, 84874, 302453, 529154, 654997, 605351, 394658, 87015, -190101, -327079, -299680, -177332, -68882, 62243, 289277, 601569, 937446, 1242372, 1517987, 1734342, 1839089, 1861369, 1856102, 1834403, 1795774, 1784681, 1849913, 1947228, 1997611, 1971278, 1898238, 1789941, 1639742, 1490632, 1383392, 1277585, 1115598, 916082, 786223, 807145, 980995, 1242425, 1439648, 1478845, 1431430, 1385802, 1416064, 1609775, 1827645, 1799271, 1535012, 1200402, 888296, 605528, 331404, 130289, 45545, 33041, 65533, 123505, 266177, 530110, 789175, 901961, 909796, 953106, 1042718, 1064178, 1043325, 1027588, 985519, 998752, 1104466, 1238361, 1379749, 1531826, 1655748, 1751885]
8368A751885J18564J38420P7379o3014j94798k86361l08433k82799k63599k42861
8358D44383j82214k8948J50946K14583J81313N1689j16159j31349L53J60381K03910
8347I48888P5071q7080j11173r034Q0503J07179P4194j3169n6845m8041q91P2769
8335A032371J25405J63020J61804J43523J51853J17372P7258P5364M687j45541
8325A907116k44369j99328n2539L1763l6689j44233j56727r0864l4561J3139P0850
8314A063558J34227K17118K08806J46928R0510k0471j03814j34099j25079n0757
8304A426927O4117J57346K35512L19873K90961J14360j01230k53683k59017j62052
8294A833114q5617r9768j16975k7338R4501J27515N4749l7878j16476k17504k73592
$$ y = [1751885, 1870449, 2008869, 2086248, 2023234, 1828436, 1542075, 1233642, 950843, 687244, 444383, 262169, 233221, 384167, 598750, 780063, 831752, 715593, 584244, 584597, 744978, 948888, 1023959, 936879, 825706, 816672, 897175, 1004354, 1078548, 1065379, 1008534, 960493, 959602, 1032371, 1157776, 1320796, 1482600, 1626123, 1777976, 1895348, 1972606, 2047970, 2052657, 1907116, 1662747, 1463419, 1410880, 1442643, 1405954, 1261721, 1104994, 1014130, 979569, 992708, 1063558, 1197785, 1414903, 1623709, 1770637, 1861147, 1840676, 1736862, 1602763, 1477684, 1426927, 1491044, 1648390, 1883902, 2203775, 2494736, 2609096, 2507866, 2254183, 1995166, 1833114, 1747497, 1647729, 1530754, 1503416, 1597917, 1725432, 1780181, 1742303, 1625827, 1408323, 1134731]
8283A134731j75571l8207P0198K05923K77629K34178O5520q4348o5170J0885K9408
8272A665176k1365j11551j44473o7846K3793M8332L2764M467L7287Q1318K3349
8261A571251p8719j25269j09760q4586k223J42747K39343K44414K72225K41960
8251B311383J7182k05558k92050k33796m3731J38866J87837J38673Q4238N3589
8241B156633O0122L8778q6363k14512j96802m9987L1439J6542N297M0290J16285
8230A917722K32736L45413L79619L08778K25631J82556L8835j64727k56266j79818
8220C030479o7403k0169o6027j35409j59502k24747k64871j40569J30369L32467
8210B414618K83209Q0427j32926k57011k56443k49018k56374j85391l8703O9010
$$ y = [1134731, 959160, 920953, 991151, 1197074, 1474703, 1708881, 1774401, 1690053, 1624883, 1635768, 1665176, 1643811, 1532260, 1387787, 1319941, 1343734, 1392066, 1424830, 1429297, 1466584, 1547902, 1571251, 1492532, 1367263, 1257503, 1172917, 1170694, 1313441, 1552784, 1797198, 2069423, 2311383, 2328565, 2123007, 1830957, 1597161, 1553430, 1692296, 1880133, 2018806, 2103044, 2156633, 2216755, 2255533, 2169170, 1954658, 1757856, 1707869, 1739308, 1755850, 1761147, 1801437, 1917722, 2150458, 2495871, 2875490, 3184268, 3409899, 3592455, 3631290, 3466563, 3210297, 3030479, 2963076, 2942907, 2876880, 2741471, 2581969, 2357222, 2092351, 1951782, 2082151, 2414618, 2697827, 2778254, 2645328, 2388317, 2131874, 1882856, 1626482, 1441091, 1402388, 1471398]
8200A471398R5594J24510J80743K00652K14584K26265J54578N5871M2122K7563
8190B793880o2948j30732j30038m9961J0078j6068l7602J1411R7816J63237J60106
8179B809179J40757J78536K79584L67770L87364L81541L92135M71256O03967P48799
8169F760888Q79698R99266J161694J434730J908666K491728K885042K835418K162566
8160B3519696P90141q75376k134330k636979k547342k230692j901441j553622
8152A0430055j163128q54172o60853n12865l70664k80072k74156k97773k39336
8143E777036q1521K9889L5104L0949R8236K11210K82799L03072K67553K25630
8133G179957K09347J43906J29871K29571L39304M48182N59035O15089P58172J119251
$$ y = [1471398, 1566992, 1691502, 1872245, 2072897, 2287481, 2513746, 2668324, 2724195, 2766317, 2793880, 2730932, 2600200, 2470162, 2420201, 2430279, 2414211, 2376609, 2388020, 2485836, 2649073, 2809179, 2949936, 3128472, 3408056, 3775826, 4163190, 4544731, 4936866, 5408122, 6012089, 6760888, 7640586, 8639852, 9801546, 11236276, 13144942, 15636670, 18521712, 21357130, 23519696, 24309837, 23434461, 21300131, 18663152, 16115810, 13885118, 11983677, 10430055, 9266927, 8412755, 7751902, 7239037, 6868373, 6588301, 6314145, 6016372, 5777036, 5695515, 5725404, 5760508, 5791457, 5889693, 6100903, 6383702, 6686774, 6954327, 7179957, 7389304, 7533210, 7663081, 7892652, 8231956, 8680138, 9239173, 9854262, 10612434, 11731685]
8123A1731685J594669J968692K120047K039290J696799J067132J67497q40351
8115B1545460j632437j974727j953229j737752j490750j331054j240104j120809
8107I064598q98828o52605m56779m17356m58756m02344k67441j43725j19097j88931
8097E058736k50210k29942j07396J3613O5131Q2406M4606k9469r2829j01167q1004
8086D372475j26307k08250k45262j67032n5852l8670o1495l2872M1621N9363o877
8075C530842r5149j02353m5811N0410J50833K05650K07691K10323K55454K50960
8065D618850J40627n434p1498k1741J20520J83989R7392O309l7747p3473r0108
8054D867686q8684l5708L1776j6892r5272q2553p054R8111J94862K29798J75625
$$ y = [11731685, 13326354, 15295046, 17415093, 19454383, 21151182, 22218314, 22385811, 21545460, 19913023, 17938296, 15985067, 14247315, 12756565, 11425511, 10185407, 9064598, 8165770, 7513165, 7056386, 6639030, 6180274, 5777930, 5510489, 5366764, 5247667, 5058736, 4808526, 4578584, 4471188, 4484801, 4549932, 4632338, 4676944, 4647475, 4554646, 4453479, 4372475, 4246168, 4037918, 3792656, 3625624, 3569772, 3531102, 3469607, 3436735, 3478356, 3537719, 3530842, 3435693, 3333340, 3287529, 3337939, 3488772, 3694422, 3902113, 4112436, 4367890, 4618850, 4759477, 4754043, 4682545, 4660804, 4781324, 4965313, 5062705, 5069014, 5031267, 4957794, 4867686, 4779002, 4743294, 4775070, 4758178, 4662906, 4580353, 4573299, 4671410, 4866272, 5096070, 5271695]
8043E271695N5738p2305q9149M6695J29366M6939n7100m1169L5379O9324N9203
8032E454616O9543J54838J65235P1127M1648O7173M8224j6519p8195r1270l8963
8021E847457N9181J64820K27161K48556K20464J18778L8671O0047J82293L78982
8011G546410N49223O44691P14784Q84579J147692J367950J479160J524696J564943
8002A7424128J623813J793449K110866K486519K835152L174578L503305L752782
7994C8704592L758890L414182K800091J948984Q46281l56958j381243k158469
7986D7576350k696162k908975k792341k506268k203961j938280j679139j310170
7978B9541054q58757n07950k83831q2296N0674N4347K5065q5644l68133p12765
$$ y = [5271695, 5327433, 5255128, 5165979, 5212674, 5342040, 5388979, 5331879, 5290710, 5326089, 5395413, 5454616, 5524159, 5678997, 5844232, 5915359, 5957007, 6024180, 6072404, 6055885, 5977690, 5886420, 5847457, 5906638, 6071458, 6298619, 6547175, 6767639, 6886417, 6925088, 6985135, 7167428, 7546410, 8095633, 8740324, 9455108, 10339687, 11487379, 12855329, 14334489, 15859185, 17424128, 19047941, 20841390, 22952256, 25438775, 28273927, 31448505, 34951810, 38704592, 42463482, 45877664, 48677755, 50626739, 51473020, 51116062, 49734819, 47576350, 44880188, 41971213, 39178872, 36672604, 34468643, 32530363, 30851224, 29541054, 28682297, 28174347, 27890516, 27808220, 27858894, 27913241, 27938306, 27852662, 27484529, 26771764]
7968B6771764r33192j009566j040537j028312r35945p65890n89496m35750k69438
7959A9763638q4794O4294J48000K67537M52112N83876P51917J113780J601215
7950B4661575K045778K358720K657061L157042L810849M548458N445037O515236
7942E5199756P749288R047429J0262435J1279515J1875608J1708283J0539794
7935A27662108Q328176N169815J368420k568915o086374q789730j0499239j1131028
7927A03453233j0826940r996802q886852p647798o515157n484366m529749l700274
7919D5865295l012647k440751j983183j689645j499542j233502r07216o67656
7911C2431153n23790m54287n15530o25529p00127o81227n00791j96842J15378
$$ y = [26771764, 25838572, 24829006, 23788469, 22760157, 21824212, 21058322, 20468826, 20033076, 19763638, 19678844, 19743138, 19891138, 20158675, 20610787, 21194663, 21946580, 23060360, 24661575, 26707353, 29066073, 31723134, 34880176, 38691025, 43239483, 48684520, 55199756, 62949044, 71996473, 82258908, 93538423, 105414031, 117122314, 127662108, 135990284, 141160099, 142528519, 139959604, 133873230, 125083500, 114584261, 103453233, 92626293, 82629491, 73742639, 66094841, 59579684, 54095318, 49565569, 45865295, 42852648, 40411897, 38428714, 36739069, 35239527, 34006025, 33098809, 32431153, 31907363, 31453076, 30937546, 30312017, 29611890, 28930663, 28429872, 28233030, 28348408]
7902B8348408L87856O88491J055092J415166J666424J831669K060139K452126
7894C9905371L046957L749991M440496N214487O154204P370243Q989763J0943876
7886H9815388J3205371J5733464J8341668K0829011K2963736K4276157K4043772
7879B29208567K1759121J7258484J0773746L070675m786141j1698872j6860745
7872B48724835j9871066k0859783k0389310j9116199j7583800j6160530j4793863
7865A19950284j3175164j1313396r459929p679763o103819m945585m131671l482665
7857E9658292k913475k419521k043923j843079j720892j566623j488507j471949
7849D4190323j332661j058241p10074l63540j9056K56998M80685Q03109J270821
$$ y = [28348408, 28736264, 29424755, 30479847, 31895013, 33561437, 35393106, 37453245, 39905371, 42952328, 46702319, 51142815, 56357302, 62511506, 69881749, 78871512, 89815388, 103020759, 118754223, 137095891, 157924902, 180888638, 205164795, 229208567, 250967688, 268226172, 278999918, 282070593, 277284452, 265585580, 248724835, 228853769, 207993986, 187604676, 168488477, 150904677, 134744147, 119950284, 106775120, 95461724, 86001795, 78322032, 72218213, 67272628, 63140957, 59658292, 56744817, 54325296, 52281373, 50438294, 48717402, 47150779, 45662272, 44190323, 42857662, 41799421, 41089347, 40725807, 40706751, 40963749, 41444434, 42247543, 43518364]
7840D3518364J794061K339883K845444L272867L788200M561054N551871O774942
7832G4446686Q325851J0261760J2649734J5337657J8182047K1169804K4095524
7825A84469063K6544387K7899305K7400901K4549366J9273375J1840542K910266
7818C24887205o403950j4840424k1335726k5345244k6865977k6369994k4549191
7811A79176699k1948884j9090618j6354310j3825846j1599924r773877q246134
7804G8337106o866676n619014m541116l651712l026864k637263k412634k276471
7796D7305356k083417j847771j657525j473233j233970r52234o24769k66912J1647
7787C7177172J84226L66401O38512R38651J231503J578458K055571K628079L325557
$$ y = [43518364, 45312425, 47652308, 50497752, 53770619, 57558819, 62119873, 67671744, 74446686, 82772537, 93034297, 105684031, 121021688, 139203735, 160373539, 184469063, 211013450, 238912755, 266313656, 290863022, 310136397, 321976939, 324887205, 318483255, 303642831, 282307105, 256961861, 230095884, 203725890, 179176699, 157227815, 138137197, 121782887, 107957041, 96357117, 86583240, 78337106, 71470430, 65851416, 61310300, 57658588, 54631724, 51994461, 49581827, 47305356, 45221939, 43374168, 41716643, 40243410, 39009440, 38057206, 37432437, 37165525, 37177172, 37361398, 37727799, 38366311, 39304962, 40536465, 42114923, 44170494, 46798573, 50124130]
7778E0124130M182031N133542O110903P244972Q781219J0742209J2932496J5228458
7770A20479960J7653775K0111752K2213589K3426170K3093371K0738432J6290149
7763B64007198R934208K173499n929959j3114224j8478941k1669068k2839150
7756A94083563k2409212k0893944j8815947j6477949j4068948j1879648j0074173
7749G9463742q514940p137425n986748n028532m278972l729703l282597k811714
7741C8693111k348803j960477j690055j528718j443873j342673j197995j050659
7733B6129858r00272p39523n28227l25085k08564q7004J70173M79993P41382J006750
7723B5739481J291398J614752K016150K427410K888270L510714M243683N100587
$$ y = [50124130, 54306161, 59439703, 65550606, 72795578, 81576797, 92319006, 105251502, 120479960, 138133735, 158245487, 180459076, 203885246, 226978617, 247717049, 264007198, 273941406, 276114905, 270184946, 257070722, 238591781, 216922713, 194083563, 171674351, 150780407, 131964460, 115486511, 101417563, 89537915, 79463742, 70948802, 63811377, 57824629, 52796097, 48517125, 44787422, 41504825, 38693111, 36344308, 34383831, 32693776, 31165058, 29721185, 28378512, 27180517, 26129858, 25229586, 24490063, 23961836, 23636751, 23428187, 23341183, 23511356, 23991349, 24732731, 25739481, 27030879, 28645631, 30661781, 33089191, 35977461, 39488175, 43731858, 48832445]
7715D8832445O222816P533335Q845309J0101664J1191183J1766018J1466899J0130570
7707A26090239P751342M480725O01811l421432o998170r646092j1131549j1506077
7699I6220797j1083875j0253575r280728q219716p107138o063345n104992m278554
7691C4828874l705765l254247k749730k208152j691744j323689j201151j194168
7683A7500228j117683r94491q91684q02569o47915n10970m96973m57909l14299
7674A1265735k37579k68009k81778k67555k61515k07299j5056K18365M23046O50005
7664A1018360P82929Q10166R39594J177302J406899J664358K003142K390747K813140
7655B5006637L239007L555100L670319L487717K990281K308059J393896K55074
$$ y = [48832445, 55055261, 62588596, 71433905, 81535569, 92726752, 104492770, 115959669, 126090239, 133841581, 138322306, 138924117, 135502685, 128504515, 118858423, 107726874, 96220797, 85136922, 74883347, 65602619, 57382903, 50275765, 44212420, 39107428, 34828874, 31123109, 27868862, 25119132, 22910980, 21219236, 19895547, 18694396, 17500228, 16382545, 15388054, 14496370, 13693801, 13045886, 12534916, 12037943, 11580034, 11265735, 11028156, 10760147, 10478369, 10210814, 9949299, 9742000, 9726944, 9945309, 10368355, 11018360, 11801289, 12611455, 13551049, 14728351, 16135250, 17799608, 19802750, 22193497, 25006637, 28245644, 31800744, 35471063, 38958780, 41949061, 44257120, 45651016, 45906090]
7647D5906090r36484k019224k904126l566134l927614l898136l564367l132255
7639B1957750k713019k297976j906960j668960j526512j343020j135745q93527
7631H472031o62756n13876m30854l38115k32323j82648j80065k42246l37464l66195
7621D985489k77642j08413R569o268j40954l14417m13236l83160k71461j31305
7611B948202n4229j03204k33248l41403l61974k70419j55044j48307j92648j76312
7601I11414j2961K34262L91734M15340L67376L24722K03448O1698M8556P5644
7591C021233N1039j2652k7444P2042K77538M26887L82364K32994J56168J73141
7581D753310J88695J84166J60424Q7878J4761j0738J9501J36047K54733K39541
$$ y = [45906090, 44969606, 42950382, 40046256, 36480122, 32552508, 28654372, 25090005, 21957750, 19244731, 16946755, 15039795, 13370835, 11844323, 10501303, 9365558, 8472031, 7809275, 7295399, 6864545, 6526430, 6294107, 6111459, 5931394, 5689148, 5351684, 4985489, 4707847, 4599434, 4609003, 4602735, 4461781, 4147364, 3734128, 3350968, 3079507, 2948202, 2893973, 2790769, 2557521, 2216118, 1854144, 1583725, 1428681, 1280374, 1087726, 911414, 898453, 1132715, 1524449, 1939789, 2307165, 2631887, 2835335, 2897033, 2945589, 3021233, 3072272, 3059620, 3032176, 3104218, 3381756, 3808643, 4191007, 4424001, 4580169, 4753310, 4942005, 5126171, 5286595, 5374473, 5389234, 5378496, 5397997, 5534044, 5788777, 6028318]
7571F028318J54245J03573J16646K55126M19287M91377N01282N29166N96078N47451
7561I742549L46276K08641L20492O64227J010835J199699J219209J245680J426817
7552A7384425J607760J818476K194603K658167L080180L477105L888968M220716
7544D0330400M465891M659867M742773M545982L945811K921338J605582J17726
7536F7335370j375197k589036l435604m034923m411221m496710m356126m127701
7528C8508852l870256l511578l046604k670310k481833k391089k203152j787253
7520A6546777j253368q75980p92582q31584p70035n66181l83349l52592m39371
7511A0281735n17886n23701m47538l39002k12689j05318j06184j78940k85103
$$ y = [6028318, 6182563, 6286136, 6402782, 6657908, 7077195, 7568572, 8069854, 8599020, 9195098, 9742549, 10088825, 10297466, 10617958, 11282185, 12293020, 13492719, 14711928, 15957608, 17384425, 18992185, 20810661, 23005264, 25663431, 28743611, 32220716, 36109684, 40330400, 44796291, 49456158, 54198931, 58744913, 62690724, 65612062, 67217644, 67335370, 65960173, 63371137, 59935533, 55900610, 51489389, 46992679, 42636553, 38508852, 34638596, 31127018, 28080414, 25410104, 22928271, 20537182, 18334030, 16546777, 15293409, 14417429, 13624847, 12793263, 12023228, 11457047, 11073698, 10721106, 10281735, 9763849, 9240148, 8792610, 8453608, 8240919, 8135601, 8029417, 7850477, 7565374]
7502G565374m29770n20708m67815l05476k63791m01844m13520k16246r347Q7155
7492D624012M4478j29977k61019k12167o7761K5747J7737r1345k33020l45829
7482C370856l98534l69044k68899j62011j28797j93017k70470k73689k15148n6385
7472A034862Q9936J11711J15334J79847K37539J57985L8991j9643o3583p9891
7462A803088j12836k37832l17081k40265j25328m408J62012K94492L13292K55870
7452A791004K32291K57196K17136O9157p0361j46033j65481j48868j21994j38262
7442A775785j93763j65955l0276Q5737N9289k1203k5Q8778J12355M2647p1633
7431A681736o8118R53o3067j71680q2882J08659J93258J18360m7993j06022l0627
$$ y = [7565374, 7135604, 6614896, 6147081, 5841605, 5577814, 5175970, 4762450, 4546204, 4536857, 4624012, 4668490, 4538513, 4277494, 4065327, 3997566, 4023313, 4041050, 3949705, 3716685, 3370856, 2972322, 2603278, 2334379, 2172368, 2043571, 1850554, 1580084, 1306395, 1091247, 1034862, 1124798, 1236509, 1351843, 1531690, 1769229, 1927214, 1966205, 1946562, 1882979, 1803088, 1690252, 1452420, 1135339, 895074, 769746, 765338, 927350, 1221842, 1535134, 1791004, 2023295, 2280491, 2497627, 2566784, 2496423, 2350390, 2184909, 2036041, 1914047, 1775785, 1582022, 1416067, 1385791, 1471528, 1530817, 1509614, 1509589, 1598367, 1710722, 1753369, 1681736, 1613618, 1614571, 1551504, 1379824, 1296942, 1405601, 1598859, 1717219, 1669226, 1563204, 1532577]
7420A532577L7286J10869J64480J35074J21817J42339J46138J67815J31959M8328
7410B738682L9384M8503k0011j45934j78935o4684J09207K61176L53909M01205
7400C542502M47646M87213M54447L49993K89846K86460L12156M23180N82040O93774
7390G869257P86718R00265R94580J034253J066332J091997J068584R97905Q22676
7381A6632567N58595K86818K4564j59601k16141k86529n61228r30551j128690
7372A4219804j091334r89050r17804q48439p54292o41775n67551n18160n60147
7363G331252o66657o64605n81462m89293l65459j83827Q774P5028M2767N7428
7353D563946Q7182j0108j64255k68703l27623k87864j11064N3697R4952J46797
$$ y = [1532577, 1569863, 1680732, 1845212, 1980286, 2102103, 2244442, 2390580, 2558395, 2690354, 2738682, 2778066, 2826569, 2806558, 2660624, 2481689, 2417005, 2526212, 2787388, 3141297, 3542502, 3990148, 4477361, 4931808, 5281801, 5571647, 5858107, 6170263, 6593443, 7175483, 7869257, 8655975, 9556240, 10550820, 11585073, 12651405, 13743402, 14811986, 15809891, 16632567, 17191162, 17477980, 17502544, 17342943, 17126802, 16840273, 16279045, 15348494, 14219804, 13128470, 12139420, 11221616, 10373177, 9618885, 8977110, 8409559, 7891399, 7331252, 6664595, 5999990, 5418528, 4929235, 4563776, 4379949, 4388723, 4463751, 4506518, 4563946, 4651128, 4641020, 4476765, 4208062, 3880439, 3592575, 3481511, 3535208, 3630160, 3776957]
7343C776957K53397K45449Q6300j13347k21729k46928k72933k91812k50423k45884
7333B719047k92605k74646k07730j52676j08833k4041J01385J45846N8885n9963
7323A904669j06448q8259K4563K47514L62894J84428n1263j26411j22706j35771
7313B093210j29971j9236J44171J57113R0j27786j33317n3896K2119M3871j1093
7302A985275l8792L8632J56317J72221J10841R9485J77403K09825J27297Q0142
7292C118646R5792Q7995N3203L6772L6614L4751L2233q367k9899L8019J18650
7281C614409J74615K09553J93233J58560J24886Q9085J11030J54548J92537L56949
7271E379405O00229P20372O49729L94127J00669K2847P6041P6691J06258K91248
$$ y = [3776957, 4030354, 4275803, 4362103, 4248756, 4027027, 3780099, 3507166, 3215354, 2964931, 2719047, 2426442, 2151796, 1944066, 1791390, 1682557, 1658516, 1759901, 1905747, 1964632, 1904669, 1798221, 1709962, 1734525, 1982039, 2344933, 2529361, 2478098, 2351687, 2228981, 2093210, 1963239, 1944003, 2088174, 2245287, 2245377, 2117591, 1984274, 1930378, 1952497, 1996368, 1985275, 1946483, 1985115, 2141432, 2313653, 2424494, 2523979, 2701382, 2911207, 3038504, 3118646, 3214438, 3302433, 3355636, 3392408, 3429022, 3463773, 3496006, 3487639, 3457740, 3495759, 3614409, 3789024, 3998577, 4191810, 4350370, 4475256, 4564341, 4675371, 4829919, 5022456, 5379405, 5979634, 6700006, 7349735, 7743862, 7844531, 7867378, 7943419, 8020110, 8126368, 8417616]
7261H417616N75056Q24207R62558J040819J178238J346962J474173J594618J763632
7252A9177879J917497K023295K265251K761450L381492L908330M266542M464279
7244D4166015M492866M339936L997047L311908K369170J447828N28071m09851
7236F4242990j272035k063765k691372k976640l001610k830313k448625k020342
7228D4938288j772400j769147k021403k458693k856456l007088k918967k710838
7220B5423296k454799k236979k043513j812973j595625j363288j120424q96325
7212A1899370o85331n27745m28543m16613n65273p70634q71262q24502p06466
7203F103001o05092m73260k74337p5017l4963j96830l48963l65308l56153l43920
$$ y = [8417616, 8992672, 9816879, 10779437, 11820256, 12998494, 14345456, 15819629, 17414247, 19177879, 21095376, 23118671, 25383922, 28145372, 31526864, 35435194, 39701736, 44166015, 48658881, 52998817, 56995864, 60307772, 62676942, 64124770, 64652841, 64242990, 62970955, 60907190, 58215818, 55239178, 52237568, 49407255, 46958630, 44938288, 43165888, 41396741, 39375338, 36916645, 34060189, 31053101, 28134134, 25423296, 22968497, 20731518, 18688005, 16875032, 15279407, 13916119, 12795695, 11899370, 11214039, 10686294, 10257751, 9841138, 9275865, 8505231, 7633969, 6809467, 6103001, 5497909, 5024649, 4750312, 4675295, 4640332, 4443502, 4094539, 3729231, 3373078, 3029158]
7193C029158l19858l57609l85171k61645o3425N8483R7584O0793O2541J55679
7183B076530J94854J36229r964j65941k19257j91853j64042j99962k93065k84780
7173H78749j85359j5305K03748L72687M40228L10767J00262K4253J9567q485p6709
7162B064403j79700k37155k40252j84658j21009q7331j04087j45654j27645n8963
7152E77949L927M7596j775j18527j48998j74700k11131j50634n674J41166J58722
7141A17921J10200J50431J83557J51209N9298r4539k47722l42481l58571k97048
7131e67745j22831J04793K74105L40886L35281K51930R9417l5330j34081k07087
7121C39338k15729j06651O1662J45509O7460j02656k47300k90577k01730o7465
$$ y = [3029158, 2709300, 2351691, 1966520, 1704875, 1641450, 1699933, 1797517, 1858310, 1920851, 2076530, 2271384, 2407613, 2397649, 2231708, 2012451, 1820598, 1656556, 1456594, 1163529, 878749, 693390, 678085, 881833, 1254520, 1694748, 2005515, 2105777, 2130030, 2149597, 2141112, 2064403, 1884703, 1647548, 1407296, 1222638, 1101629, 1014298, 910211, 764557, 636912, 577949, 581876, 629472, 627697, 509170, 360172, 185472, -25659, -176293, -181967, -40801, 117921, 228121, 378552, 562109, 713318, 772616, 678077, 430355, 87874, -270697, -567745, -690576, -585783, -311678, 29208, 364489, 616419, 715836, 680506, 546425, 339338, 123609, 16958, 78620, 224129, 291589, 188933, -58367, -348944, -550674, -618139]
7111f18139J07333K69172K67721J98572J73490J38771J30414J93237K15691P2697
7101A148959j52066l31348l40547k24979j4344K67382M04183L46495L03947J96631
7091A604313j00035l01714k30949l2035J19862J50295J5782k16308l85129l87964
7081B36118l25121k00487Q986J71297K45015K85344K47581J71672J47562J39009
7071A126976Q5519l8152j04738p1786n2829q4068j12274j26336j20784o8251r460
7060D23817K2832k5687j61925k98434k65249p9045L4889N6750Q5877M2390j1247
7049a75032J03978K90983L53952K37696P3787K6489M9484K1529o6243j35077j41551
7038F39995j50070j53323j03849L6121J54968J09841m0226j36525j64109k64419
$$ y = [-618139, -510806, -241634, 26087, 224659, 398149, 536920, 667334, 860571, 1076262, 1148959, 996893, 665545, 324998, 100019, 85675, 353057, 757240, 1103735, 1407682, 1604313, 1504278, 1202564, 971615, 939580, 1059442, 1209737, 1225519, 1009211, 624082, 236118, -89003, -289490, -280504, -109207, 135808, 421152, 668733, 840405, 987967, 1126976, 1212495, 1174343, 1069605, 997819, 944990, 860922, 748648, 622312, 501528, 433277, 423817, 446649, 420962, 259037, -39397, -304646, -383691, -348802, -292052, -206175, -163785, -175032, -71054, 219929, 573881, 811577, 885364, 911853, 961337, 982866, 916623, 781546, 639995, 489925, 336602, 232753, 268874, 423842, 533683, 493457, 356932, 192823, -71596]
7028g1596l15766j56459r301K64L9255J17062J53685J09436M7863J8677J2398
7017e4482N4539J49049J40686o606p5510l1415j4308n5347j29294j98355j73200
7006c94243m2761J11331J63398J0819j52204j46058n8431k1825Q7612K97045M30405
6995B85088L63652J41993k6249k8528K2488L7687O8057L3665o3776j39610j99708
6984D94759k67789l23531l06986j90741l3197L9394J7497j7362K6750J70132K32321
6973a58753J43553J2560o1163n4685p6094j10757j03461q4103j9646Q5526J66603
6962b60420J27700n4427k07023j27593J22112L15853K61572K8888j80942k60591
6952b34871k62839k27129j00074p825j3756j530k3834j41223k54887k12949K6378
$$ y = [-71596, -387362, -543821, -553122, -552858, -513603, -396541, -242856, -133420, -85557, -66880, -54482, 57, 149106, 289792, 283186, 207676, 176261, 161953, 106606, -22688, -221043, -394243, -437004, -325673, -162275, -151456, -303660, -449718, -508149, -529974, -442362, -145317, 285088, 648740, 790733, 764484, 735956, 758444, 796131, 864188, 897853, 834077, 694467, 494759, 226970, -96561, -403547, -594288, -627485, -588091, -570594, -587956, -561206, -391074, -158753, -15200, -2640, -63803, -118488, -194582, -305339, -408800, -492903, -512549, -427023, -260420, -132720, -187147, -394170, -521763, -399651, -83798, 177774, 206662, 25720, -234871, -497710, -724839, -824913, -832738, -846494, -848024, -871858, -1013081, -1267968, -1480917, -1454539]
6941a454539K63896K77347J53081P8712M1333n7770j82587k40789j46253O9729
6931a197840K25039L17358L61552K75134J33602l2993j78929j18837J19473L26283
6921B29842L98237L32213J39013j00073k35487k39925j87254q5283O0899J25384
6911D37566N4326l6421k1066j838o5070n1121P8197J66398J39344N6416k7523
6900G29208p2231o7640l6661M2678P3869J9845J4102Q1808J47259J99918K58851
6889A391006L04721K97951K19124P6686k1950m7822j55447l12704m14476m60142
6879H76947m80335m25410k85935j50676r9991j01407p9282m9741j6393O2060J41718
6868f08445J90270K03516J75576L1489j65594k46454j15280J29468K07520J3983
$$ y = [-1454539, -1190643, -913296, -760215, -681503, -640170, -697940, -880527, -1121316, -1267569, -1197840, -972801, -655443, -293891, -18757, 114845, 81852, -97077, -215914, -96441, 229842, 628079, 960292, 1099305, 999232, 763745, 523820, 336566, 251283, 312182, 437566, 491892, 455471, 434405, 432567, 367497, 316376, 394573, 560971, 700315, 756731, 729208, 656977, 589337, 552676, 595354, 669223, 689068, 703170, 784978, 932237, 1132155, 1391006, 1695727, 1993678, 2212802, 2289488, 2267538, 2219716, 2064269, 1751565, 1337089, 876947, 396612, -28798, -314733, -465409, -565400, -666807, -746089, -795830, -812223, -750163, -608445, -418175, -214659, -39083, -7594, -173188, -419642, -534922, -405454, -197934, -183951]
6858a83951k66114l78808k90285j45171j6469J06897J84605K11667K55168L00579
6848b21882K24236L6840r2927r5234o6206k1384N7048J13107J54780K13857K77896
6837E80131K82131K05535J29359O0445J313l4969k4982N2751J28365J02280j1793
6826A470566j20003j53268k05943l38533l94812k77877j11528l983M3570k1553
6816a13364p3670o153O1855J28429J59962P9355m3478j15484j04770m6382n2894
6805a26594j40309j72182j11096l5584K2724O1369J9525l0197L24J8458k7451
6794e21013l2658m2696j69622k44997j65971m8772K8481J31302K30445K29928
6784f05573J85472J97711K17115N6942k28151m10301l32557n3183K23506K86102
$$ y = [-183951, -450065, -828873, -1119158, -1264329, -1280798, -1173901, -989296, -777629, -522461, -221882, 2354, 39194, -53733, -148967, -215173, -236557, -179509, -66402, 88378, 302235, 580131, 862262, 1067797, 1197156, 1257601, 1258914, 1223945, 1198963, 1251714, 1380079, 1482359, 1470566, 1350563, 1197295, 991352, 652819, 258007, -19870, -131398, -135381, -91811, -113364, -187034, -193187, -131332, -2903, 157059, 236414, 192936, 77452, -27318, -73700, -126594, -266903, -439085, -550181, -585765, -563041, -501672, -482147, -512344, -512020, -493562, -521013, -553671, -596367, -765989, -1010986, -1176957, -1225729, -1197248, -1065946, -835501, -605573, -420101, -222390, -5275, 51667, -176484, -586785, -919342, -972525, -749019, -462917]
6774d62917J08160j00283j50552m8857M2281K6574K1404Q6436J05441N1862k4918
6763c45369n3003m9591n356J45829K45129J54000l025j44069j88067r5957N3138
6752b86341K30472L13925J95795l2090k31774l76341m49739m06695k66542j11318
6742a420648k3457J4747R0901J41554N6456p1116r2196J8833J66395K24272J18438
6731g75821o9152j57292j27188n3078K0914L2191M0282O6568J18409J67120J64744
6720e72303J33014O3447q86L5874J84964L27943L10240J28119q6165k24606k45401
6709E4240k08134j37339q4314l9265P1253J14499P38j66476k14252p3108J65429
6698e16729L32534L39448L16560L16090K65939J86375O4195q2600j80844j77003
$$ y = [-462917, -354757, -455040, -605592, -654449, -612168, -585594, -564190, -477754, -372313, -320451, -345369, -398372, -447963, -453319, -307490, -62361, 91639, 88614, -55455, -243522, -339479, -286341, -55869, 258056, 453851, 421761, 189987, -186354, -636093, -1042788, -1309330, -1420648, -1444105, -1429358, -1338457, -1196903, -1140447, -1211563, -1303759, -1284926, -1118531, -894259, -775821, -844973, -1002265, -1129453, -1182531, -1161617, -1129426, -1089144, -1022576, -904167, -737047, -572303, -439289, -375842, -376728, -340854, -155890, 172053, 482293, 610412, 524247, 299641, 54240, -153894, -291233, -375547, -414812, -343559, -229060, -228322, -394798, -609050, -682158, -516729, -184195, 155253, 471813, 787903, 1053842, 1240217, 1304412, 1221812, 1040968, 863965]
6688H63965m9854N4484J09262Q6330p4271k32020l88303n28567m87817k41469
6678h88260O5957K83909L05758J75282P2247P7759N3613p0600j90678j79779o1421
6667c56213J2964r218k87R3066J42131J60580K06622J51146L9316M0064M5207
6656E25378m3931r9670r3669j23884j27955k8470J61072K99007K31657l1279k39728
6645D28528k38054k00722k89151l46690j97264m8077K9445J35216J37602L5269
6635e53898k2332L5476J19363P7948p2357j89257j48029P61J52221J79663P2035
6624c48406O865k7492p5606l8147M4802N5869k2273q5732n4240P6089K50095L24507
6612A06331K69967J00779j15029k68418k71882j30474K2600L2669j2125J5271
$$ y = [863965, 814111, 868595, 977857, 1064187, 989916, 757896, 369593, -158974, -646791, -888260, -822303, -538394, -232636, -57354, 14893, 92652, 146265, 75665, -115013, -294792, -356213, -343249, -352467, -352754, -259688, -117557, 43023, 249645, 400791, 440107, 480171, 525378, 481447, 381777, 288108, 164224, 36269, 7799, 168871, 467878, 699535, 668256, 428528, 190474, -10248, -299399, -646089, -843353, -891430, -861985, -726769, -589167, -553898, -576230, -540754, -421391, -343443, -415800, -605057, -753086, -752325, -600104, -420441, -348406, -341541, -369033, -444639, -482786, -437984, -382115, -404388, -490120, -544360, -468271, -218176, 106331, 376298, 477077, 362048, 93630, -178252, -308726, -286126, -253457, -265582, -250311]
6602b50311L4884N0166J11263J61699J60645K05677J70794m873j33468j40093
6592C66383j20286j71844j40860K2573J59186K24187J98258Q9972j4220p8304
6582E35045l1435P3508J63121K40088J92742L5836o2583j5543Q9468J16341m9155
6571A287433k74312l16498k47805k21472k39188k54791l35724m97189n79758m05723
6561b085027k0145K53591L43375L60047K49358M6865j22262j74674q8104P92n512
6550a241696n4867r7615r7493k7192J00629J92456J23494N0896J03906Q9890N0903
6539h06689P8733J66776K51170L19716L93161L83663K02071n3802j48085n1829
6529G34885M003l6373j57421l13299k87361j00414O8774Q0434n3309k22695l74265
$$ y = [-250311, -215427, -165261, -53998, 107701, 268346, 474023, 644817, 639944, 506476, 366383, 246097, 74253, -66607, -44034, 115152, 339339, 537597, 627569, 613349, 535045, 503610, 577118, 740239, 980327, 1173069, 1208905, 1146322, 1130779, 1220247, 1336588, 1287433, 1013121, 696623, 448818, 227346, -11842, -266633, -602357, -1099546, -1679304, -2085027, -2105172, -1851581, -1508206, -1148159, -898801, -851936, -974198, -1148872, -1236976, -1236184, -1241696, -1296563, -1394178, -1491671, -1518863, -1418234, -1225778, -1102284, -1051388, -947482, -857592, -806689, -727956, -561180, -310010, 9706, 402867, 786530, 988601, 934799, 786714, 734885, 738888, 702515, 545094, 231795, -55566, -155980, -87206, -6772, -60081, -282776, -657041]
6518f57041m20344l60725k39703r7952k6838l3999M8920K39148L28207K79639
6508i40688J92716J18326O5221P0369J70352J87822O2367K1838J10886J57538
6498B16747R9678L4487O4450Q4880J10042K38597K95219J37536j51566m01980
6488G28090n12067m77463l85172l48716l60389k43710K6797K54653L48017L17652
6478f52308J80719L851q8335l2330K7242K1293L0619k2125k22185l96299l74871
6467a524729j42432Q9793Q9135r793k4648J175N3413J12305P3991J1735Q0667
6456a189388K36250L72082M35106L99201J97198l3899q0975K1502O2064q6677
6446C32464k11048j68193j16770o4575O4523J55932R8492j007l3569k7500l9505
$$ y = [-657041, -1077385, -1438110, -1677813, -1775765, -1802603, -1836602, -1787682, -1548534, -1220327, -940688, -747972, -629646, -564425, -494056, -323704, -135882, -73515, -51677, 59209, 216747, 316425, 350912, 415362, 500242, 610284, 848881, 1144100, 1281636, 1130070, 728090, 216023, -261440, -646612, -995328, -1355717, -1599427, -1572630, -1317977, -969960, -652308, -471589, -467738, -556073, -588403, -561161, -539868, -509249, -531374, -753559, -1149858, -1524729, -1667161, -1577368, -1488233, -1498026, -1522674, -1521499, -1468086, -1355781, -1281790, -1270055, -1189388, -953138, -581056, -145950, 253251, 450449, 416550, 335575, 357077, 419141, 332464, 121416, -46777, -163547, -228122, -163599, -7667, 90825, 89818, 56249, 28749, -10756]
6435a0756l8342k8259j324r072l7340k7939K4847O8797R6086J49008J79766J70430
6423E35902J68930J41978R6382Q1859O4523M646k5936l5843p4684l8064O9428
6412I89121O4448l7828j00246j49316k40572k94359k52320k16473j63033Q304
6402c92274J91206K82537L16407K67506J90445J30620P2052L9595P5118N9346
6392A232558j8436o1957q2970q4258p1718j7879J06714J58650R8289L3532K3837
6381A316362K9594L5103j6436j40376j76311j06362p7274o3939O6900J95009J27359
6370A189629q5819j81368p5460L0981J05593J77936K21083K53830K44314J54828
6360B035547N9133O3950J68539K18737J31242J09852K16578K70314J62840j8736
$$ y = [-10756, -49098, -77357, -78681, -87753, -125093, -153032, -128185, -59388, 36698, 185706, 365472, 535902, 704832, 846810, 943192, 1025051, 1089574, 1094220, 1068284, 1032441, 957757, 919693, 989121, 1053569, 1015741, 915495, 766179, 525607, 231248, -21072, -237545, -400578, -392274, -201068, 81469, 397876, 665382, 855827, 986447, 1058499, 1098094, 1173212, 1232558, 1214122, 1152165, 1069195, 984937, 913219, 895340, 1002054, 1160704, 1258993, 1292525, 1316362, 1345956, 1381059, 1364623, 1224247, 1047936, 941574, 864300, 800361, 867261, 1062270, 1189629, 1103810, 922442, 846982, 877963, 983556, 1161492, 1382575, 1636405, 1880719, 2035547, 2094680, 2158630, 2327169, 2545906, 2677148, 2787000, 3003578, 3273892, 3436732, 3417996]
6350C417996j07348n3378Q8212K15448K65978K13785J21171K3764q0331j1522
6340D093775K00340K70990J89276J06089J08499J49063K45799L74761M01859L79642
6330F520093M57327O24480P61576Q80024R40637Q78925Q85526J107208J425867
6321A4481663J694800K101304K832411L657248M342880N004688N784193O686953
6313D6586140P763477Q852954R561782R363232P864458M998304J069098k942517
6305I3116928o034730p771303q238745p850347o990212n807723m452774l172307
6297D2798787k140727j568491j615852k121487k724125l195487l332346l071927
6289B3028345k586560k128139j881489j790980j608756j332563j155983j033423
$$ y = [3417996, 3310648, 3257270, 3345482, 3560930, 3826908, 4040693, 4161864, 4185628, 4105297, 4093775, 4294115, 4565105, 4754381, 4860470, 4968969, 5118032, 5363831, 5738592, 6140451, 6520093, 6977420, 7601900, 8363476, 9243500, 10184137, 11063062, 11948588, 13055796, 14481663, 16176463, 18277767, 21110178, 24767426, 29110306, 34114994, 39899187, 46586140, 54349617, 63202571, 72764353, 82127585, 89992043, 94990347, 96059445, 93116928, 87082198, 79310895, 71072150, 63221803, 56231591, 50423868, 45971094, 42798787, 40658060, 39089569, 37473717, 35352230, 32628105, 29432618, 26100272, 23028345, 20441785, 18313646, 16432157, 14641177, 13032421, 11699858, 10543875, 9510452]
6281I510452q61589o45106m13301k51250k53000l87128n25087n84532n99209n54301
6271D435949l87362j53869M7935J63379J49175O0383L5715l7183k68420m68281
6261C577421m54910l18955k02950j74293r6645J01426K52948J66686l7388j63206
6251B650134k56208k50190k03223k73888k88837j49417K4321J15495L9307o3622
6241A343872p36J18879J76557J88590J19090N7023J28097J64342M9971q7847j63586
6230B094252j46588n2805R9170K07818J06386j12328j96303j33508r5373j15601
6220A655120j19822n6799m4681p3059j6933K6121o3899j93406k36390j64322r138
6209G02792J81048K16511Q9898L6101J32045J95170J35379o409j50633k46874
$$ y = [9510452, 8648863, 8003757, 7590456, 7339206, 7086206, 6699078, 6173991, 5589459, 4990250, 4435949, 4048587, 3894718, 3942653, 4106032, 4255207, 4315590, 4351305, 4314122, 4045702, 3577421, 3122511, 2803556, 2600606, 2426313, 2329668, 2431094, 2684042, 2850728, 2813340, 2650134, 2393926, 2143736, 1940513, 1666625, 1377788, 1228371, 1252692, 1368187, 1407494, 1343872, 1343136, 1462015, 1638572, 1827162, 1946252, 2003275, 2131372, 2295714, 2345685, 2257838, 2094252, 1947664, 1894859, 1994029, 2201847, 2308233, 2195905, 1999602, 1866094, 1770721, 1655120, 1535298, 1478499, 1433818, 1360759, 1343826, 1369947, 1306048, 1112642, 876252, 711930, 702792, 883840, 1100351, 1190249, 1226350, 1358395, 1553565, 1688944, 1682535, 1531902, 1285028]
6199A285028k51103j50575o9481l3135o1495j67809k75760k51507p0257J72244
6189A26150K87825J94237O9242K4196M561K5732J7457o5468j44751j94731k31077
6178A13373k49039k47739j87345r8040j07328k10022j72281O0107K29957K00651
6168f67706P3771q3Q4188K14949L25446M11594M16021K96132J81751K08563K69839
6157A814465J85577R534r8814j49279j48771r5153r2941n1406J64113L14823J91307
6146B043455J3128j8677L2065J29258J76663J57167J44323R6844l0319k80610
6136B463297m47344l15511k9701R7057j5179j56160j40368q3957o4737R7163K42655
6125A647215K14559J14038l4936j91626k57134j94964q0151K6046J12288J51636
$$ y = [1285028, 1033925, 883350, 813869, 780734, 719239, 551430, 275670, 24163, -46094, 126150, 413975, 608212, 677454, 701650, 706211, 731943, 749400, 683932, 539181, 344450, 113373, -135666, -383405, -570750, -668790, -776118, -986140, -1158421, -1098314, -868357, -667706, -593935, -594018, -509830, -294881, 30565, 442159, 858180, 1154312, 1336063, 1544626, 1814465, 2000042, 2009576, 1910762, 1761483, 1612712, 1517559, 1424618, 1373212, 1537325, 1852148, 2043455, 2056583, 2037906, 2069971, 2199229, 2375892, 2533059, 2677382, 2774226, 2743907, 2463297, 2015953, 1700442, 1670741, 1767798, 1752619, 1596459, 1456091, 1372134, 1307397, 1404560, 1647215, 1861774, 1975812, 1940876, 1749250, 1492116, 1297152, 1217001, 1243047, 1355335, 1506971]
6115A506971J93085L29580M38714K81376K7382m6026M7806K61577M86719N37146
6105D064330M70715M62817M96889M40240L27729L05942M02842N36308P26993R38889
6095I173694J023949R92208Q80790O79685L26452j03019m64625o60235o92126
6086A1156773o86745o88782o78886o23561n05173m02036l91707m20044m18327
6077F341512m40508n23911o28105o58021n41807l98388l75956l93187l23456k41375
6067A816798q1472J38576J75352N9000m7958j27211k04774k63431k42880j72718
6057A049282j62335j19035k9097N1623J49026J72258L6094j35579j83620j84813
6047F43804k07697j57591j07046j84123k39926j62373P2736M16903O16855N23685
$$ y = [1506971, 1700056, 2029636, 2468350, 2749726, 2777108, 2731082, 2778888, 3040465, 3527184, 4064330, 4535045, 4997862, 5494751, 5934991, 6262720, 6568662, 6971504, 7507812, 8234805, 9173694, 10197643, 11189851, 12070641, 12750326, 13076778, 12973759, 12509134, 11848899, 11156773, 10470028, 9781246, 9102360, 8478799, 7973626, 7571590, 7179883, 6759839, 6341512, 5901004, 5377093, 4748988, 4090967, 3549160, 3150772, 2774816, 2381629, 2058173, 1816798, 1735326, 1873902, 2049254, 2108254, 2060296, 1933085, 1728311, 1464880, 1222000, 1049282, 886947, 767912, 738815, 790438, 939464, 1111722, 1147816, 1012237, 828617, 643804, 436107, 278516, 171470, -12653, -252579, -414952, -342216, 74687, 691542, 1215227]
6037A215227K85739P0590r8733k58864k60896k0386K10612K56625K04452J62994
6027A767360Q4037j09187l05850l48051k18053r4906j05490j65865j21299M3058
6017D25754J80421J54237K4215l5314n616K9561M4571R8384J49544J27047R9358
6006A292162N6287j2385n3399p5560r1186l0133R6046J40371Q9939K4048j1155
5995A425035j989M7013J09145N1958j91901l74686l14997j14964M9630J09833
5985G94077j304j79833k65757l27021k75977o1131O8567J02145K16657K91131
5975C61554K01837Q5351N9657Q1284Q8462k1202j72107k12081k91988l91420l46274
5964e56927j99903j29644j07075n3376Q788Q3274J58972J98000J70625J53007
$$ y = [1215227, 1500966, 1571556, 1472823, 1213959, 953063, 932677, 1143289, 1399914, 1604366, 1767360, 1851397, 1742210, 1436360, 1088309, 870256, 775350, 669860, 503995, 382696, 425754, 606175, 760412, 784627, 749313, 743697, 773258, 817829, 916213, 1065757, 1192804, 1292162, 1348449, 1336064, 1282665, 1207105, 1115919, 1085786, 1181832, 1322203, 1412142, 1436190, 1425035, 1423046, 1470059, 1579204, 1631162, 1439261, 1064575, 749578, 634614, 684244, 794077, 792773, 612940, 347183, 20162, -255815, -316946, -248379, -146234, 70423, 361554, 563391, 648742, 708399, 789683, 878145, 856943, 684836, 472755, 180767, -210653, -556927, -756830, -886474, -993549, -1046925, -1038137, -954863, -795891, -597891, -427266, -274259]
5954b74259J49884J45590J31315K8920r5229j65048r9998J30043K92532K04530
5944D48280n75j26186j23092n7913N2805J30086N6901q1059p5141J7725P9131
5933C20962J45093J25727K2917r6477k73091l32686j11157J23063K06745K14167
5923C45263J52815L4843q6918j97185j70863K1925J20789P7550K3255o7252j24460
5912A29762j70099k30085j94145j47948j25197o0877J2947R5425J79499K11485
5902b99233J65706N4093p4092j03188n6566r480k5622j12827j03022j3846O6172
5891e11905R2410P074p2983j25069j55355o6660J2885J3906Q2254J70797J79288
5880c73358O5060n9761j3103N8078j7950j86188l14889k76873p7038J21091K15800
$$ y = [-274259, -124375, 21215, 152530, 181450, 86221, -78827, -178825, -48782, 243750, 448280, 447705, 321519, 198427, 140514, 193319, 323405, 380306, 299247, 224106, 241831, 320962, 466055, 591782, 614699, 518222, 245131, -87555, -198712, -75649, 131096, 345263, 498078, 532921, 446003, 248818, 77955, 99880, 220669, 298219, 321474, 254222, 129762, -40337, -270422, -464567, -612515, -737712, -798589, -785642, -690217, -510718, -299233, -133527, -79434, -153526, -256714, -313280, -322760, -348382, -461209, -564231, -578077, -511905, -419495, -412421, -485404, -610473, -765828, -832488, -819603, -805697, -723443, -552646, -373358, -308298, -368059, -381162, -323084, -341034, -527222, -842111, -1118984, -1196022, -1074931, -859131]
5869h59131K55339K81222K80912K27287J12347k3371j41777k06643j73998j09154
5859c56967Q009J71137K31891J61705Q4081O4855J02637J06952M1294L1567J24976
5848G72137K17563K68249L16721K79275J32964q7785k68000k91924k11780o4388
5838A063032j6948j13638j66145o9830Q8642J89490J21901m6620p5429k7803m5861
5827I00791j31563j54344n6146P8614R7858p5765k40376j99502n8223K1181o874
5816A75651o4399k1785J94769M05760L70910J87245J8191r2013j95694k35557
5806G43078j55776o4090m4126p3332r4563j16706j22523j5724J12153J49017J22824
5795D40232R5603j5741j78286k26949j79383j04447p5173n7811L0395J78025K86786
$$ y = [-859131, -603792, -322570, -41658, 185629, 297976, 274605, 132828, -73815, -247813, -356967, -348958, -177821, 54070, 215775, 299856, 364711, 467348, 574300, 615594, 647161, 772137, 989700, 1257949, 1574670, 1853945, 1986909, 1899124, 1631124, 1339200, 1127420, 1063032, 1046084, 932446, 766301, 696471, 785113, 974603, 1096504, 1049884, 974455, 946652, 900791, 769228, 614884, 558738, 637352, 735210, 659445, 419069, 219567, 161344, 182525, 175651, 111252, 89467, 284236, 689996, 1060906, 1248151, 1266342, 1174329, 978635, 743078, 587302, 523212, 479086, 405754, 311191, 194485, 71962, 56238, 168391, 317408, 440232, 535835, 520094, 341808, 114859, -64524, -168971, -244144, -301955, -271560, -93535, 193251]
5784A93251L01081L17250L30156J80287q6354k74675l26197k94768k26540j86955
5774g3464j67372j03687K9811J54304R9872o3542j52300j73566q7654N643r6486
5763f28441l07061l45162j65321O869R5429K46296L82911K70636L2983k8602j2414
5752d51877n6286j08565j00799m1631j1659p335j5096L3666J24979J90719J89315
5741b54569J56031J10286Q6105J07061J27200J18736R2480O3112J9073p4282j24312
5730D26921n7922L0984O2245O454j7236L8813M9119k3991q1878j54223k37234
5719D2052j66688J4836J04543J00547R0094O2037K2466N3716J37023J57078J42450
5708G60154J49806J52286J23173L9128q8354k11358k46258j38876Q8296K17498
$$ y = [193251, 494332, 811582, 1141738, 1322025, 1235671, 960996, 634799, 340031, 113491, -73464, -240836, -344523, -314712, -160408, -60536, -124078, -276378, -449944, -537598, -531955, -628441, -935502, -1280664, -1445985, -1439116, -1343687, -1097391, -714480, -443844, -410861, -439463, -451877, -508163, -616728, -717527, -759158, -770817, -778152, -793248, -759582, -634603, -443884, -254569, -98538, 11748, 97853, 204914, 332114, 450850, 543330, 606442, 625515, 551233, 426921, 368999, 399983, 462228, 468682, 451446, 490259, 539378, 515387, 433509, 279286, 42052, -124636, -109800, -5257, 95290, 185384, 247421, 269887, 323603, 460626, 617704, 760154, 909960, 1062246, 1185419, 1224547, 1136193, 924835, 678577, 539701, 627997, 845495]
5698H45495J84421J30561O2646j2336j9556m8381j10530j51737j68330j34167
5688E78086j24641k11460l24078k86810j28939J07692K93114K20353M0238l8263
5678A25292L7365J69786J20758l8991n9181L1802J34746J58643M3280j53099k47367
5667C23034j98231j75240j76702j31077j24818k28040k99380k68082k01453r954
5657a489943K92698M82589M28937K33265J8801j81454l22712l21245j78283j815
5647a039162P9714P1907L8788o564n3705n1392M2679Q1832N6892J137o7815n5222
5635i00911J0572J31390K31075K77231L09988K77757J88276J2014j55862j88766
5625A92764j21670r192N0758K0517j1516k6795p0090j09798j16709p3593o003
$$ y = [845495, 1029916, 1160477, 1223123, 1210787, 1191231, 1142850, 1032320, 880583, 712253, 578086, 453445, 241985, -82093, -368903, -497842, -390150, -97036, 123317, 163555, 125292, 162657, 332443, 453201, 414210, 355029, 386831, 521577, 680220, 723500, 570401, 323034, 124803, -50437, -227139, -358216, -483034, -711074, -1010454, -1278536, -1479989, -1489943, -1197245, -714656, -285719, -52454, -33653, -215107, -537819, -859064, -1037347, -1039162, -959448, -887541, -848753, -855317, -909022, -960414, -917735, -835903, -779011, -777874, -845689, -900911, -890339, -758949, -527874, -250643, 59345, 337102, 525378, 537392, 381530, 192764, 71094, 61902, 112660, 133177, 121661, 94866, 24776, -85022, -201731, -275324, -281327]
5614b81327K904o8944j82125k84157k51921o6893R1426R5315J6814p6585j50477
5603a155970j76251j66342r5657J7388J26165K35718K59340J72875P7504J0751
5593f94479K6845Q9403N4498r1255j56288j00527m4038M1182Q7847M6433q82K2698
5581g18563Q3472J04826J71188K48423K24176J99798J65933M2718j36093k85808
5571A00070l50202k97213j64237l7243N5830J27239J88861J85763J55398J49964
5561A14230J09753M5824K4310M921l4602r1889j42447j12290o1452j09645j24273
5550c77560L2673K22766K66044K31398K94707L22947J57471m1072j52949j59701
5540G96724j48975k09547j99363l6822J10068R2488l8936j75027k16606j46800
$$ y = [-281327, -278423, -347367, -529492, -813649, -1065570, -1132463, -1041037, -945722, -928908, -1005493, -1155970, -1332221, -1498563, -1594220, -1576832, -1450667, -1214949, -955609, -782734, -705230, -694479, -667634, -578231, -523733, -614988, -771276, -871803, -915841, -874659, -786812, -740379, -741261, -718563, -635091, -530265, -359077, -110654, 113522, 313320, 479253, 521971, 385878, 100070, -250132, -547345, -711582, -748825, -692995, -565756, -376895, -191132, -35734, 114230, 223983, 269807, 294117, 299038, 264436, 172547, 30100, -82190, -143642, -253287, -377560, -344887, -122121, 143923, 375321, 670028, 992975, 1150446, 1109374, 956425, 796724, 647749, 438202, 238839, 202017, 312085, 404573, 365637, 190610, -25996, -172796]
5530a72796l8287Q9785J57895J47136O4321p8919k33553l07614k54638j55061
5520g81731p9000O917K0904n2225j01809q8087K0158J51510K25480K46189K18734
5509b12960J18098m2859j46979r0825R963q729l2931K5620o5450k19520j33947
5498h00519N8712Q0178k9955j11348r4268J16996L07206K74214J03610k2566K0385
5487i7355J81511K59767J66536L3438K4516O8091P0376J2856p7548j7638R9539
5476G24089M8502q7887j65104j70676j30732o5030r48L9115N6196R1989J16604
5465D56118J28207J48497J22049K2193m9944l1165o7355k02088l13463l76113
5455a63064l78077k60569p2616N9591N0163P935K6733k6503j10847p3343P7089
$$ y = [-172796, -211083, -121298, 36597, 183733, 248054, 169135, -64418, -372032, -626670, -781731, -860731, -853814, -832910, -885135, -986944, -1075031, -1054873, -903363, -677883, -431694, -212960, -94862, -137721, -284700, -375525, -365562, -374291, -407222, -381602, -447052, -666572, -800519, -741807, -661629, -691584, -802932, -897200, -780204, -472998, -198784, -95174, -117740, -97355, 84156, 343923, 510459, 543897, 568413, 636504, 706880, 719736, 642188, 624550, 724089, 772591, 684704, 519600, 348924, 218192, 153162, 152214, 191329, 247525, 339514, 456118, 584325, 732822, 854871, 877064, 827120, 795955, 728600, 526512, 213049, -163064, -541141, -801710, -874326, -814735, -764572, -756637, -729904, -756407, -867254, -940597, -863508]
5444h63508J76185J54951L4643p6388r8752r1362j01962j75563k02194p0616R1847
5433a222719J48232J32097M9257J4356Q2159J38118J29917K0057j19879j51574
5423g79979j20695l2426J27360K52347L17921L43302K56945O4967j15376k15600
5413I8766k50562k11183j12893J3260Q1565Q239j18023j62908n9639O2514M3235
5402f07629p894j0526J7739L5554m6995k07307k94980k68920j55741K8855K22224
5391a295620L46954L94550L77231K96945J71374J93088K42059L6036j68365j31989
5381D62263O415O0465P149j38331k82767k39275k5140J84815K24853J42228l4465
5370C68210k24037k42247j02443M9805J34659J11636k160n8463O4430K32255K92703
$$ y = [-863508, -687323, -532372, -497729, -574117, -672869, -764231, -866193, -1041756, -1243950, -1314566, -1222719, -1074487, -942390, -893133, -878777, -796618, -658500, -528583, -508526, -628405, -779979, -900674, -933100, -805740, -553393, -235472, 107830, 364775, 429742, 314366, 98766, -151796, -362979, -475872, -462612, -381047, -372808, -490831, -653739, -713378, -650864, -607629, -615523, -626049, -608310, -572756, -619751, -827058, -1122038, -1390958, -1546699, -1517844, -1295620, -948666, -554116, -176885, 120060, 291434, 484522, 726581, 762617, 594252, 462263, 468678, 529143, 536292, 397961, 115194, -124081, -149221, 35594, 260447, 402675, 368210, 144173, -98074, -200517, -150712, -16053, 95583, 93423, 34960, 99390, 331645, 624348]
5359F24348K84705K98224K80379K42765J66670q4125m01517m51764j67189M7184
5349H39680r793j11027j35967j08585l8381R364K2031L3356N0346O5168L8860
5338F55052j9052k395Q7427J87196K79582K79205J65543O8921r557j06844j58442
5327A426636j04069M6615J51929J34275J78454M05632O74103Q36105Q75831Q77666
5317E503177Q20885O38932M19840K41831K0929k63220m83874n61289n04940l77302
5307E454969k93447l04302l99582n40045o41820o67143n46477l47595k48377k62788
5297A203393k42813k16324k13607j20862N441L6911L4657R1973J78797J90972
5287I48538J23728N5589J1311l9356p8862j17217j91131k62082k36298n2986J71661
$$ y = [624348, 909053, 1207277, 1487656, 1730421, 1897091, 1812966, 1411449, 959685, 792496, 839680, 829887, 718860, 582893, 474308, 435927, 445291, 467322, 500678, 551024, 616192, 655052, 636000, 633605, 721032, 908228, 1187810, 1467015, 1632558, 1701479, 1691922, 1585078, 1426636, 1322567, 1369182, 1521111, 1655386, 1833840, 2239472, 2913575, 3749680, 4625511, 5503177, 6324062, 6962994, 7382834, 7624665, 7645594, 7382374, 6898500, 6337211, 5832271, 5454969, 5161522, 4857220, 4457638, 3917593, 3275773, 2608630, 2062153, 1714558, 1466181, 1203393, 960580, 744256, 530649, 409787, 415228, 452139, 486796, 578769, 757566, 948538, 1072266, 1127855, 1139166, 1099810, 1020948, 903731, 712600, 450518, 214220, 161234, 332895]
5276C32895K40572K01666J25994O8308Q0389L0332j06121k20563k33676j58942
5266C60854r4093n3831P492M465p0910j15009l7134R1732Q6943J6998K4691J64484
5254C86682L43291M01607L10463R2224k10768m43028m47446k68926p0634N984
5244I9449j4193r6072j54743o8540O2386Q7664O3684O7729R5526J21697J29148
5233C93735R5931n108j47196k28743j42286l551O0393Q4667O1908J1497n0164
5222A31083l9922J0452K9335M0661m708j00183k32657l03389j44667J17649K30341
5211b66005J15982k6070J3402J48319K12738J98076J77478J43994J13226Q9777
5201I20917P1161K9890j08946k51052k87453k30611j22262R607Q3417M9870M1778
$$ y = [332895, 573467, 775133, 901127, 969435, 1049824, 1080156, 974035, 753472, 519796, 360854, 266761, 212930, 220422, 224887, 153977, 38968, 1834, 93566, 180509, 197507, 222198, 386682, 729973, 1131580, 1442043, 1534267, 1323499, 880471, 433025, 164099, 93465, 99449, 85256, -10816, -165559, -234099, -171713, -84049, -20365, 47364, 142890, 264587, 393735, 489666, 484558, 337362, 108619, -33667, -37218, 23175, 107842, 169750, 181247, 131083, 91161, 101613, 130948, 171609, 166901, 66718, -165939, -469328, -613995, -496346, -266005, -150023, -176093, -162691, -14372, 198366, 396442, 573920, 717914, 831140, 920917, 992078, 1021968, 913022, 661970, 374517, 143906, 21644, 31251, 114668, 164538, 206316]
5190B06316M4319n5267j09683m2793M5885J41225J62146Q3148n2223j35375j16005
5179A71693l5146M3010Q5326R6542Q1174O1311O8305L5234J6490Q1176J46536
5168H51651J78325K14533K00759M891j51002o3794Q9232P2660j44941k79392j73357
5157G99565m6330j4111m229k4189k6761j4867O957M3902O6296M7907k8459j64985
5145F40696k81733k81862j56966m911N5076K0442p5021j54871r3611O3331K04874
5134f4556K77604K13888M7858n5943J7784J82945L28576M41446M83093M54579
5124B327274M31985M37549M05760L17520K92680L69200L83894K97284K71281L51897
5114E886324M61674N38606N77440O28824O55164N10157K90075J01342l4022j90631
$$ y = [206316, 250635, 195368, 85685, 42892, 88777, 230002, 392148, 475296, 423073, 287698, 171693, 136547, 179557, 264883, 361425, 442599, 503910, 572215, 607449, 623939, 705115, 851651, 1029976, 1244509, 1445268, 1450159, 1299157, 1235363, 1324595, 1397255, 1252314, 972922, 799565, 753235, 739124, 734895, 710706, 683945, 669078, 676035, 719937, 786233, 834140, 805681, 640696, 358963, 77101, -79865, -84776, -29700, -9258, -84279, -239150, -332761, -269430, -64556, 213048, 426936, 474794, 418851, 436635, 619580, 948156, 1389602, 1872695, 2327274, 2759259, 3196808, 3602568, 3920088, 4212768, 4581968, 4965862, 5263146, 5534427, 5886324, 6347998, 6886604, 7464044, 8092868, 8748032, 9258189, 9548264, 9649606, 9615584, 9424953]
5104I424953m61715p13723p78276o41588m85008l86322l10816l01197l22137l40589
5094D683582m45655n64160n89569n06553l68230k58552q7064R6270R2944q320
5084B044693n2066j35227k52390k99908k48169j19738m3350j14268k59716l54263
5074A65598l37113j59212Q0371K02762K40161J85192O9715J0990L447q3525k00963
5063A77423j71090o0104K5465J03631J37828J03048M0643P235L9938J31235J90028
5052G25280J50697O0321r27j5845o5493j67836k65779l26657k83059j34706m8550
5041c72554q0981j51029j47271p2621m8888p2906p5194l9008O982N3524Q0947
5030i18999J36211K54964L72378K99312J02447M2611J12308J48818J45j83044
$$ y = [9424953, 8963238, 8249515, 7471239, 6829651, 6344643, 5958321, 5647505, 5346308, 5024171, 4683582, 4237927, 3673767, 3084198, 2577645, 2209415, 1950863, 1863799, 1960069, 2053013, 2044693, 1992627, 1857400, 1605010, 1305102, 1056933, 937195, 893845, 779577, 519861, 165598, -171515, -330727, -250356, -47594, 192567, 377759, 447474, 458464, 461911, 378386, 177423, 6333, -53771, -28306, 75325, 213153, 316201, 356844, 364079, 404017, 535252, 725280, 875977, 936298, 935371, 919526, 854033, 686197, 420418, 93761, -189298, -324004, -372554, -453535, -604564, -751835, -824456, -873344, -946250, -1021444, -1060452, -1053470, -999946, -918999, -782788, -527824, -155446, 143866, 246313, 288924, 401232, 550050, 550195, 367151]
5020C67151j89907p1279L7604M2605J664j7833j8309j1054m0223j02813r6475
5009i8869K7125J74740J82375K0276j28337q9681N9566L0120j39192j79073p7375
4998b18325k407N083J0743J3475j1356k6285L1848J17496J37571M4880j04308
4987a585j44766n5801L7196M3262N8332J53767K19328Q0993j35196j46995k9082
4976G9453K484n8022l4162P6777J95193K24612N8807j33031k08597k21539k05482
4965b23507j10383M5210Q9469K0844p1166j45970j42253r5796r4309m3299N4662
4954g16498P7602N8821j2831p5081o2235p0094j14125l9460Q0839M3543q6623
4943i16142j03680K518P7157K9887m4811l7212L6992J32266K22023K57774K00012
$$ y = [367151, 177244, 105965, 143569, 186174, 187838, 170005, 151696, 140642, 100419, -2394, -98869, -71744, 102996, 285371, 305647, 177310, 87629, 147195, 177315, 38123, -140950, -218325, -220732, -215649, -204906, -191431, -202787, -229072, -197224, -79728, 57843, 102723, -1585, -146351, -202152, -164956, -121694, -63362, 90405, 309733, 390726, 255530, 108535, 79453, 81937, 23915, -10247, 66530, 261723, 486335, 545142, 412111, 203514, -18025, -223507, -333890, -288680, -199211, -178367, -249533, -395503, -537756, -633552, -727861, -771160, -716498, -638896, -580075, -592906, -667987, -730222, -800316, -914441, -953901, -873062, -829519, -916142, -1019822, -1017304, -940147, -910260, -955071, -992283, -955291, -823025, -601002, -343228, -143216]
4932a43216J06418J9928l8392o1253r3909r2568k696J27569J52503J05744J35323
4921B15451J75559J14262o7970k35339k68969k22818j31931J5194J93726L07665
4911I4830K89683K65422J95351k2247k67636l86547l56876j90739O0697K57543
4901f0519L11845J84242J9807j5414N512m5840j60513k08707j83661j52706o6747
4890c72701N8920J35811J42707J21700M9988o7104r0445K1007J80002K52408J61716
4879E94009r043k06934l74873m08468l10200j77781r2754k6715R9456K65738M25152
4868b22413N00398M05458J78197j7990j39849k38156k85470l08682l04999k13395
4858f46901o4580L1779L031l5795M5325J28173P0146n153L2964R6654J13599J32253
$$ y = [-143216, -36798, -16870, -55262, -116515, -210424, -302992, -305688, -178119, -25616, 80128, 215451, 391010, 505272, 437302, 201963, -67006, -289824, -421755, -406561, -212835, 94830, 384513, 649935, 845286, 823039, 555403, 168856, -188020, -378759, -318062, -60519, 251326, 435568, 455375, 439961, 445473, 399633, 239120, 30413, -153248, -305954, -372701, -313781, -177970, -35263, 86437, 136425, 69321, -21124, -117, 179885, 432293, 594009, 584966, 378032, 3159, -405309, -715509, -893290, -986044, -1012759, -913303, -647565, -222413, 277985, 683443, 861640, 843650, 703801, 465645, 180175, -128507, -433506, -646901, -711481, -679702, -676671, -712466, -667141, -538968, -468822, -473975, -441011, -344357, -230758, -98505]
$$ [...]
##END NTUPLES=NMR SPECTRUM
##END=
