##TITLE=C13_EC-3252x
 DMSO-d6, 2700sc

 23.7.2024
##JCAMPDX= 6.0         $$ Bruker NMR JCAMP-DX V2.0
##DATA TYPE= NMR SPECTRUM
##DATA CLASS= NTUPLES
##ORIGIN= UXNMR, Bruker Analytische Messtechnik GmbH
##OWNER= root
$$ XWIN-NMR		Version 3.5
$$ Tue Jul 23 16:18:50 2024 Russian Standard Time (UT+4h)  she@DPX200
##.OBSERVE FREQUENCY= 50.327896
##.OBSERVE NUCLEUS= ^13C
##.ACQUISITION MODE= SIMULTANEOUS
##.ACQUISITION SCHEME= undefined
##.AVERAGES= 2704
##.DIGITISER RES= 17
##SPECTROMETER/DATA SYSTEM= spect
##.PULSE SEQUENCE= zgpg30
##.SOLVENT NAME= DMSO
##.SHIFT REFERENCE= (INTERNAL, DMSO, 0, 222.565)
##AUDIT TRAIL= $$ (NUMBER, WHEN, WHO, WHERE, WHAT)
$$ ##TITLE= Audit trail, XWIN-NMR		Version 3.5
$$ ##JCAMPDX= 5.01
$$ ##ORIGIN= Bruker BioSpin GmbH
$$ ##OWNER= she
$$ F:/spectra/data/she/nmr/c13/1/pdata/1/auditp.txt
$$ ##AUDIT TRAIL=  $$ (NUMBER, WHEN, WHO, WHERE, WHAT)
(   1,<2024-07-23 16:17:13.04 +0400>,<she>,<DPX200>,
      <created by zg, POWCHK disabled, PULCHK disabled
       terminated by command 'halt'
       configuration hash MD5:
       00 E9 B6 7A A2 85 ED C7 34 08 36 98 17 FE 4E 26
       data hash MD5: 32K
       CC F6 57 5F DD 87 66 41 7C 26 FD F2 1C 2C 4D 46>)
(   2,<2024-07-23 16:17:42.59 +0400>,<she>,<DPX200>,
      <Start of raw data processing
       efp BC_mod = 2 LB = 2 FT_mod = 6 PKNL = 1 PHC0 = -558.8293 PHC1 = 59.18845 SI = 32K 
       data hash MD5: 32K
       BE 50 8D 6C 45 D9 96 3A 4F E6 C9 91 B8 29 33 D7>)
(   3,<2024-07-23 16:17:45.62 +0400>,<she>,<DPX200>,
      <abs ABSG = 5 
       data hash MD5: 32K
       E0 8D 2E F1 C5 DB 9E E2 89 5C CE 23 BA 27 94 F3>)
(   4,<2024-07-23 16:18:06.39 +0400>,<she>,<DPX200>,
      <pk PHC0 = 13.10589 PHC1 = -19 
       data hash MD5: 32K
       13 CF CF 56 FA 49 DE 77 E9 2A 12 F8 31 81 DB 55>)
(   5,<2024-07-23 16:18:10.62 +0400>,<she>,<DPX200>,
      <abs ABSG = 5 
       data hash MD5: 32K
       64 0C 7A AB 65 AF 79 89 F6 90 35 9C 6D 81 5F C1>)
$$ ##END=
$$ 
$$ hash MD5
$$ 6C DC 9A 43 3E B6 6C C2 B8 ED A9 77 FE 8E A7 60
##$RELAX= 
##$RELAX= 
##$RELAX= 
##$RELAX= 
##$RELAX= 
##$RELAX= 
##$RELAX= 
##$RELAX= 
$$ Bruker specific parameters
$$ --------------------------
##$DU= <F:/spectra>
##$EXPNO= 1
##$NAME= <c13>
##$PROCNO= 1
##$TYPE= <nmr>
##$USER= <she>
##$AMP= (0..31)
100 100 100 100 100 100 100 100 100 100 100 100 100 100 100 100 100 100 
100 100 100 100 100 100 100 100 100 100 100 100 100 100 
##$AQSEQ= 0
##$AQ_mod= 1
##$AUNM= <au_zg>
##$AUTOPOS= <>
##$BF1= 50.322709
##$BF2= 200.13
##$BF3= 50.322709
##$BF4= 500.13
##$BF5= 500.13
##$BF6= 500.13
##$BF7= 500.13
##$BF8= 500.13
##$BYTORDA= 1
##$CFDGTYP= 0
##$CFRGTYP= 5
##$CHEMSTR= <none>
##$CNST= (0..31)
1 1 145 1 1 1 1 1 1 1 1 1 1 1 1 1 1 1 1 1 1 1 1 1 1 1 1 1 1 1 1 1 
##$CPDPRG= <waltz16>
##$CPDPRG1= <>
##$CPDPRG2= <waltz16>
##$CPDPRG3= <>
##$CPDPRG4= <mlev>
##$CPDPRG5= <mlev>
##$CPDPRG6= <mlev>
##$CPDPRG7= <mlev>
##$CPDPRG8= <mlev>
##$CPDPRGB= <>
##$CPDPRGT= <>
##$D= (0..31)
$$ [...]
##$SUBNAM4= <"">
##$SUBNAM5= <"">
##$SUBNAM6= <"">
##$SUBNAM7= <"">
##$SUBNAM8= <"">
##$SUBNAM9= <"">
##$SW= 239.972175391363
##$SWIBOX= (0..15)
0 1 3 0 0 0 0 0 0 0 0 0 0 0 0 0 
##$SW_h= 12077.2946859903
##$TD= 32768
##$TD0= 1
##$TE= 0
##$TE2= 300
##$TE3= 300
##$TEG= 300
##$TL= (0..7)
120 120 120 120 120 120 120 120 
##$TP= (0..7)
150 150 150 150 150 150 150 150 
##$TP07= 0
##$TPNAME0= <>
##$TPNAME1= <>
##$TPNAME2= <>
##$TPNAME3= <>
##$TPNAME4= <>
##$TPNAME5= <>
##$TPNAME6= <>
##$TPNAME7= <>
##$TPOAL= (0..7)
0.5 0.5 0.5 0.5 0.5 0.5 0.5 0.5 
##$TPOFFS= (0..7)
0 0 0 0 0 0 0 0 
##$TUNHIN= 0
##$TUNHOUT= 0
##$TUNXOUT= 0
##$USERA1= <user>
##$USERA2= <user>
##$USERA3= <user>
##$USERA4= <user>
##$USERA5= <user>
##$V9= 5
##$VALIST= <valist>
##$VCLIST= <CCCCCCCCCCCCCCC>
##$VD= 0
##$VDLIST= <DDDDDDDDDDDDDDD>
##$VPLIST= <PPPPPPPPPPPPPPP>
##$VTLIST= <TTTTTTTTTTTTTTT>
##$WBST= 1024
##$WBSW= 4
##$XGAIN= (0..3)
0 0 0 0 
##$XL= 0
##$YL= 0
##$YMAX_a= 7485304
##$YMIN_a= -16999772
##$ZGOPTNS= <>
##$ZL1= 120
##$ZL2= 120
##$ZL3= 120
##$ZL4= 120
##$ABSF1= 222.5654
##$ABSF2= -17.4314
##$ABSG= 5
##$ABSL= 3
##$ALPHA= 0
##$AQORDER= 0
##$ASSFAC= 0
##$ASSFACI= 0
##$ASSFACX= 0
##$ASSWID= 0
##$AUNMP= <proc_1d>
##$AZFE= 0.1
##$AZFW= 0.5
##$BCFW= 0
##$BC_mod= 2
##$BYTORDP= 0
##$COROFFS= 0
##$CY= -3
##$DATMOD= 1
##$DC= 0
##$DFILT= <>
##$DTYPP= 0
##$F1P= 0
##$F2P= 0
##$FCOR= 0.5
##$FTSIZE= 32768
##$FT_mod= 6
##$GAMMA= 0
##$GB= 0
##$INTBC= 1
##$INTSCL= 4.134877e-10
##$ISEN= 128
##$LB= 2
##$LEV0= 0
##$LPBIN= 0
##$MAXI= 10000
##$MC2= 0
##$MEAN= 0
##$ME_mod= 0
##$MI= 0.1934396
##$NCOEF= 0
##$NC_proc= 0
##$NLEV= 6
##$NOISF1= 120.0001
##$NOISF2= 80.00006
##$NSP= 0
##$NTH_PI= 0
##$NZP= 0
##$OFFSET= 222.5654
##$PC= 1.4
##$PHC0= -545.7234
##$PHC1= 40.18845
##$PH_mod= 1
##$PKNL= yes
##$PPARMOD= 0
##$PSCAL= 0
##$PSIGN= 0
##$REVERSE= no
##$SF= 50.3227345484362
##$SI= 32768
##$SIGF1= 140
##$SIGF2= 120
##$SINO= 11.81781
##$SIOLD= 32768
##$SREGLST= <13C.CDCl3>
##$SSB= 0
##$STSI= 32768
##$STSR= 0
##$SW_p= 12077.2946859903
##$SYMM= 0
##$S_DEV= 0
##$TDeff= 32768
##$TDoff= 0
##$TI= <>
##$TILT= no
##$TM1= 0
##$TM2= 0
##$TOPLEV= 0
##$USERP1= <user>
##$USERP2= <user>
##$USERP3= <user>
##$USERP4= <user>
##$USERP5= <user>
##$WDW= 1
##$XDIM= 32768
##$YMAX_p= 339175975
##$YMIN_p= -9670542
$$ End of Bruker specific parameters
$$ ---------------------------------
##NTUPLES= NMR SPECTRUM
##VAR_NAME=  FREQUENCY,     SPECTRUM/REAL,   SPECTRUM/IMAG
##SYMBOL=    X,             R,               I
##VAR_TYPE=  INDEPENDENT,   DEPENDENT,       DEPENDENT
##VAR_FORM=  AFFN,          ASDF,            ASDF
##VAR_DIM=   32768,         32768,           32768
##UNITS=     HZ,            ARBITRARY UNITS, ARBITRARY UNITS
##FACTOR=    0.368581032318806, 1,           1
##FIRST=     11200.0995020947, 0,            0
##LAST=      -877.195183895579, 0,           0
##MIN=       -877.195183895579, -9670542,    0
##MAX=       11200.0995020947, 339175975,    0
$$ Real data points
##PAGE= N=1
##DATA TABLE= (X++(R..R)), XYDATA
$$ [...]
13088 -1747780 -1400803 -1089829 -1008670 -1075040 -1117018 -1056887 -911608 -672138 -356761 -102761
13078 -102761 24500 47775 13987 -21904 -112096 -290656 -452820 -548929 -658277 -755040 -749893
13067 -749893 -699101 -659286 -622761 -553745 -442816 -329160 -259600 -201842 -108249 -38297 -91273
13056 -91273 -227587 -327148 -425261 -555113 -660901 -679018 -542823 -310916 -156231 -182512
13046 -182512 -315842 -363321 -279301 -162247 -103569 -170357 -366959 -569999 -635891 -551026 -418104
13035 -418104 -320768 -253796 -281172 -458895 -769137 -1083225 -1219971 -1106264 -811063 -503545
13025 -503545 -335361 -279424 -256688 -230210 -170189 -139069 -295027 -619817 -859109 -850756 -662901
13014 -662901 -473782 -344306 -282071 -298323 -287182 -147694 149728 517082 751660 764982
13004 764982 634608 470901 286432 49150 -195832 -383112 -474292 -517824 -599058 -698101
12994 -698101 -782614 -866941 -929453 -970721 -971871 -857889 -655199 -482712 -370637 -305660 -235376
12983 -235376 -109330 58465 215896 256050 66201 -348142 -858767 -1294616 -1499513 -1488005
12973 -1488005 -1367435 -1188861 -940002 -744141 -752164 -916000 -1103493 -1223442 -1246819 -1194783
12963 -1194783 -1027184 -720975 -428436 -272034 -170546 -23187 144226 232024 181342 51037
12953 51037 -57308 -140488 -222177 -279491 -365334 -506799 -609205 -589712 -502108 -441770 -446930
12942 -446930 -527588 -642136 -691622 -589878 -367885 -138502 75949 268133 387283 438786
12932 438786 516401 683034 904543 1112086 1220394 1202916 1077717 884074 707680 640109
12922 640109 653187 654797 599528 464582 230548 -64494 -316724 -423063 -441935 -470049 -437150
12911 -437150 -299605 -113057 91036 322384 617056 930485 1143983 1220044 1214515 1172071
12901 1172071 1059678 859388 620920 410645 276592 282938 365796 364593 243004 41862
12891 41862 -206802 -351748 -262934 -15483 240506 410188 447235 355469 209891 119308
12881 119308 138941 183026 171145 93788 1988 -48236 -107298 -208288 -280640 -284400 -260047
12870 -260047 -224628 -122985 47366 177808 222509 275174 342443 293760 135522 -73875
12860 -73875 -334022 -626273 -860502 -862875 -590619 -189429 211880 487494 505849 311333
12850 311333 145695 154307 264618 404832 509538 523443 530111 600472 640970 595170 507512
12839 507512 401022 278961 175171 135181 158443 175324 208922 335977 434988 356850 197728
12828 197728 90330 78625 173651 288538 314959 226658 94879 -3335 -13536 53545 85630
12817 85630 60307 8620 -93033 -206702 -254434 -197186 -21431 256296 522262 643369
12807 643369 569114 347199 104837 -84362 -250382 -431852 -600634 -664865 -501768 -170573
12797 -170573 87299 182392 232447 318685 372873 357896 298958 193293 28931 -161640 -295169
12786 -295169 -331377 -269594 -110229 95577 264967 369646 436541 483079 527845 612194 731064
12775 731064 776979 687446 474193 129342 -286265 -706110 -1086393 -1372998 -1555732 -1562407
12765 -1562407 -1327634 -990172 -792597 -806514 -903607 -977618 -1080683 -1300563 -1577325 -1754504
12755 -1754504 -1715218 -1524983 -1295139 -999881 -677770 -452325 -369055 -399813 -546717 -743615
12745 -743615 -856041 -837477 -686248 -415121 -94794 137227 180416 58362 -147432 -306049
12735 -306049 -324243 -162827 132073 408860 595923 702087 746517 726848 634494 439264
12725 439264 70230 -380319 -738598 -947322 -1075159 -1196276 -1293977 -1326973 -1295549 -1183262
12715 -1183262 -914866 -535572 -218035 -99729 -144110 -136111 75167 282177 240358 75368
12705 75368 -39211 -81365 -91986 -82858 -52981 -34960 29818 125564 122863 59401 82146 107937
12693 107937 -54299 -370285 -645738 -763671 -689972 -442035 -143969 65028 138427 107629
12683 107629 -13144 -212781 -355336 -311290 -171726 -145393 -235232 -324226 -364603 -295106 -81751
12672 -81751 214250 435454 436684 239254 -5779 -205135 -306875 -306466 -321956 -380074 -355393
12661 -355393 -238401 -127560 -63833 -76400 -142801 -204463 -271119 -269428 -126704 29940 27900
12650 27900 -117850 -221749 -204285 -184830 -156609 8091 254916 429736 494438 478673 374767
12639 374767 135211 -172179 -327915 -263299 -74923 33629 -56650 -275621 -492245 -636747
12629 -636747 -727448 -780834 -789989 -737551 -609788 -440384 -294401 -223451 -194934 -163802 -112686
12618 -112686 -31482 47510 114014 139148 97353 82865 146341 190669 140892 6167 -155046
12607 -155046 -259783 -221653 24136 414516 822861 1105674 1184802 1133068 997269 815671
12597 815671 636067 462200 311220 202517 120174 39488 -18523 35294 268821 574750
12587 574750 718847 651588 513646 355585 166102 -45398 -339186 -657185 -816310 -776090
12577 -776090 -603441 -394081 -147361 139847 391360 595670 761660 886206 943252 915754
12567 915754 770631 509988 231422 34064 11556 208308 462172 569315 500790 421237
12557 421237 412264 396420 377250 399797 434451 416619 342356 257954 232505 282987 409955
12546 409955 609970 811003 935225 1020276 1114770 1186813 1184479 1124969 1045514 885171 670902
12535 670902 496317 416166 325627 156642 73941 136529 150234 25870 -114166 -173444 -187529
12524 -187529 -223166 -190478 24591 319327 534101 643285 658093 590279 529305 577460 702976
12513 702976 760395 639088 433665 336688 354857 437783 570697 689866 650960 402015
12503 402015 132605 -7456 -47683 -48598 -14463 60432 182779 315658 329773 165943 -44643
12492 -44643 -179822 -260278 -320375 -350034 -351775 -330804 -325827 -406302 -549397 -674732 -766534
12481 -766534 -877413 -1029695 -1154553 -1173779 -1069956 -929716 -876318 -872963 -805971 -656143
12471 -656143 -504122 -383471 -207255 18905 214194 374441 489959 475063 333317 149583
12461 149583 -4341 -58587 58837 294524 512298 616404 596019 481607 355503 301300
12451 301300 276531 219636 140966 100267 112013 135900 214703 366145 524436 672849 799912
12440 799912 872071 880053 839405 764691 678124 565217 412077 216583 38686 -101097 -266204
12429 -266204 -419907 -521563 -586891 -621123 -651341 -705730 -695045 -587283 -494772 -449217 -368788
12418 -368788 -207733 -19970 73543 -29292 -273746 -422211 -352465 -185810 -58703 -8579
12408 -8579 -9423 -16152 42981 196298 382563 537422 616308 561232 312018 -50304 -353127
12397 -353127 -550877 -676541 -763575 -844337 -946507 -1100024 -1264120 -1315794 -1189432 -989545
12387 -989545 -808675 -676259 -610734 -645525 -769318 -821550 -717855 -565843 -519926 -559136
12377 -559136 -577498 -543336 -533711 -644279 -824462 -963505 -1003932 -887612 -645517 -449123
12367 -449123 -503890 -824329 -1163578 -1343611 -1419567 -1517935 -1685510 -1830681 -1777445 -1473013
12357 -1473013 -1022065 -568369 -210942 48095 203603 251102 221846 123924 7689 -56545
12347 -56545 -70238 -13031 124165 296206 446919 543875 581259 541154 400587 239246 146824
12336 146824 128961 146116 142801 105655 12292 -193334 -472619 -744567 -901329 -855703 -701377
12325 -701377 -574551 -491705 -419110 -369441 -344888 -352342 -420659 -526042 -549186 -401773 -155772
12314 -155772 60019 198253 227962 96095 -119766 -281639 -353760 -315594 -203491 -131774
12304 -131774 -135952 -97969 -27324 -77332 -187468 -207399 -89207 69551 144190 146913 198831
12293 198831 370328 563393 631779 562105 414831 232741 72959 -2689 2721 9517 -11798
12282 -11798 -42209 -105631 -221650 -331726 -362233 -266956 -36646 245776 494371 675744
12272 675744 779692 776963 729857 764095 897087 1032339 1058574 939834 751223 600948
12262 600948 543636 603992 683185 650532 501800 343608 285435 333336 410191 448385 458075
12251 458075 547133 698397 752789 720872 689379 665342 579689 438733 374634 327930 140263
12240 140263 -166695 -492623 -804502 -1050240 -1219949 -1297541 -1201113 -950129 -590845 -93675
12230 -93675 399772 742579 975937 1001184 763116 409401 99177 -58845 3256 201231
12220 201231 418391 565911 571780 411363 147601 -26005 31254 318561 666145 833424
12210 833424 754687 536657 327598 218392 197424 244389 345494 463756 553345 536576
12200 536576 381967 212042 110707 4681 -122411 -190191 -182496 -123176 -34934 -40271 -148637
12189 -148637 -204579 -174902 -94068 52674 235273 399886 512317 577105 675251 820092
12179 820092 927667 971139 1065714 1266806 1474144 1554728 1443631 1176786 861333 585077
12169 585077 405351 328090 289714 227946 149136 106489 87239 4946 -152580 -289164 -283629
12158 -283629 -61281 314140 576297 545979 315132 116641 124399 298288 466250 492053
12148 492053 367254 145076 -73617 -126219 -4853 109724 135043 131182 77932 -78224
12138 -78224 -236380 -205123 25422 277509 425523 464511 459049 360760 57110 -359649 -660740
12127 -660740 -728895 -622042 -441975 -264156 -147480 -68202 74252 323568 597549 741001
12117 741001 644842 375751 85590 -82486 -89255 -88788 -209976 -441411 -709554 -936436 -1105717
12106 -1105717 -1188501 -1207079 -1225858 -1176940 -1024607 -862422 -778627 -775940 -799230 -778273 -732386
12095 -732386 -752188 -792651 -728000 -528283 -263018 -32633 97103 78273 -83210 -330121
12085 -330121 -595692 -843067 -1029524 -1119105 -1118652 -1049006 -943832 -851084 -839960 -887667 -929913
12074 -929913 -893653 -692284 -362198 -95504 -13741 -55022 -61879 -25581 10950 99665 284688
12063 284688 471114 534486 570662 699547 845989 893439 849983 746729 604077 451462
12053 451462 362814 351287 296250 81918 -227825 -393016 -269982 -28692 87319 41744
12043 41744 -79342 -164893 -165953 -129353 -132067 -145463 -63389 90424 142048 36784 -81643
12032 -81643 -199283 -355433 -540122 -744652 -884693 -849202 -655082 -445352 -353851 -338111
12022 -338111 -235859 -12226 260846 515735 705153 773687 746383 691943 617684 515300
12012 515300 420291 374955 365738 302448 211038 218593 310050 401044 459240 508989 594326 672694
12000 672694 681795 677087 720484 769753 760670 732969 742314 703909 547927 354220 272035 328473
11988 328473 350305 290724 243261 227128 183547 19779 -193453 -279801 -234379 -179981 -144143
11977 -144143 -170548 -309696 -557935 -866322 -1156627 -1369348 -1450869 -1335298 -984422 -461310
11967 -461310 -16842 146934 127875 56261 -56369 -235622 -458506 -655295 -830914 -1069518
11957 -1069518 -1326780 -1514034 -1617896 -1693918 -1793125 -1853335 -1834520 -1760076 -1609420 -1319057
11947 -1319057 -915658 -535207 -281745 -111475 68335 259536 403734 480655 552711 650806
11937 650806 732585 743240 652724 453015 205903 17348 -89694 -154463 -132295 -14400
11927 -14400 145478 297312 379263 362826 227942 85080 58952 73502 49638 -11979 -100743
11916 -100743 -185183 -260674 -361244 -481462 -568865 -563973 -406728 -137770 145604 336944
11906 336944 324155 104676 -155563 -321020 -434662 -571379 -705569 -759187 -681105 -413802
11896 -413802 17375 464615 823186 1063428 1184076 1242648 1303710 1324907 1259355 1135036
11886 1135036 974038 801037 693724 696770 760412 853131 945206 1006524 1029092 1030928 1029521
11875 1029521 990816 933405 870367 700377 392534 60250 -216882 -433900 -545666 -456394
11865 -456394 -206856 62753 245012 281145 176741 -16861 -270253 -589771 -932664 -1165234
11855 -1165234 -1156458 -945101 -652439 -333536 -62823 146880 349777 471427 424577 297968
11845 297968 181423 55081 -60330 -117431 -115787 -138933 -279196 -554659 -899249 -1160260
11835 -1160260 -1194216 -1021733 -777764 -590580 -495914 -397332 -253878 -114402 -23525 -538
11825 -538 -26218 -65165 -109245 -202334 -355576 -521640 -653279 -720271 -711535 -621707 -498054
11814 -498054 -424800 -404504 -392946 -416137 -486232 -568332 -651838 -784666 -992609 -1169280 -1211840
11803 -1211840 -1179370 -1135584 -1075251 -950035 -749101 -622179 -608910 -623856 -602134 -489897
11793 -489897 -296314 -126477 -93651 -139861 -104105 29355 166147 192656 28711 -251180
11783 -251180 -509960 -653093 -623449 -428028 -169092 -26383 -43230 -117801 -211559 -351403
11773 -351403 -484091 -549799 -558998 -545166 -464385 -316523 -196725 -160370 -165262 -131643 36442
11762 36442 355308 723923 1063457 1378276 1647203 1841352 1974275 1993151 1857762 1618052
11752 1618052 1361306 1175192 1133508 1277731 1570009 1835996 1991832 2140254 2247592 2228178
11742 2228178 2117897 1945455 1619481 1133600 689630 463558 442362 403505 186535 -152702
11732 -152702 -467039 -683210 -868287 -1111841 -1368903 -1550587 -1597554 -1494700 -1312407 -1134436
11722 -1134436 -1036841 -1022199 -1002712 -847806 -543572 -261985 -137449 -185070 -334018 -464032
11712 -464032 -456637 -341912 -306709 -397247 -498596 -545169 -502102 -400244 -400355 -579398 -844324
11701 -844324 -1099039 -1281506 -1302116 -1126225 -852290 -552053 -274602 -75253 56905 198829
11691 198829 376080 579624 802299 964180 989392 889160 683114 420876 129131 -156798
11681 -156798 -335984 -383741 -328063 -208211 -136500 -197514 -317151 -370359 -309983 -188968 -83149
11670 -83149 -51342 -82624 -16212 200214 467793 697961 793654 668103 394102 84568
11660 84568 -248267 -722137 -1405543 -2028140 -2131707 -1742379 -1189278 -692895 -409281 -330887
11650 -330887 -361064 -464626 -627854 -770814 -860185 -930139 -935084 -847980 -758031 -682553 -577879
11639 -577879 -426472 -264221 -102262 69392 141823 22727 -217749 -495778 -758641 -904028
11629 -904028 -866928 -735275 -613826 -520815 -498038 -538607 -589749 -657460 -730598 -748566 -702816
11618 -702816 -599518 -425604 -252782 -201370 -244850 -257768 -195742 -84890 59640 192038
11608 192038 235029 216470 190961 247149 384475 435535 316201 140794 13752 -60664 -56010
11597 -56010 14893 93083 109791 28572 -105567 -232558 -294443 -254979 -163134 -123319 -132567
11586 -132567 -81738 -38158 -141020 -334761 -463531 -429810 -342264 -366303 -544998 -768078
11576 -768078 -860297 -758956 -527119 -234614 31874 192098 292362 314021 186830 16761
11566 16761 -139655 -361828 -615320 -752638 -713994 -603417 -539875 -486329 -388728 -295015 -248525
11555 -248525 -248236 -402407 -677430 -845671 -726601 -343062 28265 148483 39417 -148300
11545 -148300 -300208 -408164 -485158 -487454 -427099 -370205 -325310 -250150 -147661 -62663 -13823
11534 -13823 25833 100669 170144 109380 -78347 -234043 -294055 -329155 -377176 -438981 -481985
11523 -481985 -455552 -395174 -372108 -347259 -284284 -227774 -185588 -115197 -10886 64154 68654
11512 68654 26768 13848 37041 41594 -7150 -49837 -36233 19559 74539 86711 111318 204591
11500 204591 310955 358832 322470 228370 115758 13507 -51302 -59794 -33814 -35580 -99389
11489 -99389 -204089 -238588 -112958 126616 325898 350912 262368 187011 135841 58158 -39963
11478 -39963 -151689 -317184 -488647 -587937 -618512 -606472 -558950 -475293 -388155 -359116 -444133
11467 -444133 -589303 -676145 -640715 -467520 -160529 247852 592198 702663 573077 375297
11457 375297 218204 17018 -264817 -510582 -599094 -532373 -359811 -132107 78628 183025
11447 183025 92031 -165758 -425829 -567168 -628057 -594771 -433663 -281566 -289701 -412301
11437 -412301 -558168 -679972 -777375 -897152 -1058767 -1173418 -1138702 -1059270 -1039044 -973791
11427 -973791 -783908 -578243 -480579 -501966 -648647 -861999 -1011125 -1041068 -1015569 -963434
11417 -963434 -793488 -502045 -239648 -54448 80362 103510 -47806 -264935 -411827 -484224
11407 -484224 -536733 -585136 -563299 -457146 -310173 -220726 -252229 -306477 -240279 -55737 64934
11396 64934 27716 -104921 -223753 -205595 -37097 207749 425269 537244 571909 536210
11386 536210 434998 356275 324414 363787 442930 432315 287394 18225 -337934 -644860
11376 -644860 -774562 -754756 -679454 -576529 -438040 -334815 -323686 -352354 -326435 -266176 -217132
11365 -217132 -147327 -17310 135251 204747 117910 -86437 -274556 -368095 -456687 -556049 -536260
11354 -536260 -353654 -110799 115736 327656 453004 425027 352891 419144 590211 713138
11344 713138 697938 550346 368616 302979 400508 584604 750496 809735 762780 691004 606986
11333 606986 495274 405889 401500 471960 600563 750367 869652 941620 945611 850714 719490
11322 719490 633379 572433 547435 572345 624958 670644 599597 331573 -39512 -389901 -648034
11311 -648034 -803758 -962298 -1100250 -1082545 -982653 -944533 -949934 -910416 -769266 -592062 -463451
11300 -463451 -407640 -414176 -404253 -334237 -269355 -278536 -363619 -465385 -515708 -488497 -380117 -223315
11288 -223315 -108318 -149032 -348285 -575742 -749002 -841019 -750092 -474455 -228201 -147643
11278 -147643 -119655 -42715 59894 104268 5725 -174688 -308548 -352777 -370577 -445795 -526974
11267 -526974 -579861 -605219 -570025 -467235 -357993 -297042 -238863 -150439 -75839 -22525 96871
11256 96871 253094 268003 134319 27767 -1799 -33502 -111650 -242042 -432095 -657152
11246 -657152 -786123 -764597 -609568 -379882 -191042 -60636 16315 85222 242468 409366
11236 409366 470449 467158 478640 516242 553845 545004 466213 446493 563585 674800 635394
11225 635394 490839 286714 81706 12841 112647 250540 254993 41531 -322726 -622020
11215 -622020 -672442 -539042 -388056 -264030 -141260 -17092 118120 257377 298219 172165
11205 172165 -30755 -217997 -402946 -554096 -626962 -647335 -650506 -611474 -519606 -387765 -225999
11194 -225999 -91798 25046 183226 414609 735209 1020746 1033874 752510 394599 101892
11184 101892 -100469 -213565 -199156 -97438 38782 186641 238506 133564 -81175 -329597
11174 -329597 -526017 -591242 -510732 -344843 -190247 -122625 -151181 -241308 -334621 -351914 -274258
11163 -274258 -214151 -274597 -409794 -540240 -640985 -776506 -1009624 -1258188 -1441148 -1559573
11153 -1559573 -1600643 -1552028 -1423708 -1213946 -907950 -566044 -278433 -94796 -42750 -111495
11143 -111495 -247179 -378466 -459138 -493341 -499694 -406954 -185586 113660 434280 719541
11133 719541 969250 1148405 1144419 929364 618843 314520 65650 -94963 -164121 -155090
11123 -155090 -123409 -139774 -113064 135970 556105 888495 903362 555902 52314 -326192
11113 -326192 -490389 -523195 -497678 -466329 -515946 -722435 -1019584 -1260870 -1311341 -1075895
11103 -1075895 -632411 -273937 -137213 -34183 184734 397102 403621 184262 -61078 -143460
11093 -143460 -57384 57134 90119 38434 -25831 -81580 -132942 -86079 154500 495277 797199
11082 797199 978925 1047026 1044990 983453 891007 776882 674310 608368 525441 345567 134207
11071 134207 -36005 -204470 -291997 -178800 105367 462360 743075 874713 892184 894776
11061 894776 957686 1077105 1214738 1292167 1226105 1014938 750767 522786 353798 229280
11051 229280 91662 -49606 -102794 -38999 33547 -19530 -187764 -308210 -315520 -264988 -168108
11040 -168108 -73404 -60020 -109132 -121640 -2350 164625 287308 308376 147243 -82400
11030 -82400 -167389 -37954 131574 145983 29402 -68141 -42429 89404 227751 322555 418121
11019 418121 510870 588089 715816 821715 740340 511315 269474 113339 73211 117257
11009 117257 213759 307262 296937 140813 -77048 -229342 -259862 -221701 -134120 -15626 56884
10998 56884 78051 76385 10847 -92321 -101038 57766 303126 460369 458896 349037 211445
10987 211445 137193 157115 214886 265269 330674 443983 573168 649498 637161 505628 251223
10976 251223 -12513 -145306 -166240 -93277 77637 254222 343956 400334 484851 586747
10966 586747 646027 597908 524144 535216 576450 552244 497640 479416 501627 599810 761192
10955 761192 921367 1015013 973104 814669 626465 424309 217207 -5161 -245015 -418576
10945 -418576 -507391 -516237 -387063 -148880 49371 152989 259740 464303 679366 802841
10935 802841 836439 759731 577320 320759 45519 -164281 -294851 -406849 -563862 -775351
10925 -775351 -951727 -1013250 -1051793 -1142548 -1222912 -1257603 -1289312 -1256064 -1109695 -945982 -895528
10914 -895528 -995256 -1143347 -1249375 -1310669 -1378164 -1469106 -1481589 -1288735 -985026 -761544
10904 -761544 -666896 -649225 -648164 -584735 -448758 -298202 -156575 -53387 11184 67418 188516
10893 188516 406415 658317 842980 917477 885208 743552 599027 544363 552467 576351 625582
10882 625582 652303 580852 467989 462332 587109 714545 718900 590105 471982 473932 495813
10871 495813 381554 125506 -109997 -231263 -261800 -207432 -79680 9160 4929 -40869 -108889
10860 -108889 -231256 -422784 -645351 -856130 -1050588 -1153349 -1082352 -917955 -719174 -455657
10850 -455657 -132062 157318 347525 466051 555541 636956 696744 724934 743364 698655 508038
10839 508038 196908 -54212 -118818 -169220 -332106 -537782 -699141 -735289 -683326 -595937
10829 -595937 -434962 -223729 -98797 -103865 -95962 -47045 -82727 -287233 -600892 -868267 -1021988
10818 -1021988 -1103282 -1139776 -1115211 -1049467 -1003890 -1005672 -1048165 -1062310 -918589 -657241 -455429
10807 -455429 -391504 -434118 -520492 -609409 -706966 -841981 -1040013 -1284984 -1458687 -1415223 -1161996
10796 -1161996 -828863 -508523 -283335 -280286 -491522 -770268 -933785 -867421 -597494 -266314
10786 -266314 -2319 171906 326843 492713 642101 716620 644203 424429 128789 -155872
10776 -155872 -332284 -340751 -156975 157520 418090 499770 452833 354287 215797 71853
10766 71853 -53563 -205783 -399929 -574526 -633828 -489235 -211134 45610 234194 343781
10756 343781 337764 216151 82727 59101 102442 126318 179677 318845 485148 607274 677171
10745 677171 692705 665584 574528 522941 655497 875912 1046847 1208869 1331825 1282610
10735 1282610 1002532 576119 259667 220363 377118 565124 702281 757660 668968 480522
10725 480522 367191 419294 630570 928997 1222726 1480257 1673491 1791092 1842627 1827939
10715 1827939 1708029 1489581 1287629 1126232 950152 761901 629378 612316 703695 783598
10705 783598 715408 484010 184959 -71627 -224115 -266687 -217431 -143127 -159639 -331605
10695 -331605 -559462 -747434 -903989 -988384 -950448 -861058 -852246 -895729 -816911 -591543 -350842
10684 -350842 -147883 50214 225162 273961 92008 -264794 -623168 -836516 -968383 -1162676
10674 -1162676 -1371366 -1463220 -1466182 -1486650 -1564018 -1593183 -1444048 -1176986 -948221 -821087
10664 -821087 -715648 -536629 -342955 -238551 -220598 -227210 -265508 -423675 -622925 -638786
10654 -638786 -425356 -157270 33295 173512 250469 161433 -43814 -217706 -302454 -303734
10644 -303734 -228992 -165650 -235958 -393071 -444952 -312548 -50820 246756 437763 536560
10634 536560 647942 658991 467081 183766 -47816 -190387 -265391 -292187 -258672 -105792
10624 -105792 134564 338886 493546 638662 666336 473641 153523 -122527 -257203 -281386
10614 -281386 -261645 -214842 -140307 -66286 -25915 22824 147100 292562 310185 154777 -35217
10603 -35217 -185231 -291311 -335184 -293479 -166545 42723 270231 388803 386776 418894 543294
10592 543294 605953 550084 491002 447734 382547 338386 362791 442518 515079 563531 675478
10581 675478 813828 811885 644186 364433 -27645 -459033 -753637 -781609 -563104 -308592
10571 -308592 -232011 -306457 -397234 -385825 -219527 -6608 86903 -2280 -173374 -297858 -330872
10560 -330872 -276388 -221365 -220682 -240897 -282721 -341131 -343807 -216979 56073 428472 801678
10549 801678 1092740 1290096 1308373 1127646 898279 745138 668667 648037 625817 549686
10539 549686 448237 363142 326701 398845 552195 620011 547131 453974 390624 288745 178646
10528 178646 161604 259985 403568 520813 614569 731677 845887 919480 911302 755094 496166
10517 496166 262259 52899 -155601 -344403 -477488 -558250 -589300 -507896 -341306 -233679
10507 -233679 -113031 186719 580806 890075 1040386 1044836 1003950 1045682 1197518 1350835
10497 1350835 1375697 1284809 1198818 1183635 1219526 1237782 1229352 1201338 1128253 1005850 907906
10486 907906 814823 648570 515616 567379 764119 977341 1152108 1240941 1234193 1251752 1288334
10475 1288334 1213546 1035781 810542 583712 451796 486652 684467 944420 1116161 1179293
10465 1179293 1213269 1170067 1031036 873048 690457 470697 294043 279144 394969 442401
10455 442401 369917 244400 49874 -233500 -527490 -688733 -770474 -929331 -1067713 -989006
10445 -989006 -702543 -406794 -269522 -298605 -405217 -554042 -743311 -851975 -706534 -306121
10435 -306121 122430 362538 346426 128285 -138736 -222448 31881 501646 858738 938638
10425 938638 801671 596358 452967 354540 254691 203257 302062 527134 757698 915668
10415 915668 971332 950155 873246 755991 620267 465923 251300 -26663 -234349 -345001
10405 -345001 -501616 -676831 -719841 -618341 -461757 -355540 -377511 -430789 -349260 -143032
10395 -143032 115576 384002 540148 455161 139154 -225217 -427130 -408923 -278350 -111175
10385 -111175 111794 370482 575733 692953 768046 809822 813116 818702 901209 1100822 1378866
10374 1378866 1596270 1654885 1640482 1577936 1434057 1263116 1106785 1013845 929940 736323
10364 736323 519243 498464 689326 933003 1076998 1028694 874820 752470 628010 410663
10354 410663 194083 133970 160150 135659 39214 -114594 -267413 -289011 -125165 130963
10344 130963 309418 363985 327133 219553 86461 -39213 -138088 -170653 -133160 -80466 -3786
10333 -3786 118936 319822 571580 734604 730870 587993 419606 373681 516805 781115
10323 781115 1005041 1108631 1051135 825285 549265 331796 238594 246208 188553 -13030
10313 -13030 -229186 -346087 -370463 -368577 -444880 -586944 -727126 -833766 -852515 -807570 -799659
10302 -799659 -838356 -887693 -920339 -942532 -995719 -1067521 -1086972 -1009315 -812289 -493579 -144733
10291 -144733 124682 246310 289494 386318 534001 669657 714198 580925 332729 79068
10281 79068 -206945 -515886 -729049 -815511 -790188 -683386 -538069 -376247 -250644 -237506
10271 -237506 -363401 -527674 -596063 -561031 -462466 -291582 -118159 1471 118536 226018
10261 226018 201835 27629 -257507 -622209 -957524 -1066402 -878503 -492150 -103371 108803
10251 108803 167371 203175 224123 171127 59098 -97736 -282532 -425117 -521260 -527214 -401579
10240 -401579 -188679 20441 168446 213405 125841 -26091 -134021 -185586 -220815 -269497
10230 -269497 -414392 -601059 -689268 -633243 -434231 -125286 180079 417963 567797 644978
10220 644978 686391 686678 603065 391221 82144 -233554 -442933 -472129 -347050 -188049 -145447
10209 -145447 -224598 -301909 -259721 -144422 -88981 -75832 1152 136440 244490 238413 109275
10198 109275 -68185 -232398 -328535 -329610 -330379 -425325 -610731 -792873 -820136 -718376 -611429
10187 -611429 -512396 -438804 -413767 -390942 -351660 -348085 -407168 -470820 -444369 -283491 -32946
10176 -32946 199234 330346 401705 434477 393487 307381 247309 281401 406132 575646 770032
10165 770032 959478 1123762 1262227 1395591 1528624 1661992 1722646 1614272 1356911 1083565
10155 1083565 885266 748578 661915 634775 673598 775213 939738 1143180 1298667 1322385
10145 1322385 1235319 1130118 1055751 991889 915676 872313 864376 846096 833872 782365 624844
10134 624844 460407 484596 771286 1134272 1360455 1415064 1366899 1309625 1298549 1332711 1419914
10123 1419914 1616797 1925948 2281931 2674334 3147958 3718735 4335217 4984830 5808051
10114 5808051 6881611 8072831 9179546 9985399 10386265 10542369 10631903 10699946 10705117 10626269
10104 10626269 10476359 10267690 10100934 10105351 10330535 10865291 11817543 13188062 14836292
10095 14836292 16355785 17130726 16764791 15500798 13954174 12618092 11642653 10856929 9977481
10086 9977481 8910977 7813409 6903120 6319538 6080692 6047485 6000844 5892372 5699615
10077 5699615 5344365 4861223 4285664 3631244 2988070 2420262 1983458 1786051 1853738 2032778
10067 2032778 2154199 2207506 2263371 2354217 2457734 2494809 2373801 2150142 1938368 1721943
10057 1721943 1428150 1106096 867439 737081 628007 512501 473265 575468 855054 1236026
10047 1236026 1539623 1653827 1546040 1253694 933091 796340 894665 1123661 1317714 1357515
10037 1357515 1253650 1079669 960071 916265 792475 528625 230076 -16157 -265884 -501413
10027 -501413 -612878 -667121 -735142 -759046 -701595 -587903 -420572 -236414 -126870 -132544 -196292
10016 -196292 -288171 -399103 -462253 -467268 -530565 -666570 -773967 -857191 -989039 -1128391 -1162154
10005 -1162154 -1031080 -783306 -554921 -386459 -189868 84191 352878 476531 476212 466213
9995 466213 480530 427621 216900 -30985 -130459 -90852 -32026 -19109 -14919 -45412 -114724
9984 -114724 -184619 -222566 -212858 -184898 -129339 -71143 -57145 -44749 93185 372785 677941
9973 677941 864588 843164 683492 526777 474136 499355 531263 505409 426681 339581 264907
9962 264907 275512 409816 527105 464326 229199 -107656 -453763 -703939 -840685 -897020
9952 -897020 -903805 -904241 -886033 -855774 -789467 -659219 -500005 -335476 -148036 60475 235508
9941 235508 380750 504053 573290 586090 550978 485491 431886 346358 179386 37836 29778
9930 29778 42595 -49079 -164797 -252518 -344994 -458162 -603222 -688108 -593122 -332122 -21337
9919 -21337 210775 366327 511528 631330 737138 839876 844127 669842 355647 2710
9909 2710 -319151 -527127 -516241 -349628 -217015 -219789 -316352 -453608 -583095 -586507 -443813
9898 -443813 -305380 -250873 -232595 -277692 -417509 -551535 -554270 -411180 -164744 102497 297410
9887 297410 451583 583686 610944 540560 500559 488836 364251 117688 -122556 -240735
9877 -240735 -209967 -138545 -109205 -100050 -114024 -179094 -260334 -291612 -248644 -136813 33840
9866 33840 256978 517850 780555 954046 942325 797018 702119 767413 917231 964609 864408
9855 864408 728416 641533 606746 568685 470736 364966 340854 409468 499828 520292 471950
9844 471950 401748 312248 212574 125310 68189 44779 -50246 -251396 -478955 -673360 -776126
9833 -776126 -786659 -719167 -521921 -316779 -365154 -657887 -902845 -979898 -975855 -936831 -853671
9822 -853671 -649142 -360165 -138455 -57374 -95676 -163371 -231283 -298999 -349293 -412895 -492290
9811 -492290 -554037 -576862 -572371 -531216 -423091 -306162 -289679 -370243 -434404 -367252 -171804
9800 -171804 51359 264233 427624 448203 338344 170714 6081 -48715 -14940 -3245
9790 -3245 -42075 -86488 -128686 -182977 -235715 -233017 -143898 7599 172878 263299 245438 170639
9778 170639 80904 27898 82950 276458 555354 777070 868865 930948 1027044 1088797 1011143
9767 1011143 725342 340018 42230 -95041 -137526 -135801 -90270 43020 251495 391776
9757 391776 375161 260893 82668 -155446 -429111 -670402 -749951 -699572 -663859 -689955 -721207
9746 -721207 -669469 -565792 -485058 -468955 -546362 -673652 -732596 -690279 -593164 -522905 -507185
9735 -507185 -447646 -270242 -26154 171077 268293 310440 272790 64802 -258707 -465416
9725 -465416 -413055 -276946 -343163 -634611 -945414 -1140435 -1216976 -1181577 -1079805 -923130
9715 -923130 -667085 -393416 -173519 52455 257910 350634 316980 222619 139851 71110 -26607
9704 -26607 -158405 -280535 -310596 -235507 -55911 161364 268818 258358 231300 250755 286616
9693 286616 283801 221778 151663 116987 94307 28331 -51018 -45902 50848 165578 144145 -27222
9681 -27222 -143052 -130049 -17553 177732 356716 469811 565509 661275 724012 711161 619097
9670 619097 488948 347408 159839 -116281 -473582 -807217 -957936 -861682 -640102 -469840
9660 -469840 -385103 -315269 -207138 -68503 26938 -18622 -163895 -258703 -204554 6887 318962
9649 318962 609484 737427 701977 634111 563056 383257 111665 -90395 -190111 -293207
9639 -293207 -364239 -265173 5352 301761 459860 384229 172077 -6223 -136020 -246881
9629 -246881 -357882 -492038 -597498 -629286 -577567 -465976 -362750 -294664 -233715 -164399 -92854
9618 -92854 -88686 -238828 -526650 -801975 -896156 -809638 -672703 -466597 -185230 9391 55692
9607 55692 27584 -8850 -9831 38670 156607 339868 476218 458341 348135 304870 378326
9596 378326 510035 649233 808237 1005630 1206934 1315720 1293090 1162659 902207 548362
9586 548362 270639 141601 121650 178287 251273 278259 235485 184273 202567 254774 266359
9575 266359 217157 150742 107563 81582 79197 142243 337401 673393 998824 1174394 1220899
9564 1220899 1187973 1107933 1006561 887584 730182 548893 302671 -95189 -594945 -986592
9554 -986592 -1174586 -1232931 -1221695 -1125648 -927583 -759002 -771616 -987381 -1359042 -1717737
9544 -1717737 -1816951 -1606493 -1291069 -1046562 -879560 -729609 -485960 -125814 206626 380562
9534 380562 354701 201519 70646 55218 101199 126775 151457 183355 162486 154053 218676
9523 218676 323413 410919 354742 86943 -352608 -842201 -1154418 -1191626 -1174634 -1304405
9513 -1304405 -1544756 -1810194 -1951636 -1823700 -1536562 -1322594 -1292401 -1418472 -1582940 -1701254
9503 -1701254 -1762272 -1779684 -1809308 -1840009 -1780056 -1608225 -1375945 -1152276 -971732 -860420
9493 -860420 -879557 -1021416 -1171710 -1200977 -1056904 -743731 -300623 161128 520013 788344
9483 788344 935035 842077 604437 431070 381063 392603 426051 443106 390024 248518 28687
9472 28687 -195397 -295481 -280007 -285572 -358048 -413763 -387777 -305447 -299841 -395170 -475696 -477503
9460 -477503 -383287 -262817 -212096 -235448 -288969 -380055 -493058 -580538 -638728 -670552 -645935
9449 -645935 -548432 -397576 -216926 -85591 -56784 -128572 -258736 -345911 -283032 -57314 211023
9438 211023 349485 311602 295118 461000 649995 651343 444245 140237 -106069 -221726
9428 -221726 -267944 -316895 -356794 -346803 -246080 -19711 312913 662918 977031 1253640 1470640
9417 1470640 1612903 1660357 1591112 1425543 1173884 901238 729413 633081 470104 271557
9407 271557 170793 224074 397069 537450 591197 608414 559046 429624 349045 446272 714420
9396 714420 1029235 1291647 1557764 1925171 2491211 3300074 4251191 5278911 6416181
9387 6416181 7531248 8186030 7917068 6828172 5476256 4258218 3313095 2668047 2194313
9378 2194313 1702150 1209931 873735 737840 706635 671634 656019 692955 683516 567985 377523
9367 377523 174339 13090 -150629 -316038 -366362 -307123 -218211 -206460 -282063 -344071 -378650
9356 -378650 -417700 -495811 -665321 -850308 -883463 -743665 -494206 -197289 54432 220623
9346 220623 347620 500003 681142 910980 1278174 1727291 2085422 2268417 2276650 2147995
9336 2147995 1952282 1738894 1563323 1438652 1287830 1093125 889025 707795 602160 603928
9326 603928 631911 597580 549139 583890 646692 677478 726322 837141 1036737 1303675 1608783
9315 1608783 1887724 2022323 1984744 1844546 1744666 1725594 1659326 1536852 1454083 1472176 1593257
9304 1593257 1757092 1822360 1815995 1914822 2057849 2082775 2034684 2046738 2177437 2365169 2586303
9293 2586303 2934869 3397000 3845181 4216024 4458507 4590586 4742834 4920323 5024524 4990156
9283 4990156 4731398 4278159 3801769 3423178 3176930 3005394 2828761 2717959 2746336 2838931
9273 2838931 2910467 2933808 2869798 2665275 2387419 2191886 2148202 2162050 2103341 1995955 1904972
9262 1904972 1812291 1675948 1469210 1207968 974599 838858 787397 724039 587769 394453
9252 394453 178612 -31738 -198407 -289561 -268011 -125318 -4767 64156 269217 616654
9242 616654 886822 995717 981982 885863 779724 649384 447429 237962 90173 -4872
9232 -4872 -43838 -19499 6312 1490 48008 219141 470954 716707 934829 1156434 1411297
9221 1411297 1662773 1856173 1936969 1920248 1945020 2122589 2417360 2761915 3128682 3538976
9211 3538976 3993072 4443440 4824927 5033530 5038514 4886344 4652795 4424175 4251439 4133728
9201 4133728 4073650 4045786 3958372 3767627 3490874 3127983 2696101 2342903 2144189 2049730
9191 2049730 2004130 1895023 1628490 1304943 1141784 1178512 1303726 1406610 1400103 1266526
9181 1266526 1066857 962335 1028400 1158657 1220942 1138626 876652 589229 487991 556531
9171 556531 678786 770585 806068 822250 783086 598571 332577 101561 -84879 -257576
9161 -257576 -428222 -535411 -494322 -313019 -80080 160833 401029 551691 500995 292288
9151 292288 80945 -71954 -183134 -242517 -209160 -69122 126761 339510 589642 821975
9141 821975 879459 736597 505989 313716 201965 124213 55333 -48940 -175131 -243355
9131 -243355 -158883 116503 430569 651612 773336 821683 849448 878865 892353 866705 801390
9120 801390 674657 443766 87149 -318923 -626562 -774994 -795046 -647012 -324210 27467
9110 27467 251987 355552 437660 540204 612657 575361 390483 91960 -164501 -187416 -21033
9099 -21033 78929 -13165 -166978 -225624 -166474 -46043 72788 151127 206364 199353 24247
9088 24247 -327852 -704454 -916668 -952985 -908434 -798929 -662775 -614256 -645615 -540796 -159409
9077 -159409 338577 772907 1105103 1381205 1597036 1730459 1728547 1551223 1299122 1002086
9067 1002086 668994 416877 401416 599999 791870 823402 750081 700292 678432 689149 730197
9056 730197 772497 835489 915271 988688 1066040 1177504 1357050 1542311 1640493 1634100 1550779
9045 1550779 1409573 1252077 1161645 1166057 1207872 1205969 1096094 867462 548407 200175 -56035
9034 -56035 -184657 -233162 -254082 -262731 -216102 -38564 258056 559450 769172 838451 835890
9023 835890 868502 904572 897836 835022 699801 465363 212836 75267 75196 114816 87781 24821
9011 24821 -18107 -48023 -91606 -160244 -147251 31042 311416 586655 734141 684585 493393
9000 493393 265303 86236 -55372 -202779 -355135 -509191 -611938 -627105 -585345 -473432
8990 -473432 -256549 -11078 101301 41682 -60945 -136670 -199701 -250726 -326751 -452266 -507743
8979 -507743 -439186 -264137 -39642 139589 264431 360107 411348 341186 110431 -212753
8969 -212753 -460042 -507241 -466967 -419327 -229943 138354 449837 514649 408892 239852
8959 239852 61825 -98680 -209543 -270834 -301179 -273510 -141077 101374 397251 627423
8949 627423 758649 795944 770653 687995 494678 223543 22749 29787 139211 188421 175679
8938 175679 115719 51366 11232 -4793 13844 43280 109545 241940 403191 470977 382036
8927 382036 231071 76444 -49818 -67029 47393 274796 554782 779628 941313 1052985
8917 1052985 1012878 838610 650458 480988 319276 191421 190423 325286 504382 592789
8907 592789 527126 325966 58077 -258678 -583490 -824666 -910229 -790240 -486273 -142024
8897 -142024 76484 147347 174209 241044 331014 352444 283871 183230 61987 -59662 -138735
8886 -138735 -218681 -328893 -414832 -442120 -424114 -373948 -317957 -342274 -479137 -657563 -817390
8875 -817390 -918903 -928016 -840348 -675029 -541624 -441209 -309215 -178844 -96390 2660 204018
8864 204018 481647 736256 850697 764082 548012 329303 181195 103138 60250 -28825
8854 -28825 -196953 -368286 -440478 -430466 -454382 -440601 -307087 -170335 -117520 -117276 -125929 -109352
8842 -109352 -47769 40902 36479 -132226 -294312 -308668 -220422 -150992 -129614 -36427 144570
8831 144570 300881 452773 657073 892119 1110583 1189956 1091414 969599 904286 852295
8821 852295 760145 624391 475630 281068 68513 -53845 -79174 -35042 97826 305743
8811 305743 476692 495123 311162 41590 -155962 -244687 -253923 -267862 -364896 -533902 -767677
8800 -767677 -1045504 -1250812 -1264194 -1087905 -823732 -599361 -531096 -580687 -642829 -642609 -486094
8789 -486094 -199943 86095 323630 566481 908876 1365379 1812727 2084429 2139235 2111195
8779 2111195 2159406 2318433 2657242 3176131 3641333 3802972 3609608 3202157 2744599 2307662
8769 2307662 1891928 1524998 1180720 858248 637702 534090 470867 417940 425058 498526
8759 498526 550619 495247 335160 155338 -16636 -205743 -381867 -462524 -420104 -260056
8749 -260056 -61297 44756 -3182 -96325 -133759 -136243 -66516 125105 427401 784353 1088574
8738 1088574 1276142 1339990 1317900 1301931 1324666 1285625 1024392 489626 -162151 -665565
8728 -665565 -823005 -674746 -418956 -170702 34537 149466 188066 189874 79025 -139671
8718 -139671 -285151 -293274 -226629 -146408 -75108 -18733 43836 179892 272880 128733 -219004
8707 -219004 -631813 -983302 -1130126 -1019651 -745874 -442850 -199326 -84569 -89311 -129309
8697 -129309 -197809 -322504 -407106 -362304 -228660 -98859 -44498 -95513 -170897 -142798 -37830
8686 -37830 93362 269374 388881 374222 341476 371018 449331 614708 790186 851964 843003
8675 843003 814438 704262 464672 156563 -169998 -476763 -663775 -637277 -432926 -236581
8665 -236581 -155596 -123557 -62576 4957 -21225 -202256 -527162 -926687 -1248085 -1321316 -1178626
8654 -1178626 -940894 -677799 -452568 -295292 -175941 -78631 -54250 -80078 -40888 121324
8644 121324 359022 549303 620383 642353 691366 745544 772260 784307 755140 574349 216300
8633 216300 -179100 -442326 -480746 -360004 -231427 -137506 -45015 1301 10514 -18653 -147090
8622 -147090 -360464 -589691 -730875 -716910 -523142 -208783 95804 319798 417420 429059
8612 429059 432749 468442 505711 497388 427858 343177 277175 222705 186529 155434 167629 313790
8600 313790 568999 816936 1017220 1183365 1307453 1310332 1192612 1090931 1006201 924203
8590 924203 931900 1018248 1097198 1094385 1003235 866323 715532 575534 480193 423782 328846
8579 328846 168744 7015 -68219 -103095 -290243 -681184 -1079247 -1322958 -1358592 -1222721
8569 -1222721 -1044896 -948458 -975326 -1026728 -1054408 -1042777 -888916 -598141 -252936 85681
8559 85681 405733 645969 760681 784147 730904 659794 632732 637978 631002 575430 542246 627264
8547 627264 756231 795507 734157 662064 621149 621917 688896 771295 798588 853472 977681 1086238
8535 1086238 1097953 984845 833581 732064 702910 719801 731359 761171 841842 968210 1157741
8524 1157741 1393818 1552351 1509820 1282017 1041442 934220 922297 854012 607603 203222
8514 203222 -222533 -529629 -652373 -612377 -452328 -255697 -54545 170576 352821 435306
8504 435306 421489 390056 457976 565281 576068 524895 553642 696804 884299 1009750 991088
8493 991088 843405 663502 551070 481129 393222 395221 592582 882960 1093265 1153547 1120372
8482 1120372 1024530 884088 797772 798381 806448 751481 580193 383585 285569 246905 196274
8471 196274 100022 -35902 -176101 -269792 -277002 -242511 -181758 -48732 103828 137400 2433
8460 2433 -192781 -296439 -270254 -122081 135366 408591 548808 480467 279674 93003
8450 93003 -4930 38038 222756 381474 400539 410501 547527 746012 856292 828822 800595
8439 800595 894840 1018522 1041814 965832 902099 972898 1120401 1198270 1194310 1171130 1125671
8428 1125671 1052217 974474 900732 839175 808382 821055 835023 798214 732928 686503 628036
8417 628036 573186 556012 584792 647895 766540 936607 1118969 1299190 1482896 1686296
8407 1686296 1844584 1874020 1806356 1740160 1744213 1841967 2042848 2289107 2457476 2525629 2562245
8396 2562245 2557770 2496167 2424062 2419196 2516776 2661210 2781869 2804614 2720383 2631548 2604983
8385 2604983 2608869 2566416 2489206 2447434 2493227 2535268 2424201 2227425 2072109 1953728 1828495
8374 1828495 1662134 1474150 1339046 1251013 1213104 1230062 1247507 1269320 1309986 1339353 1372584
8363 1372584 1411610 1418204 1398326 1440978 1602638 1871480 2202067 2525002 2789377 2990684
8353 2990684 3126645 3143196 2968137 2737279 2605884 2488658 2211789 1797580 1452976 1271718
8343 1271718 1219213 1254989 1333452 1394145 1336310 1231023 1179709 1131533 1052884 962231 899454
8332 899454 909262 977406 1092896 1260066 1404032 1425005 1327898 1219820 1185476 1211401 1288721
8321 1288721 1339719 1282730 1157575 995791 838642 783718 872018 1006997 1053232 970004 843513
8310 843513 849736 1063241 1376203 1603448 1583564 1375622 1191971 1106144 1062993 1089505 1216321
8299 1216321 1381235 1526083 1635932 1713196 1795801 1920149 2062471 2188785 2221046 2102380
8289 2102380 1869463 1582398 1282898 1051003 987286 1060075 1158844 1278783 1467997 1680455
8279 1680455 1847893 1954720 2056349 2103814 2015560 1851026 1678296 1568893 1574940 1631033
8269 1631033 1626090 1617206 1696539 1859822 2069753 2236171 2351548 2459025 2520290 2514515 2472978
8258 2472978 2387161 2268696 2123039 1950640 1767942 1600171 1427739 1197647 937274 738715
8248 738715 637201 544913 376916 247232 262373 364250 515207 657431 743690 790612
8238 790612 842550 924789 997027 1066637 1170929 1277777 1339687 1327549 1232653 1151934 1194077
8227 1194077 1287171 1368833 1471754 1578221 1630587 1636003 1601321 1520723 1409895 1338317 1395698
8216 1395698 1614056 1970185 2344429 2548475 2574521 2539116 2567358 2694035 2799888 2776563
8206 2776563 2711176 2725024 2749719 2631895 2352822 2067722 1910924 1883302 1914862 1989590 2094208
8195 2094208 2174390 2142061 1945422 1677210 1467682 1375742 1426533 1597507 1796922 1913645
8185 1913645 1903281 1870696 1882735 1891573 1897256 1908140 1969563 2143838 2359102 2469897 2441030
8174 2441030 2442968 2646049 2976004 3270065 3473687 3618059 3691517 3622957 3373862 3089454
8164 3089454 2916592 2928179 3105920 3286779 3373906 3392241 3431036 3583000 3821679 4059445
8154 4059445 4267093 4456729 4606546 4674128 4626573 4545048 4575522 4718040 4860046 4870087
8144 4870087 4707873 4488803 4367138 4390101 4579016 4858231 5033568 5064392 5153047 5415520
8134 5415520 5717574 5975526 6207152 6407962 6553246 6641739 6796679 7204729 7891892 8709377
8124 8709377 9580329 10540617 11635419 12792844 13818186 14427595 14382578 13650102 12450012
8115 12450012 11113847 9889920 8880819 8092930 7540131 7181772 6937769 6741481 6616275
8106 6616275 6613360 6704449 6806358 6804858 6623722 6348866 6107456 5935825 5895109 5961885 6033520
8095 6033520 6075763 6064286 5966617 5807098 5601789 5310518 4920423 4489522 4062033 3647263
8085 3647263 3364036 3275396 3241118 3175482 3163021 3225333 3311395 3428469 3564716 3639891 3571943
8074 3571943 3373358 3133391 2946991 2868045 2818851 2755266 2739953 2804475 2861965 2835948 2798323
8063 2798323 2799358 2846358 2942690 3021714 3038685 2989002 2898794 2884388 3016645 3219146 3424264
8052 3424264 3653789 3905376 4087132 4204759 4269138 4209930 4064349 3965454 4049016 4296372
8042 4296372 4511210 4591821 4655538 4788700 4903516 4853769 4632814 4397224 4312004 4380492
8032 4380492 4436323 4395529 4354376 4380341 4401200 4374552 4351936 4416344 4561590 4693156 4757783
8021 4757783 4830476 4929302 4981938 5025175 5168546 5446557 5811073 6219857 6651444 7077599
8011 7077599 7485257 7843826 8103331 8256376 8354086 8438019 8554158 8812089 9323525 10052751
8001 10052751 10918263 11891744 12990020 14230187 15666274 17471942 19854836 22767323
7993 22767323 26034478 29683489 33799020 38276294 42714685 46553231 49315205 50694506
7985 50694506 50558983 49024206 46372175 42968689 39249098 35596244 32216200 29157263
7977 29157263 26389678 23886420 21712580 19988221 18725280 17815858 17247813 17051180 17083238
7968 17083238 17134007 17123236 17031265 16829228 16543749 16205980 15870896 15535979 15195623 14889865
7958 14889865 14582779 14309014 14177163 14241185 14495168 14939990 15516502 16119945 16768586 17609297
7948 17609297 18806830 20415077 22358308 24552266 27080859 30145195 33897287 38422036
7940 38422036 43806970 50176125 57788862 66927743 77676501 89871010 103102582 116616206
7932 116616206 129288206 139864997 147224649 150514657 149286693 143631927 134257287 122407186
7924 122407186 109581661 97044208 85556327 75473799 66872772 59644378 53644119
7917 53644119 48793680 44884729 41700762 39203605 37299578 35831014 34712519 33892411
7909 33892411 33263211 32652990 31940420 31104702 30162163 29149001 28027386 26876400 25980069
7900 25980069 25567186 25613240 25957827 26480022 27129405 27949637 28955208 30159477 31670369
7891 31670369 33587096 35921434 38728798 42146499 46371402 51624565 58086484 66107814
7883 66107814 76170343 88697585 104030403 122458973 144112449 168824662 196039605
7876 196039605 224560539 252443792 277105344 295773808 306102171 306577564 296996070
7869 296996070 278666429 254126959 226543309 198844294 173124074 150477330 131152273
7862 131152273 114988095 101687615 90821788 81916780 74709251 69042427 64709758 61452535
7854 61452535 58916960 56774213 54825172 52974247 51169862 49358613 47435457 45391704
7846 45391704 43376519 41544579 39978458 38674267 37578587 36699833 36154493 36011188 36234376
7837 36234376 36792609 37680858 38973673 40841620 43411465 46698589 50742149 55756459
7829 55756459 61989351 69606300 78866505 90189378 104113514 121126740 141543464 165520610
7821 165520610 192931340 223164511 254790967 285410017 311797612 330575264 339175975
7814 339175975 336388724 322638545 300020457 271678649 240954552 210825103 183307013
7807 183307013 159235160 138695981 121387308 106892390 94881656 85119350 77360489
7800 77360489 71179125 66114917 61922555 58497271 55779527 53621408 51667154 49680047
7792 49680047 47656170 45599128 43544508 41563257 39747576 38232068 37054652 36141267
7784 36141267 35398181 34826941 34590266 34750695 35295346 36217397 37439318 38926780 40878061
7775 40878061 43566378 47037082 51266026 56425833 62771218 70533436 80012949 91592384
7767 91592384 105652696 122574021 142723643 166129610 192068826 219037324 244875056
7760 244875056 266968330 282613120 289564134 286736420 274593695 255020940 230725932
7753 230725932 204509743 178645243 154676981 133501236 115430238 100344059 87880658
7746 87880658 77577676 69063149 62092944 56415212 51714872 47780050 44507096 41766106
7738 41766106 39391048 37276186 35363385 33597314 31924314 30330210 28838656 27486279
7730 27486279 26355072 25556946 25025771 24599765 24160848 23744766 23581721 23699955 23998005
7721 23998005 24479595 25153236 26119121 27420747 29006454 30912016 33321038 36356961 40050602
7712 40050602 44625053 50420974 57579344 66069396 75924592 87132999 99397582 112181096
7704 112181096 124638671 135464865 143171210 146568251 145091256 138965390 129065688 116690011
7696 116690011 103396268 90523102 78760815 68302696 59304051 51833434 45677210
7689 45677210 40488988 36037980 32222655 28965017 26196049 23842962 21862827 20253751
7681 20253751 18912012 17701176 16558508 15490284 14525016 13659000 12899815 12305840 11919300
7672 11919300 11665353 11391697 11063489 10749605 10411602 10013282 9667328 9572369 9822146 10304896
7662 10304896 10846424 11390236 12032501 12826058 13759841 14905753 16317117 17967252 19839372
7653 19839372 22035236 24666857 27764242 31356028 35367672 39511821 43300373 46319952
7645 46319952 48296142 48972302 48250548 46179064 42963220 39012137 34759497 30595089
7637 30595089 26832181 23634219 20967793 18617680 16460778 14559569 13017191 11837991
7629 11837991 10952229 10283944 9767046 9306957 8765560 8105738 7466317 6984784 6634801
7620 6634801 6342618 6119381 5939929 5676568 5331421 4993073 4646329 4225122 3777604 3376518
7610 3376518 3086519 2924845 2791136 2652799 2565988 2531333 2523654 2555933 2576914 2533289 2490780
7599 2490780 2554193 2742299 2991067 3215770 3383356 3470291 3470345 3414217 3299738 3170949 3151418
7588 3151418 3272430 3415511 3501020 3554168 3561930 3516683 3548841 3676839 3850871 4096699 4403345
7577 4403345 4725288 5020689 5216061 5259251 5142937 4904320 4670551 4668162 4968146 5419000
7567 5419000 5849859 6240375 6668275 7140866 7680402 8302036 9000751 9799499 10689173 11618716
7557 11618716 12538923 13479943 14606815 16051557 17767755 19610485 21497906 23425235
7549 23425235 25403047 27451797 29552025 31657965 33760120 35930863 38239811 40559767
7541 40559767 42723178 44712042 46424734 47603016 48027609 47489463 45909546 43513963
7533 43513963 40682574 37732193 34881140 32220703 29728486 27328869 24948497 22627142
7525 22627142 20451121 18481770 16775593 15359969 14224873 13354000 12626849 11829482 10921734
7516 10921734 10030199 9222655 8544826 8119817 8002117 8048716 8082550 7951752 7639642 7347566
7506 7347566 7184707 7114329 7120867 7183198 7206300 7106262 6891969 6638017 6389396 6152589
7496 6152589 5954732 5767458 5546050 5352327 5227323 5072482 4871882 4700068 4583059 4511460
7486 4511460 4498303 4427443 4213759 3995874 3840450 3713309 3581885 3398500 3188217 2951997
7476 2951997 2624500 2338939 2268046 2345589 2462830 2594862 2686473 2722914 2742203 2743554 2732044
7465 2732044 2650735 2434742 2160198 1987568 1953777 1959164 1957543 1892539 1776234 1763846 1953049
7454 1953049 2260354 2495893 2568845 2532328 2412993 2179297 1914059 1808652 1895278 2048848
7444 2048848 2157713 2203633 2227379 2212850 2152426 2120677 2136498 2203869 2262469 2224441 2078324
7433 2078324 1901233 1786042 1741494 1732441 1718506 1726026 1853834 2118674 2429943 2776958 3149791
7422 3149791 3431631 3539147 3548026 3579071 3688373 3845013 3970128 4025759 4064765 4173441
7412 4173441 4358860 4603116 4898739 5222514 5595342 6037511 6505944 6928768 7224601 7343273
7402 7343273 7322998 7309409 7400328 7491382 7447620 7332834 7348653 7561768 7876327 8247969 8668441
7391 8668441 9080719 9387015 9539578 9569825 9477972 9246531 8899943 8493553 8114067 7820714
7381 7820714 7601021 7379965 7082551 6715568 6330118 5932450 5605512 5492082 5626822 5947686
7371 5947686 6349024 6660377 6763101 6690726 6492589 6184497 5871207 5646773 5453542 5209640
7361 5209640 4929022 4667688 4436405 4230479 4095850 4019231 3892028 3609735 3170535 2753496
7351 2753496 2568100 2639679 2837298 3017864 3156443 3299773 3350998 3218578 3033440 2934904
7341 2934904 2922509 2871033 2727477 2520015 2294777 2119501 2011756 1967684 1981161 1990103 1951502
7330 1951502 1862326 1834932 2009782 2305912 2554985 2714501 2765272 2683845 2502067 2292472
7320 2292472 2097978 1947943 1887235 1866211 1846373 1888454 2070943 2355156 2622242 2741229
7310 2741229 2673378 2542850 2491240 2528686 2579513 2616654 2676695 2713559 2670439 2595104 2573373
7299 2573373 2604324 2611083 2610414 2702120 2836821 2904055 2864695 2720119 2645799 2799287 3106563
7288 3106563 3431792 3708298 3955696 4149381 4241403 4279532 4343692 4471549 4635493 4757841
7278 4757841 4862672 4989733 5084481 5155805 5226727 5372152 5640054 5973021 6262555 6482271
7268 6482271 6653510 6753039 6764252 6741740 6782031 6962700 7279438 7644527 8099591 8783846
7258 8783846 9679404 10671245 11803574 13099751 14451787 15853291 17512491 19607496 22085484
7249 22085484 24788283 27663088 30640195 33639715 36625488 39515008 42149785 44378630
7241 44378630 46122304 47429936 48321122 48687533 48510749 47888012 46893218 45664767 44451102
7232 44451102 43392603 42506850 41838581 41496188 41466465 41414434 40737970 38972356 36158393
7223 36158393 32687586 29029775 25557563 22479374 19865776 17769340 16167321 14887872
7215 14887872 13776167 12754341 11824484 11012074 10291405 9660205 9150683 8802074 8644631
7206 8644631 8595798 8503934 8315476 8089032 7821000 7499752 7154119 6800563 6467311 6182767
7196 6182767 5874996 5462314 5003968 4587426 4208342 3855213 3559204 3324428 3150050 3082421
7186 3082421 3097013 3067379 3044516 3138543 3226316 3167888 2972233 2724821 2548355 2506699 2532836
7175 2532836 2525236 2468581 2372710 2284709 2253230 2241417 2115084 1845526 1568837 1371333 1235965
7164 1235965 1240622 1414034 1595056 1672845 1689551 1780180 2016599 2329367 2631295 2842549
7154 2842549 2865478 2677801 2308909 1830257 1338981 890451 533669 316124 220773 189960
7144 189960 185599 197436 189656 124780 92006 149321 202918 214369 246530 344998 553908 840019
7132 840019 1110150 1265118 1215298 1022889 823898 683959 599897 532983 433844 248017
7122 248017 41480 -23629 88430 252651 398530 537831 621096 584866 482982 424823
7112 424823 464870 540284 607554 683147 749498 752272 584906 231630 -132557 -283729 -216353
7101 -216353 -93653 -19900 13032 78211 236519 432834 616340 782428 941677 1154457
7091 1154457 1468279 1788377 1958734 2006314 2055961 2067947 1998333 1891969 1769154 1592739
7081 1592739 1377535 1223624 1220231 1361036 1515928 1619102 1758589 2001137 2309873 2645001
7071 2645001 2893973 2912662 2736005 2525555 2346839 2169668 2011004 1943211 1970241 2009453
7061 2009453 1941534 1723059 1439454 1198203 987320 763097 578814 429777 240931 93119
7051 93119 86017 124392 160699 277711 378927 280894 -68348 -547904 -972833 -1278313 -1458185
7040 -1458185 -1516848 -1478596 -1370303 -1195445 -923643 -544670 -185611 11565 21428 -41627
7030 -41627 -62441 18029 169417 280815 277146 183067 82662 43460 77982 222572 501968
7019 501968 832168 1064254 1116305 973963 720341 562750 592486 698757 805169 849353
7009 849353 732718 492308 201873 -37641 -120697 -52037 117757 330621 530928 679546
6999 679546 742058 718878 679410 661295 638347 623940 659295 777699 928518 978393 947593
6988 947593 926484 928973 957419 994029 989395 951405 939449 961279 1028213 1122169 1124224 993572
6976 993572 740928 427955 231729 209778 204561 5983 -370578 -679059 -735706 -583431
6966 -583431 -389129 -290727 -295952 -305106 -254638 -187174 -141342 -61131 112376 363302 579372
6955 579372 669503 683203 709007 762631 803481 750927 532643 214116 -35046 -142111 -169191
6944 -169191 -155704 -79413 94165 297657 429494 408140 236238 81768 29392 52355 164437
6933 164437 361763 514349 534951 416435 268553 216675 285645 474554 755647 1009484
6923 1009484 1081463 899534 528431 132046 -150089 -241387 -188671 -76582 68659 216148
6913 216148 325587 385323 350318 237106 111588 -15932 -56683 90041 267204 268992 127899
6902 127899 -57132 -231881 -347553 -368844 -277143 -75699 193208 487877 771285 1045681
6892 1045681 1299982 1545669 1723543 1705024 1536320 1325720 1106444 921068 807326 759654
6882 759654 689104 561769 498933 526043 569856 565423 465494 349262 354077 447099 490142 387671
6870 387671 169694 -58194 -235020 -405161 -598504 -801520 -1003650 -1127525 -1077749 -915081
6860 -915081 -778068 -642686 -466413 -296989 -168564 -85844 -17698 116173 236312 252070
6850 252070 218352 216108 239051 230799 245265 319445 397400 413546 361533 258019 148670 122115
6838 122115 203878 324913 372737 298589 159620 83112 161006 375366 585515 647878 631593
6827 631593 635051 625442 561410 504819 535234 564804 473346 278332 49978 -133448 -268767
6816 -268767 -411009 -564874 -739371 -947054 -1110369 -1164036 -1128407 -1047479 -897930 -618918
6806 -618918 -217111 228283 653082 1009763 1221434 1251307 1140439 938695 696142 425650
6796 425650 108078 -187894 -397723 -528541 -524153 -387991 -204969 59023 412482 689780
6786 689780 790402 736417 583680 427852 363506 385483 449562 543024 663319 779993 865160
6775 865160 914074 946316 970166 961566 861974 643325 348697 45280 -196646 -288587 -289627
6764 -289627 -350161 -444039 -482612 -404639 -179683 150496 554421 1008796 1459644 1803883
6754 1803883 1924299 1852342 1751652 1720491 1653626 1413759 1019981 641873 373117 149235
6744 149235 -83780 -309159 -466183 -501562 -430759 -302321 -163997 -96805 -91113 -13293 247975
6733 247975 594470 809275 871851 878024 865926 843343 755767 580664 374522 147776 -79511
6722 -79511 -256470 -405699 -504265 -418418 -164320 108431 263173 205494 1670 -121473
6712 -121473 -91861 4162 151234 329565 427031 415392 341741 215023 70402 -111490 -295607
6701 -295607 -423992 -473355 -439704 -333353 -215390 -189440 -268511 -370781 -413518 -402968 -438698
6690 -438698 -516817 -497597 -369677 -226749 -142616 -204518 -420794 -696409 -936716 -1107528
6680 -1107528 -1134890 -957739 -659610 -391941 -254439 -253206 -318717 -401526 -539039 -681046
6670 -681046 -703639 -653211 -579150 -419299 -204172 -66004 -94564 -288754 -579561 -807769
6660 -807769 -818894 -637357 -429584 -285910 -153004 -14680 42646 -60187 -282112 -433407
6650 -433407 -408090 -318638 -311300 -392110 -497176 -554912 -502782 -412501 -383400 -388347 -402517 -415605
6638 -415605 -466088 -543851 -480948 -206529 76813 129809 -7523 -111707 -141958 -249878 -499154
6627 -499154 -716842 -730466 -568549 -399118 -369857 -469658 -588461 -668223 -706383 -705775 -685836
6616 -685836 -651327 -619833 -642097 -702057 -764693 -855660 -929217 -938799 -936089 -911230 -866036 -890534
6604 -890534 -1071695 -1307122 -1381421 -1280706 -1126878 -1025386 -978602 -943958 -932746 -976192 -1027658
6593 -1027658 -1043982 -1015880 -905683 -717831 -471556 -251266 -112086 -58901 -81283 -132186
6583 -132186 -243451 -420554 -546782 -542978 -425897 -204119 61232 236084 241211 140968
6573 140968 86130 118664 107156 -52484 -300571 -516986 -647019 -687887 -647808 -552432 -426399
6562 -426399 -311685 -236648 -188449 -153336 -97626 -33375 -22461 -75475 -130359 -115680 -41945
6551 -41945 31727 16772 10445 117091 159457 2854 -243110 -457177 -604317 -672576 -657635
6540 -657635 -584389 -475334 -363450 -232146 -47533 153702 290546 274761 152424 29663
6530 29663 -20276 51820 189840 318160 442109 555346 591284 510089 469995 620248 823237
6519 823237 869314 707307 445004 254545 269587 371919 292281 2911 -289762 -475359
6509 -475359 -645992 -896849 -1144068 -1203530 -1036271 -779629 -549109 -389308 -339620 -347274
6499 -347274 -309846 -245378 -176593 -54580 106728 252732 347958 446969 640971 898619 1089573
6488 1089573 1154641 1143976 1099881 1014464 871835 677123 496581 388841 317667 228809 98954
6477 98954 -32067 -118129 -188132 -239922 -228611 -204582 -227523 -254521 -297578 -372106 -414687 -385956
6465 -385956 -303254 -198929 -51941 130850 260370 319288 383796 447391 447427 395623 335795
6454 335795 228579 70406 -86159 -205828 -245460 -183210 -36762 96326 180203 246951
6444 246951 233671 144963 122786 195160 247263 189892 -25827 -393334 -798182 -1082576 -1143616
6433 -1143616 -992153 -721034 -448596 -208040 14242 162443 185616 170348 225809 397590
6423 397590 698570 1030214 1202304 1135674 926611 721371 640924 658757 740632 867762
6413 867762 979632 996494 944467 882199 761332 641276 670101 819990 978082 1171972
6403 1171972 1411185 1609479 1725175 1839073 2047774 2361784 2589832 2527725 2328047 2197452
6393 2197452 2105225 2016522 1992057 2032286 2091446 2048216 1844228 1665712 1694587 1863279 2013319
6382 2013319 2078504 2075895 2060460 2064518 2038313 1927651 1848071 1887144 1960084 1958203 1933224 1995405
6370 1995405 2114769 2231492 2401001 2624895 2789727 2829540 2767565 2641027 2511654 2461523
6360 2461523 2529679 2649566 2778672 2934526 3092823 3235960 3348790 3426776 3499247 3605776
6350 3605776 3697860 3727272 3718042 3660186 3572192 3564642 3694955 3874135 3988948 4004471 3916477
6339 3916477 3734074 3549624 3487853 3550755 3651761 3786537 4002355 4272081 4588089 5028470
6329 5028470 5625103 6326419 7073539 7866980 8747441 9740544 10844874 12129261 13719280
6320 13719280 15683029 17961878 20555612 23545738 27019550 31122765 35993870 41649679
6312 41649679 48013387 54845748 61535551 67294953 71349636 73058368 72184821 69080999
6304 69080999 64593247 59593770 54674370 50190880 46440041 43655040 41957853 41353752
6296 41353752 41612491 42056109 41573045 39365122 35661829 31256389 26867854 23037779 19956871
6287 19956871 17506574 15548408 13975977 12609283 11330847 10135298 9027087 7966696
6279 7966696 7014731 6271765 5726916 5305890 4968562 4722194 4585293 4565755 4597839 4635794
6269 4635794 4705794 4767750 4743599 4660226 4621331 4672776 4729636 4618196 4271750 3791981 3334944
6258 3334944 3007614 2800968 2650738 2504685 2353822 2274236 2319530 2345291 2207090 1919709
6248 1919709 1597793 1358273 1230666 1154765 1091410 1066260 1095159 1257053 1524430 1639967
6238 1639967 1504816 1336898 1353187 1507374 1653361 1702861 1647215 1493908 1265968 1063271
6228 1063271 945314 849563 779857 819603 936698 991575 946719 900878 900296 882744 803115
6217 803115 667851 547742 529563 580905 599943 534506 427015 368574 389966 436090 528320
6206 528320 701610 868759 981617 972605 766855 476794 317404 421062 747673 1100747
6196 1100747 1268234 1178420 931234 702569 605763 601523 608888 698623 961757 1312193 1583180
6185 1583180 1746678 1823359 1820236 1846848 1911343 1942849 1946276 1915492 1830189 1715542 1615517
6174 1615517 1548572 1497385 1492427 1540890 1537166 1365116 1053565 791404 688099 712178 756896
6163 756896 756158 765664 888662 1162167 1471350 1668622 1777846 1845013 1865569 1810494 1637087
6152 1637087 1409914 1197158 999118 880814 909175 1044598 1187004 1351893 1548065 1664476
6142 1664476 1638959 1530334 1421735 1336215 1228910 1046468 786092 585973 584337 677539
6132 677539 670628 541844 393740 316314 381240 609080 890327 1033540 989974 891270 849791
6121 849791 850229 890364 918001 847595 746836 707070 712637 709513 646882 542467 459804 522856
6109 522856 819793 1243361 1689830 2183490 2709879 3195773 3584503 3799259 3859996 3934391
6099 3934391 4099470 4285491 4467690 4702756 4885475 4864178 4673502 4374152 3984787 3640583
6089 3640583 3477643 3415444 3285128 2975135 2536276 2108043 1775224 1512551 1262261 1046555
6079 1046555 913167 800825 625710 437021 330072 333200 445708 668374 988667 1277594
6069 1277594 1423841 1417455 1262336 988327 642901 336576 173634 122046 87557 15160
6059 15160 -69364 -126882 -98273 42223 211011 301497 366253 557133 814757 996786 1068714
6048 1068714 1049349 1037086 994592 827203 597818 479849 521949 580772 569953 575745 650710
6037 650710 674788 618227 532844 424474 325902 274924 285417 372341 505752 571107 484017
6026 484017 347190 252999 209173 232833 294794 313101 233579 82684 -96195 -266171 -382411
6015 -382411 -369683 -196171 10998 165723 333865 534272 682208 753174 859045 1025051
6005 1025051 1167640 1215362 1179134 1150627 1156619 1138802 1094559 1039985 996535 970379 939933
5994 939933 848929 681237 531438 425125 342177 315930 293020 212015 107557 746 -101935
5983 -101935 -172107 -229750 -293013 -292440 -196244 -32614 126561 207286 222122 250085 313478 318502
5971 318502 154099 -123312 -400630 -584247 -567428 -343816 -10488 361677 744498 1122426
5961 1122426 1446403 1606111 1613253 1618389 1702899 1791941 1752152 1581346 1397720 1240082 1032338
5950 1032338 700878 298034 6352 -24163 197149 522127 797830 1001446 1206778 1374219
5940 1374219 1440897 1495053 1608066 1698241 1654830 1496072 1442004 1568510 1690346 1756137 1856702
5929 1856702 2067299 2381440 2674429 2835042 2860558 2840931 2778582 2590199 2346544 2174975
5919 2174975 2075202 1959861 1748156 1458229 1073884 593300 157056 -98730 -191827 -223983
5909 -223983 -244490 -232247 -160353 -66417 -20493 -2873 46355 65172 -30507 -125908 -64747 55383
5897 55383 35820 -142291 -315960 -353996 -244398 -41315 111128 137664 39820 -93289 -103208
5886 -103208 40374 131508 45984 -100735 -246798 -373296 -421294 -394751 -322836 -254142 -233668
5875 -233668 -239680 -275041 -287151 -214845 -123114 -96582 -190994 -410291 -692242 -978605 -1241641
5864 -1241641 -1420240 -1462650 -1419862 -1356825 -1264820 -1130085 -941604 -734589 -586613 -492861
5854 -492861 -327544 17949 404834 596224 571496 453892 299744 149218 34685 -49774
5844 -49774 -106844 -194391 -341680 -501412 -558735 -420148 -158313 85197 251360 408724
5834 408724 591366 767346 937158 1114810 1275681 1384103 1395982 1301347 1093854 776758
5824 776758 435761 144529 -53456 -54516 118841 255033 248105 268404 436065 630648 751440
5813 751440 845967 979697 1089744 1092281 1071611 1124210 1129799 995266 809002 658101 594227
5802 594227 636220 731578 822930 921276 1004731 1018606 1010796 1027001 1062197 1083735 1078271 1103580
5790 1103580 1242378 1454204 1636804 1786346 1866545 1785771 1604199 1446991 1355796 1267238
5780 1267238 1079980 825510 701123 743845 813858 872695 979813 1155806 1292228 1343475
5770 1343475 1345893 1345767 1465273 1742555 1975858 2006131 1940988 1907847 1932466 1944916 1881558
5759 1881558 1818844 1891899 2048410 2123655 2102931 2047002 2040818 2052818 2008662 1910751 1846508
5748 1846508 1843868 1809560 1657273 1415706 1212076 1144357 1143403 1126554 1104687 1111099 1185276 1286872
5736 1286872 1340593 1339206 1269369 1095102 847631 694484 753656 905583 950281 789987 488494
5725 488494 245483 201894 244839 153955 -169451 -626335 -1034511 -1294961 -1414786 -1496304
5715 -1496304 -1597991 -1679308 -1648487 -1459461 -1237320 -1147069 -1242525 -1373733 -1340279 -1091868
5705 -1091868 -722425 -416119 -261305 -202310 -191974 -266807 -396972 -488356 -512466 -518081 -477140
5694 -477140 -301138 -13173 227329 296989 262368 216924 115519 25185 73356 130039 86871
5683 86871 5695 -86185 -205978 -313874 -391407 -432070 -453834 -459138 -394339 -182279 151025
5672 151025 409363 454712 287093 88421 2124 -29100 -30292 19303 99141 250695 519390
5661 519390 791861 927031 938350 932178 954222 961729 903681 757751 568813 438177 373370
5650 373370 344847 380392 501087 684556 871266 1018144 1079620 1042098 941305 797384
5640 797384 635599 529656 504506 507193 503105 500309 506963 458385 304242 96030 -161032
5629 -161032 -457292 -621965 -542448 -361842 -270690 -303173 -372698 -339308 -164682 53029 187791
5618 187791 168871 30188 -136782 -294150 -407581 -441140 -433252 -386725 -251942 -35430 238129
5607 238129 505565 680574 707467 616239 593478 727750 885529 951027 917234 846057 793479
5596 793479 779688 728553 655766 658711 700499 665298 562948 515341 538824 552655 537738 499739
5584 499739 413092 268249 111079 -26149 -146927 -232847 -270671 -304943 -417022 -641229
5574 -641229 -928403 -1148346 -1194488 -1131465 -1173124 -1398634 -1606059 -1663377 -1603621 -1455126 -1235360
5563 -1235360 -1027309 -921834 -879536 -799759 -617817 -406365 -268300 -173186 -17193 164034
5553 164034 237468 186630 34539 -183556 -321721 -301688 -186366 -82707 -19697 -7717 -119114
5542 -119114 -294264 -378163 -329771 -216838 -103274 39260 252947 465374 580310 587687
5532 587687 529939 484954 498865 506817 437403 277013 -2776 -358176 -624984 -768423 -825932
5521 -825932 -801244 -802118 -920440 -1070724 -1116352 -1038982 -887860 -609193 -164958 360526 849373
5510 849373 1173930 1325713 1362082 1266159 1000378 631877 324984 167245 128000 172522
5500 172522 222055 304727 399376 375585 268951 180683 142311 168207 288904 441837 494912
5489 494912 350753 124981 9720 53780 195720 301257 196937 -127042 -465772 -595659
5479 -595659 -461811 -186627 108974 411748 745939 1067481 1263202 1277079 1165905 920207
5469 920207 537413 111123 -283106 -591996 -720805 -681156 -621453 -590247 -574115 -534380 -369931
5458 -369931 -128749 10694 -12973 -112244 -108021 37326 254463 501332 707225 765833 682205
5447 682205 552726 401074 220359 -1327 -265156 -489090 -540134 -412172 -213254 -25334
5437 -25334 146439 295518 363523 346010 326706 286741 114196 -155677 -405275 -588414 -695729
5426 -695729 -723576 -657674 -532911 -449322 -444958 -485917 -516106 -478950 -415030 -466158 -648476
5415 -648476 -813286 -908990 -1003534 -1169927 -1375147 -1425781 -1262875 -1050468 -909144 -854950
5405 -854950 -803738 -587397 -189216 286358 698629 910605 950102 957293 975393 918976 811256
5394 811256 719320 634875 508610 334555 160695 -5001 -168433 -294283 -373040 -438448
5384 -438448 -425334 -312397 -219600 -199589 -238996 -249772 -177718 -100788 -159979 -379058 -592293
5373 -592293 -642869 -529341 -313520 -55012 149429 243689 298625 390936 500494 536107 449314
5362 449314 350935 410204 657048 956553 1116575 1056015 839390 593604 379538 146595
5352 146595 -121331 -356952 -461822 -396735 -196289 76134 383437 626988 703756 684025
5342 684025 601660 505378 522951 707403 978480 1153188 1217215 1273664 1305306 1287406 1313323
5331 1313323 1458632 1719645 2061905 2405468 2722326 3090299 3544352 4037206 4506780 4883775
5321 4883775 5214835 5674578 6334526 7082770 7847392 8764376 9976425 11411735 12801124
5312 12801124 13771798 13935015 13224104 11975023 10584685 9323150 8417700 7968112 7833257
5303 7833257 7859666 7985359 8215974 8520399 8693744 8532689 8078380 7454669 6753598 6089793
5293 6089793 5580221 5197899 4728583 4042833 3267336 2581752 2074807 1788506 1666775 1558797
5283 1558797 1369773 1117664 879601 712762 608534 597377 677719 793324 873325 827423
5273 827423 624507 411957 445707 838522 1467700 2141015 2813352 3529819 4222908 4755580
5263 4755580 4968388 4822439 4453481 3971085 3477171 3078328 2756156 2436156 2119321 1830519
5253 1830519 1614240 1471707 1349242 1223169 1093948 934468 778735 680870 637210 572277
5243 572277 391939 108633 -67409 63877 453605 913601 1259196 1441351 1470171 1381452
5233 1381452 1230550 1056137 849321 584207 329401 204522 248134 445395 748891 972916
5223 972916 900711 572273 332744 376041 541752 598562 497610 366146 316584 435741
5213 435741 731626 1052146 1252643 1292356 1184545 988062 798393 658712 547605 473455
5203 473455 435397 380664 281494 165811 -1528 -224747 -337590 -155222 258932 702676
5193 702676 1058297 1246482 1186184 929146 691608 590641 585394 637674 731243 829586 927146
5182 927146 1067278 1262929 1434398 1435839 1210365 930444 734520 619972 550210 474551
5172 474551 407277 352663 348335 413528 483977 502113 491569 515734 574438 572570 478350 339819
5160 339819 226474 124782 23319 24106 206892 455987 588706 560714 440826 277318
5150 277318 99172 -20672 -36223 37199 135308 212163 323257 546695 780913 820954 712049
5139 712049 664487 674945 630605 543971 509609 533865 577221 581531 485800 313625 114176
5128 114176 -52106 -119938 -134999 -219266 -347617 -413170 -435923 -492229 -525509 -435732 -247299
5117 -247299 -5467 223884 359647 387519 423463 593409 922522 1307140 1625135 1863487
5107 1863487 2133713 2545710 3049825 3501126 3846187 4146217 4477213 4856974 5185248 5409662
5097 5409662 5585076 5757318 5912653 6020667 6033982 5898319 5648664 5312306 4871168 4371812
5087 4371812 3900771 3508077 3123679 2664309 2176431 1798254 1575968 1485067 1473124 1387559
5077 1387559 1157565 870844 620449 422525 261926 149534 126235 285092 620049 931481
5067 931481 1010240 870707 717148 653104 625189 564501 472277 418849 466894 589564 713307
5056 713307 772102 749395 675152 535550 313551 67784 -181073 -408507 -569950 -719948
5046 -719948 -863966 -871074 -717121 -521793 -362109 -249887 -193998 -162113 -130240 -177092 -286500
5035 -286500 -323835 -228232 -6761 277562 493735 533974 453227 374701 337689 301307 164654
5024 164654 -75596 -303916 -494670 -644300 -690335 -673297 -693793 -670029 -481620 -182059
5014 -182059 161142 493578 737017 849013 840154 787330 730851 722892 749511 704270 577784
5003 577784 448961 420995 545333 780342 1038958 1229459 1293058 1159664 806192 327579
4993 327579 -143481 -429233 -449171 -337887 -250573 -221672 -261723 -379388 -532937 -650912
4983 -650912 -664145 -538619 -355639 -273096 -290560 -300145 -165339 143952 431401 515151 486087
4972 486087 470097 417260 261827 41877 -150179 -208173 -126745 13351 141558 217435 210481
4961 210481 128325 65052 111611 236476 322565 263961 29438 -249412 -359794 -267000 -90846
4950 -90846 -7341 -55313 -102219 -135351 -299236 -567203 -809652 -1004120 -1094719 -1079552 -1021181
4939 -1021181 -917419 -777565 -538294 -194233 30400 -13774 -229513 -433871 -580683 -663960
4929 -663960 -697704 -755732 -837750 -950209 -1075673 -1137849 -1148436 -1150816 -1067550 -859845 -668858
4918 -668858 -634562 -762833 -944259 -1006743 -928632 -873995 -871758 -861904 -849754 -790676 -666189
4907 -666189 -608896 -683426 -775377 -785433 -722643 -620016 -530700 -509508 -482346 -337560 -156953
4896 -156953 -88459 -153844 -269104 -289185 -242482 -251296 -233241 -60339 213294 464014 646842
4885 646842 660510 460837 201256 67400 63465 116301 195311 301556 422669 511743 587830
4874 587830 682331 692393 632264 624044 622467 499759 253627 4842 -114690 -85524 -5494
4863 -5494 37755 17397 -97340 -216811 -239303 -203410 -198622 -299815 -555974 -901418 -1176694
4852 -1176694 -1267580 -1205886 -1108474 -1065407 -1026958 -923302 -786092 -640914 -481748 -318674
4842 -318674 -208733 -181954 -172335 -135580 -139341 -270603 -485675 -664318 -741907 -723318 -657347
4831 -657347 -576264 -500340 -407871 -319196 -335393 -442891 -591840 -764827 -933690 -1083609 -1212572
4820 -1212572 -1253721 -1113564 -802909 -487221 -346938 -405282 -544561 -661857 -712880 -685277
4810 -685277 -599547 -471073 -340925 -259261 -156436 60689 346241 680541 1036975 1282660
4800 1282660 1294049 1014821 506550 618 -346410 -578991 -741702 -787062 -729753 -666933
4790 -666933 -619139 -525099 -344476 -89650 141460 240758 145102 -102865 -340244 -465517
4780 -465517 -492636 -461084 -376415 -249467 -167506 -161592 -225092 -339865 -480882 -614712 -699674
4769 -699674 -747255 -763030 -743236 -686100 -595480 -490758 -412774 -396914 -458585 -612943 -758650
4758 -758650 -739114 -606906 -538458 -646862 -841741 -923136 -846871 -693035 -517262 -294564
4748 -294564 -61111 69652 109846 76315 -64989 -217725 -263949 -227377 -189993 -204514 -256427
4737 -256427 -301591 -335504 -365250 -389873 -399621 -430299 -591597 -870423 -1043586 -1006797 -867458
4726 -867458 -718464 -583472 -478971 -390608 -322831 -297406 -254543 -132793 12223 110669 135413
4715 135413 99617 16941 -105110 -213610 -252706 -160597 61990 300236 379476 240013 4291
4704 4291 -239256 -478418 -689250 -863330 -1044739 -1244603 -1419602 -1539431 -1584755 -1502454
4694 -1502454 -1292843 -1038738 -822095 -618551 -387451 -164534 -28344 -5245 -75000 -295926
4684 -295926 -676103 -1063989 -1314431 -1390285 -1381279 -1368470 -1356323 -1301306 -1121583 -837284 -614391
4673 -614391 -589349 -664857 -695050 -720141 -802928 -898006 -996510 -1099392 -1240647 -1408244 -1479861
4662 -1479861 -1336950 -960093 -516026 -198956 -41973 358 -90268 -276365 -419987 -512157
4652 -512157 -623411 -795716 -1004202 -1215607 -1385097 -1423089 -1368200 -1251961 -1045378 -746115
4642 -746115 -433775 -221837 -130359 25817 336413 617832 663926 469223 206933 -8412
4632 -8412 -198776 -453295 -781139 -1027441 -1044047 -854966 -576497 -324971 -247284 -392462
4622 -392462 -651284 -891098 -1016905 -1038820 -1099547 -1219075 -1288048 -1286758 -1233354 -1206350 -1273452
4611 -1273452 -1325235 -1288498 -1168604 -938811 -689200 -532832 -530575 -664797 -858858 -1072716
4601 -1072716 -1292230 -1532150 -1741317 -1843607 -1824506 -1658979 -1350974 -1040970 -785792 -560451
4591 -560451 -357785 -221120 -162883 -80215 47519 126371 130936 68779 -85419 -271960 -419674
4580 -419674 -520707 -564806 -513243 -360508 -136793 68229 163272 78895 -140644 -412659
4570 -412659 -685166 -865648 -865639 -674994 -370146 -74023 102188 172701 267698 441018 578723
4559 578723 599361 552849 518565 430912 231097 30006 -139500 -300725 -444236 -555138
4549 -555138 -596932 -546912 -448414 -382100 -349963 -246735 -124666 -61541 36210 198784 311633
4538 311633 320515 253645 139386 17701 -66177 -101576 -135506 -176772 -186377 -243129 -409676
4527 -409676 -582575 -657397 -612880 -521727 -459547 -427959 -382693 -242934 -7480 238564 397208
4516 397208 453357 474390 513503 535183 554860 654955 793124 835523 781686 732104 648668
4505 648668 459223 214688 49333 95651 305896 471773 513575 519792 524775 510871 411137
4494 411137 212546 45861 14373 33408 922 -49063 -38884 39194 152031 302884 417212
4483 417212 383182 207532 -10550 -203585 -322957 -342073 -319623 -257843 -95480 102702
4473 102702 205203 195991 132690 17654 -72608 -45933 58035 175320 312781 465706 564453
4462 564453 568019 485993 334415 177737 79850 25210 13095 43843 94040 95298 -35055
4451 -35055 -242814 -423696 -546056 -619994 -638889 -586509 -502885 -408037 -317067 -258434 -169688
4440 -169688 32526 349549 679392 910708 938647 765494 492019 225495 42583 29050
4430 29050 181094 366969 453696 415200 318203 267417 259280 166197 17287 -85359 -162728
4419 -162728 -269937 -404569 -472536 -396790 -259353 -309933 -623300 -919823 -941042 -756319
4409 -756319 -561728 -450421 -366436 -249136 -110448 130836 476107 771019 943007 989174
4399 989174 895649 624205 241513 -64877 -232711 -311094 -245620 -65929 63174 79098
4389 79098 17641 -48915 -82831 -131452 -266568 -520274 -815851 -1014787 -1013697 -855935 -728960
4378 -728960 -689452 -633764 -501356 -242500 95141 296720 262239 77931 -122801 -324385
4368 -324385 -522308 -606419 -514581 -330446 -119913 145818 397374 526167 574849 615850
4358 615850 608371 505098 358933 245753 146741 36745 -106961 -355780 -630258 -717069
4348 -717069 -601255 -497311 -556146 -646687 -541692 -262003 2451 137895 188874 163924
4338 163924 28910 -129348 -175666 -95276 45888 167922 289147 449066 564018 490974
4328 490974 310131 156548 43112 10401 60067 133384 167476 141063 81650 44102 41352
4317 41352 -35815 -257480 -472771 -528272 -466270 -403859 -425086 -591406 -872287 -1146543 -1319234
4306 -1319234 -1367269 -1352371 -1393279 -1501722 -1544545 -1437431 -1238980 -1098037 -1102551 -1207780 -1347644
4295 -1347644 -1425521 -1415858 -1425844 -1435845 -1330159 -1147952 -1006468 -958459 -979208 -1036466 -1106580
4284 -1106580 -1128096 -1076408 -1007346 -893387 -695604 -505494 -420984 -446553 -502035 -454709 -291204
4273 -291204 -115470 -59449 -147638 -289492 -404638 -463758 -510817 -540736 -459347 -316322 -171620
4262 -171620 -15081 52260 -46327 -235427 -401003 -515775 -614235 -709388 -787169 -877211 -989043
4251 -989043 -1024731 -919511 -706571 -410256 -133779 -33001 -109078 -207610 -185022 -50254
4241 -50254 116429 279023 396837 358735 138419 -108454 -252951 -283599 -285356 -333766 -386159
4230 -386159 -361404 -240987 -134172 -139080 -202136 -215020 -153372 -82500 -87406 -161226 -189397 -84457
4218 -84457 63576 61504 -134941 -455359 -760370 -906647 -873520 -734266 -539911 -331576
4208 -331576 -145069 -48952 -173788 -490756 -784898 -930360 -982584 -1081760 -1220276 -1289825
4198 -1289825 -1306189 -1352980 -1469700 -1582834 -1627098 -1643871 -1723525 -1904782 -2042257 -2008340 -1818644
4187 -1818644 -1555039 -1275189 -972372 -669677 -539677 -669913 -920437 -1100042 -1122998 -1018846
4177 -1018846 -848536 -648969 -459475 -359489 -406500 -470358 -468386 -519421 -651650 -824758 -1010999
4166 -1010999 -1112295 -1054691 -837779 -556959 -376027 -308897 -274404 -262073 -293622 -372062 -449197
4155 -449197 -472483 -388706 -166958 115319 302344 287757 90819 -208653 -485998 -640233
4145 -640233 -618396 -513671 -521612 -657753 -804210 -844403 -751174 -579167 -421807 -334237 -270355
4134 -270355 -182837 -81810 -743 153493 435067 699751 815188 779802 620620 424619
4124 424619 338411 409264 498348 439356 219932 -16860 -153762 -203477 -182835 -72331 121776
4113 121776 372717 562821 567489 426825 259106 164503 195767 286706 370045 403858 369266
4102 369266 301970 278660 328607 369447 320208 190948 58065 -31406 -83256 -136792 -191611
4091 -191611 -166273 20686 306408 544072 666732 690106 613131 396407 90587 -234097
4081 -234097 -514211 -632136 -560167 -408316 -276218 -173750 -89663 31974 130271 36097
4071 36097 -192391 -388472 -459336 -398747 -335953 -370360 -412188 -320277 -31929 381649 772418
4060 772418 1054602 1288650 1531497 1637772 1441943 998095 497263 154773 31798 20809
4050 20809 25645 -43682 -281247 -683678 -1091987 -1319785 -1333367 -1165187 -847354 -498826 -241953
4039 -241953 -103692 -92256 -155265 -194875 -163126 -72090 19875 68467 50467 15767 -3867
4028 -3867 -18575 -38988 -44814 5470 68208 90088 81538 20049 -118994 -264249 -300966 -237965
4016 -237965 -215155 -255953 -297137 -335364 -417985 -559323 -636208 -524309 -247842 104296 401055
4005 401055 578631 719320 892837 1043938 1104362 1097321 1091974 1062218 936709 746912 525487
3994 525487 210390 -165791 -407451 -368529 -171249 31229 228532 457187 765249 1071273
3984 1071273 1233435 1220168 1107627 1002419 932905 850397 772177 760351 809192 845821 879881
3973 879881 978647 1130084 1295861 1451238 1556131 1568105 1418325 1186759 1011872 864133
3963 864133 655602 400720 141254 -186417 -637001 -1077145 -1343696 -1420834 -1365129 -1223635
3953 -1223635 -1034100 -781930 -462390 -131325 122389 201527 113387 -15832 -77003 -72258
3943 -72258 -154511 -410751 -675379 -753572 -605726 -338230 -124861 -85262 -200774 -342525
3933 -342525 -437671 -484627 -494149 -499123 -529150 -636957 -829495 -998698 -1037052 -957380 -896677
3922 -896677 -934320 -986287 -1011523 -1042588 -1048557 -978080 -904053 -936471 -980560 -919188 -782869 -691614
3910 -691614 -744683 -949321 -1149522 -1186204 -1104754 -1016863 -940800 -865408 -797756 -739283 -739478 -835326
3898 -835326 -1047709 -1352874 -1554443 -1508639 -1255913 -978934 -872797 -965584 -1112005 -1192566
3888 -1192566 -1157639 -1001364 -800568 -613460 -454143 -369985 -386912 -504617 -699551 -910289
3878 -910289 -1142313 -1334864 -1305468 -1037830 -720460 -493523 -371691 -297302 -279002 -338154
3868 -338154 -445484 -593115 -733648 -834461 -937718 -1031116 -1041816 -1002451 -986967 -975104 -996541
3857 -996541 -1037288 -1025926 -1037009 -1124266 -1156704 -1052345 -899353 -776869 -607809 -342846 -81580
3846 -81580 73413 80828 -23878 -140621 -225465 -303600 -357864 -367957 -243112 109139 564409
3835 564409 849771 811832 588956 367429 169801 -80567 -391027 -678631 -846639 -862567
3825 -862567 -792349 -709598 -585806 -426575 -301966 -178093 -44982 16355 -19493 -162383
3815 -162383 -332790 -454449 -537577 -602643 -711684 -861723 -914333 -806834 -573045 -264296
3805 -264296 -18284 89318 116505 139957 230216 399092 541854 590582 633145 737361 816904
3794 816904 826208 778941 585344 197394 -270842 -688092 -981481 -1173962 -1276428 -1244121
3784 -1244121 -1106820 -1018249 -1056917 -1164792 -1273783 -1317609 -1297607 -1248613 -1178392 -1078765 -971334
3773 -971334 -905430 -881445 -833821 -753621 -672747 -612200 -529917 -365691 -148700 24651 118854
3762 118854 199354 274976 351012 438467 468438 412398 336151 338435 460144 665725 899269
3751 899269 1111010 1264760 1392763 1513896 1646526 1798490 1864776 1764770 1515920 1210671
3741 1210671 951886 777599 641951 532823 421478 241342 3048 -283496 -567822 -753257
3731 -753257 -819784 -820760 -739287 -542000 -378078 -356468 -448319 -584782 -642781 -580603 -488086
3720 -488086 -488897 -623795 -786279 -824813 -773565 -735460 -728140 -710697 -640644 -545555 -452450 -300018
3708 -300018 -66154 113392 146855 63925 -40667 -136993 -242955 -291566 -222149 -72947 20906
3697 20906 -17096 -103751 -190409 -300347 -470918 -603281 -610627 -570460 -523345 -415437 -212246
3686 -212246 6030 151464 158716 39193 -94154 -207798 -368284 -537924 -614400 -600519
3676 -600519 -562265 -526630 -475520 -392285 -274137 -159808 -55410 54204 111698 65929 -76675
3665 -76675 -223754 -255822 -149435 38857 246115 428854 549518 614006 607100 551095 465819
3654 465819 300639 54862 -177067 -296227 -342016 -363295 -330017 -273896 -237616 -177198 -57756
3643 -57756 100040 240727 284324 190653 50363 -31055 -36435 18206 67504 12827 -105356
3632 -105356 -169868 -93398 122573 386884 570707 600374 468363 274137 145344 110133
3622 110133 151632 233730 297382 287000 238400 165622 76184 25759 7822 3418 40464 146225
3610 146225 269058 246145 33401 -149623 -142385 -71633 -126302 -291815 -411238 -444585 -444120
3599 -444120 -456883 -472459 -400106 -199931 4935 90103 85169 49126 15382 -14018 -54890
3588 -54890 -143626 -303146 -516748 -726450 -844592 -828622 -690611 -495162 -353149 -315990
3578 -315990 -365297 -479661 -573747 -556723 -424773 -257363 -136139 -77520 -45919 42801 213420
3567 213420 366767 410260 369213 350656 429592 569937 599031 449027 266439 203360 250606
3556 250606 327134 347765 321586 266379 133040 -111442 -453259 -764852 -984597 -1183554
3546 -1183554 -1432529 -1693287 -1875654 -1960317 -1933434 -1794121 -1566408 -1269727 -983649 -810098
3536 -810098 -782173 -867227 -958096 -1027827 -1092742 -1097870 -959229 -691764 -326227 72042 387937
3525 387937 493005 361031 122263 -92785 -166371 -94585 38431 192325 371406 575307
3515 575307 737094 742022 630512 555020 556266 570089 545333 442746 294491 166972 113494
3504 113494 179268 296576 376208 511271 764103 1022012 1121589 1011304 806545 684123
3494 684123 645667 568149 388086 129122 -159358 -455188 -697961 -882888 -1091269 -1322798
3484 -1322798 -1470952 -1427822 -1217322 -986168 -840670 -771460 -720452 -613512 -410482 -117979
3474 -117979 224845 499475 588571 484512 297439 157935 60644 -21873 -109623 -196315 -148811
3463 -148811 43434 187621 220461 190602 104155 -18806 -43057 41081 35104 -159652 -482132
3452 -482132 -765030 -908104 -913437 -837278 -740233 -696624 -726933 -744111 -644095 -462211 -315121
3441 -315121 -247845 -284752 -462907 -664083 -711863 -620904 -444168 -219471 -31164 99974
3431 99974 175656 222031 282773 377693 490458 514685 415605 297642 251812 262184 268098 264292
3419 264292 324452 496795 738177 947863 1061213 1043185 874421 615168 353804 140860
3409 140860 -34152 -177639 -287666 -374614 -398945 -424205 -501530 -567210 -569054 -506467 -398989
3398 -398989 -308879 -278899 -282428 -225624 -54055 119473 160964 70917 -99070 -236313 -242644
3387 -242644 -98879 111578 207762 123859 -33383 -86927 -780 160056 332582 470507
3377 470507 583150 648833 658073 650160 612656 519347 338754 110523 -74787 -177749 -223556
3366 -223556 -262650 -355935 -513208 -716098 -939599 -1105179 -1054974 -678784 -140956 204099
3356 204099 244568 196055 250691 389782 478629 442854 297979 106559 -33475 -24390 135690
3345 135690 306128 363048 291811 139099 -39365 -198030 -310014 -476438 -735819 -938080
3335 -938080 -981130 -869555 -707625 -645929 -643929 -575931 -430260 -306720 -274568 -321598 -371686
3324 -371686 -328678 -212784 -152631 -220720 -302652 -297247 -190768 -34321 111543 239066 366961
3313 366961 513149 613369 575056 486263 422082 363118 280677 173860 39092 -198758 -574758
3302 -574758 -948518 -1135426 -1112597 -957654 -772671 -684528 -724329 -748823 -663928 -506718 -325326
3291 -325326 -162420 -54281 -93268 -270675 -392578 -360972 -253145 -173583 -176022 -259389 -411849
3280 -411849 -628045 -792551 -837842 -856737 -908317 -1041776 -1255506 -1475319 -1644094 -1734926
3270 -1734926 -1732382 -1598997 -1364081 -1106371 -873740 -715264 -722906 -898956 -1091349 -1166246
3260 -1166246 -1175016 -1189821 -1205083 -1262901 -1413483 -1539750 -1487140 -1212888 -848682 -550753 -342392
3249 -342392 -150377 102614 319533 329888 118342 -188115 -447885 -562934 -506684 -313931
3239 -313931 -66602 171717 341781 376759 335269 298671 252866 223429 215975 153079 30120
3228 30120 -56636 -43502 -409 -13968 -35928 -44377 -36720 67712 206080 212986 26736 -257862
3216 -257862 -494712 -619264 -658886 -720784 -847969 -980259 -1099947 -1205619 -1292098 -1399686
3206 -1399686 -1501070 -1543863 -1542335 -1525304 -1504375 -1488642 -1464237 -1410994 -1403250 -1511974 -1608268
3195 -1608268 -1524480 -1303886 -1100787 -958179 -861322 -839988 -885559 -877683 -696325 -385584 -131592
3184 -131592 -94891 -260097 -497925 -691532 -802007 -790781 -650328 -481428 -430810 -577546
3174 -577546 -896563 -1306310 -1658416 -1816857 -1794277 -1742379 -1703208 -1565146 -1271573 -940905
3164 -940905 -763534 -828678 -1089133 -1331562 -1399561 -1254023 -965863 -755880 -753509 -885304
3154 -885304 -1046414 -1105154 -980321 -748517 -515484 -275511 -11047 246738 451323 518270
3144 518270 459314 324653 142866 -55441 -254479 -424539 -593669 -816604 -1050275 -1205348
3134 -1205348 -1160392 -942582 -747941 -618083 -525614 -491717 -452795 -279719 32171 304892
3124 304892 444233 529411 559836 413938 117259 -195675 -450186 -681240 -957277 -1215962
3114 -1215962 -1372324 -1462453 -1513441 -1444397 -1292144 -1127186 -955004 -821739 -835792 -1006153
3104 -1006153 -1227764 -1339589 -1217142 -923183 -613595 -364031 -174127 -64405 -32639 -3861
3094 -3861 28617 -1856 -47692 -74254 -122601 -218617 -348672 -437506 -328848 -44892 194422
3083 194422 269843 179776 -82473 -497562 -1000932 -1445861 -1673280 -1684593 -1605513 -1460087
3073 -1460087 -1198760 -801963 -299289 232970 681752 944976 1012454 912499 678154 422826
3063 422826 288004 223068 65323 -213015 -515713 -733088 -802739 -772082 -736734 -741612 -708185
3052 -708185 -547736 -270524 28481 261855 433673 557617 603653 510053 366317 297930
3042 297930 275861 262167 294715 433423 607994 687778 650722 534446 378111 258802 268015
3031 268015 442110 689406 810515 717045 520333 383794 332095 321556 310912 181408
3021 181408 -107013 -409283 -560967 -510213 -299562 -64048 54556 49715 23630 103604 323238
3010 323238 589883 824902 951189 884000 653744 420339 327263 377447 508940 693591
3000 693591 848733 893227 932639 1034057 1133247 1187398 1162200 1112745 1153559 1247908 1285468
2989 1285468 1211475 1021266 684317 222872 -203708 -482342 -645983 -781852 -905496 -949780
2979 -949780 -897386 -893586 -1006094 -1124313 -1228398 -1308172 -1279713 -1133245 -924047 -705939 -540659
2968 -540659 -459111 -488335 -585248 -663400 -689604 -652064 -587255 -544228 -559250 -618291 -636349 -649285
2956 -649285 -774818 -999676 -1156304 -1056966 -702063 -264605 61665 215975 308181 435548
2946 435548 588640 693051 684189 598081 463277 337787 291487 198333 -68159 -401873 -700301
2935 -700301 -965596 -1173444 -1229196 -1085846 -817757 -551534 -394529 -322553 -216983 -84325
2925 -84325 -63075 -174510 -239033 -169804 -52590 24111 13570 -96611 -226045 -237835 -88580
2914 -88580 151651 364782 458312 394685 260661 213162 318490 538225 784839 952673
2904 952673 998854 909101 633220 268014 60271 25942 -17836 -126124 -231610 -271787 -220893
2893 -220893 -83498 55796 101842 30197 -56461 -37738 40334 135403 278798 416148 489683
2882 489683 495711 403268 231251 97485 91811 160603 192769 145361 106245 160158 239172 246201
2870 246201 164138 69524 76429 205422 385379 536919 628415 658191 663366 639777 508396
2859 508396 211985 -201607 -624741 -946589 -1104930 -1116552 -1046942 -964863 -940935 -998718 -1068641
2848 -1068641 -1022319 -794918 -520110 -319008 -193351 -143476 -113895 -69836 -42672 75029
2838 75029 377032 682996 778683 722308 697077 744710 786955 803742 832185 878040 896201
2827 896201 826171 674716 487009 248284 -63241 -379782 -571686 -627913 -617762 -622296 -627017
2816 -627017 -602306 -584958 -557955 -490754 -347654 -78377 277103 573285 665116 588162 483045
2805 483045 390107 270403 184530 189887 209648 159460 79742 83509 206715 304040 182218
2794 182218 -89603 -255655 -243325 -173227 -104174 -38157 23023 136418 342643 586062 799544
2783 799544 919003 947237 927218 928843 954590 873921 713130 623233 599932 605171 577837 423065
2771 423065 144958 -74828 -165550 -206563 -250834 -335907 -478004 -735969 -1068465 -1323220
2761 -1323220 -1455018 -1510319 -1499663 -1441813 -1347710 -1257055 -1194604 -1118616 -998355 -879751 -734517
2750 -734517 -506608 -230518 -35486 14147 -48202 -156794 -256379 -396528 -569102 -696431
2740 -696431 -763572 -719078 -567152 -412380 -320591 -279519 -290060 -305830 -268792 -236788 -196458
2729 -196458 -35197 301399 747795 1161079 1453306 1610626 1624004 1458547 1068411 538899
2719 538899 59684 -276841 -529380 -729104 -817222 -758725 -582936 -289238 106674 470079
2709 470079 683606 752746 780340 874563 959130 907300 748151 581348 467780 421359 373501
2698 373501 266920 102294 -91851 -225699 -290185 -427438 -646950 -806238 -776782 -605668
2688 -605668 -475165 -471222 -529040 -517403 -419089 -274037 -79562 82841 108033 9784 -120136
2677 -120136 -275107 -421914 -412713 -237033 -6145 178847 204526 93247 80239 260059
2667 260059 454547 548760 589678 588518 434742 91520 -303850 -576966 -627756 -479281 -303791
2656 -303791 -223440 -194942 -205901 -290338 -353133 -353855 -412196 -505499 -517299 -493054 -453806 -334369
2644 -334369 -128060 96826 299493 459163 506038 335153 -16591 -343028 -497072 -453729
2634 -453729 -286499 -170977 -208621 -277202 -259069 -137337 91196 364150 606363 831719
2624 831719 1022533 1065112 900656 609483 336933 158731 138218 306898 472896 441204
2614 441204 195746 -115880 -357582 -542604 -678855 -699094 -643423 -562684 -432115 -293214
2604 -293214 -162381 -58343 -29793 -8796 117869 307160 459776 564202 618069 569155
2594 569155 393669 188632 56026 21210 70365 154163 203328 179292 153308 296401 597600
2583 597600 879938 1083481 1201378 1129436 871326 644356 535506 446384 291658 116985
2573 116985 85502 207012 282400 265642 180207 -22003 -245695 -343849 -285265 -190926 -239881
2562 -239881 -413461 -459787 -268191 -32258 22486 -111929 -253397 -265715 -189691 -106167 -7004
2551 -7004 161825 372743 559376 731305 964854 1273347 1515800 1565537 1426494 1178194
2541 1178194 930451 705170 462835 237946 35707 -234636 -597099 -951177 -1182975 -1279593
2531 -1279593 -1268693 -1277419 -1447682 -1677540 -1710040 -1502467 -1292054 -1247048 -1302029 -1267025 -1100691
$$ [...]
##END NTUPLES=NMR SPECTRUM
##END=
