##TITLE=C13_DF-402
 DMSO-d6, 22000 sc

 30.7.2019
##JCAMPDX= 6.0         $$ Bruker NMR JCAMP-DX V2.0
##DATA TYPE= NMR SPECTRUM
##DATA CLASS= NTUPLES
##ORIGIN= UXNMR, Bruker Analytische Messtechnik GmbH
##OWNER= root
$$ XWIN-NMR		Version 3.5
$$ Wed Jul 31 13:38:54 2019 Russian Standard Time (UT+4h)  she@DPX200
##.OBSERVE FREQUENCY= 50.327896
##.OBSERVE NUCLEUS= ^13C
##.ACQUISITION MODE= SIMULTANEOUS
##.ACQUISITION SCHEME= undefined
##.AVERAGES= 22000
##.DIGITISER RES= 17
##SPECTROMETER/DATA SYSTEM= spect
##.PULSE SEQUENCE= zgpg30
##.SOLVENT NAME= CDCl3
##.SHIFT REFERENCE= (INTERNAL, CDCl3, 0, 225.252)
##AUDIT TRAIL= $$ (NUMBER, WHEN, WHO, WHERE, WHAT)
$$ ##TITLE= Audit trail, XWIN-NMR		Version 3.5
$$ ##JCAMPDX= 5.01
$$ ##ORIGIN= Bruker BioSpin GmbH
$$ ##OWNER= she
$$ F:/spectra/data/she/nmr/c13/1/pdata/1/auditp.txt
$$ ##AUDIT TRAIL=  $$ (NUMBER, WHEN, WHO, WHERE, WHAT)
(   1,<2019-07-31 13:36:40.18 +0400>,<she>,<DPX200>,
      <created by zg, POWCHK disabled, PULCHK disabled
       terminated by command 'halt'
       configuration hash MD5:
       00 E9 B6 7A A2 85 ED C7 34 08 36 98 17 FE 4E 26
       data hash MD5: 32K
       22 46 17 3B 47 00 7E 1C 0E 98 F4 C2 1D F2 26 C2>)
(   2,<2019-07-31 13:36:46.75 +0400>,<she>,<DPX200>,
      <Start of raw data processing
       efp BC_mod = 2 LB = 1 FT_mod = 6 PKNL = 1 PHC0 = -382.4814 PHC1 = 42.40641 SI = 32K 
       data hash MD5: 32K
       21 F2 2C B6 1B D9 A0 83 8D 71 A3 FA 23 99 AB 48>)
(   3,<2019-07-31 13:37:08.54 +0400>,<she>,<DPX200>,
      <pk PHC0 = 5.723635 PHC1 = -13.59999 
       data hash MD5: 32K
       5B 39 9C B9 B3 E3 C5 03 76 9D AA 66 EC E3 AA 7B>)
(   4,<2019-07-31 13:37:12.07 +0400>,<she>,<DPX200>,
      <abs ABSG = 5 
       data hash MD5: 32K
       8B 45 B1 77 8B 8B 71 CE 88 FC 71 F7 0F 9B E3 01>)
(   5,<2019-07-31 13:37:30.50 +0400>,<she>,<DPX200>,
      <pk PHC0 = -2.148762 PHC1 = 3.6 
       data hash MD5: 32K
       CF 38 F6 11 57 02 5D DB 09 3A 66 7E 84 96 3D 35>)
(   6,<2019-07-31 13:37:34.06 +0400>,<she>,<DPX200>,
      <abs ABSG = 5 
       data hash MD5: 32K
       1C 58 BB FE EE 2C E9 34 B7 29 EF 2B 1B F0 CF 6E>)
$$ ##END=
$$ 
$$ hash MD5
$$ 3D F4 5C 5A F1 27 AA 0E 09 6E 4D 6A 7E BB 8B 5F
##$RELAX= 
##$RELAX= 
##$RELAX= 
##$RELAX= 
##$RELAX= 
##$RELAX= 
##$RELAX= 
##$RELAX= 
$$ Bruker specific parameters
$$ --------------------------
##$DU= <F:/spectra>
##$EXPNO= 1
##$NAME= <c13>
##$PROCNO= 1
##$TYPE= <nmr>
##$USER= <she>
##$AMP= (0..31)
100 100 100 100 100 100 100 100 100 100 100 100 100 100 100 100 100 100 
100 100 100 100 100 100 100 100 100 100 100 100 100 100 
##$AQSEQ= 0
##$AQ_mod= 1
##$AUNM= <au_zg>
##$AUTOPOS= <>
##$BF1= 50.322709
##$BF2= 200.13
##$BF3= 50.322709
##$BF4= 500.13
##$BF5= 500.13
##$BF6= 500.13
##$BF7= 500.13
##$BF8= 500.13
##$BYTORDA= 1
##$CFDGTYP= 0
##$CFRGTYP= 5
##$CHEMSTR= <none>
##$CNST= (0..31)
1 1 145 1 1 1 1 1 1 1 1 1 1 1 1 1 1 1 1 1 1 1 1 1 1 1 1 1 1 1 1 1 
##$CPDPRG= <waltz16>
##$CPDPRG1= <>
##$CPDPRG2= <waltz16>
##$CPDPRG3= <>
$$ [...]
##$SUBNAM4= <"">
##$SUBNAM5= <"">
##$SUBNAM6= <"">
##$SUBNAM7= <"">
##$SUBNAM8= <"">
##$SUBNAM9= <"">
##$SW= 239.972175391363
##$SWIBOX= (0..15)
0 1 3 0 0 0 0 0 0 0 0 0 0 0 0 0 
##$SW_h= 12077.2946859903
##$TD= 32768
##$TD0= 1
##$TE= 0
##$TE2= 300
##$TE3= 300
##$TEG= 300
##$TL= (0..7)
120 120 120 120 120 120 120 120 
##$TP= (0..7)
150 150 150 150 150 150 150 150 
##$TP07= 0
##$TPNAME0= <>
##$TPNAME1= <>
##$TPNAME2= <>
##$TPNAME3= <>
##$TPNAME4= <>
##$TPNAME5= <>
##$TPNAME6= <>
##$TPNAME7= <>
##$TPOAL= (0..7)
0.5 0.5 0.5 0.5 0.5 0.5 0.5 0.5 
##$TPOFFS= (0..7)
0 0 0 0 0 0 0 0 
##$TUNHIN= 0
##$TUNHOUT= 0
##$TUNXOUT= 0
##$USERA1= <user>
##$USERA2= <user>
##$USERA3= <user>
##$USERA4= <user>
##$USERA5= <user>
##$V9= 5
##$VALIST= <valist>
##$VCLIST= <CCCCCCCCCCCCCCC>
##$VD= 0
##$VDLIST= <DDDDDDDDDDDDDDD>
##$VPLIST= <PPPPPPPPPPPPPPP>
##$VTLIST= <TTTTTTTTTTTTTTT>
##$WBST= 1024
##$WBSW= 4
##$XGAIN= (0..3)
0 0 0 0 
##$XL= 0
##$YL= 0
##$YMAX_a= 92073434
##$YMIN_a= -114076691
##$ZGOPTNS= <>
##$ZL1= 120
##$ZL2= 120
##$ZL3= 120
##$ZL4= 120
##$ABSF1= 225.2522
##$ABSF2= -14.74524
##$ABSG= 5
##$ABSL= 3
##$ALPHA= 0
##$AQORDER= 0
##$ASSFAC= 0
##$ASSFACI= 0
##$ASSFACX= 0
##$ASSWID= 0
##$AUNMP= <proc_1d>
##$AZFE= 0.1
##$AZFW= 0.5
##$BCFW= 0
##$BC_mod= 2
##$BYTORDP= 0
##$COROFFS= 0
##$CY= -3
##$DATMOD= 1
##$DC= 0
##$DFILT= <>
##$DTYPP= 0
##$F1P= 0
##$F2P= 0
##$FCOR= 0.5
##$FTSIZE= 32768
##$FT_mod= 6
##$GAMMA= 0
##$GB= 0
##$INTBC= 1
##$INTSCL= 4.134877e-10
##$ISEN= 128
##$LB= 1
##$LEV0= 0
##$LPBIN= 0
##$MAXI= 10000
##$MC2= 0
##$MEAN= 0
##$ME_mod= 0
##$MI= 0.1934396
##$NCOEF= 0
##$NC_proc= 3
##$NLEV= 6
##$NOISF1= 120.0001
##$NOISF2= 80.00006
##$NSP= 0
##$NTH_PI= 0
##$NZP= 0
##$OFFSET= 225.2522
##$PC= 1.4
##$PHC0= -378.9066
##$PHC1= 32.40642
##$PH_mod= 1
##$PKNL= yes
##$PPARMOD= 0
##$PSCAL= 0
##$PSIGN= 0
##$REVERSE= no
##$SF= 50.3225993700027
##$SI= 32768
##$SIGF1= 140
##$SIGF2= 120
##$SINO= 11.81781
##$SIOLD= 32768
##$SREGLST= <13C.CDCl3>
##$SSB= 0
##$STSI= 32768
##$STSR= 0
##$SW_p= 12077.2946859903
##$SYMM= 0
##$S_DEV= 0
##$TDeff= 32768
##$TDoff= 0
##$TI= <>
##$TILT= no
##$TM1= 0
##$TM2= 0
##$TOPLEV= 0
##$USERP1= <user>
##$USERP2= <user>
##$USERP3= <user>
##$USERP4= <user>
##$USERP5= <user>
##$WDW= 1
##$XDIM= 32768
##$YMAX_p= 280399133
##$YMIN_p= -1155980
$$ End of Bruker specific parameters
$$ ---------------------------------
##NTUPLES= NMR SPECTRUM
##VAR_NAME=  FREQUENCY,     SPECTRUM/REAL,   SPECTRUM/IMAG
##SYMBOL=    X,             R,               I
##VAR_TYPE=  INDEPENDENT,   DEPENDENT,       DEPENDENT
##VAR_FORM=  AFFN,          ASDF,            ASDF
##VAR_DIM=   32768,         32768,           32768
##UNITS=     HZ,            ARBITRARY UNITS, ARBITRARY UNITS
##FACTOR=    0.368581032318806, 1,           1
##FIRST=     11335.2760802109, 0,            0
##LAST=      -742.018605779436, 0,           0
##MIN=       -742.018605779436, -1155980,    0
##MAX=       11335.2760802109, 280399133,    0
$$ Real data points
##PAGE= N=1
##DATA TABLE= (X++(R..R)), XYDATA
$$ [...]
10854c85543j05421j4187O4956m9810J23200K15336J57540R0589r2463j23251
10844a19054L1077L6094R018j16138N0293M34714K50668k62674m74539k56485
10834d17026j7562J3104J07533J68481K07874K01069N8351m0416j35196l5637
10824A10575k9626n0753K9080J53441J36887j97187j05006J18061j37823k34735
10814b07086j77209P8614J05470n7273Q762J33067J25964k10155j26857J58857
10804a67846Q523M8561R9076L4354j20091r2922M8919r6019j785Q384J03681L12783
10792A85618J62703m1683j10865q5643n9849Q3847J4320p4580j32230k60828j58241
10781d77431m2744P8049R1619J4382P4002k4365j60476r801J45249J74346J18330
$$ plain form
10854 -385543 -490964 -505151 -440195 -490005 -366805 -151469 6071 96660 4197 -119054
10844 -119054 -87977 -51883 -42865 -159003 -108710 326004 576672 313998 -160541 -417026
10834 -417026 -434588 -421484 -313951 -145470 62404 263473 321824 281408 146212 110575
10824 110575 80949 30196 59276 212717 349604 152417 47411 165472 27649 -207086
10814 -207086 -384295 -305681 -200211 -257484 -248722 -115655 10309 -199846 -326703 -167846
10804 -167846 -159323 -110762 -11686 22668 -97423 -190345 -141426 -237445 -239230 -230846 -127165 185618
10792 185618 348321 306638 195773 110130 50281 134128 148448 73868 -58362 -319190 -477431
10781 -477431 -520175 -442126 -350507 -336125 -262123 -286488 -446964 -456765 -311516 -137170 -18840
10770a8840j21517p5810J02533r358L2525R1990J35115p880l85850k47132L2603
10759d71621K5813O0575R1031R2006J1075J8289k11586j38124j9953M2423J89754
10748c10318n7579K3899J48843j32666k37507O6250K49859K36562J72206J32451
10738B92000M230n588N5996j34674m1283l5807j20999j86576l5229J17657L4947
10727e5326K2187j046r4659l7105p2537K5609J93110J68147o4912j40951j8016
10716g5499m3918N2245J45614K54521j0964j38852p4554R2772R3637M2476L3244
10705C70722j30924l59513k05705N9972j5256m2451k2737J04561K65980R1651
10695A16300j24591R530J12998M8913q3435J21445m9796k21246j06203n4118L36808
$$ plain form
10770 -18840 -140357 -216167 -113634 -122992 -90467 1523 136638 128758 -257092 -504224 -471621
10759 -471621 -445808 -385233 -294202 -202196 -191121 -172832 -384418 -522542 -542495 -500072 -310318
10748 -310318 -367897 -343998 -195155 -327821 -565328 -499078 -249219 -12657 159549 292000
10738 292000 296230 290642 346638 211964 170681 134874 13875 -172701 -207930 -90273 -55326
10727 -55326 -33139 -34185 -128844 -165949 -238486 -212877 -19767 148380 83468 -57483 -75499
10716 -75499 -119417 -67172 78442 332963 321999 183147 108593 201365 295002 337478 370722
10705 370722 239798 -119715 -325420 -265448 -280704 -323155 -345892 -241331 24649 116300
10695 116300 -8291 1239 114237 163150 79715 201160 151364 -69882 -176085 -230203 106605
10684A06605J78027j86427J63086M9010j90038k02056j83006L1404K41757K09077
10674B17439r1934j56397o7682q6426k29227k89733J33130L59275K14523K8662
10664C1630j1687n7174M1121K05769J76568k3949k75749k26497N0849J6386j8074
10653i0807Q1795J71458j18390k4932K48878Q8452l05037q3114K55683L31679
10643E55665J55059j53519n02329k85482P2730P3391J88864Q8028L1127q0963
10633A42571k813p3293l3584J35215J8869L0559J0696o9688K1364j5760j28139
10622C5997j23797Q0153P1721j40965j49918p8633K72P9105J26592j12723k03626
10611d15822M7820r7140p2697J57219J34091J6299p6957J0615L0925N4355P4523
$$ plain form
10684 106605 284632 98205 261291 310301 120263 -81793 -264799 -233395 8362 217439
10674 217439 125505 -30892 -98574 -185000 -414227 -703960 -570830 -211555 2968 31630
10664 31630 19943 -37231 3890 209659 386227 362278 86529 -139968 -89119 -72733 -90807
10653 -90807 -9012 162446 44056 19124 268002 356454 51417 -31697 223986 555665
10643 555665 710724 557205 54876 -230606 -157876 -84485 104379 192407 223534 142571
10633 142571 139758 66465 32881 168096 186965 217524 228220 158532 179896 164136 35997
10622 35997 -87800 -7647 64074 -76891 -226809 -305442 -305170 -226065 -99473 -212196 -415822
10611 -415822 -368002 -465142 -537839 -380620 -246529 -230230 -307187 -296572 -265647 -211292 -136769
10600a36769q0035l5257J37150Q1867m0506r0697j80750j24561l8082L00787L44510
10589A37657R9143N4086n1037j97003n3790L349p5803j36094k34947k95941J0867
10578g39513K36433K30730l3902K8849K61626Q2225k27435k06665o0003k3264
10568d50919j8497J43081J76938j7291J66916K31356J38384k14940j36298K9318
10558D8048J2362j47637j07390J16661L29026K50744l6131j87232l59397k51570
10548c32516j47269M3562L8030L7366J27680J98859J39227J02176j23n4841J17533
10537B69684j35619k67438m6805J39871O3045n5470Q0271J43088j94887k64658
10527b68918j82098R072J51741K32987R0589j5319J30889M4971j8137Q5265R4602
$$ plain form
10600 -136769 -216804 -252061 -114911 -33044 -73550 -164247 -344997 -469558 -507640 -206853 137657
10589 137657 236800 290886 239849 42846 -10944 -7595 -83398 -219492 -454439 -750380 -739513
10578 -739513 -503080 -272350 -306252 -277403 -15777 66448 -160987 -367652 -427655 -450919
10568 -450919 -469416 -326335 -149397 -166688 228 231584 369968 155028 18730 48048
10558 48048 60410 -87227 -194617 -77956 251070 501814 465683 278451 -80946 -332516
10548 -332516 -479785 -436223 -398193 -360827 -233147 -34288 104939 207115 206992 152151 269684
10537 269684 134065 -133373 -180178 -40307 22738 -32732 47539 190627 -4260 -268918
10527 -268918 -451016 -441944 -290203 -57216 33373 18054 148943 193914 175777 261042 355644
10516C55644q509m2114k39834l26723j24188K74006J10410m5060o1089k0846k758
10505a31061k1940m1739J05004J51185P3295j321J6048J74634K3722q4351k37068
10494B6408p2343n0650j61441l9191Q499j40451J18448M36737L57491m1388j33652
10483C08467j43328J2402Q9440n3345n7917j54246p7116J26463o1124k11900p5521
10472b97725N4055O8725R9436N3003J1059J06212J66410n7473j31675l5025N3787
10461I0789p4115q1192n0237o8789L5693O4588P9905j01656k42453L7183J29087
10450a81197K66521J04269k34551J7464J87323J88270K23439m7758l24029k00519
10440g68j16368J9507N1219Q5604o8033o589K13214o7412l31629l12326k81851
$$ plain form
10516 355644 347135 305021 65187 -261536 -385724 -111718 -1308 -46368 -107457 -128303 -131061
10505 -131061 -153001 -194740 -89736 61449 134744 133423 149471 324105 347827 263476 26408
10494 26408 -45935 -96585 -258026 -297217 -288718 -429169 -310721 126016 483507 442119 308467
10483 308467 165139 177541 266981 213636 155719 1473 -75643 50820 -10304 -222204 -297725
10472 -297725 -243670 -174945 -75509 -22506 -11447 94765 261175 203702 72027 37002 90789
10461 90789 16674 -64518 -114755 -183544 -147851 -83263 -3358 -105014 -347467 -310284 -181197
10450 -181197 85324 189593 -44958 -27494 159829 348099 571538 523780 199751 -768
10440 -768 -117136 -97629 -46410 39194 -28839 -35428 177786 110374 -221255 -533581 -815432
10429h15432q2277R1658m0682J891K55982O7403j58894o6228R3770J25392J29392
10418c98025K7972J29600j946M8472J00541N7230p4098j7173j6755o8721p3113
10407b86016q6135j20648R0689Q6756m8948j63597j3300J57225m3438q6384J21406
10396c92390L20675L51177K32503p6064j78403o6469q4077j55691j83787O2871
10386a69655J82024J51239k4156k21288j55151k20983q9350K5993l2871P7674
10376d76524L34856J53471R7292J42520R2370J0197j10813n6731Q8734l8916q9117
10365A47339p9696k20211o5918Q8185Q2444o169l8080J0104M9119M234M6398L1196
10353D8945p8826j53472q231J56395K46176J21301k2259j47612j23049p2392k49319
$$ plain form
10429 -815432 -897709 -806051 -846733 -844842 -588860 -521457 -680351 -746579 -652809 -527417 -398025
10418 -398025 -370053 -240453 -242399 -193927 -93386 -36156 -110254 -127427 -144182 -212903 -286016
10407 -286016 -372151 -492799 -402110 -315354 -364302 -527899 -541199 -383974 -427412 -513796 -392390
10396 -392390 -71715 279462 511965 435901 257498 191029 106952 -48739 -232526 -169655
10386 -169655 12369 163608 139452 -81836 -236987 -457970 -547320 -521327 -554198 -476524
10376 -476524 -141668 11803 109095 251615 343985 354182 243369 186638 275372 236456 147339
10365 147339 67643 -152568 -218486 -130301 -47857 -54026 -92106 -82002 -32883 -28649 17749 48945
10353 48945 -29881 -183353 -191584 -35189 210987 332288 310029 162417 39368 -33024 -282343
10342b82343k43759j32350O2678L61073L42765K21276P0170l9501j77332K415
10332A85092J42157j05925k61662k78383j65315p1824j27158l6497J69623P6329
10322d73563j47014k17231Q4300J67592J78558K0881j4801J13490N5846R3594
10312a38348J32703P2122N0407n6227P0244L8466o0075l6539n1735q9658j54658
10301b23298j19066r9068O6323J71368K37371K13092N2933j11833k90789j29831
10291b32798J52902J58957O3208q8302k67350j37762J85384o2923j79549J37196
10281b71037J29138r2989J58674P430k39367j82019k19267P3641J91367J78083
10271b66346O4737j03840r1044P0163J34188R9490J85657j00j24324j58649o0519
$$ plain form
10342 -282343 -526102 -658452 -595774 -234701 108064 329340 399510 360009 182677 185092
10332 185092 327249 221324 -40338 -318721 -484036 -555860 -683018 -719515 -549892 -473563
10322 -473563 -620577 -837808 -753508 -585916 -407358 -386477 -401278 -287788 -231942 -138348
10312 -138348 -5645 66477 116884 60657 130901 169367 109292 72753 21018 -68640 -223298
10301 -223298 -342364 -441432 -375109 -203741 33630 246722 299655 187822 -102967 -232798
10291 -232798 -79896 79061 142269 53967 -213383 -351145 -165761 -228684 -408233 -271037
10281 -271037 -141899 -234888 -76214 -68784 -308151 -490170 -709437 -635796 -444429 -266346
10271 -266346 -201609 -305449 -396493 -326330 -192142 -92652 93005 92905 -31419 -190068 -250587
10260b50587n3540J69158J39270k19418j8355J58362O0233n3293n5316n2518J7911
10249a58093k1050N2198J55423p9673k15390j93080m5391J13335J08018R9321
10239a84382J87763J47195r0331j55877q0431m2544M1624n566J0046J18910L4477
10228a9116j71712q5545l3490L871J93408J11303p6206p806K5537p8120j37323
10217b75199l2648L6531j44454j43477M8607R7504j00390O9776J41742J75530
10207a26478K31988J11039N2453j43328o7317J47067J61804Q7453r6505k54209
10197A03967k16183k4004R6574R0370Q9673k20422k50834p1658j08298j8035Q9009
10186d39841P4344J96487K12842J64532L2901k96995j60512K14302P2009r0798
$$ plain form
10260 -250587 -304127 -134969 4301 -215117 -233472 -75110 -14877 -68170 -123486 -176004 -158093
10249 -158093 -179143 -126945 28478 -51195 -266585 -459665 -505056 -391721 -283703 -184382
10239 -184382 3381 150576 60245 -95632 -176063 -218607 -176983 -182549 -172503 -53593 -19116
10228 -19116 -190828 -276373 -309863 -305992 -112584 -1281 -77487 -85293 -59756 -137876 -275199
10217 -275199 -307847 -271316 -415770 -559247 -510640 -413136 -513526 -443750 -302008 -126478
10207 -126478 105510 216549 269002 125674 58357 205424 367228 454681 358176 103967
10197 103967 -112216 -136220 -39646 50724 140397 -80025 -330859 -402517 -510815 -528850 -439841
10186 -439841 -365497 -169010 43832 208364 241265 -55730 -216242 -1940 70069 -20729
10176b0729J19220K9514j07327j90725n7700R9026M7239j16350q1842J02279j04761
10165b82156K4250J81564l8256j76767j20063O2880R8452J91720J04052j38293
10155i2617l4357K09914J14568j79359j58519k9639J6053P5775Q2872K39122P5137
10144C18950o8304j59483j41569K4340J96773R2816n7057J4401J07813J00566
10134D29246J7389o8536P7025q9094j72743n1491J53737n2453k65504k51959l9746
10123c14129j5991r926j5401J34539J22998J18019K54j24558o2797J7497J41202
10112h293M0520K5012M3196j58741j66621j49072k411K98008K40067J15941Q5606
10101C63212j10787j96008k50550j32309Q8569j99582k20081j48478J73506L36173
$$ plain form
10176 -20729 98491 128005 20678 -170047 -227747 -128721 -81482 -197832 -279674 -177395 -282156
10165 -282156 -257906 -76342 -114598 -291365 -411428 -348548 -250096 -58376 45676 -92617
10155 -92617 -126974 82940 197508 18149 -140370 -170009 -153956 -78181 4691 243813 318950
10144 318950 250646 91163 -50406 -26066 170707 263523 206466 220867 328680 429246
10134 429246 446635 378099 455124 366030 193287 141796 295533 243080 -22424 -274383 -314129
10123 -314129 -330120 -340046 -355447 -220908 -97910 20109 20363 -104195 -166992 -149495 -8293
10112 -8293 32227 57239 100435 -58306 -224927 -373999 -376410 -78402 161665 277606 363212
10101 363212 252425 56417 -194133 -326442 -237873 -437455 -657536 -806014 -632508 -296335
10091b96335K6753q804O8671L4061P1904N0946j49417p2975r2061p036J96770
10080a77523L18983K33864N8224j09122k67884j48343m6282K16578L59135J37732
10070E75362l7332m4098k2511l6397j43935j21352J6968o1756k41379k14006o2673
10059c93109K73520K54784k4133o1920l2338n5739j87042j62625J93529J88963
10049f110R6341q3267j27047m0107n8374Q6316J97299K2765p7901j32141j81654
10038c03880j5197Q5971k3138K1782J35743j8925O71O5377J4393o0916j8501P8639
10026c7981M1244K13119N4504j52043o4308n559o7411j17921k30603j32565L6882
10015d62642O516O9683K57081M43755K69201R6625r7569o6311m4502j51252k36716
$$ plain form
10091 -296335 -269582 -278386 -209715 -175654 -103750 -52804 -202221 -275196 -367257 -374293 -177523
10080 -177523 141460 375324 433548 324426 56542 -91801 -138083 78495 437630 575362
10070 575362 538030 493932 471421 435024 291089 169737 186705 124949 -116430 -330436 -393109
10059 -393109 -119589 135195 111062 49142 16804 -38935 -225977 -388602 -195073 -6110
10049 -6110 90231 6964 -120083 -160190 -218564 -132248 65051 87816 9915 -122226 -303880
10038 -303880 -319077 -233106 -256244 -234462 -98719 -117644 -116973 -51596 -37203 -98119 -116620 -37981
10026 -37981 3263 216382 270886 118843 54535 48976 -18435 -136356 -366959 -499524 -462642
10015 -462642 -456126 -386443 -129362 314393 583594 680219 582650 516339 471837 320585 83869
10004H3869k12557j08142r2933J21778J44380Q1446R0843l123K6730p2875o9697
9993a0281q9569j71887p943j1470j85205k41165Q5106K10454J33733J46312p2935
9982b14850k14811j21544j2601N7504k3847M2959n7220j59572q0051J54816K47461
9971c81756K59226K07928q8368j56546j63658j52155J9864N6586O2602J12850
9961b23427L03j27347K1200p4373N5195J71148R9368J8196n061J22945K32735
9950B90882J90403L220l21357l31109k17849K69910K19717j7460k61522l21037
9940d96202j24334R8556L21590J36768N8138K60389K71266J16895J961k26242
9930D18785l00466j08972Q4909m4094j77684j07985J19443K20647J30336k25066
$$ plain form
10004 83869 -128688 -236830 -329763 -207985 -63605 17841 108684 105561 132291 59416 -10281
9993 -10281 -99850 -271737 -279680 -291150 -476355 -717520 -632414 -421960 -288227 -141915 -214850
9982 -214850 -429661 -551205 -563806 -506302 -530149 -487190 -544410 -703982 -784033 -629217 -381756
9971 -381756 -122530 85398 -2970 -159516 -323174 -475329 -455465 -398879 -336277 -223427
9961 -223427 -223124 -350471 -329271 -403644 -348449 -177301 -77933 -59737 -64798 58147 290882
9950 290882 481285 484505 163148 -167961 -385810 -115900 103817 86357 -175165 -496202
9940 -496202 -620536 -521980 -200390 -63622 -5484 254905 526171 643066 645027 418785
9930 418785 118319 9347 94256 50162 -127522 -235507 -116064 104583 234919 9853
9920I853k56793o7355N4417P2293J54371L15488K9779j4605R7149R1551k31709
9909B54439j61280L5794m3566l07406n0893K23303J14031J57250K273q515M6243
9898B61673q5161o2766r2959n4857j03960k44318m0223j8159J19385k4391k12925
9887e58661j63529j52472R8669L8822O8416K91097J42032K2331l1148R112Q2040
9876a53291m1895r1375R58Q8599J65237o834K3803j20464k17768j00792j6590
9865d70412O5225j14164J11844K43625L6959j22484j57263k64224l47291m7118
9855a065303Q7459K15471J37777O1324K44619K13725j40068j52510j34954o1692
9845e94152K12592J28674R5950J21477J4505j3330j51595J6735J60447J30372
$$ plain form
9920 9853 -246940 -314295 -259878 -187585 -33214 282274 312053 297448 394597 486148 254439
9909 254439 93159 128953 85387 -222019 -272912 -49609 64422 221672 223945 215430 261673
9898 261673 176512 113746 20787 -34070 -138030 -382348 -422571 -440730 -321345 -345736 -558661
9887 -558661 -722190 -874662 -775993 -737171 -668755 -377658 -235626 -213295 -244443 -235331 -153291
9876 -153291 -195186 -286561 -285603 -197004 -31767 -38601 -14798 -135262 -353030 -453822 -470412
9865 -470412 -405187 -519351 -407507 -163882 -126923 -249407 -406670 -670894 -1018185 -1065303
9855 -1065303 -977844 -762373 -624596 -563272 -318653 -104928 -244996 -397506 -532460 -594152
9845 -594152 -381560 -252886 -156936 -35459 -20954 -34284 -185879 -169144 -8697 121675
9835A21675n7697j402J9606J51463k591k25175j64664p6032o8559J8342K07909
9824g7125J31789n0198Q7487J01803k1786L6097P5812l2565j18546j1161j99197
9813g7590k53165N6038O2134j99740j02992J36074J5617n4227J01323K95975K55071
9802B34518O9203n866j40924m72724k40444J83988K32780R5581J74455J00801
9792B31368k05640k31443k3653J35374J1049J07255K7324p9498O0231J2716J40848
9781A85931Q9589N0059R6179K5355j16440j58120j80121j34224q9109J38742K4632
9770f7527p3514J85774O0247j84635k22168j2230K06140N6566k6544l6363p6151
9759a90405J69735J32104K6412j00702O9574J48437K6661n9314k02658j01918
$$ plain form
9835 121675 63978 62576 82182 233645 231054 5879 -158785 -234817 -303376 -285034 -77125
9824 -77125 54664 4466 91953 193756 171970 208067 283879 251314 132768 121607 -77590
9813 -77590 -330755 -274717 -212583 -412323 -515315 -379241 -363624 -417851 -316528 -20553 234518
9802 234518 303721 297855 156931 -315793 -556237 -372249 -139469 -43888 130567 231368
9792 231368 25728 -205715 -229368 -93994 -82945 24310 51634 -27864 32367 45083 185931
9781 185931 275520 325579 421758 447113 330673 172553 -7568 -141792 -230901 -92159 -67527
9770 -67527 -141041 44733 104980 -79655 -301823 -314053 -107913 -51347 -77891 -114254 -190405
9759 -190405 -20670 111434 137846 37144 106718 255155 281816 222502 19844 -82074
9749h2074J58897P6270R5184J23331p6149j46547M5184K3951p4703j14106j98332
9738a69094n5240J49732L1735j86850j1207K030m3598K0728J87012M3905k30109
9727b60956j68877o5558L5082N5622k7960p9213j2959J54273K43182J56930K52523
9716B82089K52232J38109l5979j79577k05760j88416J6491K12360K76828J1648
9706E80025j06125n0036l4034n9382k71119m7493n1967j29645q5505j528k0671
9695b77480j28621J89126L08572K0156j61121j72336L1540J21475k4384k52710
9685c45783q3176J47929J76669o807o3942r2365p5023p5304n8795K08306J53682
9674a14609Q5915J084k1999L6318R6726K7325R6876N1852m6599j07077q3975M28573
$$ plain form
9749 -82074 76823 153093 248277 371608 295459 148912 194096 218047 143344 29238 -169094
9738 -169094 -224334 -74602 -42867 -229717 -240924 -238894 -282492 -261764 -74752 -30847 -260956
9727 -260956 -429833 -495391 -460309 -404687 -432647 -511860 -524819 -370546 -127364 29566 282089
9716 282089 534321 672430 636451 456874 251114 62698 79189 291549 568377 580025
9706 580025 473900 423864 389830 330448 59329 11836 -40131 -169776 -255281 -256809 -277480
9695 -277480 -406101 -216975 91597 111753 -49368 -221704 -190164 -68689 -93073 -345783
9685 -345783 -428959 -281030 -104361 -111168 -175110 -267475 -342498 -417802 -476597 -268291 -114609
9674 -114609 -28694 -27610 -49609 -13291 83435 110760 207636 259488 212889 105812 21837 450410
9662D50410K42479p7414k22654j93497L3680J25654j58638k51272Q37n7804l2035
9651a40254J70118N3943j4057o1164O4655J96470O3063j01113k93608l75380j79654
9640f16981R1343L82146K23281j70518k18136j29447j21836l4897J86479K29183
9630a79383J07552M5111m8889j84641l32230m2696K77871J3263k11468p4923J25750
9619e04683K90927K43062J45014O082j90413k10947M8773P8455j43756k5183J79902
9608h2767J86970J15590K49774n0642l45745k47030M4643K31633j21385m41019
9598d59978j02678L06608K31603j52350l76717k53869N298J25447J85149k0119
9588e11606k10273q1084K67982K99825P5151k65485k78199N0253J62541K00582
$$ plain form
9662 450410 692889 615475 392821 199324 233004 358658 200020 -51252 -50415 -108219 -140254
9651 -140254 29864 83807 69750 8586 73241 269711 332774 231661 -61947 -437327 -616981
9640 -616981 -525638 -143492 79789 -90729 -308865 -438312 -560148 -595045 -408566 -179383
9630 -179383 -71831 -26720 -75609 -260250 -592480 -635176 -357305 -344042 -555510 -630433 -504683
9619 -504683 -213756 29306 174320 180402 -10011 -220958 -172185 -93730 -237486 -262669 -82767
9608 -82767 104203 219793 469567 418925 73180 -173850 -129207 102426 -18959 -459978
9598 -459978 -562656 -256048 -24445 -176795 -553512 -807381 -802083 -676636 -491487 -511606
9588 -511606 -721879 -802963 -534981 -235156 -160005 -425490 -703689 -653436 -490895 -290313
9578b90313J99104K991o750K74243L68023J30123k3154m1402m2073p0300k76262
9567B24230j94228l6571j13081Q6612J62839j794N3058P0496J57642O6769k18435
9556B57537k77270j51641n0869o4593M4672N3112j551O7343Q583o4821j21784
9545c01282m6648J5716J44476L15062J15767J62694K00526l4592l21112k52349
9535a742j68492j95200j7117J48121J41808J66052L06658K28162q4679p7067o2093
9524C84411q7077j0744j3135k36208k53582j46493k6355O8773J7646P1333L8632
9513a92799p2570M4611J95341O7943j38067q189N7138M6376r0033j21454L9580
9502a72123J88440k5137k66405q5020R1040j07216l17968Q500K04008J63907K53387
$$ plain form
9578 -290313 -91209 -88218 -94968 179275 547298 677421 654267 612865 570792 500492 224230
9567 224230 30002 -6569 -119650 -33038 129801 128007 181065 251561 409203 475972 257537
9556 257537 -19733 -171374 -222243 -286836 -242164 -189052 -190603 -123260 -114677 -179498 -301282
9545 -301282 -347930 -332214 -187738 127324 243091 405785 606311 571719 250607 -1742
9535 -1742 -170234 -365434 -382551 -234430 -92622 73430 380088 608250 523571 446504 384411
9524 384411 297334 286590 273455 37247 -216335 -362828 -389183 -320410 -302764 -231431 -192799
9513 -192799 -265369 -220758 -25417 42526 -95541 -103730 -46592 -216 -90249 -211703 -172123
9502 -172123 16317 -8820 -275225 -360245 -269205 -376421 -694389 -685889 -481881 -317974 -64587
9491f4587J01986m6489J36639J97476j81054l07720j11019J69682K31326M0370
9481A66610j33282n9961J4814j64417r5177J22768J2707j22067p3583p8107o2691
9470d72386n1802J01916J13171m9443l4352J40031J77502R4953J14081q0277j64664
9459a11270N7772N3904J14481P5276k6422j70356L3397J67668P7661l2611L9537
9448B79037J3021p1942r4435q2745j3718M0001q8387j70324l731k1484M0617L35186
9436A61096J85236j80380k99126k02617n3554O138q7714L8655J72504j02590j09802
9425d72154J10759K20708K6664m0205P3225J36819K9142n6246j70921o0516J18413
9414h4312K80457J80590J22640p7628j50737k2661j46065r6263p9527j20797q6455
$$ plain form
9491 -64587 37399 -9090 127549 325025 143971 -163749 -274768 -105086 126240 166610
9481 166610 33328 -26633 -11819 -176236 -271413 -148645 -135938 -258005 -331588 -409695 -472386
9470 -472386 -524188 -422272 -309101 -358544 -392896 -252865 -75363 19590 133671 53394 -111270
9459 -111270 -53498 406 114887 190163 163741 -6615 26782 194450 272111 239500 279037
9448 279037 292058 220116 125681 42936 29218 69219 -19168 -189492 -193223 -214707 -174090 161096
9436 161096 346332 165952 -133174 -335791 -389345 -383207 -470921 -432266 -259762 -362352 -472154
9425 -472154 -361395 -140687 -114023 -154228 -81003 55816 84958 28712 -142209 -202725 -84312
9414 -84312 196145 376735 499375 421747 271010 248349 102284 6021 -73506 -194303 -280758
9403b80758j5726Q1488J83347J88296J0554N1420r8634j24849P9428l724j93448
9392a22606k10774j8846J26796Q4743o5960J6796n2218j05461K3551J41405m9263
9381b31837K4795K03836J23384J60271M6301j41389p0677j35783J37814J56067
9371B72782L3287M5994M3118J1764j65393m5117J20166N8747P8014j02959j89790
9360A60613j84061m4990K82041L93977J32031k10531j34188K08117Q5435k00646
9350D87798j97063k11712L5446K01417m8139k18754j01066k2632L33275K44718
9340E03288j04864O886N2406J44240l9518j46726N8207Q4646r8538k69195j56214
9329C4618J4375J42590J80500J79779K19882J97294J17903J37590l0049j51362
$$ plain form
9403 -280758 -296484 -214996 -31649 156647 167201 218621 119987 -4862 74566 70842 -122606
9392 -122606 -333380 -352226 -225430 -140687 -206647 -189851 -242069 -347530 -323979 -182574 -231837
9381 -231837 -207042 -3206 120178 280449 326750 185361 114684 -21099 116715 272782
9371 272782 306069 352063 395181 406945 241552 196435 316601 375348 453362 350403 160613
9360 160613 -23448 -68438 213603 607580 739611 529080 394892 603009 688444 487798
9350 487798 290735 79023 114469 315886 267747 48993 -52073 -74705 258570 503288
9340 503288 398424 405310 457716 601956 562438 415712 473919 558565 460027 190832 34618
9329 34618 48993 191583 372083 551862 771744 969038 1086941 1224531 1194482 1043120
9319A043120o5018j66767P765Q8034k4565j44051j12548l1042J33934L20035K90134
9308A339031K8940n5933o231Q1640j2595m01689k69434j1367J97713M5051r7474
9297H37652J31310j2351L7401L85571L41366J20894J13200k7448n8348K66164
9287B135411K08218R33N0346R4197J99652K49728K66368K45999K18885J35423
9277C805160M11701N04761L52704K01122J92686N37264P11702R06831Q49803P61507
9267I235241P30753Q86609J044686Q84271J257105J640759J657976J775057K027704
9258B1140161J977388J766132J442899P79816L19017j02283o69535j366701j775727
9249B3511167j982455j895183j831634j895286j782448j523922j214860j199229
$$ plain form
9319 1043120 978102 811335 819100 907134 882569 738518 625970 594928 728862 1048897 1339031
9308 1339031 1367971 1312038 1305807 1387447 1374852 973163 703729 692362 890075 935126 837652
9297 837652 968962 956611 994012 1379583 1720949 1841843 1955043 1927595 1869247 2135411
9287 2135411 2343629 2344562 2394908 2489105 2688757 2938485 3204853 3450852 3669737 3805160
9277 3805160 4216861 4721622 5074326 5275448 5468134 6005398 6717100 7623931 8473734 9235241
9267 9235241 9965994 10852603 11897289 12781560 14038665 15679424 17337400 19112457 21140161
9258 21140161 23117549 24883681 26326580 27106396 27425413 27323130 26653595 25286894 23511167
9249 23511167 21528712 19633529 17801895 15906609 14124161 12600239 11385379 10186150
9241A0186150j027159o36026n44827o33805p03821n66366m62597k86752k85828
9232E038969l27001j02742j77877m12646l14284M8772n5962n4877J22306J53141
9222C917799n7502p3507J91081Q6991J02612O9673n1150J04380J56873O1638k1001
9211D487887J02042K15274K08935K46433K72414M78597O33822P30681O09039P25302
9201H710426P23597Q54855J274534J401264J328921J415344J406653J426861J661364
9192B0203819J768556J773062J630227J409900O94998k23753q13014j100689j479324
9183B3863782j647609j854080j834818j799490j644963j504628j534283j278180
9175A0765731j181418j055227p82985p90427o89597m38786n38624n62889m99579
$$ plain form
9241 10186150 9158991 8522965 7978138 7344333 6640512 6074146 5611549 5324797 5038969
9232 5038969 4711968 4609226 4431349 4018703 3704419 3753191 3697229 3642352 3764658 3917799
9222 3917799 3860297 3786790 3977871 4064862 4167474 4237147 4185997 4290377 4447250 4508888 4487887
9211 4487887 4589929 4805203 5014138 5260571 5532985 6011582 6645404 7376085 7985124 8710426
9201 8710426 9434023 10288878 11563412 12964676 14293597 15708941 17115594 18542455 20203819
9192 20203819 21972375 23745437 25375664 26785564 27480562 27256809 26443795 25343106 23863782
9183 23863782 22216173 20362093 18527275 16727785 15082822 13578194 12043911 10765731
9175 10765731 9584313 8529086 7746101 6955674 6266077 5827291 5288667 4725778 4226199
9166D226199n59408l50305J8112l2547j83980k72348k50499m8550l259j39899
9156B403516j63254j14102r2579j75696k48580j08590P4987L8880J08301K3539
9146A746422k48044j41448J7543q3170p6429j7426N7677r9653k79234r6580P7214
9135H56872K1603l5466Q858M327n5723Q3446J78876J18445R5315O5373p6282l7557
9123A228087q6096l77997j95987N7972J50567J95714K4448j41150N784K8612J7654
9112I07608J8709p0181K7703m6926j59835j45452J4964n8778j56950L4433M9090
9101D14385o4821J0l7234N82J46977J63352k20184j72252J13711J9586q6j8608
9089C45418q4099n0442M1914P7115l6272j66232k80806k38678K9007L1804J77068
$$ plain form
9166 4226199 3666791 3316486 3334598 3302051 3118071 2845723 2595224 2546674 2543415 2403516
9156 2403516 2240262 2126160 2033581 1857885 1609305 1500715 1575702 1614582 1722883 1746422
9146 1746422 1498378 1356930 1374473 1291303 1214874 1197448 1255125 1155472 876238 779658 856872
9135 856872 878475 843009 851867 856194 800471 883917 1062793 1181238 1276553 1341926 1265644 1228087
9123 1228087 1141991 763994 568007 625979 776546 972260 996708 855558 861342 889954 907608
9112 907608 926317 856136 883839 836913 677078 531626 546590 487812 330862 365295 414385
9101 414385 349564 349574 312340 312922 459899 623251 403067 230815 344526 364112 364026 345418
9089 345418 261319 210877 252791 329906 293634 127402 -153404 -392082 -363075 -331271 -154203
9078a54203K18340m3157j16331r7407o7518k09458j10034N7940K72606M81763
9068B32541L35128J62170p9832j18160j44544j42800q1430J36118J38764P71l370
9057D35356j68613k85912j88225K8603J01370Q4395l376L9182J44889J4938j43753
9046E8854j67927j13559q259J64245J87234J58823j24358r2281J15423J95663
9036C73858J38859j61785k38850j58030j46113k40494k28816N2132J94897n8631
9026d72973m6440J29174P8976J41135J58903K48369J54340J7962j07879l90657
9016h9090k29753j8524M8129K2854K03J48846K71171J88669n7509o3871J35707
9005C56832J05438k69391l90601k23196l9966j1700Q7197n062p2031l373J30297
$$ plain form
9078 -154203 64137 20980 -95351 -192758 -260276 -469734 -579768 -521828 -249222 232541
9068 232541 567669 729839 650007 531847 387303 244503 163073 299191 437955 438726 435356
9057 435356 266743 -19169 -207394 -178791 -77421 6974 3598 42780 187669 202607 58854
9046 58854 -109073 -222632 -230891 -66646 120588 279411 155053 62772 178195 373858
9036 373858 512717 350932 112082 -45948 -192061 -432555 -661371 -609239 -414342 -472973
9026 -472973 -519413 -390239 -311263 -170128 -11225 237144 391484 409446 301567 -89090
9016 -89090 -318843 -337367 -289238 -266384 -266181 -117335 153836 342505 284996 221125 356832
9005 356832 462270 192879 -197722 -420918 -460884 -472584 -385387 -390449 -462480 -465853 -335556
8994c35556Q5813Q7100N4775k0750k1347j14515j18814q5542q3881o4529J25364
8983d91882n821l6492M8976O2033J45895J59308L1291M1061o710l2300O0358P4502
8971E0219O7538n0083k10563j04136O83R8729J63176J07766J39820q368j12663
8960A42118o9725j11563q8727n2880r3568J26314L28297J85893K00264K10597
8950G77020j12656j86724k37693j95157j5509J39880J05449o2648l3284j61724
8940A6954N203k876L698Q1481J42722J24470r4040k14534j85935j72860M8048
8929b47669R0504o89J5119K2516n5176j97098p135J03557K8907l9569K21209Q7409
8917B1885j12732k49676m30942l09636R281K05930J13838J24722j4120L2241L14432
$$ plain form
8994 -335556 -249743 -162643 -107868 -128618 -149965 -264480 -383294 -468836 -552717 -617246 -491882
8983 -491882 -497703 -534195 -485219 -423186 -277291 -117983 -86692 -45631 -52341 -84641 -24283 50219
8971 50219 117757 67674 -142889 -247025 -246342 -147613 15563 123329 263149 254781 142118
8960 142118 72393 -39170 -127897 -180777 -274345 -148031 180266 366159 566423 777020
8950 777020 664364 477640 239947 44790 29281 169161 274610 211962 178678 16954
8940 16954 22157 19281 22979 104460 247182 371652 277612 63078 -122857 -295717 -247669
8929 -247669 -157165 -157854 -142735 -120219 -175395 -372493 -379628 -276071 -247164 -286733 -65524 21885
8917 21885 -90847 -340523 -771465 -1081101 -1071820 -865890 -752052 -627330 -641450 -609209 -294777
8906b94777M42944Q3888l6555P7238k16349l17764k45448j97762j17387j05586
8896i27558J23551M31903L79373K45352p7165j58277J15505J40502j51823k71589
8886a50226j10145P5100j4316o8963J63682J35958N5232q7826r5208j26751k01749
8875d25212j57529m4851J02260J31952p4734n7149P5990J47069K10128J32572
8865D0496j5832r83j01008N8261J34052r0402r4856J16589M0274j85464j39908
8854b38781J2527K50913n1870j97842J80477J00074m7032j69888m9248J03587
8844a07083M6266l8542k39475q6573j03421P8826J99835M24204K17710k73528
8834A18219k00291O4566O1639n1863L719l9835j06149o4511p0801J63316K78536
$$ plain form
8906 -294777 148167 232055 195500 272738 56389 -261375 -506823 -704585 -821972 -927558
8896 -927558 -804007 -372104 7269 252621 175456 17179 132684 273186 121363 -150226
8886 -150226 -260371 -185271 -199587 -268550 -104868 31090 86322 -1504 -96712 -223463 -425212
8875 -425212 -582741 -627592 -525332 -393380 -468114 -525263 -449273 -302204 -92076 40496
8865 40496 24664 23681 -77327 -19066 114986 24584 -70272 46317 86591 -98873 -238781
8854 -238781 -226254 24659 -27211 -225053 -44576 55498 8466 -161422 -210670 -107083
8844 -107083 -60817 -99359 -338834 -425407 -528828 -450002 -250167 174037 391747 118219
8834 118219 -82072 -17506 44133 -7730 -4011 -43846 -149995 -214506 -285307 -121991 156545
8823A56545l4996j65198k455j44455k44260j11415R1081K25483J88187L20456
8813B78973O0879k64745j56568J85445K1279k29551r151J49153J89865J50804
8803C76383J49164J8209j48435p9949j59213J6336J45126N153j41934k35841l26773
8792c81774j81479R2908J96554O5723J47218K31819J20685l2949N2831j74724
8782A36812k48807n0095J52328M09027J88433j0795j94562p4745Q6486j16769
8772B77313j78637k8408L189j0652j5791O5622K6134J86372K43539J30310L2903
8761G31894J9563l02598l28127j41260l46221j89040K31168L80502Q2806j86746
8751d8059j94598k5015k7206J87446L87008J7761j64945j11863n7196l015J75575
$$ plain form
8823 156545 121549 -43649 -46104 -190559 -434819 -546234 -455153 -229670 -41483 278973
8813 278973 339852 75107 -81461 103984 125263 -104288 -113439 35714 225579 376383
8803 376383 525547 543756 395321 315372 156159 172495 317621 322774 180840 -55001 -381774
8792 -381774 -563253 -470345 -273791 -208068 -60850 170969 291654 258705 311536 136812
8782 136812 -111995 -162090 -9762 399265 587698 576903 382341 307596 394082 277313
8772 277313 98676 70268 73457 62805 47014 112636 138770 325142 568681 698991 731894
8761 731894 751457 448859 120732 -20528 -366749 -555789 -324621 55881 138687 -48059
8751 -48059 -242657 -267672 -294878 -107432 279576 297337 132392 20529 -36667 -39682 135893
8740A35893J2550k04401j59706o1018J98972j0727j95830j19666J0244Q4676L1907
8729b77106J08652Q28j2235K332K61989K01603p4359p1922r698j18570k8485O2805
8717D5834j69135j30014M0237j5947J74159K74615r2560j17949k8648k5635l2176
8706g7219j45052M1767j2172j9917O0560n0414P8407K83620J07998Q3480J11082
8695D62140K392o3035l15996k76966r1058L2560K90406K13282p9630J06365K6536
8684C06996j75486J34572L06156m9051k02169m8354P3902P067m2068J8199k55423
8673G4341k93134j89141r0763j30644K0426J19885n5947J5690J35913J31560l4971
8662b96785l2308J02283L3234J06913n0294j85440k00897k26187l7323K66961
$$ plain form
8740 135893 148443 -55958 -215664 -276682 -77710 -88437 -284267 -403933 -393689 -309013 -277106
8729 -277106 -168454 -167626 -179861 -177529 84460 286063 211704 139782 130084 11514 -16971 45834
8717 45834 -123301 -253315 -213078 -229025 -54866 219749 127189 9240 -19408 -45043 -77219
8706 -77219 -222271 -180504 -192676 -212593 -152033 -202447 -124040 159580 267578 351058 462140
8695 462140 464532 401497 85501 -191465 -282523 -249963 40443 253725 174095 280460 306996
8684 306996 131510 266082 572238 523187 321018 272664 346566 353633 311565 329764 74341
8673 74341 -218793 -407934 -498697 -629341 -608915 -489030 -544977 -529287 -393374 -261814 -296785
8662 -296785 -329093 -226810 -193576 -86663 -136957 -322397 -523294 -749481 -786804 -519843
8652e19843L33791J51895O7770N681J25106N7378r4807k1544j28150j36429K2872
8641a36280J62926K42870R7953j73017j56431j4857j35737q5471j27879k03792
8631e29715J8952J99674P2490O6338J16684k122n5409J39554J9519m8024j75654
8620a77713k4667J2560J04257J78778L2388Q7114q895r9936k23771j59900J18599
8609a61186J99825R2327R863k25539p9015R1345K5201N8302L9397J3585J91377
8598B55482O0195k08184k1821O4748M900Q6456P4607J77361K73827m2986p6241
8587F48344j08298l35494j67607l8873j4324L9453J13839Q2916m0122K0849O9254
8576B69937P96l6741q8426P4404J2727l05555j42189K6463j11970J26185J27091
$$ plain form
8652 -519843 -186052 -34157 33613 39294 164400 221778 126971 105427 -22723 -159152 -136280
8641 -136280 26646 269516 367469 194452 38021 23164 -112573 -198044 -325923 -529715
8631 -529715 -510763 -311089 -238599 -172261 -55577 -57699 -113108 26446 45965 -2059 -177713
8620 -177713 -202380 -189820 -85563 93215 125603 212717 203822 103886 -119885 -279785 -161186
8609 -161186 38639 130966 140829 -84710 -163725 -72380 -47179 11123 50520 64105 255482
8598 255482 315677 107493 85672 150420 155320 241776 316383 493744 767571 724585 648344
8587 648344 540046 204552 36945 -1928 -16252 23201 137040 219956 179834 200683 269937
8576 269937 270733 233992 145566 219970 232697 -72858 -215047 -188584 -300554 -174369 -47278
8565d7278j13548k27770j16811P7286m2584m0267K51629L23799O2753N4405L8090
8554B19704O908J67379J40267p5315j00524o3479m2634q7619M8839J49324J08424
8543D71274k02520j85322k2357j7568K76031J63618j38260p7038k08635j74576
8533a15353K23089K61940J26130n6836r0969k09822j10201K64554J05246j42005
8523B55773j33673o3845j76241o1174P6777J45635M4160L3921P7939Q1020Q6800
8512C67092o0616k82818n1897J51655N5021J866q578k2734n6049r6182m3046o8938
8500a15224m6498L6172j12973q7220K633O6682P6951J72976J44014K6457M6763
8489B10733J86659J4355k44813j20346o1546j3167K61892J99888r6087j45168
$$ plain form
8565 -47278 -160826 -388596 -505407 -428121 -470705 -510972 -259343 64456 127209 181614 219704
8554 219704 226612 393991 534258 458943 358419 294940 252306 164687 213526 362850 471274
8543 471274 268754 83432 61075 43507 319538 483156 344896 267858 59223 -115353
8533 -115353 107736 369676 495806 438970 348001 138179 27978 292532 397778 255773
8523 255773 122100 58255 -117986 -179160 -102383 43252 87412 121333 199272 280292 367092
8512 367092 306476 23658 -28239 123416 178437 180303 171725 148991 92942 -3240 -46286 -115224
8500 -115224 -161722 -125550 -238523 -325743 -323110 -256428 -179477 -6501 137513 163970 210733
8489 210733 397392 411747 166934 46588 -14958 -28125 233767 433655 337568 192400
8479A92400r0676j43839j46962M3523K0109m3903k090L3175N2989R302L4357J75909
8467A34294R5696J69653K90831r338k60489j91593M4884p250o7393J24839K23118
8456E47252R3943O7566m3521k23176j55591r1594n8915o0729J1824P5145J45479
8445C07683L78250m763j31663L1391P4358N1108j79592l5531Q1181J1823j06580
8434D77665J17596J70181J02805Q0023m4382q8492J00024Q8637j44703j43106
8424G16248j72748p0311K53538J12348j38302j59280k45619m5295J70167J24706
8414E45452O4795L2668J21556K07895Q9138r2800j60379n9023K09087L24922J73135
8403A456446j91711l97936j25104M6175K34790L67182K41179P0329K31167N6711
$$ plain form
8479 192400 101724 -42115 -189077 -145554 -125445 -169348 -171438 -138263 -85274 -75972 -41615 134294
8467 134294 229990 399643 690474 681136 420647 229054 273938 266688 199295 324134 547252
8456 547252 641195 708761 665240 442064 286473 194879 135964 75235 87059 162204 307683
8445 307683 685933 681170 549507 580898 655256 706364 526772 491241 572422 584245 477665
8434 477665 595261 765442 868247 948270 903888 815396 915420 1004057 859354 716248
8424 716248 543500 473189 726727 839075 700773 541493 295874 250579 420746 545452
8414 545452 610247 642915 764471 972366 1061504 968704 808325 749302 958389 1283311 1456446
8403 1456446 1264735 866799 741695 787870 1022660 1389842 1631021 1701350 1932517 1989228
8393A989228j27141J88626K65119K9753k06272n7293O2742J58626L51042J84107
8383B838537Q1960J49345J38986J38135K87866K45391J33846K85023N35572P23506
8373E558167O46717L49033L07998N18147O49047Q03473J158300J231820J202552
8364A2425254J275035J533978J752511J657238J797469K091207K163472J690579
8356B6386743R54183P08831K82096p51183j394566j710263j800543j888968j946336
8347A8839994j829147j692983j661171j451766j186424j088702r38639q37186
8339H153976o30602l80696m48051m63725m21493n74782o49911m85558k31433j24648
8329C743077j07695l2746j7710k4162o2592l50467o18469l51541l170M2005J02152
$$ plain form
8393 1989228 1862087 2050713 2315832 2345585 2139313 2082020 2144762 2303388 2654430 2838537
8383 2838537 2920497 3069842 3208828 3346963 3634829 3880220 4014066 4299089 4834661 5558167
8373 5558167 6204884 6553917 6861915 7380062 8029109 8832582 9990882 11222702 12425254
8364 12425254 13700289 15234267 16986778 18644016 20441485 22532692 24696164 26386743
8356 26386743 27340926 28049757 28331853 27580670 26186104 24475841 22675298 20786330 18839994
8347 18839994 17010847 15317864 13656693 12204927 11018503 9929801 8991162 8153976
8339 8153976 7523374 7142678 6694627 6230902 5809409 5234627 4584716 4099158 3867725 3743077
8329 3743077 3635382 3602636 3584926 3560764 3498172 3147705 2529236 2177695 2174525 2216530 2318682
8318B318682P4048m1577l22789k87433o1206k83043k82588K2046J78885P8132
8308A393157p5564J22746K76990N1710j10624j86626m5250J14710P6494j7756
8298A599987j26531p9500k01431m3610J58529J87604J9063k16395k38612P0220
8288A129324K59950J62322k7229n9858J43348M7441j19667o386m4942k51238k12530
8277A020535N1442l2060k04771O5074O9641K2071n7027k79656j04081J76825O8843
8266G96836p0180j02614k54231n4485J98018j3358l07892j72759K55091L16959
8256E91385M1913Q5289K07974k3463k21773M8154n4167j90276j21511J88080L52975
8245I04580L61555J92557o6943k23681j30323j374j22476k45413k75306k63186
$$ plain form
8318 2318682 2392730 2351153 2028364 1740931 1679725 1396682 1114094 1136140 1315025 1393157
8308 1393157 1317593 1440339 1717329 1769039 1658415 1471789 1426539 1541249 1617743 1599987
8298 1599987 1473456 1393956 1192525 1148915 1307444 1495048 1514111 1297716 1059104 1129324
8288 1129324 1389274 1551596 1524367 1464509 1607857 1655298 1535631 1529245 1484303 1233065 1020535
8277 1020535 1071977 1039917 835146 900220 969861 991932 934905 655249 551168 727993 796836
8266 796836 726656 624042 369811 315326 513344 499986 192094 19335 274426 591385
8256 591385 633298 718587 926561 903098 681325 729479 675312 485036 363525 551605 904580
8245 904580 1266135 1458692 1391749 1168068 1037745 1036371 913895 668482 393176 129990
8235A29990R673K75691L38233Q0247j21011K14122L08414o7961l15980k47664
8225F03754k77637K1630m636j4679J85172R4183o4346l2583J68047J21917q3169
8214G17653j9010J34227j5950k5095K16924J75485J7203p180J76465M1135j52668
8203A259189j57786l30067j74154L5187P6964J22162J17421K4804j13280j03145
8193G57295O7039K78196L09333k16501m52393j18589N1344k6343O9005J34985
8183H53371j54146j87326j28547K67539J21274J0468K87755R7889p4954j14102
8173I79221o5976O1725K69373J76954J8964p2464k05835l4420L9644j0697k0953
8162A135536O6098O5549K5477j2874j45102j94854j13931K0448J10378J11518
$$ plain form
8235 129990 139663 415354 753587 833834 712823 926945 1235359 1167398 851418 603754
8225 603754 326117 347747 343111 328432 513604 607787 543441 510858 678905 800822 717653
8214 717653 698643 832870 816920 791825 1008749 1184234 1201437 1194257 1370722 1411857 1259189
8203 1259189 1101403 771336 597182 632369 709333 831495 948916 973720 860440 757295
8193 757295 824334 1102530 1411863 1195362 742969 624380 675724 649381 718386 853371
8183 853371 699225 511899 383352 650891 772165 782633 1070388 1168277 1093323 979221
8173 979221 913245 974970 1244343 1421297 1440261 1367797 1161962 1127542 1167186 1156489 1135536
8162 1135536 1201634 1267183 1292660 1279786 1134684 939830 825899 846347 956725 1068243
8152A068243L5784K2106J41928J7656p4710l8486M5964O4800l0368r9371L5967
8141A189513p4987p7499K14520K26892P3869j2242j18252j45947q3423J9012J04772
8130A316228j2738K7119O5096R6104J4821n7057k56807K5825K68712L56164J68454
8119B011921j09523q116j05958n4809L9878J66272K17735J57806q3035k34635
8109A997536p5539N0769J07788O9572J60691J28190j56848r1676K0343j0975J81475
8098B381326K51618J0817q0276P1553K18048K57798K44677K07994L37850K12583
8088D113988K26750L17308N06890N52642N02449N14682P09551P71885N79936L10664
8078I106745N76423J092688J309144J466400J700054K201416K624006L106887
$$ plain form
8152 1068243 1104027 1126133 1268061 1285717 1211007 1172521 1218485 1283285 1252917 1153546 1189513
8141 1189513 1114526 1037027 1251547 1478439 1552308 1540066 1421814 1275867 1192444 1211456 1316228
8130 1316228 1303490 1330609 1395705 1491809 1506630 1449573 1192766 1218591 1487303 1843467 2011921
8119 2011921 1902398 1894282 1788324 1733515 1773393 1939665 2157400 2315206 2232171 1997536
8109 1997536 1921997 1972766 2080554 2150126 2310817 2439007 2282159 2190483 2210826 2199851 2381326
8098 2381326 2632944 2643761 2563485 2635038 2853086 3110884 3355561 3563555 3901405 4113988
8088 4113988 4340738 4658046 5164936 5717578 6220027 6734709 7444260 8216145 8796081 9106745
8078 9106745 9683168 10775856 12085000 13551400 15251454 17452870 20076876 23183763
8070B3183763L571160M230050M561737L836951K413276P02985j151412k957812
8062C8390698l998069m166104l960917l527613k826254k427942k233262j771473
8054A3479064j475514j352654j097576p34040o65970m70862n42230o60589m93886
8045E985743q2396J12998P9957k26138k55600j10402j35695l43703l40111j09583
8035D575070p3426N0670O3226J05468J20815j26280k35515o3894J17795m6819
8025D487110l1168J43027K15200J79452J57004J93327J80437L09694K77402K82524
8015F394009L38165L79483K55186L61312N39486M18550M29060M85147N51378Q13410
8005A0965186R97576J307752J644513J896570K290192K562300K865833L210520
$$ plain form
8070 23183763 26754923 30984973 35546710 39383661 41796937 42499922 41348510 38390698
8062 38390698 34392629 30226525 26265608 22737995 19911741 17483799 15250537 13479064
8054 13479064 12003550 10650896 9553320 8819280 8153310 7682448 7140218 6479629 5985743
8045 5985743 5903347 6016345 6096302 5870164 5614564 5504162 5368467 5024764 4684653 4575070
8035 4575070 4501644 4552314 4615540 4721008 4841823 4715543 4480028 4416134 4533929 4487110
8025 4487110 4455942 4598969 4814169 4993621 5150625 5343952 5524389 5834083 6111485 6394009
8015 6394009 6732174 7111657 7366843 7728155 8267641 8686191 9115251 9600398 10151776 10965186
8005 10965186 11962762 13270514 14915027 16811597 19101789 21664089 24529922 27740442
7997B7740442L477181L373721K976477K427073J534639M73748m43715j396945
7989D0162621k347853k715454l069974l230191k818993k420542k145374j991483
7981A9422757j628119j110912q81837o38225k81662j70323k63302j28899j90542
7972A4128936j69553L1714J67733M9002j18183r0201j55011j63309J16017K36941
7962A4034086L75960L09321R2918J73102O52955J226101J350674J286526J147698
7953B0649341J097596J545456K077602K282792K647022L106705L723435M499788
7945D1629737N382518O301331P362033Q370836R769246J0664008J0310478R276387
7937A09066574P384120M604406J439223j953568n262299p878682r161071r716036
$$ plain form
7997 27740442 31217623 34591344 37567821 39994894 41529533 42003281 41559566 40162621
7989 40162621 37814768 35099314 32029340 28799149 25980156 23559614 21414240 19422757
7981 19422757 17794638 16683726 15801889 15163664 14882002 14711679 14448377 14319478 14128936
7972 14128936 13959383 13991097 14158830 14207832 14089649 13999448 13844437 13681128 13797145 14034086
7962 14034086 14410046 14719367 14812285 14985387 15638342 16864443 18215117 19501643 20649341
7953 20649341 21746937 23292393 25369995 27652787 30299809 33406514 37129949 41629737
7945 41629737 47012255 53313586 60675619 69046455 78815701 89479709 99790187 109066574
7937 109066574 116450694 121055100 122494323 120540755 115278456 107399774 98238703 88522667
7929H8522667r457086q634375p781308o891107n765868m643423l841425l189693
7921C8318382k479936j859562j242488p42854o43143o83026n29422l49238l37614
7912B9451099l02469n80378n79709m38632j50030J31172m8903J96168O05240O84355
7902B8967913R61127J226547J345135J501317J746853K053927K610044L305163
7894D3718026L990581M471856N144951O321414P682466R016232J0515543J2388722
7886A03249791J4526850J6960899J8982619K0363250K0355135J8600116J4790074
7879B27828734R343411K694862m511459j1030615j5876996j8625229j9766476
7872A70056232j9493634j8148764j6028106j3642283j1619498r680467q013053
$$ plain form
7929 88522667 79065581 70431206 62649898 55758791 49992923 45349500 41508075 38318382
7921 38318382 35838446 33978884 32736396 31993542 31350399 30667373 30137951 29788713 29451099
7912 29451099 29148630 28568252 27988543 27549911 27399881 27531053 27482150 27678318 28283558 28967913
7902 28967913 29929040 31155587 32500722 34002039 35748892 37802819 40412863 43718026
7894 43718026 47708607 52180463 57325414 63646828 71329294 80345526 90861069 103249791
7886 103249791 117776641 134737540 153720159 174083409 194438544 213038660 227828734
7879 227828734 237172145 239867007 235355548 224324933 208447937 189822708 170056232
7872 170056232 150562598 132413834 116385728 102743445 91123947 81443480 73430427
7865G3430427o653504n182251l993731l093673k242496j676342j553996j673600
7857D7360834j706127j506327j314618j114632j076269q71619q80832o36218l80086
7848C7874106j95501n7673L35857N75419P86185J447323J870817K233923K675067
7839D7545523K996959L633109M247597N064597O168305P324790Q679773J0238114
7831I5898767J2168349J4451591J6891314J9537329K2005627K3498110K3665305
7824B28116392K1703709J7409862J0704238K464932o036909j3522899j9162237
7817B41677088k2635021k3797902k3252520k1401160j8744897j6162107j3702936
7810A01980545j1533473r623286p961540o461532n246645m128886l396627k965954
$$ plain form
7865 73430427 66776923 61594672 57600941 54507268 52264772 50588430 49034434 47360834
7857 47360834 45654707 44148380 42833762 41719130 40642861 39771242 38890410 38254192 37874106
7848 37874106 37678605 37620932 37956789 38532208 39318393 40765716 42636533 44870456 47545523
7839 47545523 50542482 54175591 58423188 63487785 69656090 76980880 85660653 95898767
7831 95898767 108067116 122518707 139410021 158947350 180952977 204451087 228116392
7824 228116392 249820101 267229963 277934201 280399133 274362224 260839325 241677088
7817 241677088 219042067 195244165 171991645 150590485 131845588 115683481 101980545
7810 101980545 90447072 80823786 72862246 66400714 61154069 57025183 53628556 50662602
7802E0662602k498380k203467j889484j564926j476082j308910j192657j082201
7794C7446495q52482q01840o20710k83576P2518L94389N33810O78590R29717J319298
7784C8816209J916829K296137K645393L013672L498552M203661N151534O159196
7776F7701183P352133Q871382J0730863J2400406J4148778J6328788J8565995
7769A56099528J9885256J9937556J8248112J4278915Q466830J629796n342634
7762B33203359j1842272j6713992j9390550k0187574j9767088j8531943j6393621
7755A10376319j4191635j2023243j0024334q346407o852788n726397m781320l787848
7747D4642347l134801k560861k115871j895988j857035j807304j734699j398777
$$ plain form
7802 50662602 48164222 45960755 44071271 42506345 41030263 39721353 38528696 37446495
7794 37446495 36594013 35792173 35171463 34887887 34960405 35354794 35888604 36567194 37496911 38816209
7784 38816209 40733038 43029175 45674568 48688240 52186792 56390453 61541987 67701183
7776 67701183 75053316 83924698 94655561 107055967 121204745 137533533 156099528
7769 156099528 175984784 195922340 214170452 228449367 236916197 238545993 233203359
7762 233203359 221361087 204647095 185256545 165068971 145301883 126769940 110376319
7755 110376319 96184684 84161441 74137107 65790700 58937912 53211515 48430195 44642347
7747 44642347 41507546 38946685 36830814 34934826 33077791 31270487 29535788 28137011
7739B8137011j086112j029979q32842p25162o45314l04777k18708j66855o4946
7730B3062316J94625O36094P12585M78892O69986J200146J463573J674694K043427
7721C2136338K456304K924358L653575M296654N077521O001767O990213Q344680
7713G1881410R286010R721592R740610Q766382O832187L978297M93808k987882
7705A17712414o275203q688623r830501j0372449j0255213r063190q029122p246430
7697D7951683o342650n378863m405667l441244l010622k519537j847473j428411
7689A9577216j285687j474337j178935r21820q04491q03171n85426n06455l82491
7680A1634403k33562p8954j71902j99121j42356p8779K2824L6759k6146l5323
$$ plain form
7739 28137011 27050899 26020920 25188078 24462916 23817602 23512825 23294117 23127262 23062316
7730 23062316 23256941 23893035 24605620 25084512 25754498 26954644 28418217 30092911 32136338
7721 32136338 34592642 37517000 41170575 45467229 50544750 56546517 63536730 71881410
7713 71881410 81167420 90889012 100629622 109396004 116228191 120206488 120700296 117712414
7705 117712414 111437211 102748588 92918087 82545638 72290425 63227235 55198113 47951683
7697 47951683 41609033 36230170 31824503 28383259 25372637 22853100 21005627 19577216
7689 19577216 18291529 16817192 15638257 14716437 13911946 13108775 12523349 12016894 11634403
7680 11634403 11400841 11321887 11149985 10950864 10808508 10729729 10752553 10789312 10763166 10727843
7670A0727843R9219M4278P9123N63311P15167P04507R12774R95818J121788J340458
7660A7304286J462496J821485K179059K438571K937640L314688L229708K721939
7652C7409872J966133J023390J34878p48313j786809k705041l242823l380798
7644B8670489l432577l255670k613612k063904j759696j562355j491994j459375
7636A1031306j332975j039731q14887n15855m26584k59315m67401o32609n52528
7627D989421k28709l6444R0930j95774m67045l35166j47589k05008m42209l50284
7617B672123q1026K2732P5751o2032l8290Q6068O5596j32902j906R0351J57232
7606B853697J21841k65767j65689R9884J58781q9426r9966j00335k67076l84596
$$ plain form
7670 10727843 10827062 10871340 10950463 11513774 12228941 12933448 13846222 14842040 15963828 17304286
7660 17304286 18766782 20588267 22767326 25205897 28143537 31458225 34687933 37409872
7652 37409872 39376005 40399395 40534273 39785960 37999151 35294110 32051287 28670489
7644 28670489 25237912 21982242 19368630 17304726 15545030 13982675 12490681 11031306
7636 11031306 9698331 8658600 7843713 7327858 6901274 6641959 6174558 5541949 4989421
7627 4989421 4760712 4724268 4815198 4619424 4152379 3817213 3669624 3464616 3022407 2672123
7617 2672123 2591097 2613829 2689580 2627548 2589258 2675326 2740922 2608020 2606114 2696465 2853697
7606 2853697 2975538 2709771 2544082 2643966 2802747 2713321 2613355 2513020 2245944 1861348
7596A861348j56540J17056q9122j12343K1343Q8320M3642r3078r1633J65264J98812
7585A953069l6466q9293q5737j28982j73915l2508k3515j63041J07537K2327j55262
7574A194214J2639L737P2911K05842j07505k62574l3203l2573n5197R5223J16113
7563A209627p0487J2231J07245k1914j52603n6573J98486L03786L8355l00136
7553A268017k10775J17848J73330N834k09143j62253j90149j57359M0259k1500
7543F54109j9433Q6411K0292Q304P5134M6875m0056L2184N0473J18292J96283
7532A228868N6432R7113j22937k15890O768N1306l4778l5050k82523l02839J38148
7521E84618J25936K51680J45958k32682l06150M0593Q5611o9512O1062k7800j21006
$$ plain form
7596 1861348 1704808 1821864 1732742 1620399 1641742 1730062 1773704 1680626 1588993 1754257 1953069
7585 1953069 1916603 1827310 1741573 1612591 1438676 1406168 1382653 1219612 1327149 1349476 1194214
7574 1194214 1206853 1210590 1283501 1489343 1381838 1119264 1086061 1053488 998291 1093514 1209627
7563 1209627 1139140 1151371 1258616 1236702 1084099 1027526 1226012 1529798 1568153 1268017
7553 1268017 1057242 1175090 1348420 1354254 1145111 982858 792709 635350 675609 654109
7543 654109 634676 721087 741379 749683 824817 871692 831636 863820 914293 1032585 1228868
7532 1228868 1285300 1382413 1259476 1043586 1050354 1101660 1066882 1031832 749309 446470 584618
7521 584618 710554 962234 1108192 875510 569360 609953 695564 626052 687114 659314 538308
7510E38308m6560L3631M4647K8207M5574K68439M35409P4591j09508k61279k21755
7499H29704J2267J62824K51023J33271j77947p2144J24895O2396j31600m9999
7489A144690K4259k12173k28952k20151o1670P6956m2061N4209K43584K03354
7479I82045J41456J49226l591j27955K9316n9586j37517p2204r7399k14168j83137
7468D06486j23392K32015L42518q2347j68268j83348r5289q8502K17691K24671
7458F82235k8042k52916r3124J47728n4843j54289J21978J85133L4088l5615j85677
7447C66656j50028Q2921K50695J80162j93634k05747J35268R9884j65363j06039
7437B94775K9338P1333K7236R5182k831r5425k4368O4079n5682k98881M7012k7902
$$ plain form
7510 538308 491748 525379 570026 598233 643807 912246 1347655 1422246 1312738 1051459 829704
7499 829704 841971 1004795 1255818 1389089 1211142 1138998 1263893 1326289 1194689 1144690
7489 1144690 1168949 956776 727824 507673 446003 522959 480898 535107 778691 982045
7479 982045 1123501 1272727 1269136 1141181 1170497 1110911 973394 901190 803791 589623 406486
7468 406486 283094 515109 857627 775280 607012 423664 328375 239873 457564 682235
7458 682235 654193 401277 308153 455881 401038 246749 368727 553860 587948 552333 366656
7447 366656 216628 299549 550244 730406 536772 331025 466293 566177 400814 294775
7437 294775 324113 395446 422682 517864 515033 419608 395240 459319 403637 104756 151768 123866
7425A23866n5476J74246J56274j30040l68034l18317p2183K52821K89006j96038
7415a43875l65876K37499L71208K10308P1242q324o0290r2712j1636L3682J06945
7404C48171K2675m3527r0888k3772J29666r5126r2067N2890M8805k6699J7620
7393B47748p6907k04870j67306J34723M15548K79178O87j03728J69204J81294
7383H75571m1456j67829n6590n2325K2238j27119l16657j10886O0240J03206Q2927
7372B71320J16823J41104L52238J98826j10801k03484p8511J1654j01968p4318
7362E22883j15515j1766j10141j84325j22288k6098J45573k9960j25976j17656
7352a75269j82937o8894Q9643J34990K08852K12204Q7422j4705J830n2718r1473
$$ plain form
7425 123866 68390 242636 398910 268870 -99164 -417481 -489664 -236843 52163 -143875
7415 -143875 -509751 -272252 98956 309264 380506 372182 311892 219180 207544 241226 348171
7404 348171 370846 327319 236431 212659 342325 247199 155132 208022 256827 230128 247748
7393 247748 170841 -34029 -201335 -66612 348936 628114 628801 525073 694277 875571
7383 875571 834115 666286 609696 557371 579609 452490 135833 24947 85187 188393 271320
7372 271320 388143 529247 881485 1080311 969510 766026 687515 699169 597201 522883
7362 522883 407368 395602 285461 101136 -21152 -47250 98323 68363 -57613 -175269
7352 -175269 -358206 -427100 -337457 -202467 6385 218589 306011 291306 293136 240418 148945
7341A48945j10362N4932j2079J49571J07508M9344Q6065l7908j46798k51067j12427
7330g4276M7100J65321J09562R4404K35396M4775j87817l18011j91895l3683j15296
7319b24420k434K15794K55343J48571J3699l1219j04466j65779M3702J71425J18023
7308D38239J44213N4886l836Q4004J7745j63551k19006n1226j00446n9890Q3130
7297B24262N2724j82899j44175j27441Q324J46718J02164J70699K46640K29099
7287G26115P7002k30978l780J46537q2216l14023k70881l10800r536J27890J6297
7276a28373L35433K64155Q7614J10898m0492k10542j64813j46577j54313N9032
7266A2022N2256m7824k1669k3451o7664q9700R338n9451M5626L20843J31991j58302
$$ plain form
7341 148945 38583 93515 81436 231007 338515 387859 473924 436016 289218 38151 -74276
7330 -74276 -27176 138145 247707 342111 577507 622282 434465 116454 -75441 -109124 -224420
7319 -224420 -226854 -11060 244283 392854 406553 375334 270868 105089 148791 320216 438239
7308 438239 582452 637338 633502 717506 735251 571700 352694 301468 201022 141132 224262
7297 224262 276986 94087 -50088 -177529 -169205 -22487 79677 250376 497016 726115
7287 726115 803117 572139 568359 714896 632680 318657 47776 -263024 -272560 -144670 -128373
7276 -128373 207060 471215 558829 669727 629235 418693 253880 107303 -47010 12022
7266 12022 64278 16454 -5215 -28666 -96330 -186030 -176692 -236143 -190517 130326 262317 104015
7254A04015n2445R4496J36839K1265j56523m8851q2534j73207J17729L62607J25439
7243D48830J08901L2919j34044J7988k7533n0432m3865j74285k22916l7134J60204
7232G8633N9825q878m6246J22942L31773J11455K9763N9370J70557N3711m00267
7221E62638m69174k05451N0278O8203K23974K48078O7934j59798l19439L4575
7211A01818J99797O1156k54906k39253j44745j57542N0060J25146J22627J87368
7201E1526J84440N8624Q5638J01600R2135m3639n8268n014m6757R5050Q8195r2431
7189E11099j88780j51249J63252R3536p0878J30138J02492j12264N9181M514k01263
7178C39778j9428J19739Q1431o6004l1318J34023R2270k10561o1010N1995j56948
$$ plain form
7254 104015 51570 146066 282905 304170 147647 98796 16262 -156945 -39216 323391 448830
7243 448830 557731 590650 456606 474594 447061 396629 352764 178479 -44437 -81571 78633
7232 78633 138458 129580 83334 206276 538049 649504 679267 738637 909194 962905 562638
7221 562638 93464 -111987 -61709 6494 230468 478546 546480 386682 67243 101818
7211 101818 301615 362771 107865 -131388 -276133 -433675 -383615 -258469 -135842 51526
7201 51526 235966 294590 380228 481828 573963 530324 472056 467042 420285 515335 603530 511099
7189 511099 322319 171070 334322 427858 356980 487118 589610 477346 536527 541041 339778
7178 339778 320350 440089 521520 455516 424198 558221 650491 439930 378920 430915 273967
7167B73967k02033L935Q4614K37938J89507j48196k78158o8946J98862K33997
7157E25487J38983m3985K9253j68442j73936L0551m2606m1249J15750K2830j54049
7146B38587j53011k78735j81128J16196J78672J25699J06788N9173M5044O6794
7136C24079N7166o1442p3434N5764K26309M6379j81488l997N1867O7730p8200
7125D30733p7975K711J09132k1706j00863P0210p0185j23170l2793J77108M8873
7114D12075j33206k52147k06387j9815n1241J30347J29138L0400N9948J33160
7104B32272k1542j66377j04758q8640k9575r4059j35813M3537K80927K19989r328
7093A26633k4010K4593N655n1519j20400k65689j21378J02845J94612J99551J63899
$$ plain form
7167 273967 71934 75869 160483 398421 587928 439732 161574 92628 291490 525487
7157 525487 664470 620485 649738 481296 307360 337911 295305 254056 369806 392636 238587
7146 238587 85576 -193159 -374287 -258091 -79419 46280 153068 212241 257285 324079
7136 324079 381245 319803 246369 302133 528442 574821 393333 389336 441203 508933 430733
7125 430733 352758 355469 464601 442895 342032 412242 342057 218887 186094 363202 412075
7114 412075 278869 26722 -179665 -199480 -250721 -120374 8764 39164 99112 232272
7104 232272 210730 44353 -60405 -149045 -178620 -272679 -408492 -364955 -84028 135961 126633
7093 126633 102623 127216 132871 81352 -39048 -304737 -426115 -323270 -128658 70893 234792
7082B34792l7037q1129K4577P3291J29176j2056J11283k1897j56585j85930j29036
7071e0551n7508j2214l1408M7560N9739n4518o9198k47566J360K85208L60471
7060B31375L9759l9600J31733K39543n4226l70233r0513Q6852L8692J62911K9310
7049D05603j47701l7257J60385J98025K7806P4076r4414j79618J06435K29087
7039G42427J5217j94101q9288N3588j34449j67558R5476K13325J36187J04054
7029G74878J30833r9773j19324J1935M0097j59907l84301k8532J8833J29905q6297
7018B28347j33007J56633L20643K15903P7386l03714k57083J9323J89496K66804
7008G80731M1677J9750M9961R2658j89770k57999k37228K4245L11432J94811P4477
$$ plain form
7082 234792 197755 116626 141203 214494 343670 331614 442897 421000 264415 78485 -50551
7071 -50551 -108059 -120273 -151681 -104121 -44382 -98900 -168098 -415664 -414304 -129096 231375
7060 231375 271134 231534 363267 602810 548584 178351 87838 174690 213382 376293 405603
7049 405603 257902 220645 381030 579055 606861 680937 586523 406905 513340 742427
7039 742427 757644 563543 474255 527843 393394 225836 321312 534637 670824 774878
7029 774878 905711 805938 686614 698549 738646 578739 194438 165906 184739 314644 228347
7018 228347 95340 251973 572616 788519 865905 562191 305108 324431 513927 780731
7008 780731 822408 842158 892119 984777 795007 537008 299780 324025 635457 830268 904745
6997I04745J4661k30126k29007k64j13800j49429K46807K56427O2994j45113k55418
6986C62477M6705J89490K6629j61667j46256Q4545J53034j55614k22489j65793
6976A1061m52j10434n4624J47059J91022N4631P7058q5229j8765J07504M6806
6965C65637K35519J89014O9428n5935n4726q3510j50161K1441n5131j39332J18181
6954D60425J20661m2147k0621J93585K91190O0545k34599j47215k2737K26935
6944H86022K41914P9244Q8344p1534j99861j57217r4176k92284j57414J20979
6934D44017M8284P5016J97332J85992J0573k5422j2059O3692R0493J09459J67604
6923A354981J83903p931j76172k50559j12397k4716J34106P4652N4304K10846
$$ plain form
6997 904745 919406 689280 460273 460009 346209 196780 443587 700014 763008 617895 362477
6986 362477 409182 598672 625301 463634 317378 401923 554957 399343 176854 11061
6976 11061 10609 -99825 -154449 -7390 183632 238263 315321 230092 211327 318831 365637
6965 365637 601156 790170 859598 803663 748937 665427 515266 536707 481576 342244 460425
6954 460425 581086 538939 518318 711903 1003093 1063638 829039 681824 659087 886022
6944 886022 1127936 1207180 1295524 1223990 1024129 866912 772736 480452 323038 444017
6934 444017 492301 567317 764649 950641 961214 935792 923733 987425 1077918 1187377 1354981
6923 1354981 1538884 1530953 1354781 1104222 991825 967109 1101215 1175867 1230171 1441017
6913A441017J67491J67555K9267P9814J10535J08283K43478J25855K05796K62589
6903B941680M2051N2268L27881K64337J96071N08406N22737M25848N80508O12728
6893F474515M50977M44741P71521P94243Q91896J206166J251525J425281J742822
6884A5453687J976417K080902K104407K327587K265789J737500R51966J00956
6876B8999211l92215j071972j710432k151380k193815k158991k210850k276728
6868A4832828j873820j349670j196809j126975r11145p57560m83869m98405p82596
6859E851979o25183n59696o41385l37552k05769j99225p2641R5769P3036k25075
6849C154258l31168m07331j82509k5134j28574r8545o7263m2628J5382q3687l12481
$$ plain form
6913 1441017 1608508 1776063 1805330 1885144 1995679 2103962 2347440 2473295 2679091 2941680
6903 2941680 2983731 3035999 3363880 3628217 3824288 4332694 4855431 5281279 5861787 6474515
6893 6474515 6925492 7370233 8141754 8935997 9827893 11034059 12285584 13710865 15453687
6884 15453687 17430104 19511006 21615413 23943000 26208789 27946289 28898255 28999211
6876 28999211 28606996 27535024 25824592 23673212 21479397 19320406 17109556 14832828
6868 14832828 12959008 11609338 10412529 9285554 8374409 7616849 7132980 6634575 5851979
6859 5851979 5226796 4667100 4025715 3688163 3482394 3283169 3210528 3306297 3379333 3154258
6849 3154258 2823090 2415759 2233250 2208116 2079542 1980997 1913734 1871106 1886488 1802801 1490320
6838A490320j40122L1706m7756q4981j03370k6454k0277M4290J70234m7140p3007
6827A193443j32700n4362J13243j06448m7715L9535J27486N7897J50131n9067
6817A281443l34008m42316j76346J51169J72414Q7959J60777O4902k2607L6158
6807I79545Q005k37145l23453j10333j16226J98713L17171K2340k56593n0475
6797D31549K48613K78764J0373J401k6890j04661j82821j31340J04939n8191k32326
6786C39410j2117J90925J0411Q712J13924N8639j5576p4931j68938L0192m7898
6775D32753k09085p3892j17908q0616N7611K88961L63037J32268m333n564q613
6764G74619o1390j25072j07097j56785l40495j49591J24226J24627J83504J31136
$$ plain form
6838 1490320 1350198 1381904 1334148 1249167 1145797 1119343 1099066 1143356 1313590 1266450 1193443
6827 1193443 1060743 1006381 1119624 1013176 965461 1004996 1132482 1190379 1340510 1281443
6817 1281443 947435 505119 328773 479942 652356 740315 901092 965994 943387 979545
6807 979545 987550 750405 426952 316619 200393 399106 716277 738617 482024 431549
6797 431549 680162 958926 969299 970700 943810 839149 656328 524988 629927 571736 339410
6786 339410 327293 518218 528629 537341 651265 709904 694328 619397 450459 480651 432753
6775 432753 223668 149776 31868 -48748 8863 297824 660861 793129 788796 783232 774619
6764 774619 713229 588157 481060 324275 -16220 -165811 -41585 83042 266546 397682
6754C97682j49320l0270J97206j09766k09138J8715N6918l3211K9192j33530K0110
6743E4588J86795l4610j03057n6671k1983P6167J82865R0258J10500J17102m037
6732E97917J15466P2201j98961k39430j68537O1470J70225k12227k25143P3133
6722D6114J65918j1072j14396J03126J50673J59082q83m4703M8326R5673j30996
6711D66862l09480j45160J51352R5065K7674J0383n3596j06909J24114L40714
6701F01019M4103j04046K4837L2584k46752k55583J4951J86258M5246L963J24945
6690D71525K300k13631j85511p9607P466K08793R3029K3168k0723j90787n4416
6679F1606O6671M2230j72485k17566k05583N0029K57246J90178R0669O4021P4425
$$ plain form
6754 397682 248362 218092 415298 305532 96394 115109 172027 138816 168008 34478 54588
6743 54588 241383 206773 103716 47045 25062 101229 284094 374352 484852 601954 597917
6732 597917 713383 785584 586623 347193 178656 240126 410351 198124 -27019 46114
6722 46114 212032 200960 86564 189690 340363 499445 498562 453859 502185 597858 466862
6711 466862 157382 12222 163574 258639 286313 296696 243100 136191 260305 601019
6701 601019 645122 541076 565913 598497 351745 96162 111113 297371 342617 346580 471525
6690 471525 473825 260194 74683 -4924 2542 211335 304364 327532 306809 116022 61606
6679 61606 128277 170507 -1978 -219544 -425127 -375098 -117852 72326 162995 227016 301441
6668C01441L592K2379l4198j35963j44973j8479J43910k15732k17619L7253Q7893
6657a70496K50087J56551k9322j54039J4459l094M8899P726j28540K0868R0055
6646A03154M8016O2151K5592j31674m179M0307p9406k81046k01878J58435L65490
6635A04962P2420M78M6568M6253k2089R1913K62104j38716q9545K89418J83085
6624H46851p4242K625L2582P1565J81786M3874q0106l41568m45872j71118P9758
6613A46135J51372P0296J29424P5951p549P4389p4406k29585m1454R2458M2218
6602D29249j39896j23526M9492J16736q5755k47578k32241J2843P7084R1494R7960
6591D5862N4891K0601N8419J55023J16702L4407m0833n4651k2226j118N8091J2593
$$ plain form
6668 301441 305033 327412 293214 157251 12278 -6201 137709 -78023 -295642 -258389 -170496
6657 -170496 79591 236142 206820 52781 67240 64146 113045 120771 -7769 13099 103154
6646 103154 151170 213321 238913 107239 103060 143367 63961 -217085 -418963 -260528 104962
6635 104962 177382 177860 224428 270681 248592 340505 602609 463893 374348 663766 846851
6624 846851 772609 775234 807816 879381 1061167 1105041 1024935 683367 237495 66377 146135
6613 146135 297507 367803 497227 573178 565629 640018 565612 336027 294573 387031 429249
6602 429249 289353 165827 215319 332055 246300 -1278 -233519 -220676 -143592 -52098 45862
6591 45862 100753 121354 179773 334796 451498 485905 445072 390421 368195 367077 425168 437761
6579D37761O4495J10298Q4006p8220k42365k01853k19879o582J31439P1470Q8978
6568B39548L1949m0274j72002j47597J65661J49725n9307r5588j21173M204L5903
6557h951n0235r1830j1093J51363J84264j14517l48735J0044L59607J77228o6515
6546A90630L037m9894M9693K31529K08453K1894j66425o3368j49834r8401k12052
6535c4738k02593o097J38333J73163L9101O3549o1493p9554l6469n2364n4433
6524a13595m9923Q6939l3179J9827l2601Q1702K15303J25223j618Q8575J20131
6513E06784K7720j80515j41846q5981k6670K9027j90719L2568R8435l7833o2694
6502c1724J60966K5834j84196R6501K55550q3793l93117r9279K72126J69391L6458
$$ plain form
6579 437761 502256 612554 696560 618340 375975 174122 -45757 -52339 79100 150570 239548
6568 239548 271497 231223 59221 -88376 77285 227010 167703 72115 -49058 -44854 -8951
6557 -8951 -59186 -151016 -162109 -10746 173518 59001 -289734 -279690 79917 257145 190630
6546 190630 193667 143773 193466 424995 633448 655342 488917 425549 275715 177314 -34738
6535 -34738 -237331 -243428 -105095 68068 107169 170718 109225 29671 -6798 -59162 -113595
6524 -113595 -163518 -76579 -109758 -89931 -122532 -40830 174473 299696 298078 386653 506784
6513 506784 534504 353989 212143 126162 99492 128519 -62200 -29632 68803 30970 -31724
6502 -31724 129242 155076 -29120 67381 322931 239138 -153979 -253258 18868 188259 224717
6491B24717k34858l51075j19596J05072K55180K42271J29180j3988j14725k69228
6481a47050j80171j0370J45727L53126K20530L0488r3160k40937l3779L27795
6471C72199L24087R1158J07761J63228J7325j10338m6844q4893k73348l65649
6461A94686j59499n6406j43093L3534J10897R3533J39549L9749J22137J28504
6451E03591o1674p2019l0638j08634j35197j12551k3165J05523J31387j59129
6441C7494j95131J26846J75447M9426k2303J13709O5041Q2805m3146l18654k56009
6430a84475o8793J23977J37996Q9913K03432J03865j21416o0000M6418j0660M0020
6419C00277M9186l6595j22861j21313k4496r547P237J75218K75127O374k3844
$$ plain form
6491 224717 -10141 -361216 -480812 -375740 -120560 121711 250891 236903 122178 -147050
6481 -147050 -327221 -337591 -191864 161262 381792 412280 319120 78183 44404 372199
6471 372199 696286 787444 895205 1058433 1075758 965420 918576 833683 560335 194686
6461 194686 35187 -21219 -164312 -130778 -19881 73652 213201 252950 375087 503591
6451 503591 441917 369898 339260 230626 95429 -17122 -40287 65236 196623 37494
6441 37494 -157637 -30791 144656 194082 171779 285488 350529 433334 390188 71534 -184475
6430 -184475 -253268 -129291 8705 98618 302050 405915 284499 224499 270917 260257 300277
6419 300277 349463 312868 190007 68694 44198 34651 41888 217106 492233 498607 474763
6408D74763j31922j50478P5846j24656r8218p0830q2455l8370R6708K28350K34518
6397D13256J33339j7735k38753k95158j22383J85337O3467m6198L9439N4642l0277
6386A38976r9969R610l9067j42161R1259N8828n3441r2333N5080M8270p843k0691
6374e3482M1816j1393m8393n8097L5376J24317N4461J16562R4812o6860m0449
6363A88670L0249r7560j75064k681P8058K6151l7303l3074L0349J06009L7947
6352A51751n15j09273N6636O0374K1391j86086k0645j10588l75888r0429J99981
6341d03291J17452N2873K02685J55893N9397j47776l37569k77549J99976K41205
6331a36704P4431J23269K36794J14172L6837Q9447M2388J4260j80736q2285J30836
$$ plain form
6408 474763 342841 192363 268209 143553 45335 -25495 -107950 -146320 -49612 178738 413256
6397 413256 546595 528860 290107 -5051 -127434 57903 121370 75172 114611 169253 138976
6386 138976 39007 48617 9550 -132611 -41352 17476 -35965 -128298 -73218 -24948 -32791 -53482
6374 -53482 -11666 -23059 -71452 -129549 -94173 30144 84605 201167 295979 229119 188670
6363 188670 218919 121359 -53705 -56386 21672 47823 10520 -22554 7795 113804 151751
6352 151751 151236 41963 98599 158973 180364 -5722 -26367 -136955 -512843 -603272 -403291
6341 -403291 -285839 -232966 -30281 125612 185009 37233 -300336 -577885 -377909 -136704
6331 -136704 -62273 60996 297790 411962 448799 538246 580634 594894 414158 331873 462709
6320D62709m0671j32198J0339Q0524m7600M3539Q9628n9010l976P6904j57703
6309C22485l17522j88842j26342q5578M9511N4004O0946q8187O2149K04504j18740
6298a71612O0836O2554o3175j5341P3127l7341j7766J95938J16251j31502j82574
6287a10605M6459P6557P7244J48327J66174N9783J06152J22054P0437p0627j53863
6276E38092l09037l19342p7335M8232k7637K2089J24973J09869Q046q0311j16769
6265g9130p7350j9931M9426k6429O7886J82167m6839j81716j5306L58097J78256
6254C89131l70327l11564j41800m6167j12352o0598K06645K13767k6907q7717
6244c47889p9191J59357k9374j05262q3881j71575j77634N5944K10405K29158
$$ plain form
6320 462709 422038 289840 300179 380703 333103 376642 466270 407260 403284 480188 322485
6309 322485 4963 -183879 -310221 -395799 -346288 -292284 -231338 -319525 -257376 -52872 -171612
6298 -171612 -110776 -48222 -111397 -126738 -53611 -90952 -108718 87220 203471 71969 -110605
6287 -110605 -64146 12411 89655 237982 404156 463939 570091 692145 762582 691955 538092
6276 538092 229055 -90287 -167622 -119390 -147027 -124938 35 109904 117950 37639 -79130
6265 -79130 -156480 -176411 -126985 -153414 -85528 96639 49800 -131916 -147222 210875 389131
6254 389131 18804 -292760 -434560 -480727 -593079 -653677 -447032 -233265 -260172 -347889
6244 -347889 -427080 -267723 -297097 -402359 -486240 -657815 -835449 -779505 -569100 -339942
6234c39942J13953O3854J07274L7170j78261j82682j7412n6811n2951K36738L20510
6223E1440J82260j56271k44715n2054N4470N2237N7587J16589p447l89P7754K0963
6211A52424L0120q4740J0071J55712K8903J27262o7333j65679j08759j606K55991
6200C32366J64010p2648q0119r9717o7589m0554l9664j57513j46000j1680K3480
6189a95628J01680J34208L7485L1760k7073O366L8655m7101J7371j1370j70038
6178h3685j67986l6799r3756O4896K17270Q7555j0178j7613j00173l3002m209
6167a77680j25261J3190K01170J75241j30992r4148O334L7138J9481q7560q9865
6156b52952j5500j09776l8792Q3320j86825k52514J47370K98432K25704K02581
$$ plain form
6234 -339942 -225989 -162135 -54861 -17691 -195952 -378634 -396046 -452857 -505808 -269070 51440
6223 51440 233700 77429 -167286 -219340 -164870 -112633 -55046 61543 54096 53707 131461 152424
6211 152424 182544 97804 107875 263587 292490 419752 352419 186740 77981 76375 332366
6200 332366 496376 423728 343609 243892 176303 135749 96085 -61428 -207428 -219108 -195628
6189 -195628 -93948 40260 77745 109505 82432 88798 127453 80352 97723 86353 -83685
6178 -83685 -251671 -288470 -382226 -317330 -100060 -12505 -22683 -40296 -140469 -173471 -177680
6167 -177680 -302941 -289751 -88581 86660 -44332 -138480 -132146 -95008 -75527 -163087 -252952
6156 -252952 -268452 -378228 -417020 -333700 -520525 -773039 -625669 -327237 -101533 101048
6146A01048L2272p0018j05904l7378o0963O9586J78701m7387j78600o1905r4815
6135b75363j54900m4192l3653l6462M128J80810L52541J23630J3158j2652k31878
6124a14833j58068o5623k15988j46864o8503Q1665J17832O5764K4134J33204J06306
6113b40974j07730O1531J60470K60574J86724m5632j692J86618n9221j1262j8148
6102C71258k10178j66217j3323k10053k43844J73684J65343j8362O5212K25751
6092A39271P5607j81563r6167Q5274K2743q1993o9518J7577N6514P9582R8165
6081A45492K0325N1794J15976r6959l02725m7852K82335M5693m3991j1604q3239
6070G5245k77285r6945Q1813K37365K06217J72876P4833o74J07668p1634m7485
$$ plain form
6146 101048 133320 63302 -42602 -79980 -140943 -71357 107344 59957 -118643 -180548 -275363
6135 -275363 -430263 -474455 -508108 -544570 -540442 -359632 -7091 116539 129697 117045 -114833
6124 -114833 -272901 -338524 -554512 -701376 -769879 -688214 -570382 -504618 -480484 -347280 -240974
6113 -240974 -348704 -287173 -126703 133871 320595 274963 273271 459889 400668 389406 371258
6102 371258 161080 -5137 -18460 -228513 -472357 -298673 -133330 -151692 -86480 139271
6092 139271 214878 33315 -62852 22422 45165 -36828 -106346 -88769 -32255 47327 145492
6081 145492 165817 217611 333587 236628 -66097 -113949 168386 214079 170088 158484 75245
6070 75245 -202040 -298985 -217172 20193 226410 399286 474119 473445 581113 509479 461994
6059D61994q9737k43577q817r0307k69116j06457J6989j47118N5232L33954K74693
6048A87733K1231k53854N1554L29388L66041o1984k51210o8821L4615K04473P9969
6037F39135J0395j32970l09089j47926j28332o0864L7770J67363L03354N0998
6027D29834j31030l09322l39414k84345k82015M641J11068J05558P8506J31319
6017d85200J67769J62913n6468j66737j56924K31469J43135j92169j03488k2747
6007d78447R5058K18890K89174J93325O8248q4553k0279m9338j74731j39602j16955
5996a99210k02592j66326l5047J23381J90594Q5899J629M5371m0289k0914L00516
5985H3012J86097m8715j21694k68060k21729O036P3628J45974l0556q1851K3777
$$ plain form
6059 461994 372257 128680 119863 29556 -239560 -346017 -329028 -476146 -420914 -86960 187733
6048 187733 208964 -44890 6664 336052 702093 640109 388899 320078 354693 559166 639135
6037 639135 649530 516560 207471 59545 -68787 -129651 -91881 75482 378836 429834
6027 429834 298804 -10518 -349932 -634277 -916292 -911651 -800583 -695025 -616519 -485200
6017 -485200 -317431 -154518 -210986 -377723 -534647 -303178 -160043 -352212 -455700 -478447
6007 -478447 -383389 -164499 124675 318000 386248 301695 281416 232078 57347 -82255 -199210
5996 -199210 -401802 -568128 -603175 -479794 -289200 -203301 -201672 -156301 -196590 -217504 83012
5985 83012 269109 220394 98700 -169360 -391089 -385053 -311425 -165451 -196007 -277858 -254081
5974b54081J73187J06334j41806q9784L2539j12615l75015j76927K14223K17754
5964d06191L7909P6976j39010r4695R5199O0815m1304l6832Q1106P8750J09886
5953a77391L2321p1252j08451m7005k9744j47493O5576L01840K07871J53058K02980
5942C82310L2180j84667j92457o3308k8700p4640Q3645M0926M6830L1360r3145
5931a9666n2009o3463m456J35083L7712j01051n5047n0915j42973j56861l9614
5920e13260Q4122N2889r3162J71185L14250J0080j23009o5044N7552J18989J06152
5909A20744l252j38923r5988o9948n5107J51888N8383Q62K21690J23443j89540
5898A24252j26626j57396O5930J34390M3329L0889o0190r1292l7151l680p8644
$$ plain form
5974 -254081 -80894 25440 -116366 -206150 -173611 -286226 -661241 -838168 -623945 -406191
5964 -406191 -368282 -291306 -430316 -525011 -429812 -368997 -410301 -447133 -366027 -287277 -177391
5953 -177391 -145070 -216322 -324773 -371778 -401522 -549015 -483439 -181599 26272 179330 382310
5942 382310 414490 229823 37366 -25942 -54642 -129282 -45637 -4711 42119 73479 -19666
5931 -19666 -71675 -135138 -139594 -4511 33201 -67850 -122897 -173812 -316785 -473646 -513260
5920 -513260 -429138 -376249 -469411 -298226 16024 26104 -96905 -161949 -104397 14592 120744
5909 120744 117492 -21431 -117419 -187367 -242474 -90586 -32203 -31341 190349 313792 124252
5898 124252 -2374 -159770 -93840 40550 83879 114768 54578 -36714 -73865 -77545 -156189
5887a56189j73459p1728J09193J16459m5125n3078J18901j9804k7384j43804j45488
5876d91506L8583J67411J50867O9134L02861L58482l1211l98002l11332O3298
5866h1415K48671j2823p8054K4181O9923o0530j59873p2500P8482K248j05446
5855a47136p2181l4064n3456J92003L32263M8953j20884M081J66895J89917J93734
5844G00125O2602k03409j81113k2060k70573k93488j23532J25268K24599J01756
5834A20175L1706j00707k35523m4774M4179J11665q606l18791k37015K44989M13897
5823B1195P8061j59996k18741j96955K4589L01164L28294J95303j15815k79334
5813b2235l80393k55761j08631J99770L84437K2041q1318J01406J39205O3492
$$ plain form
5887 -156189 -329648 -401376 -292183 -175724 -220849 -273927 -155026 -174830 -202214 -346018 -491506
5876 -491506 -452923 -285512 -134645 -65511 237350 595832 564621 166619 -144713 -81415
5866 -81415 167256 154433 76379 100560 170483 109953 -49920 -122420 -43938 -41690 -147136
5855 -147136 -219317 -253381 -306837 -114834 217429 266382 145498 149579 316474 506391 700125
5844 700125 762727 559318 378205 356145 85572 -207916 -331448 -206180 18419 120175
5834 120175 151881 51174 -184349 -229123 -184944 -73279 -81885 -400676 -637691 -392702 21195
5823 21195 99256 -60740 -279481 -476436 -451847 -150683 177611 372914 257099 -22235
5813 -22235 -402628 -658389 -767020 -567250 -182813 -160772 -242090 -140684 -1479 62013
5803F2013k7739L0033J32978J76063K800r858J39555J9740m7095l6457k93465
5792A48568k49128k5057j00532j38462o7594o974J53396K01214K14814L5983l11739
5781a45511k19614K4825J79727j3115P28J9318m7962k0701N9436J03071P2134
5770A2336J17583J23580k9904k01117j4438K26635j79j55349n4805L7120k2737
5759C8725K762J08646n991j56582j56327m6276J19783J47537J13997n9506j27999
5748b1231j9199P2654j37283j34473J33922K47829p4356j40239J11569J98248
5738B37441Q3611k09492l20462J471R0463J62945K71887J66989K5522j01484K5033
5727D33924n1094m1987O0603N1287j25508j60798j48843N2124J42223M4480j32261
$$ plain form
5803 62013 34274 64307 197285 373348 376148 366290 505845 525585 478490 442033 148568
5792 148568 -100560 -125617 -226149 -364611 -432205 -439179 -285783 -84569 130245 166228 -145511
5781 -145511 -365125 -340300 -160573 -173688 -172960 -153642 -201604 -222305 -162869 -59798 12336
5770 12336 129919 253499 223595 22478 8040 234675 234496 79147 24342 61462 38725
5759 38725 41487 150133 144142 -12440 -168767 -215043 -95260 52277 166274 106768 -21231
5748 -21231 -40430 32224 -105059 -239532 -105610 142219 67863 -72376 39193 237441
5738 237441 321052 111560 -208902 -207431 -116968 45977 317864 484853 510375 408891 433924
5727 433924 382830 340843 401446 452733 327225 166427 17584 69708 211931 256411 124150
5716A24150n880J38519J47511J07941j42198r9644j76553r8090n4311O8823J42216
5705A52484J33936L7833Q869J47820J26796J4582q9233p4022l8453j00078j97086
5694A23448j54434j7184o3776K3442L50609K67076J10684J35419k33447j80520
5684C61317K0351o6623q1986K522k69199j97031m6223j95526M5100K92079M455
5673a30764j07311O7890J33626J75665J36051J1027K4909p4130k21013k34065
5663b18115o7449K06299k5864j40009j43477q8555P3213L829p3924R7915J86256
5652a89881J70586R9708J7482P8870P5315j41727j36386j0980J15062P022q3359
5641A712k50627j50133l4052K0582O8376K30287K52761J97449L6244j07782j00515
$$ plain form
5716 124150 118270 256789 404300 512241 370043 270399 93846 -4244 -58555 10268 152484
5705 152484 286420 324253 333122 480942 607738 622320 533087 459065 420612 320534 123448
5694 123448 -30986 -48170 -111946 -88504 262105 529181 639865 775284 541837 361317
5684 361317 381668 315045 233059 235581 -33618 -230649 -276872 -472398 -427298 -135219 -130764
5673 -130764 -238075 -170185 -36559 139106 275157 286184 311093 236963 15950 -218115
5663 -218115 -285564 -79265 -105129 -245138 -388615 -477170 -403957 -400128 -474052 -376137 -189881
5652 -189881 -19295 80413 97895 176765 252080 110353 -26033 -37013 78049 85071 1712
5641 1712 -248915 -399048 -433100 -412518 -344142 -113855 138906 336355 372599 264817 164302
5630A64302j51148o0514K21002L3017k13946p9098j3967o4693J52355J87110R0691
5619B65111R5124P1113J60093M1886j55987k66188j70793J5271P5849J51824J03403
5608C86706r3914j9140N2867J41413O0051o2178j46241k07730k06040r7407l5622
5597b27235J11688J26325l2619N7706j39668J5765K80337m1019k88551k21437
5587c58708k8028J98004J44984J85290K10230J04625j2207l1544k30811k66359
5577h4524l8451L9777P6354J15913L12497J71589o0071j29824j07223J7700R682
5566C23419j20551q7877P3743p07q9722J09892M2133l46598k08545n8172R2870
5555b70115J38286K68047Q1347j17883R5617K03246K9423q7184J0132q0063k62938
$$ plain form
5630 164302 13154 -47360 173642 206659 -7287 -86385 -100352 -165045 -12690 174420 265111
5619 265111 360235 431348 591441 633327 477340 211152 40359 55630 131479 283303 386706
5608 386706 292792 273652 326519 467932 527983 465805 319564 111834 -94206 -191613 -227235
5597 -227235 -115547 10778 -21841 35865 -103803 -88038 192299 151280 -137271 -358708
5587 -358708 -386736 -188732 -43748 141542 351772 456397 444190 412646 181835 -84524
5577 -84524 -122975 -83198 -6844 109069 421566 593155 533084 403260 296037 313737 323419
5566 323419 202868 114991 188734 188027 98305 208197 250330 -96268 -304813 -362985 -270115
5555 -270115 -131829 136218 217565 99682 195299 398545 427968 340784 350916 270853 7915
5544G915k42390n6465J44158R5381R3130J42173j13694j23617l5891K33008J80817
5533C24525j43056k23573j35797r670O3984k5024N7975o3248l2704K77294J12427
5522B03133j41466M596j25458j17262O378J09179N4918q8814J2731L0805J16809
5511F5549J6136N4321m7308k39292M6030J47649R2519n1723N2029J33949R3174
5500C63033r6428n4291O3349Q7506q9870l18907k82673K24386L29855K97872J44522
5489F68354j05612k51240k02118j58146Q6557Q8610n0563r9195P9274J41287J9258
5478B16466J8033j25646j39146q1676j80565j8545q417k54763o2286K25283K05678
5467b05584J15151J51044J3750o0023j83921k02173R9061L6642j2552J22790L2194
$$ plain form
5544 7915 -234475 -290940 -146782 -51401 41729 183902 70208 -53409 -89300 143708 324525
5533 324525 181469 -42104 -177901 -187571 -123587 -148611 -90636 -153884 -186588 90706 203133
5522 203133 61667 66263 -59195 -176457 -170079 -60900 -5982 -94796 -82065 -51260 65549
5511 65549 81685 136006 88698 -150594 -104564 43085 135604 83881 135910 269859 363033
5500 363033 266605 212314 275663 363169 273299 -45608 -328281 -103895 225960 523832 668354
5489 668354 562742 311502 109384 -48762 37795 126405 75842 -23353 55921 197208 216466
5478 216466 234499 108853 -30293 -111969 -292534 -311079 -319496 -574259 -636545 -411262 -205584
5467 -205584 -90433 60611 74361 14338 -169583 -371756 -272695 -236053 -248605 -125815 -93621
5456i3621o5665r8220J55223J57796j96151k79001r8309J3939K60676O8171q4285
5445b59447K0263O9365R8597R3439j9671j00098O6000L50646K26528j14829j58009
5434B72784j42048j20565k8320K50103K93264K1330r7327k26460j73476j15890
5424f6605l10625k84062Q6974J59720J77256K75600J04731j19337j23039M7632
5414e1755J3016k03499j14767k8105j35065J91090L80992N6735L3231K9476O098
5403A77447k1118p9127K2935J0168q717q4186l44786j92000j188o5062J5770K52853
5391c17011K85449K77346L11172J88412j8728j78052j12185J07578n7290j92876
5381B93815q9444J32657q030k91912o0041K22509J71045j840l25700j28488J94228
$$ plain form
5456 -93621 -159286 -257506 -102283 55513 -140638 -419639 -517948 -504009 -243333 -175162 -259447
5445 -259447 -239184 -169819 -71222 22217 2546 -97552 -31552 319094 545622 430793 272784
5434 272784 130736 10171 -18149 231954 525218 546548 449221 222761 49285 -66605
5424 -66605 -377230 -661292 -574318 -414598 -237342 38258 142989 23652 -99387 -51755
5414 -51755 -38739 -242238 -357005 -385110 -520175 -329085 51907 108642 141873 171349 177447
5403 177447 156329 77202 100137 110305 101588 17402 -327384 -519384 -520572 -585634 -569864 -317011
5391 -317011 -31562 245784 556956 745368 726640 548588 436403 543981 486691 293815
5381 293815 204371 337028 328998 37086 -22955 199554 370599 368759 43059 -85429 108799
5370A08799K69809J08068p6171k8858K09965K20458k7558p0914j61551j68231
5360C83816k56210j72821J71500J46021m8506n6201J12137K03137J99321J61373
5350H43567m2028l27407n4418J30902O1665n9646J9516Q8732J26269K24594K02389
5339A214135L2530R1895J69113P8391j1488J98636L80665K01041m0429q5737L0323
5328B259075J57140J83407L46155K82978J04130J26597K43511M12026N03866P95306
5318E414191P11059P84062J127996J276196J382674J460032J741813K326445K966677
5309A9191145L768593M823417N667653N137421L368445J225785j229114l752119
5301C8201226m926478m847011m604008m188594l304337k479098k073961j652225
$$ plain form
5370 108799 378608 486676 410505 381647 591612 812070 784512 713598 552047 383816
5360 383816 127606 -45215 126285 272306 223800 167599 279736 482873 682194 843567
5350 843567 801539 474132 419714 550616 612281 552635 572151 660883 787152 1011746 1214135
5339 1214135 1246665 1338560 1507673 1586064 1574576 1773212 2153877 2354918 2314489 2228752 2259075
5328 2259075 2416215 2599622 2945777 3228755 3332885 3459482 3702993 4115019 4618885 5414191
5318 5414191 6125250 6909312 8037308 9313504 10696178 12156210 13898023 16224468 19191145
5309 19191145 22959738 27783155 33450808 38588229 41956674 43182459 41953345 38201226
5301 38201226 33274748 28427737 23823729 19635135 16330798 13851700 11777739 10125514
5293A0125514j342623j060548q92269j018393j045521p47223k62165l52279l74337
5284C030156l85966l17828j17732K5421k1867k54153j36957l9388j10978m082
5274A666626P7173j66236q5536J58323L3588j99604j23563J39133J38043o5046
5264A572901k75239l27316j29406k3958N7520K3003K5854J09986N2459k48554
5254H37250j80248m6614P0631j8403j22655o8933K00012K08276R2016N766J8147
5243I95245L27536L40557K3626l31303m36350k18043N2618j44231k47818L5137
5233C96974J19059j31661N886o738J5320J62997J11756j32135k77256r147K48195
5222E03250J40300K1844N4956J21521N192j83823l34564m80831j93636K74737
$$ plain form
5293 10125514 8782891 7722343 6830074 5811681 4766160 4018937 3756772 3404493 3030156
5284 3030156 2644190 2326362 2208630 2234051 2212184 1958031 1821074 1781686 1670708 1666626
5274 1666626 1743799 1577563 1492027 1650350 1683938 1484334 1360771 1499904 1637947 1572901
5264 1572901 1297662 970346 840940 816982 874502 897505 923359 1033345 1085804 837250
5254 837250 657002 610388 681019 662616 539961 471028 671040 879316 971332 977098 995245
5243 995245 1322781 1663338 1686964 1355661 919311 701268 753886 609655 361837 396974
5233 396974 516033 384372 390258 383520 398840 561837 673593 541458 264202 255055 503250
5222 503250 643550 665394 720350 841871 847063 663240 328676 -152155 -345791 -71054
5212g1054L10787O6607J07252R5731J00407J22942Q4416R022j766p3532l21882
5201D28930m00865j65292k18025k45548o3191r2518J18889L91484L49831J60177
5191B63872K71825K94392P2589p9946k79670r1542L59797j3910j99873j38809
5181D58725n6806r1495M161m1559k0007J85543p603k54985l60512o0070K4340
5170b20268j65238r9103m806J09319K51747J09878k5923n5928J14348K47079p7433
5159A83672n4578N5821J53297L3552q5769k1638J47459M8156q0064j16314J30714
5148C94308J14042p2381j52639k45241j96657J21778K60957P5091J9892M9542
5138C68692l6291j40531j34663q5757J03877J59903o3058j72086j35765K11793
$$ plain form
5212 -71054 239733 306340 413592 509323 609730 732672 817088 826110 824344 750812 428930
5201 428930 28065 -137227 -355252 -600800 -663991 -756509 -637620 -246136 103695 263872
5191 263872 535697 830089 902678 822732 543062 451520 811317 797407 597534 458725
5181 458725 401919 310424 314585 273026 253019 438562 430959 175974 -184538 -244608 -220268
5170 -220268 -385506 -484609 -489415 -380096 -128349 -18471 -44394 -100322 14026 261105 183672
5159 183672 129094 184915 338212 371764 285995 264357 411816 459972 379908 263594 394308
5148 394308 508350 435969 283330 38089 -158568 -36790 224167 299258 319150 368692
5138 368692 332401 191870 57207 -28550 75327 235230 172172 86 -135679 76114
5128G6114K44879K7112j2842L256P1501j7031j62078l8110K12839J16961p9412
5117D43189n1596j76449j16487O2407P2343M3048r4525K2248J29225k5327L2279
5106C40355J6918k0660K351J18090O318j43504n0751m5749J25167K81762K61892
5095H92189K75795J58412P4724j60614k86139o2721n855q8872O8646K41544J20854
5084A227963N6566K3731p0895p1302j53379M1534J52216K01642N0731j09580j14324
5073A234903r0845R2116J34995L3162j272L19774M17639L32273Q2298k74642j20210
5062B160191K93046K65122K08940L30653M61436L06164L73861L94659L55003K30435
5052E379510L06414N97997O64339P25182R56878J120533J140538J220172J449563
$$ plain form
5128 76114 320993 348105 335263 338519 410020 392989 230911 192801 405640 522601 443189
5117 443189 391593 215144 98657 161064 233407 276455 181930 204178 333403 308076 340355
5106 340355 357273 336613 338964 457054 463372 319868 269117 223368 348535 630297 892189
5095 892189 1167984 1326396 1401120 1240506 954367 891646 885791 796919 865565 1107109 1227963
5084 1227963 1284529 1308260 1237365 1166063 1012684 1054218 1206434 1408076 1458807 1349227 1234903
5073 1234903 1144058 1236174 1371169 1404331 1403059 1722833 2140472 2472745 2555043 2280401 2160191
5062 2160191 2453237 2718359 2927299 3257952 3719388 4025552 4399413 4794072 5149075 5379510
5052 5379510 5685924 6283921 6948260 7673442 8630320 9750853 10891391 12111563 13561126
5043A3561126J609324J568525J839897K123966J988629J955704J661126R93267
5035B7301564K33481j98210r07174j508958j781713j804419j964195j854660j631181
5026A5884535j545572j504990j451752j258664r09581q23262q18732o24260m81615
5017F466107l89763l77214m46456m91737m20459m31119n99724l86673j89974O455
5007B739443j28161n6878l5816l00160l32256k65301L1941J44651J16713N8659
4997A972835j91849k40032j29462j12952p8499L9503m2539j10193p3564j01834
4987I31414J43510O4367n742P3421J91323R3114o4978j82225k46564k98746j07025
4976E91869k9888k5764K25237R9587j10733j43959k5925m9619j90633r2402J5041
$$ plain form
5043 13561126 15170450 16738975 18578872 20702838 22691467 24647171 26308297 27301564
5035 27301564 27535045 27336835 26429661 24920703 23138990 21334571 19370376 17515716 15884535
5026 15884535 14338963 12833973 11382221 10123557 9213976 8390714 7571982 6947722 6466107
5017 6466107 6076344 5699130 5252674 4760937 4340478 3909359 3309635 2922962 2732988 2739443
5007 2739443 2611282 2554404 2518588 2218428 1886172 1620871 1652812 1797463 1914176 1972835
4997 1972835 1780986 1540954 1411492 1298540 1220041 1259544 1217005 1106812 1033248 931414
4987 931414 1074924 1139291 1133549 1206970 1398293 1491407 1426429 1244204 997640 698894 591869
4976 591869 561981 536217 761454 861041 750308 606349 580424 530805 340172 247770 262811
4965B62811K80904L00415J68868M7093k28959k58565j86175r300O7361j63911
4955B80542k38923j14038N9063J55378J10731J12257J14553k46918l49983N563
4945a11775J37631K36474K78385J31538K1201q4166j22788p8817q1339j35243
4935A91101j11435K4529m3796J93480K26121Q6563L1427p295r2046j93634j13719
4924A91296k6165j08116j25778j9209J02077m7522J9827L0609K539M2405J82235
4913B44198K22758Q4779l8708r0578r7262n430J3132m0102P1545o1957r0167n9917
4901A52291k48608j62877P5187j4421k0299K26096J84389O233R203j02735k0367
4890H4092J10557J66947n5457N2712J80205K3187j81221j93008j62167M7798K6156
$$ plain form
4965 262811 543715 844130 1012998 1060091 831132 572567 386392 377092 444453 280542
4955 280542 41619 -72419 -13356 142022 252753 365010 479563 232645 -117338 -111775
4945 -111775 25856 262330 540715 672253 693454 609288 486500 407683 326344 191101
4935 191101 79666 104195 60399 253879 480000 566563 597990 590695 498649 305015 191296
4924 191296 165131 57015 -68763 -87972 14105 -33417 -13590 17019 19558 61963 244198
4913 244198 466956 551735 513027 422449 325187 319757 332889 292787 364332 302375 212208 152291
4901 152291 -96317 -259194 -184007 -198428 -218727 7369 191758 197991 207194 104459 84092
4890 84092 194649 361596 306139 358851 539056 562243 381022 188014 25847 73645 99801
4879I9801j73686J0361J52666J90685L74610N3280l12716l18350N8885j9670k00441
4868h4575m7353m7211j17558j46824r5696M0961R8108J22105q2818k74989r5017
4857g30867J94400J08657O980q2718k3423J61851J02234R7507l9471j38569K06604
4846a36815J38787j2185K166J03599K03136P5486j29764j51422P2606K1868j54289
4835C3173l15000j03037r153O924J46964L89698L75006J128k46552k04821r5451
4824b1121K3427Q9938O9668l0510K613J0117R8402J14845p7372k00792k17455
4813a38240j08079R7929P6269K4119O8454J58568K11843L9326j55341j69534j08681
4802c367K5220J93008K03217p5389k86176K687K90549J17911j54821k39821j33753
$$ plain form
4879 99801 -73885 -63524 89142 279827 654437 707717 395001 76651 135536 115866 -84575
4868 -84575 -131928 -179139 -296697 -443521 -539217 -498256 -400148 -278043 -360861 -635850 -730867
4857 -730867 -536467 -427810 -420830 -503548 -526971 -365120 -262886 -165379 -204850 -343419 -136815
4846 -136815 1972 -10213 -8047 95552 298688 374174 244410 92988 165594 187462 33173
4835 33173 -281827 -384864 -394017 -387093 -240129 149569 524575 525703 279151 74330 -21121
4824 -21121 2306 92244 161912 131402 134015 144132 242534 357379 280007 79215 -138240
4813 -138240 -246319 -148390 -72121 -48002 20452 179020 390863 430189 274848 105314 -3367
4802 -3367 21853 214861 418078 342689 56513 59200 349749 467660 312839 73018 -60735
4791f0735j7504J13657J51938K1221q9874p1258O6020K06486J94508L5362R5962
4780F45783n0500k22519j45825j95076j23874m2623n1052j09821k0583r0087k2716
4769d28893K00626J78473N1797n0272j5234Q9364K1537p7504j61634N2338J10475
4758b8927k08513p3414N290J08291K06919J00251r7784J6115Q7451J10774m087
4747B22366k065P958K4101j14123j79805l1149J29670M0257l24696k98409j3343
4736e39238K33782O7463k16766p7950K34927J36733r395P4032J9652m3853J66780
$$ plain form
4791 -60735 -78239 35418 187356 208577 118703 47445 113465 319951 514459 549821 645783
4780 645783 595283 372764 226939 31863 -92011 -134634 -185686 -295507 -316090 -406177 -428893
4769 -428893 -228267 -49794 2003 -48269 -63503 25861 47398 -30106 -191740 -139402 -28927
4758 -28927 -237440 -310854 -305564 -197273 9646 109897 12113 28228 115679 226453 222366
4747 222366 220301 228259 252360 138237 -41568 -72717 56953 97210 -227486 -525895 -539238
4736 -539238 -305456 -237993 -454759 -532709 -297782 -161049 -170444 -96412 -76760 -120613 46167
$$ [...]
##END NTUPLES=NMR SPECTRUM
##END=
