##TITLE=C13_DF-402-base
 CDCl3, 300 sc

 31.7.2019
##JCAMPDX= 6.0         $$ Bruker NMR JCAMP-DX V2.0
##DATA TYPE= NMR SPECTRUM
##DATA CLASS= NTUPLES
##ORIGIN= UXNMR, Bruker Analytische Messtechnik GmbH
##OWNER= root
$$ XWIN-NMR		Version 3.5
$$ Thu Aug  1 13:43:01 2019 Russian Standard Time (UT+4h)  she@DPX200
##.OBSERVE FREQUENCY= 50.327896
##.OBSERVE NUCLEUS= ^13C
##.ACQUISITION MODE= SIMULTANEOUS
##.ACQUISITION SCHEME= undefined
##.AVERAGES= 17000
##.DIGITISER RES= 17
##SPECTROMETER/DATA SYSTEM= spect
##.PULSE SEQUENCE= zgpg30
##.SOLVENT NAME= CDCl3
##.SHIFT REFERENCE= (INTERNAL, CDCl3, 0, 225.252)
##AUDIT TRAIL= $$ (NUMBER, WHEN, WHO, WHERE, WHAT)
$$ ##TITLE= Audit trail, XWIN-NMR		Version 3.5
$$ ##JCAMPDX= 5.01
$$ ##ORIGIN= Bruker BioSpin GmbH
$$ ##OWNER= she
$$ F:/spectra/data/she/nmr/c13/1/pdata/1/auditp.txt
$$ ##AUDIT TRAIL=  $$ (NUMBER, WHEN, WHO, WHERE, WHAT)
(   1,<2019-08-01 08:58:27.92 +0400>,<she>,<DPX200>,
      <created by zg, POWCHK disabled, PULCHK disabled
       terminated by command 'halt'
       configuration hash MD5:
       00 E9 B6 7A A2 85 ED C7 34 08 36 98 17 FE 4E 26
       data hash MD5: 32K
       4E 6D 67 33 2C 1C 82 55 C2 CF BA 2B E9 22 47 49>)
(   2,<2019-08-01 13:39:12.95 +0400>,<she>,<DPX200>,
      <Start of raw data processing
       efp BC_mod = 2 LB = 1 FT_mod = 6 PKNL = 1 PHC0 = -364.8677 PHC1 = 28.60641 SI = 32K 
       data hash MD5: 32K
       72 64 13 24 63 12 36 5F 87 3B 98 E5 F6 D0 A3 C0>)
(   3,<2019-08-01 13:39:36.18 +0400>,<she>,<DPX200>,
      <pk PHC0 = 1.012168 PHC1 = -2.6 
       data hash MD5: 32K
       2F A4 E0 99 5F 17 29 9E DC BD B8 CE 7D DE 26 BA>)
(   4,<2019-08-01 13:39:56.93 +0400>,<she>,<DPX200>,
      <pk PHC0 = -7.656429 PHC1 = 19.4 
       data hash MD5: 32K
       19 BE 4B 35 0C DA C9 3C D6 4E 82 BF 4A 17 A2 91>)
(   5,<2019-08-01 13:40:04.00 +0400>,<she>,<DPX200>,
      <abs ABSG = 5 
       data hash MD5: 32K
       8B 38 D5 9E DD A3 38 19 4E 9D 88 64 D9 14 CD 9C>)
(   6,<2019-08-01 13:40:39.48 +0400>,<she>,<DPX200>,
      <pk PHC0 = 1.207573 PHC1 = -7.599998 
       data hash MD5: 32K
       2C F7 0F 7D A9 6C 3A 99 DA 9E A5 DC BF 44 1A 49>)
(   7,<2019-08-01 13:41:30.29 +0400>,<she>,<DPX200>,
      <pk PHC0 = 5.663558 PHC1 = -9.799997 
       data hash MD5: 32K
       F9 39 3D 8F A7 8F FE DC 22 34 53 75 2A EC A0 C9>)
(   8,<2019-08-01 13:41:33.89 +0400>,<she>,<DPX200>,
      <abs ABSG = 5 
       data hash MD5: 32K
       32 3A 0B EE FA BA CB 00 3B 16 73 D4 EF FF E5 C3>)
$$ ##END=
$$ 
$$ hash MD5
$$ 91 9F D6 9E EA D2 E6 8E 7F A6 F3 3E 4C A4 E0 C8
##$RELAX= 
##$RELAX= 
##$RELAX= 
##$RELAX= 
##$RELAX= 
##$RELAX= 
##$RELAX= 
##$RELAX= 
$$ Bruker specific parameters
$$ --------------------------
##$DU= <F:/spectra>
##$EXPNO= 1
##$NAME= <c13>
##$PROCNO= 1
##$TYPE= <nmr>
##$USER= <she>
##$AMP= (0..31)
100 100 100 100 100 100 100 100 100 100 100 100 100 100 100 100 100 100 
100 100 100 100 100 100 100 100 100 100 100 100 100 100 
##$AQSEQ= 0
##$AQ_mod= 1
##$AUNM= <au_zg>
$$ [...]
##$SUBNAM4= <"">
##$SUBNAM5= <"">
##$SUBNAM6= <"">
##$SUBNAM7= <"">
##$SUBNAM8= <"">
##$SUBNAM9= <"">
##$SW= 239.972175391363
##$SWIBOX= (0..15)
0 1 3 0 0 0 0 0 0 0 0 0 0 0 0 0 
##$SW_h= 12077.2946859903
##$TD= 32768
##$TD0= 1
##$TE= 0
##$TE2= 300
##$TE3= 300
##$TEG= 300
##$TL= (0..7)
120 120 120 120 120 120 120 120 
##$TP= (0..7)
150 150 150 150 150 150 150 150 
##$TP07= 0
##$TPNAME0= <>
##$TPNAME1= <>
##$TPNAME2= <>
##$TPNAME3= <>
##$TPNAME4= <>
##$TPNAME5= <>
##$TPNAME6= <>
##$TPNAME7= <>
##$TPOAL= (0..7)
0.5 0.5 0.5 0.5 0.5 0.5 0.5 0.5 
##$TPOFFS= (0..7)
0 0 0 0 0 0 0 0 
##$TUNHIN= 0
##$TUNHOUT= 0
##$TUNXOUT= 0
##$USERA1= <user>
##$USERA2= <user>
##$USERA3= <user>
##$USERA4= <user>
##$USERA5= <user>
##$V9= 5
##$VALIST= <valist>
##$VCLIST= <CCCCCCCCCCCCCCC>
##$VD= 0
##$VDLIST= <DDDDDDDDDDDDDDD>
##$VPLIST= <PPPPPPPPPPPPPPP>
##$VTLIST= <TTTTTTTTTTTTTTT>
##$WBST= 1024
##$WBSW= 4
##$XGAIN= (0..3)
0 0 0 0 
##$XL= 0
##$YL= 0
##$YMAX_a= 120999880
##$YMIN_a= -34756608
##$ZGOPTNS= <>
##$ZL1= 120
##$ZL2= 120
##$ZL3= 120
##$ZL4= 120
##$ABSF1= 225.2522
##$ABSF2= -14.74524
##$ABSG= 5
##$ABSL= 3
##$ALPHA= 0
##$AQORDER= 0
##$ASSFAC= 0
##$ASSFACI= 0
##$ASSFACX= 0
##$ASSWID= 0
##$AUNMP= <proc_1d>
##$AZFE= 0.1
##$AZFW= 0.5
##$BCFW= 0
##$BC_mod= 2
##$BYTORDP= 0
##$COROFFS= 0
##$CY= -3
##$DATMOD= 1
##$DC= 0
##$DFILT= <>
##$DTYPP= 0
##$F1P= 0
##$F2P= 0
##$FCOR= 0.5
##$FTSIZE= 32768
##$FT_mod= 6
##$GAMMA= 0
##$GB= 0
##$INTBC= 1
##$INTSCL= 4.134877e-10
##$ISEN= 128
##$LB= 1
##$LEV0= 0
##$LPBIN= 0
##$MAXI= 10000
##$MC2= 0
##$MEAN= 0
##$ME_mod= 0
##$MI= 0.1934396
##$NCOEF= 0
##$NC_proc= 2
##$NLEV= 6
##$NOISF1= 120.0001
##$NOISF2= 80.00006
##$NSP= 0
##$NTH_PI= 0
##$NZP= 0
##$OFFSET= 225.2522
##$PC= 1.4
##$PHC0= -364.6407
##$PHC1= 28.00641
##$PH_mod= 1
##$PKNL= yes
##$PPARMOD= 0
##$PSCAL= 0
##$PSIGN= 0
##$REVERSE= no
##$SF= 50.3225993700027
##$SI= 32768
##$SIGF1= 140
##$SIGF2= 120
##$SINO= 11.81781
##$SIOLD= 32768
##$SREGLST= <13C.CDCl3>
##$SSB= 0
##$STSI= 32768
##$STSR= 0
##$SW_p= 12077.2946859903
##$SYMM= 0
##$S_DEV= 0
##$TDeff= 32768
##$TDoff= 0
##$TI= <>
##$TILT= no
##$TM1= 0
##$TM2= 0
##$TOPLEV= 0
##$USERP1= <user>
##$USERP2= <user>
##$USERP3= <user>
##$USERP4= <user>
##$USERP5= <user>
##$WDW= 1
##$XDIM= 32768
##$YMAX_p= 460565452
##$YMIN_p= -2044528
$$ End of Bruker specific parameters
$$ ---------------------------------
##NTUPLES= NMR SPECTRUM
##VAR_NAME=  FREQUENCY,     SPECTRUM/REAL,   SPECTRUM/IMAG
##SYMBOL=    X,             R,               I
##VAR_TYPE=  INDEPENDENT,   DEPENDENT,       DEPENDENT
##VAR_FORM=  AFFN,          ASDF,            ASDF
##VAR_DIM=   32768,         32768,           32768
##UNITS=     HZ,            ARBITRARY UNITS, ARBITRARY UNITS
##FACTOR=    0.368581032318806, 1,           1
##FIRST=     11335.2760802109, 0,            0
##LAST=      -742.018605779436, 0,           0
##MIN=       -742.018605779436, -2044528,    0
##MAX=       11335.2760802109, 460565452,    0
$$ Real data points
##PAGE= N=1
##DATA TABLE= (X++(R..R)), XYDATA
$$ [...]
24146c99857n30908O5266N84601K91968P5392J72025l763k25991j06024R2731
24136A5440J17841p556j1945r9857l47705J41304j11579j76817L46190M4617l12899
24125d02966o0259K51772R9415j6750n6144k57337k34566o075K96733L47456r1173
24114a29894l21245m48592m66847K05797K32092K13080L7713k73381O4243K51725
24104f35309J58031N2070M3477J21292j63515l41268o204L75029R7546j06606
24094d05457k76973j2456M73173K69222j39418l97031o274K89775J27640J93556
24084A15757M12392J8833o14663m19326J30887K92206L0830l07110j19750m8341
24074e08285k10383K04624L01857J5824J86407q6946k37362j14563l44334k50511
$$ plain form
24146 -399857 -930765 -865499 -280898 11070 86462 258487 254724 28733 -77291 15440
24136 15440 133281 125725 113780 13923 -333782 -192478 -304057 -480874 -134684 -90067 -402966
24125 -402966 -463225 -211453 -112038 -128788 -184932 -442269 -676835 -682910 -386177 -38721 -129894
24114 -129894 -451139 -899731 -1366578 -1160781 -928689 -715609 -677896 -951277 -887034 -635309
24104 -635309 -477278 -425208 -381731 -260439 -423954 -765222 -771426 -396397 -298851 -405457
24094 -405457 -682430 -694886 -221713 47509 -91909 -488940 -495214 -205439 -77799 115757
24084 115757 528149 546982 -67681 -487007 -356120 -63914 -33084 -340194 -459944 -508285
24074 -508285 -718668 -514044 -212187 -196363 -9956 -96902 -334264 -448827 -793161 -1043672
24064a043672K15458M2577J51838M51867r0960k46946L2K08733n0730j40148k6428
24053e28379N1192J10803J30936K7962k93922l31420K06861N63512J26834j82884
24043a18505m6393j90004K11133L57848J82339l6221j77781j00382k03208J73336
24033E2162j72259m43869j14204k1226j40619j80440L14768N03763J89126q9319
24023a02117J13189L92194P6215j91126J20204r4046k49884l29126o4250r1466
24013d20213J15174M64680Q8093n9962M0879o0985l3199R9452R5769j32433l17650
24002a20395k45347k40744k95663J6844j7454q7697J88395N02516K32200j8806
23992h6151j83501m5575J38776q6716j75677J41276j50441n64843k68697p977
$$ plain form
24064 -1043672 -828214 -785637 -633799 -181932 -272892 -519838 -519806 -311073 -361803 -501951 -528379
24053 -528379 -477187 -366384 -235448 -207486 -501408 -832828 -625967 -62455 64379 -118505
24043 -118505 -164898 -354902 -143769 214079 396418 360197 182416 82034 -121174 52162
24033 52162 -120097 -563966 -678170 -699396 -840015 -1020455 -705687 -201924 -12798 -102117
24023 -102117 11072 403266 479481 288355 408559 314513 64629 -264497 -328747 -420213
24013 -420213 -305039 159641 247734 187772 228651 167666 134467 233919 329688 197255 -120395
24002 -120395 -365742 -606486 -902149 -885305 -902759 -990456 -802061 -299545 -67345 -86151
23992 -86151 -269652 -315227 -176451 -263167 -438844 -297568 -448009 -1012852 -1281549 -1289526
23982a289526r4818k1010K25283L33987l1463k94011p9111J05788O1998r3706
23972a176589l37696m3329K06450L02224K53677K24598k31294l36661P7816O29426
23962d31378O13886q9989j37431K34631L81293p377J9122J80778J7527q6659J4002
23951G08405m9825k48852k23105J25166J62602j3455P6264L6582l00999j31789
23941A40994p9627N5685J46563o8230Q6558Q0246k5978K1081M16978J77133l70345
23930E81058j54808P5490K43192J25262j9042j7739Q1741r0419k8037p3608J44990
23919H68080K3205k94699k59456q0457J31846K0119o9461k37108l19900l11297
23909e29128j91901j03596N4869K36408J2956l83330L9255q3125P9196L56673
$$ plain form
23982 -1289526 -1384344 -1405354 -1180071 -846084 -877547 -1171558 -1250669 -1144881 -1082883 -1176589
23972 -1176589 -1514285 -1557614 -1351164 -1048940 -795263 -570665 -801959 -1138620 -1060804 -431378
23962 -431378 182508 92519 -44912 189719 571012 563635 582757 763535 781062 694403 708405
23951 708405 658580 409728 186623 311789 474391 460936 537200 573782 272783 140994
23941 140994 61367 117052 263615 195385 281943 362189 336211 357292 774270 951403 581058
23930 581058 426250 501740 744932 870194 851152 833413 915154 824735 796698 723090 868080
23919 868080 891285 596586 337130 256673 388519 408638 339177 102069 -217831 -529128
23909 -529128 -721029 -824625 -769756 -533348 -520392 -903722 -864467 -947592 -868396 -511723
23899e11723N9390R1527J37876k8591j48727k6558j26836K06164J99033K68291
23889A19846K35586L9460j98420J89493J39461m91014o87442n42778k02868Q4229
23879a314447K07181K40752J80952J084M03190M49206M148j47498k07097p3788
23869b56317k32099K6501q549j96749j98121J45330J94301Q3009k2136R526J14652
23858c40652Q3419J86768n685j98855j67751P3788J93318Q9791J75516o4994k90572
23847b65909n44275l34501R9403K40508L34617J21735j32161l9459L00546K98137
23837G8641P1876k36720k12619K93502L71894l946l70625p3413K80389J61717
23827C60696P2700k47916j16730L30889L53164k39721l36899l50334n48508l90510
$$ plain form
23899 -511723 -452333 -360806 -222930 -251521 -400248 -426806 -553642 -347478 -148445 119846
23889 119846 355432 394892 196472 385965 525426 34412 -653030 -1195808 -1398676 -1314447
23879 -1314447 -1107266 -866514 -685562 -684478 -281288 167918 172066 24568 -182529 -256317
23869 -256317 -488416 -461915 -470464 -667213 -865334 -720004 -525703 -442694 -464830 -455304 -340652
23858 -340652 -257233 -70465 -76150 -275005 -442756 -368968 -175650 -85859 89657 24663 -265909
23847 -265909 -810184 -1144685 -1045282 -804774 -470157 -348422 -480583 -520042 -219496 78641
23837 78641 150517 -86203 -298822 -5320 366574 362628 -7997 -81410 198979 360696
23827 360696 433396 185480 68750 399639 752803 513082 176183 -174151 -722659 -1113169
23817a113169R8617J28875k00537n7944L02450K04352j57509l08162j18775R6276
23807a125526L33126L29461J90044k35822q0471L56727j3669j84427j66630k91783
23797h88970l42856k54356J82672N56837M38664K73209J20829k10427o27313k06476
23787i58187K02584K32424K37613R5846q457J9013l76191k5406K57969R2200j83035
23776d13627P7829R6144j66390l04752m9755K5590k21085J7465n6328N547r350
23765i98712q6056K96927K33071j77828N7077J51168L5658n5843o7449l1684K59669
23754c84002L38994L85058M3270N5577K3909l21180m82912p34719k51073M13809
23744i13269J58154P3868J82398O8321j00923k7102L00216J87418q8495q4948
$$ plain form
23817 -1113169 -1014552 -885677 -1086214 -1144158 -841708 -637356 -794865 -1103027 -1221802 -1125526
23807 -1125526 -792400 -462939 -272895 -508717 -589188 -232461 -246130 -430557 -597187 -888970
23797 -888970 -1231826 -1486182 -1303510 -746673 -308009 -34800 86029 -124398 -751711 -958187
23787 -958187 -755603 -523179 -285566 -189720 -198177 -179164 -555355 -580761 -322792 -230592 -413627
23776 -413627 -335798 -239654 -406044 -710796 -760551 -734961 -956046 -938581 -994909 -989362 -998712
23765 -998712 -1084768 -787841 -554770 -732598 -675521 -524353 -488695 -544538 -611987 -643671 -384002
23754 -384002 -45008 340050 383320 438897 462806 141626 -341286 -1076005 -1327078 -913269
23744 -913269 -755115 -681247 -498849 -430528 -531451 -558553 -258337 -70919 -159414 -244362
23734b44362q2382K32584N12010K84572q1105j01785m25869l41094j25278J73781
23724a98928K70903j18309m0861J69729K35426J29925j24440q5689K0914o3597
23714A95073J11285K9508k21900k70669N6703J42916o5399m93383m23295j1091
23704i50252K72718L79938K74632J42551q730k22362k07064m5466L29200M7151
23694A2316o3113j20677O4873L56066N07071K44266j34785j96067J75356J72023
23684A017329l40986j42654k27454j99006k70071k60591J99184M13015K07567
23675C96333j45229k27363J14337J46133l5883j71993l88296l35725q7096L68485
23665c66297L54540M31579L17801l65034m83836o22779m16606J08702M74763M89115
$$ plain form
23734 -244362 -326744 -94160 417850 702422 621317 519532 93663 -247431 -372709 -198928
23724 -198928 71975 -46334 -87195 82534 317960 447885 323445 237756 258670 195073
23714 195073 306358 335866 113966 -156703 -100000 42916 -22483 -515866 -939161 -950252
23704 -950252 -677534 -297596 -22964 119587 110857 -111505 -318569 -364035 -34835 12316
23694 12316 -50797 -171474 -106601 249465 756536 1000802 866017 669950 845306 1017329
23684 1017329 676343 533689 306235 107229 -162842 -423433 -224249 188766 396333
23675 396333 251104 23741 138078 284211 248328 76335 -311961 -647686 -734782 -366297
23665 -366297 -11757 419822 737623 372589 -111247 -734026 -1150632 -1041930 -567167 -78052
23655g8052K75370l7338J44425J24490j47009l51708q4578l02498m15999k9684
23645i02581l0384q0529J87292R6075k2948R118J02294q6542P6049M02624L09404
23634E9872L87986L61512q6812l49495m266j35785k63114J8263j55558l32913
23624e00310j33412K00446N41429J48308n3429J37923j19136n87131m73004q497
23614h46813R7338K2792j09137R3716p4479l48505k16647M01304M95374K64514
23604b20543Q1268l37583j64578J69078L50110J90272j7975k27817L00285M77349
23594E99866O9525l73681l17629o2633J32491J92653k1403N0886R4858L57234
23584G22167J10876n24044n07670K8688N22699J48325l45174l06235k16513k9439
$$ plain form
23655 -78052 197318 159980 304405 428895 281886 -69822 -154400 -456898 -872897 -902581
23645 -902581 -932965 -1013494 -826202 -730127 -753075 -743957 -641663 -728205 -652156 -249532 59872
23634 59872 447858 809370 722558 373063 368797 233012 -30102 -11839 -167397 -500310
23624 -500310 -633722 -433276 108153 256461 203032 340955 221819 -365312 -838316 -846813
23614 -846813 -749475 -726683 -835820 -742104 -816583 -1165088 -1381735 -980431 -485057 -220543
23604 -220543 -139275 -476858 -641436 -472358 -122248 68024 50049 -177768 122517 599866
23594 599866 669391 295710 -21919 -84552 47939 240592 219189 270075 364933 722167
23584 722167 833043 308999 -198671 -169983 352716 501041 155867 -150368 -366881 -396320
23574c96320J16174J57734L03346N0561j58287l95436j26808j86779k35540k2068
23564h93423J71265M22879N10080J83730j67921l10801j47125p6214j22718j58983
23554e89231l0057N67926J13358j88734l81653k72935L0806J25263J67174L58134
23544i9949r4354j97637L48738K33502r868L2700J51020L47175K44370K381m01067
23533E57011n57380j92978K80316K87637p737l89415l94146N1540p1943j09082
23523e46177m9334j51944k52099L756J80916J50310M61806L63184l5741q1190
23513D3487j08031j55891l52312k22342j52128k86233l2946J47043M2166O7430
23503a009757L70409J87504j64548j04117P9202k13684k91859m2292o0454j39669
$$ plain form
23574 -396320 -280146 -122412 180934 231495 73208 -322228 -449036 -635815 -871355 -893423
23564 -893423 -722158 -299279 210801 394531 226610 -84191 -231316 -307530 -430248 -589231
23554 -589231 -619288 -51362 61996 -126738 -508391 -781326 -750520 -625257 -458083 -99949
23544 -99949 -194303 -391940 -43202 190300 180432 213132 364152 711327 955697 958078 557011
23533 557011 -369 -193347 86969 374606 366869 -22546 -416692 -365152 -437095 -546177
23523 -546177 -595511 -747455 -999554 -995798 -814882 -664572 -202766 160418 124677 43487
23513 43487 -64544 -220435 -572747 -795089 -947217 -1233450 -1266396 -1119353 -1077187 -1009757
23503 -1009757 -639348 -451844 -616392 -720509 -641307 -854991 -1146850 -1189142 -1249596 -1389265
23493a389265J14052R2610p9031O6556L02028l20639k43880L63269L72391L66804
23483c55105Q5754l02864k74921J48806K78949O9498J8447N7060m7026k49486
23473e70888j67865J60932j92161n53399l418N8028n4013K04106L26511M95154
23463b97013O87973K10416l02846k54206l78181n23389l01094P41J88469M92607
23453d76523L29097J84389K42388K46533J11366k45653j89415k04320m53440Q4567
23443c71011L69397O2892K19808L29760O9221o628J51814m2026j3636Q1651N8446
23432I09688k44981n05792Q1301L08468N5015k40070m97273m34014o4509j91969
23422h24136k49725J2931L97968R1359l9820N4101p6368j75092K42592M76771
$$ plain form
23493 -1389265 -1275213 -1182603 -1261634 -1195078 -893050 -1213689 -1457569 -1094300 -721909 -355105
23483 -355105 -269351 -572215 -847136 -698330 -419381 -349883 -331436 -274376 -321402 -570888
23473 -570888 -738753 -577821 -769982 -1323381 -1326799 -1268771 -1322784 -1118678 -792167 -297013
23463 -297013 390960 601376 298530 44324 -333857 -857246 -1158340 -1157599 -969130 -476523
23453 -476523 -147426 36963 279351 525884 637250 391597 202182 -2138 -455578 -371011
23443 -371011 -1614 61278 281086 610846 680067 673439 825253 783227 769591 851242 909688
23432 909688 664707 158915 240216 548684 603699 363629 -133644 -567658 -632167 -824136
23422 -824136 -1073861 -1060930 -662962 -571603 -611423 -557322 -633690 -808782 -566190 -89419
23412h9419J29283r2330k37182k17034O3384J21983J84173J30438N5014j0828
23402C7482m7040L01000K43197L7435J74390q5837m37727m16441j32135j17050
23392d42726j93259l38935k39951j60347L02801K96860k00194m5245K52248M28489
23382c40259J5458j18341k01538K1653M34689M39438J65327J91736K46819l0807
23372H24175l22462M3491J43382j74348j73752n28935o61674j15114k0895K45807
23362g40325M82213M80235R3619k55601j21020J88522k80135k53261J45586o1807
23352c21974J87012K22604L9368l64307m4306L1862J47473K56228l2490l55216
23342b33746m7094j0540l11172m64230l11075K84386K77260L79285M49813M47722
$$ plain form
23412 -89419 39864 -52466 -289648 -506682 -443298 -321315 -137142 -6704 48310 37482
23402 37482 -9558 291442 534639 572074 746464 660627 222900 -193541 -325676 -442726
23392 -442726 -635985 -974920 -1214871 -1375218 -1072417 -775557 -975751 -1020996 -768748 -340259
23382 -340259 -324801 -443142 -644680 -623027 -188338 251100 416427 608163 854982 824175
23372 824175 501713 545204 688586 514238 340486 -188449 -850123 -965237 -986132 -740325
23362 -740325 -258112 222123 315742 60141 -60879 127643 -152492 -405753 -260167 -321974
23352 -321974 -134962 87642 127010 -237297 -281603 -249741 -102268 153960 121470 -233746
23342 -233746 -280840 -291380 -602552 -1066782 -1377857 -1093471 -816211 -436926 12887 460609
23332D60609j3765k570J64888O4409j99681q4857K82148J93190J0589m69462j26450
23321B79048J03434J45131m2808n6474K4251J44209N3588k79236k52432k36259
23311a17548j77072R8248J10008j72833l70666j48698J24785K78433O02859K38818
23301D66334K9481l09187m49658j84387N7800J5354J99987K83357L12560j05879
23291C15762l76272k37226o195K1033j88985J16700L07068J97721K40225L1496
23281D21327k21795l1681k38984K8863L17233j06943l51160k40106R1184J22047
23271b10015l49070k96016L23021J70033J31731Q6989j85197j9719k21338l48347
23261i17928j40103K83065R7810J05750L35443K48964K10721p8572k90494m27397
$$ plain form
23332 460609 446844 444274 609162 673571 473890 389033 671181 864371 874960 405498 279048
23321 279048 382482 527613 484805 428331 452582 596791 650379 371143 118711 -117548
23311 -117548 -294620 -196372 -86364 -259197 -629863 -778561 -653776 -375343 227516 466334
23301 466334 495815 186628 -263030 -447417 -389617 -374263 -174276 109081 421641 315762
23291 315762 -60510 -297736 -303931 -282898 -471883 -355183 -48115 149606 389831 421327
23281 421327 199532 167851 -71133 -42270 274963 168020 -183140 -423246 -332062 -210015
23271 -210015 -559085 -855101 -532080 -362047 -230316 -143327 -328524 -348243 -569581 -917928
23261 -917928 -1058031 -774966 -677156 -571406 -235963 13001 223722 145150 -145344 -572741
23251e72741k56070p5172k3309K67628N2511m139N52721M82766M0154l28114k93004
23240a56769r1039k14372j2944j0637J37668L88869K34341l36969l42322O6337
23230c37837J36063K84762L40011J10242n9879k86678m54485M2784N45718L15079
23220F35780K1122N6472q4943k88802l66621k77025J92708J82086K48570J92572
23210E11919m1578R0924j71044l58342j04544K10096R8683J425j97719P89L28298
23199C68907K08773j57142j28800J53430J3552N1291J41830K56716K81062j22262
23189A067357j18368O134l00154m65293j41969K90830k0393l88952m43179l34244
23179h48231M2102K31765K71897K43621q0209j88946k87699r2035L30859L88902
$$ plain form
23251 -572741 -828811 -903983 -927292 -659664 -607153 -611292 -58571 424195 464349 136235 -156769
23240 -156769 -247808 -462180 -475124 -485761 -348093 40776 275117 -61852 -404174 -337837
23230 -337837 -201774 82988 422999 533241 473362 186684 -267801 -225017 320701 635780
23220 635780 656902 713374 628431 339629 -26992 -304017 -111309 70777 319347 511919
23210 511919 470341 561265 390221 31879 -72665 137431 236114 237539 39820 40609 368907
23199 368907 577680 420538 291738 445168 458720 510011 651841 908557 1189619 1067357
23189 1067357 948989 955123 654969 189676 47707 338537 318144 -70808 -513987 -848231
23179 -848231 -806129 -574364 -302467 -58846 -139055 -328001 -615700 -707735 -376876 12026
23169A2026J72616M738J42212K43058L16038R5598j48532k35502p0821M0664K78077
23158H50172Q3961K1065r7044l89455M6605R301k10823n08800n03891m09940M9393
23147a059456K96869j00001l2776L54149L88933K45315L4871o817j21291j61418
23137a61622j406k08401r9099j49212p3374J80782L3J56781L32782K42540q9701
23126A30103J52308k24655o6709J57449M116Q7541k48059j52020M01353L38022
23116E79449q8473r5896k20690j75754j01770l65439n2853M26845M46461L75812
23106G27692j96318k45341o3519J48636r51l42835k70630k8249q6555R4449K10712
23095e2909J40172k45451J56545L63737J26086J0187j67218j90311o6671r3217
$$ plain form
23169 12026 184642 189380 331592 574650 890688 986286 837754 602252 531431 572095 850172
23158 850172 934133 955198 858154 468699 515304 524605 313782 -195018 -698909 -1108849 -1059456
23147 -1059456 -762587 -862588 -895364 -541215 -152282 93033 127904 121087 -204 -161622
23137 -161622 -163028 -371429 -470528 -619740 -693114 -512332 -512299 -355518 -22736 219804 130103
23126 130103 282411 57756 -8953 148496 152612 240153 -7906 -159926 241427 579449
23116 579449 490976 395080 174390 -1364 -103134 -468573 -521426 -94581 351880 727692
23106 727692 531374 286033 222514 371150 370199 27364 -243266 -271515 -358070 -263621 -52909
23095 -52909 87263 -158188 -1643 362094 488180 498367 331149 140838 74167 -19050
23085a9050m5516j94482n7355O4488J78806J17455l655K50091q341o67R7148q5237
23073B93685k15852m46127k29968L92160L12861J39415J6993J14136K35846N5254
23063F68403J63172J91079O8340k22282l78001k65515k47264l96329r3743M98287
23053a3853M8671n34899j11359K22746Q0777K22149J26141k46221j13263j26393
23043d45504o7000o8739l7031M63264M23074J03340k04584j83451J5445Q9979
23033H8793M9994j21433j77197M0569L71850M79690j73578o46096m47570p8012
23023f12990K06591J37175O8978K41960K96319K19644m7768j64665j7514j73889
23013A53841J754L69371K36458R7571j68482m84140k60776j30061J15872R6374
$$ plain form
23085 -19050 -64566 -259048 -316403 -251915 -73109 44346 40691 290782 282441 281774 378922 293685
23073 293685 77833 -368294 -598262 -206102 106759 246174 263167 377303 613149 668403
23063 668403 831575 1022654 1090994 868712 490711 225196 -22068 -418397 -512140 -13853
23053 -13853 34818 -500081 -611440 -388694 -307917 -85768 40373 -205848 -319111 -445504
23043 -445504 -512504 -581243 -618274 -155010 268064 371404 166820 -16631 -1186 88793
23033 88793 138787 17354 -159843 -119274 252576 732266 558688 -87408 -534978 -612990
23023 -612990 -406399 -269224 -200246 41714 338033 557677 509909 345244 327730 153841
23013 153841 155595 524966 761424 858995 690513 206373 -54403 -184464 -68592 27782
23003B7782L9748j46040j97789J14783K34169K72331L02041M78155J37557l19857
22993I42880j10601j23691n16104k52127L65865L6059k53240j73818j84891j30135
22983c99803K55100M5243L81793K87880M8471l63562n99973J26514L09237M88716
22973E79616J2870o33417k21527K54921J83589j9071J02814j4223j4282Q0151
22963C11441L9227J0420R9777N4166K44178J85282J00704M02952L82097J57821
22953A988065q9085j69166j45478j11181j38614r9726p0891m2108m55270k20134
22943D46412j33319J05774P6884L2689r0727m1310J71612K99240k7236j55930
22933F84089k59479k56847O9244P1574K91667P28911J38189l62895K3359L65451
$$ plain form
23003 27782 67530 -78510 -276299 -161516 72653 344984 647025 1125180 1262737 942880
22993 942880 832279 708588 192484 -59643 306222 342281 89041 -84777 -269668 -399803
22983 -399803 -144703 -99460 282333 570213 618684 255122 -344851 -218337 90900 579616
22973 579616 592486 -40931 -262458 -7537 176052 156981 259795 245572 231290 311441
22963 311441 350668 361088 460865 515031 759209 944491 1045195 1448147 1830244 1988065
22953 1988065 1898980 1729814 1584336 1473155 1334541 1234815 1163924 1121816 666546 446412
22943 446412 313093 418867 495751 528440 437713 396403 568015 867255 840019 684089
22933 684089 424610 167763 237007 308581 600248 1329159 1467348 1104453 1127812 1493263
22923A493263M32827L34145J29799N2042j76190M2606J39855J84489J10900L07235
22913C050971L89862M9548q2891n8123K408N2949L5678L84526N62124Q66891J100022
22902F353965J089377R66413J041557J119827J266175J680494J810545J728020
22894A7056373J882395K350118L059934L859506M986872O834522R095238J2700569
22886F1825527J8471500K7561958M1277670O0946934Q1512829Q4890152M8490061
22879D24976631j8741639p2737445q5287293o9531896m8951575l2980640k2342241
22872G4403902j5563941j1353724q175287o208736m981216l497987k704089k804573
22864A9114349k399753k126194j760689j713597j629956j096008p81936o20376
$$ plain form
22923 1493263 1926090 2260235 2390034 2442076 2265886 2308492 2448347 2632836 2743736 3050971
22913 3050971 3440833 3490381 3407490 3349367 3351775 3404724 3440402 3824928 4387052 5253943 6353965
22902 6353965 7443342 8409755 9451312 10571139 11837314 13517808 15328353 17056373
22894 17056373 18938768 21288886 24348820 28208326 33195198 40029720 49124958 61825527
22886 61825527 80297027 107858985 149136655 210083589 291596418 376486570 424976631
22879 424976631 406234992 333497547 248210254 178678358 129726783 96746143 74403902
22872 74403902 58839961 47486237 39310950 33102214 28120998 24623011 21918922 19114349
22864 19114349 16714596 14588402 12827713 11114116 9484160 8388152 7606216 6985840
22856F985840p25985m49648l78242m0535K7115l16461o59440n02633l37138l64108
22846C238765j13406J47476l4696l45133l08706l7308J76729p548k59091p6901
22836B380181j09340L45857K97566k5409J14266K3352J50326L80534P45283J022014
22826E324630J301729J113295L03301m25456j012970j163872j120379r13326m38844
22817B968108l42086l79002J32412M27055j0583m53917l17330m7761K44949M78730
22807B700575M19519j0317m72413n09779j87545J58680l19489n03657n618Q829
22797A278785j59756K5391J40829L08185k5772n45725l76350j48004J20084L12453
22787I30120M5027J35999j7117j84087R9137N0181K77396O31961R85883R34443
$$ plain form
22856 6985840 6259855 5810207 5431965 5391430 5418545 5102084 4442644 3940011 3602873 3238765
22846 3238765 3125359 3272835 3238139 2893006 2584300 2546992 2723721 2716173 2457082 2380181
22836 2380181 2270841 2616698 2914264 2888855 3003121 3026473 3176799 3557333 4302616 5324630
22826 5324630 6626359 7739654 8042955 7617499 6604529 5440657 4320278 3406952 2968108
22817 2968108 2626022 2247020 2379432 2806487 2795904 2341987 2024657 1976896 2221845 2700575
22807 2700575 3120094 3109777 2637364 2127585 1940040 2098720 1779231 1275574 1269956 1278785
22797 1278785 1119029 1144420 1285249 1593434 1567662 1021937 645587 497583 617667 930120
22787 930120 975147 1111146 1094029 909942 1009079 1059260 1336656 1968617 2954500 3888943
22777C888943O72471O37502P8768m01187o96651p13177o47287p08564j15858k82498
22767A712462o46235k21159J68067J9667j82395m41601l54496J00063M98046K59164
22757I11583M3120n0564j22808r3817K14695L51883j07145K69538J77481k21706
22747A372260k43283k35000j37462j57004m7572J79385j5594n48023k99465K19339
22737H7581J44193k8434Q4072L87782L02638M5999J80321K82844j11656o26241
22727G49099n69960l68822m04441q150K02274N4167N8443J49947K06504J47570
22717B16631k5505r1281Q5229J19858q0593j98627J93744K63198j26073o0246
22707B96335J47325j59899l67945j54583L64836N25855K17143k00304l25326j3413
$$ plain form
22777 3888943 4561414 5198916 5277684 4876497 4179846 3466669 2819382 2110818 1994960 1712462
22767 1712462 1066227 845068 1013135 1032802 850407 408806 54310 154373 652419 911583
22757 911583 954703 904139 781331 687514 902209 1254092 1146947 1416485 1593966 1372260
22747 1372260 1128977 893977 756515 599511 551939 731324 715730 167707 -131758 87581
22737 87581 231774 203340 287412 675194 977832 1023831 1204152 1486996 1375340 749099
22727 749099 179139 -189683 -594124 -602274 -400000 -345833 -287390 -137443 69061 216631
22717 216631 191126 99845 185074 304932 224339 25712 219456 482654 356581 296335
22707 296335 443660 283761 -84184 -238767 126069 651924 869067 668763 343437 330024
22697C30024K76535J7405J83994J24640j9956l70055m22146k75860L30320N10454
22687F85355M48365J65203q7990k16042k64034k06463k95810o0289N0874J95941
22677D15110k9686k55700l39740K01410K02155J73109p2243k35294l4825j4863
22667I433k26901j89096o9618j50439m11084l54435K14008M86046K57922o0570
22657d94734J76912J62893j05292J9896r2336j83796p7478O7610K27365N0168
22647b48792j56087J96844J23684O5856P2577P6018L902J30588J77550m9788P076
22636C99428m27043m25391R1430K35956j30169q9769J31425K08108L93997K13542
22626F01514j75963m0234k59913j74884K05698M86425M49112Q8928K1950J87954
$$ plain form
22697 330024 606559 623964 807958 932598 912642 542587 120441 -155419 174901 685355
22687 685355 1133720 1298923 1210933 994891 730857 524394 228584 168295 219169 415110
22677 415110 385424 129724 -210016 -8606 193549 366658 294415 59121 24296 9433
22667 9433 -217468 -406564 -476182 -626621 -1037705 -1392140 -1178132 -692086 -434164 -494734
22657 -494734 -317822 -154929 -260221 -240325 -332661 -516457 -593935 -526325 -298960 -248792
22647 -248792 -404879 -208035 -84351 -18495 54082 130100 134002 264590 442140 392352 399428
22636 399428 -27615 -453006 -361576 -125620 -255789 -345558 -214133 -6025 387972 601514
22626 601514 425551 385317 125404 -49480 156218 642643 1091755 1180683 1202633 1390587
22616A390587n422j63102k30633K3660L96318O5102k11031o20226o04950k62173
22606b21870J84791K97473O6452J24380L64819q5699o38934o97858l56026j12421
22596a074893Q4228K79679M57191J9103l05027j5535J82889L68025O4500r2464
22586c2304k72322j39745J6798K9817k351k39406J34789M57058J56561j10408
22576a513R6102K5563j82893l06935j62971k23864k25811Q5310J74737K16625
22566e05650Q7709M5697K70057o4874k43985M5337J64252J23526j62827l11580
22556e52338k8762n6912l6517J31472J82616K79784K36984L05087R6508l18037
22546B39885j85020J20159N3705k3704r3072n1520J97052n9901l08869L8109L07357
$$ plain form
22616 1390587 1385165 1222063 991430 1015090 1411408 1476510 1265479 645253 40303 -221870
22606 -221870 -37079 260394 326846 451226 816045 730346 91412 -606446 -962472 -1074893
22596 -1074893 -990665 -710986 -253795 -234692 -539719 -555254 -372365 -4340 60160 -32304
22586 -32304 -304626 -444371 -427573 -397756 -400107 -639513 -504724 -47666 108895 -1513
22576 -1513 94589 120152 -62741 -369676 -532647 -756511 -982322 -897012 -722275 -505650
22566 -505650 -417941 -372244 -102187 -167061 -411046 -365709 -201457 -77931 -240758 -552338
22556 -552338 -581100 -638012 -674529 -543057 -360441 -80657 156327 461414 557922 239885
22546 239885 54865 175024 228729 205025 111953 60433 257485 197584 -111285 -73176 234181
22535B34181L45572K60965J07658L26705L40577L78167J26005M1139J50786M55669
22525B767424O11898R23837J534667K410726L431495M269614M538522J869521
22517B2357704k684991m837958m093552k682258k076321j856523j030012n20563
22509B575526j22793p4715m979k56588p15353m71144Q8651Q5096j3825k16904
22499H72972m05947k31701J17899K86389M8702j7378l37812J42430L51217r7125
22489G29646N6086l04098m61540k24355J15320N11698J75865l08988j69178j20659
22479b03j55955r3566N37706M55301k69707l74830l490J17702k30273m8289R4794
22468B9190j7580R2949Q1276m7315k6974L89594L64772K66068J48482p798r0963
$$ plain form
22535 234181 579753 840718 948376 1275081 1615658 1993825 2119830 2160969 2311755 2767424
22525 2767424 3379322 4303159 5837826 8248552 11680047 15949661 20488183 22357704
22517 22357704 19672713 14834755 10741203 8058945 5982624 4126101 3096089 2575526
22509 2575526 2452733 2378018 2373039 2116451 1401098 929954 1018605 1103701 1089876 872972
22499 872972 467025 235324 353223 639612 688314 670936 333124 475554 826771 729646
22489 729646 785732 481634 20094 -204261 -88941 422757 598622 289634 120456 -203
22479 -203 -156158 -249724 287982 743283 473576 98746 95256 212958 -17315 -65604 29190
22468 29190 11610 104559 185835 138520 111546 501140 865912 1131980 1280462 1272664 1181701
22457A181701m99408l97685j16805L9678Q4767L61777L74200q9102j9099L06730
22447A226754J00700r5172M5257L37211L06902n6622k49488J31251N68598N82198
22437B897589j17880K69102Q13561Q84433J099098J293412J629719K596993M296366
22428A5662393O572897J0107058J4738856J6863242R215743q121541j7483072
22421D7555576j4755689j0273776o706980m198006k576649j275181q70027j106129
22413E793139j135358j002172n55465l43623J9024J14070M4156r8018m42631p50960
22403A642162l67171K32949L83010n1967l36366l84675j04686K48737j50759o41050
22393D70184n18209k4508J49111J57318K65763K62945J77242J73691K48174r9404
$$ plain form
22457 1181701 682293 284608 167803 207481 292248 654025 1028225 939123 920024 1226754
22447 1226754 1327454 1232282 1277539 1614750 1921652 1865030 1615542 1746793 2315391 2897589
22437 2897589 2779709 3048811 3862372 4746805 5845903 7139315 8769034 11366027 15662393
22428 15662393 22235290 32342348 47081204 63944446 73160189 65038648 47555576
22421 47555576 32799887 22526111 15819131 11621125 9044476 7769295 6899268 5793139
22413 5793139 4657781 3655609 3100144 2756521 2775545 2889615 2933771 2835753 2393122 1642162
22403 1642162 1274991 1507940 1890950 1838983 1502617 1117942 1013256 1261993 1111234 470184
22393 470184 -48025 -72533 76578 233896 499659 762604 939846 1113537 1361711 1262307
22383A262307j20080J74935P1221K4427l2181m5663k5407j69956k19333L7551
22373I57821K5597o1897J09453j73514j37851N4609k179N6857J7558k50963j89407
22362D06084J1311J11835L78686K62651r7405m50355m39228m3018L1383K24229
22352C96173N83121J48822k08229o7893K28232K37369J92319M21580L52486M53384
22342B737364N01991O90051R11257J205020J308361J794557K540212L791558N866816
22333B1347187Q867869J3338898J6523589J1833860m281314j6683860j5846281
22326C5099948j0624336o789532m702356l124895k184722j576227j316086q87455
22318C894339o67368m76541J19231N2051m36581k35778l71139o35143m86252J2027
$$ plain form
22383 1262307 1142227 1317162 1388383 1412810 1380629 1334966 1309559 1139603 920270 957821
22373 957821 983418 921521 1030974 857460 719609 774218 772039 828896 846454 595491 406084
22362 406084 417395 529230 907916 1170567 1073162 622807 183579 140561 171944 396173
22352 396173 979294 1128116 919887 851994 1080226 1317595 1509914 1931494 2283980 2737364
22342 2737364 3239355 3929406 4840663 6045683 7354044 9148601 11688813 15480371 21347187
22333 21347187 30215056 43553954 60077543 71911403 67630089 50946229 35099948
22326 35099948 24475612 17686080 12983724 9858829 7674107 6097880 4781794 3894339
22318 3894339 3226971 2750430 2869661 2921712 2485131 2249353 1878214 1243071 756819 768846
22308G68846K93731M41407J86799L5750l76014m95357l70373j41145K09570J46887
22298G00101P70j769k42391j58524j03898k47860j78135J46249J46748J4946K72335
22287C48572M14802N45575N81481m9690o74349m79865r2052l4727J4881J27972
22277G02600q0333l14712k6877o732K57988K59305K09867K20973K25607m28368
22267A019318p95144l81505k4450K38848K42300K05985J43719R6098J5813K00258
22257I61240r0497l24415l5803M90596L69902k37654k31384Q308j01112q9906
22247G19275k39752N1379O30082N79888O05134J100692J083740J687499L116352
22238I334289M387534N108153L791209l96863m367707n021561m056352k890603
$$ plain form
22308 768846 1062577 1503984 1690783 1726533 1350519 855162 484789 343644 553214 700101
22298 700101 700871 699102 456711 298187 194289 -53571 -231706 -85457 61291 76237 348572
22287 348572 763374 1308949 1890430 1840740 1166391 686526 594474 559747 574628 702600
22277 702600 622267 307555 280678 273946 531934 791239 1001106 1222079 1447686 1019318
22267 1019318 224174 -157331 -181781 57067 299367 505352 649071 745169 760982 961240
22257 961240 870743 546328 510525 1001121 1371023 1133369 901985 910293 809181 719275
22247 719275 479523 530902 1160984 1740872 2346006 3446698 4530438 6217937 9334289
22238 9334289 13721823 18829976 22621185 22224322 17856615 12835054 8778702 5888099
22230E888099j529587o71247l30370o02968n24546j45300j72058l74516l73509
22221A163998l3628k9683j75178P0037R3595L7017L45490J22599m98405n18428
22211E77414L833L35907K31232k177l26640k91359k89287R1629j41929n05000
22201c16377j62226K06304J35354Q4754L62739K08593j56418l57262q2880K27053
22191A49634J10815K29619J51132k62739k83442K06357j43807l77530k44622l1759
22181d96342P7294j66516j13538K2052k14072m26920o7641J42414J77276L27489
22171g38504M24970J81804l47876l31560l38960q4449N50153K82263j29288k00007
22161g31454j47093N490J27155J54002K02870Q8773l8245j06335J27730L42349
$$ plain form
22230 5888099 4358512 3687265 3356895 2753927 2229381 2084081 1912023 1537507 1163998
22221 1163998 1130370 1100687 925509 995546 1089141 1126158 1471648 1594247 1095842 577414
22211 577414 581247 917154 1148386 1146209 819569 528210 238923 330552 188623 -316377
22201 -316377 -478603 -272299 -136945 -52191 310548 519141 362723 5461 -77419 149634
22191 149634 260449 490068 641200 378461 95019 301376 157569 -219961 -464583 -496342
22181 -496342 -419048 -585564 -699102 -677050 -891122 -1318042 -1385683 -1243269 -1065993 -738504
22171 -738504 -313534 -131730 -479606 -811166 -1150126 -1234575 -684422 -402159 -531447 -731454
22161 -731454 -878547 -873057 -745902 -591900 -389030 -300257 -338502 -444837 -317107 25242
22151B5242J75479K47729K26818J27505l24915k61669o0220j09658j36197k84183
22141c74069K0493K33954l49093o21352j63569O11896P72121L52153k8406L0733
22131D84861l22994n20451j23062j90398r1958K87819K27283j23194O8511J51186
22121a52397j0885M4097K9654k74194j25301l23213m83367J98655L21621K19038
22111e56292K72998K74543N2572k15786k23159J44407J04111N5036Q6294k05771
22101b11047l72280k54466p3404L21999K78621j8088l1089P5507Q2092L8706k76054
22090d39503k57206j32185j75535L59777P00734K28453J40727N57449l57357q28788
22080b03434R0799J46366k75274j04861M73545J11666j24305l11150k51893j1535
$$ plain form
22151 25242 200721 448450 675268 802773 477858 216189 155969 46311 -89886 -374069
22141 -374069 -353576 -119622 -468715 -1090067 -1253636 -641740 130381 482534 454128 484861
22131 484861 161867 -358584 -481646 -672044 -764002 -476183 -248900 -372094 -303583 -152397
22121 -152397 -163282 -119185 -89531 -363725 -489026 -812239 -1295606 -1096951 -775330 -556292
22111 -556292 -283294 -8751 43821 -171965 -395124 -250717 -146606 -91570 -5276 -211047
22101 -211047 -583327 -837793 -911197 -589198 -310577 -328665 -359754 -284247 -202155 -163449 -439503
22090 -439503 -696709 -828894 -1004429 -644652 56082 284535 425262 982711 625354 -203434
22080 -203434 -112635 33731 -241543 -346404 127141 238807 114502 -196648 -448541 -460076
22070d60076o0712K42970m1652K8927L39500R9398m6326N4314L83822L38496k48630
22059F30031M3327M7447j42408j09229r5556N0827j59103l69879j63532j72512
22049d40587m03284k27128p9576j22739N2831J91701L72201K44123k88200k6656
22039g27314K65362M08702K35566k20177l75582L298j18706m65760J32578M11394
22029d50639N96977M3782l69776k98842L4457K36344j76473k79593j4505L24086
22019c54182M87175J67258r8446m7219K14649J41712j505j13479m76268p9592
22009a59897K74090j01320l72779m6340K59665j16279q8690k17188j84253J73881
21999e79110K00463k0213R1927L29752m8213j97627m62503k45261N24878L43799
$$ plain form
22070 -460076 -520788 -277818 -319470 -290543 48957 148355 102029 156343 540165 878661 630031
22059 630031 673358 720805 578397 469168 373612 424439 265336 -104543 -268075 -440587
22049 -440587 -843871 -1070999 -1150575 -1273314 -1220483 -1028782 -656581 -412458 -700658 -727314
22039 -727314 -461952 -53250 182316 -37861 -413443 -410145 -528851 -994611 -862033 -450639
22029 -450639 146338 190120 -179656 -478498 -444041 -207697 -384170 -663763 -678268 -354182
22019 -354182 132993 300251 201805 154586 369235 510947 509442 395963 -80305 -159897
22009 -159897 114193 12873 -359906 -406246 -146581 -262860 -351550 -568738 -752991 -579110
21999 -579110 -378647 -398860 -306933 22819 -25394 -223021 -685524 -930785 -405907 -62108
21989f2108o9906j64203j9745n1932k48923k44439J42169J09205J23851J46170
21979c39861q9095J07758K28957k3642j79717m23264m01634k68373K13107K93013
21969h82751N4379K07380N41967L85998K83081j69179n35445l43532p6163j17752
21959f52017j59547K75072J79922j08378o3214K01492J36226r1300n21487o37266
21949a440497P2060L18867m04522k38747R9459M17520O48726J81166k89821M3319
21939e92470M17088M2989k83693l4922J77497J29049j4196J16912J07975q946
21929E7283k51644k02897K44328j1955l26461n16917P6348M31185K05810j40591
21919d35511m02556K1440L79844L32967Q7382j48729k88302k19630L4579L5874
$$ plain form
21989 -62108 -132014 -296217 -315962 -367894 -616817 -861256 -719087 -609882 -486031 -339861
21979 -339861 -428956 -321198 -92241 -115883 -295600 -718864 -1120498 -1388871 -1175764 -882751
21969 -882751 -828372 -620992 -79025 306973 590054 420875 -114570 -458102 -534265 -652017
21959 -652017 -811564 -536492 -356570 -464948 -528162 -326670 -190444 -281744 -803231 -1440497
21949 -1440497 -1368437 -1049570 -1454092 -1692839 -1593380 -1175860 -527134 -345968 -635789 -592470
21939 -592470 -175382 -132393 -416086 -451008 -273511 -144462 -158658 -41746 66229 57283
21929 57283 -194361 -397258 -152930 -164885 -491346 -1008263 -931915 -500730 -294920 -435511
21919 -435511 -838067 -816627 -436783 -103816 -16434 -165163 -453465 -673095 -638516 -602642
21909f02642L22937K85055P8347M9388j14393k56906k18253K81897N8209q2269
21899a98630M58984J07793j15226p8356o0341L1301m2881L9109j82839j73497
21889b14583K55029K40431P7734L98948N6663l48154k56940o2659j35614j0072
21879G83J05742n22428n23178L29508L39402Q0285j12785K45518L09938j71485
21869H1300k78683o82368k13468M18687J95757j96389r9610J6962N52822K70835
21859F5845Q5815K35524k39961o55915n04822k2124P4453L92817M30690J25464
21849a2214R1355l8377q2762j6354l04331k0492Q2537j06204K69674M00322J41351
21838D04505j97613J0872J89085m7954O1187J27952j89855p39521n87125K68880
$$ plain form
21909 -602642 -279705 5350 83697 133085 18692 -238214 -456467 -174570 -116361 -198630
21899 -198630 260354 368147 252921 174565 114224 145525 102644 141753 -41086 -214583
21889 -214583 40446 280877 358611 757559 814222 466068 209128 146469 10855 783
21879 783 106525 -415903 -939081 -609573 -270171 -189886 -302671 -57153 252785 81300
21869 81300 -197383 -879751 -1093219 -674532 -478775 -675164 -774774 -757812 -204990 65845
21859 65845 151660 387184 147223 -508692 -1013514 -1035638 -961185 -568368 -137678 -12214
21849 -12214 79141 40764 -41998 -58352 -362683 -383175 -300638 -406842 -137168 263154 404505
21838 404505 206892 217764 406849 358895 420082 548034 358179 -381342 -968467 -699587
21828f99587N28784k05805k83794K29050L42260m2779k85235M550o2843k88321
21818g63720j97095k91390j9880M4974K07767M87490K53341j03279k76834j83556
21808h42182l89772l16288O33782N33198L05655J89637j13520p9039L9264N198
21798c4067P8901L57155M05445n4924o26173m75802n36948l51528j79832J31349
21788a286424O12593J33117l425L72945N96500N5075j91251k89491j47928o5551
21778b13840l66682j97693L5906L00854J89370p4167m60417m17132p4040K91557
21768i86284L92240N45290L95770n8418j9539J85094L09236M5882j92353l72423
21758B44495m64777l54777q5148N4745J24575N00912P852l7095L9238j78840j00289
$$ plain form
21828 -699587 -170803 -376608 -660402 -431352 -89092 -131871 -417106 -412556 -475399 -763720
21818 -763720 -960815 -1252205 -1272085 -1227111 -1019344 -531854 -278513 -381792 -658626 -842182
21808 -842182 -1231954 -1548242 -914460 -381262 -75607 114030 510 -78529 -39265 -34067
21798 -34067 44834 401989 807434 752510 126337 -349465 -886413 -1237941 -1417773 -1286424
21788 -1286424 -673831 -540714 -544139 -171194 425306 480381 289130 -361 -148289 -213840
21778 -213840 -580522 -778215 -742309 -441455 -252085 -326252 -786669 -1203801 -1277841 -986284
21768 -986284 -594044 -48754 347016 288598 269059 454153 763389 809271 616918 244495
21758 244495 -220282 -575059 -660207 -605462 -480887 20025 27877 -9218 30020 -148820 -249109
21747b49109k48561k99960J32848K27196k98476l6339J63820j44908K5468L93141
21737c34880J46770j10872j86475K04336M35694J62363J23237J0340j25162m441
21727C20910J92100k5735m19231J12164K65673k26205l48348k09406k6620L2833
21717c31865j98302m32031p5661L91611L26419j35976N966r2224l01900L4297
21707h09666L49859J33888K7485L27069M42936J66061q6492l11696M5104K47882
21697E32430J34528K07703r3673l01124k06367m1691k86508m90709o8456J52088
21687d61779O9546K0648k40788J8069j37120k52635j14554L9415Q958p7441j39930
21676a267611l33428J47044L19957J59960K96121L37329j60139j40703p4537L5681
$$ plain form
21747 -249109 -497670 -797630 -664782 -437586 -736062 -772401 -608581 -753489 -728021 -334880
21737 -334880 -188110 -298982 -485457 -281121 154573 316936 440173 450513 325351 320910
21727 320910 513010 487275 68044 180208 445881 219676 -128672 -338078 -364698 -331865
21717 -331865 -530167 -962198 -1037859 -646248 -319829 -455805 -449839 -542063 -843963 -809666
21707 -809666 -459807 -325919 -298434 28635 471571 637632 551140 239444 284548 532430
21697 532430 666958 874661 780988 479864 273497 231806 -54702 -545411 -613867 -461779
21687 -461779 -392233 -371585 -612373 -594304 -731424 -984059 -1098613 -1059198 -1050240 -1127681 -1267611
21676 -1267611 -1601039 -1453995 -1134038 -974078 -677957 -340628 -500767 -641470 -716007 -680326
21666f80326l6962N5923K7952Q4792j30014k73439l2529k97604j1184R9149k10036
21655a404278J6736K10960L74460M76256M00767p8406k99226l37121j32113K81040
21645d90925M84285J62581q9647k24347k93768k79282j4624j47493J0343J40015
21635g42862J40587J99006L3661p5988j65594q9493N2234J84883L03933J78691
21625A9058R2583L07836j02768P2249J91290L6692r6508o4953j57671o13935j31594
21614d47721O50929j87297n92542k46494K34050Q1485l89885k83793J8858K26611
21604i35799J90704O5120j4786L8707J45932J56187j05433o4882J18140J4953
21594c91157O2080M11953K77423m27703n99075o76445k86604K68673M74706J79065
$$ plain form
21666 -680326 -717288 -661365 -633413 -548621 -678635 -952074 -984603 -1282207 -1293391 -1194242 -1404278
21655 -1404278 -1387542 -1176582 -802122 -325866 74901 -3505 -302731 -639852 -771965 -490925
21645 -490925 -6640 155941 66294 -158053 -451821 -731103 -745727 -893220 -882877 -742862
21635 -742862 -602275 -403269 -369608 -445596 -611190 -700683 -648449 -463566 -159633 19058
21625 19058 111641 419477 316709 388958 580248 616940 520432 455479 297808 -316127 -447721
21614 -447721 203208 15911 -576631 -823125 -589075 -507590 -897475 -1181268 -1162410 -935799
21604 -935799 -745095 -679975 -694761 -656054 -510122 -353935 -459368 -524250 -406110 -391157
21594 -391157 -329077 82876 360299 -67404 -666479 -1342924 -1629528 -1360855 -886149 -707084
21584g07084J23905K01535R252J09659J67293P4571k3944j50456l86941j18737
21574g00947K88624J37810j22159J71228K17666K33874r3369l74223k76095j51984
21564f69575j73540M232O20642L77480q2632M2013K73007J12786k93035n52483
21554c41105n1019N32782K04478j07993N7163p5743m65798m96582m0531J29940
21544f54408K49314M3660j11515l05217l44316k46520k44742O4422P20600O70079
21534a58643k29798k97743k0241K12798J53934M5220J19036j38361J01920K59771
21524D7893M9192L00470M01112J55388l59007j55384j86528l93626j11836M06911
21514A54585L99504n8150k12348J55896N49586L58372P91143R67156K84845l68787
$$ plain form
21584 -707084 -583179 -381644 -372392 -262733 -95440 -20869 -44813 -195269 -582210 -700947
21574 -700947 -412323 -274513 -396672 -225444 -7778 226096 132727 -241496 -517591 -669575
21564 -669575 -843115 -838883 -218241 159239 76607 118620 391627 504413 211378 -341105
21554 -341105 -392124 140658 345136 237143 294306 218563 -247235 -743817 -784348 -654408
21544 -654408 -405094 -361434 -472949 -778166 -1122482 -1369002 -1613744 -1549322 -828722 -158643
21534 -158643 -388441 -686184 -706425 -493627 -339693 -294473 -175437 -313798 -211878 47893
21524 47893 97085 397555 798667 954055 595048 439664 253136 -140490 -252326 154585
21514 154585 554089 495939 283591 439487 989073 1347445 2138588 3105744 3390589 3021802
21504C021802o0219K18335j8109J8049j57126p60550n58069m29058n69070n41653
21494A64332l37461k14405k59199l32815J05552J90056J45046N38330J86392r071
21484A76757L01589M49157K32537j17318j28619L1605j17021k9853N5307k03184
21474F50957l07940k86198P0709L28351M75558K40349M7090l90203m56160q0639
21464B91874J64117P0094J44065K01582k87435m69949l29916M0730L02913L46052
21454D74127N7269n10365l60431N3971l19176m93618j11325J10725J51459J14472
21444h32892N46378Q55925M33033J49556J65811l54777o34934l13438K6381K21861
21434B62904K50684j3107J08964K66939j04211M0489L22544L0349k27759N6666
$$ plain form
21504 3021802 2961583 3179918 3161809 3179858 3022732 2262182 1704113 1275055 705985 164332
21494 164332 -173129 -387534 -646733 -979548 -873996 -683940 -538894 -564 185828 176757
21484 176757 478346 927503 1160040 1042722 914103 945708 828687 798834 854141 650957
21474 650957 343017 56819 127528 455879 931437 1171786 1218876 828673 372513 291874
21464 291874 455991 526085 670150 871732 584297 114348 -215568 -174838 128075 474127
21454 474127 531396 21031 -339400 -285429 -604605 -1098223 -1209548 -1098823 -947364 -832892
21444 -832892 -286514 569411 1002444 1152000 1317811 963034 328100 14662 41043 262904
21434 262904 513588 500481 609445 876384 772173 812662 1135206 1165555 937796 994462
21424I94462M3646k93972k71731j47171K49926J21048l65438k73941K09788K05138
21414D71755J45467N307k47972n0501k7888L44329L01550M00390L33568N78953
21404B254958N90310K01508N7141L86412L77783m73177p44523n62208n75563n29820
21394I82821k03788Q7711j16187K0416K94296j5063k24121k68819j22213J64801
21384E99854K63641J29140k54147l68056j32469l40025o53475k22819L22925J59315
21374d96116j03076k95555j23867K59655L18356L85733N05738L00773P5207M8130
21364H74978k51598k5847l3708j65263n5559J29947M14398N08430J49781l03091
21354A242468l96624j05178k80227m89215k81237M9582K91952J16464K35123J54602
$$ plain form
21424 994462 1038108 744136 472405 325234 575160 696208 330770 56829 266617 471755
21414 471755 617222 622529 374557 324056 296168 640497 942047 1342437 1676005 2254958
21404 2254958 2845268 3046776 3103917 3490329 3868112 3394935 2650412 2088204 1512641 982821
21394 982821 779033 866744 750557 770973 1065269 1050206 826085 557266 435053 599854
21384 599854 863495 992635 738488 370432 237963 -102062 -755537 -978356 -655431 -496116
21374 -496116 -599192 -894747 -1018614 -758959 -440603 -54870 450868 751641 826848 874978
21364 874978 623380 597533 563825 398562 343003 472950 887348 1395778 1545559 1242468
21354 1242468 845844 740666 460439 -28776 -310013 -260431 31521 147985 383108 537710
21344E37710q1748J86348j67614m78122m15532m0658J46106K10648M08569M97894
21334H03601K69079R9711o9540j94633j13386J58018j5982k26128j74200j90850
21324C45690k0279k7206j26806q6099p9644k0317l3865L9867J54437k06372n3026
21313a13620j71713k27800N0464k07111J12658N71015J29986j98003k6416k02923
21303b83463j71299K6643m8873m47529j24731N56629R25914N90365m61439o83401
21293a21184j49996L44409R0542p09L05850Q348k96453J60508L80768K65324k23231
21282G64176k22857n4749m5107K33632j7700K395O1160J0665K9831J87574J32289
21271A081309J2990k34231l08831J58356M76431K77172L65449N68775L42185K60628
$$ plain form
21344 537710 455962 642310 474696 -3426 -418958 -459616 -313510 -102862 305707 803601
21334 803601 1072680 1172391 1102851 908218 794832 952850 936868 710740 536540 345690
21324 345690 325411 298205 171399 85300 5656 -14661 -48526 -8659 145778 -60594 -113620
21313 -113620 -285333 -513133 -462669 -669780 -557122 13893 143879 -54124 -80540 -283463
21303 -283463 -454762 -428119 -476992 -924521 -1049252 -492623 433291 1023656 562217 -121184
21293 -121184 -271180 73229 163771 163062 468912 477260 180807 341315 722083 987407 764176
21282 764176 541319 486570 441463 675095 657395 659790 720950 731615 761446 949020 1081309
21271 1081309 1094299 860068 551237 709593 1186024 1463196 1828645 2397420 2739605 3000233
21261C000233J32047m79578k53691j1310j95131k28470m24956o49881k9638K92935
21251A152560J84729j23705l36274l51371J78388M03300L58352J97879k9839J8526
21241A652545p9937j14933J71068J51068j92742k817J38143J85493L08080N75298
21231B791266O39425N28157L04068J19427j84247k10709J91412L14286r18n2134
21221D440033J1517l468O862J8417R4521p4008K4108L76340M35050L34739J67632
21210E831743L32808M42698O98819L85335J55029Q20738J291234J465058J633765
21201A3057227J802351J998753K570277L461183M636103N945016P637766J0387475
21193E1496151J5546523K2473498L2182912M6833251O9460458R5716602R7404961
$$ plain form
21261 3000233 3132280 2652702 2399011 2387701 2192570 1964100 1539144 889263 859625 1152560
21251 1152560 1337289 1213584 877310 525939 704327 1107627 1465979 1663858 1634019 1652545
21241 1652545 1572608 1457675 1628743 1779811 1587069 1584252 1722395 1907888 2215968 2791266
21231 2791266 3430691 3958848 4262916 4382343 4198096 3987387 4178799 4493085 4492167 4440033
21221 4440033 4451550 4448082 4454944 4473361 4567882 4493874 4517982 4894322 5329372 5664111 5831743
21210 5831743 6164551 6607249 7306068 7691403 7846432 8667170 9958404 11423462 13057227
21201 13057227 14859578 16858331 19428608 22889791 27525894 33470910 41108676 51496151
21193 51496151 67042674 89516172 121699084 168532335 237992793 333709395 431114356
21186D31114356K9451096o9331137j02680997q1896324n5824681l7528864k6232565
21179H7070884j8111531j2071888q156929n474162l234951r90463Q74436J932300
21171D1837696L147611M901601Q040354J3376899K0929849K7171529L0045111
21164A49450650L3337497L0757964J1657510l19443l274381k2665250l5705562
21157A63238985l1057433k8657584k6648813k0306532j4156214r791158o688757
21150B5932494m776396l624007k453422j922494j677403j249644r43072j051635
21142H234421q84178n75983k66218l44804n82961o30929j99206O8279j88277j91853
21132D438291J6539L74680K34479Q4014R4741l30958n38335l28651n27520r3631
$$ plain form
21186 431114356 460565452 391234315 288553318 206656994 150832313 113303449 87070884
21179 87070884 68959353 56887465 48730536 43256374 40021423 39030960 39905396 41837696
21171 41837696 44985307 49886908 57927262 71304161 92234010 119405539 149450650
21164 149450650 182788147 213546111 225203621 224884178 221609797 198944547 163238985
21157 163238985 132181552 103523968 76875155 56568623 42412409 32621251 25932494
21150 25932494 21156098 17532091 15078669 13156175 11478772 10229128 9286056 8234421
21142 8234421 7350243 6774260 6508042 6163238 5580277 4949348 4750142 4818421 4630144 4438291
21132 4438291 4454830 4829510 5063989 5148003 5242744 4911786 4373451 4044800 3517280 3423649
21122C423649j24820l30963k93889K420j88567q0611J95069l8686N40672R21483
21112D025757N42360j34727l94359o05642r25227o26156p4293j6024J3960Q0817
21102A886466L5981j93753l18070k56779j73767j18919k80990J16412N04684K98081
21092A499346o4556k83160o4463m0376R7721K88050O98248O68861M99324J84610
21082C483605m17011k11725j518N1187M8742j84252l15052k07271j76564K6354
21072B096495l08340j61017J94119r667R4505L4081l75465m91644k63431n4769
21062G54867L34186J01470n27458j61185K26108r6109k29008J78179N54451N70291
21052A705792N29454O20754Q63196J247441J550553J018778n71514j474083j288507
$$ plain form
21122 3423649 3298829 2967866 2673977 2676397 2487830 2407219 2602288 2563602 3104274 4025757
21112 4025757 4568117 4433390 4039031 3433389 2508162 1882006 1807713 1791689 1805649 1886466
21102 1886466 1922447 1728694 1410624 1153845 980078 861159 580169 696581 1201265 1499346
21092 1499346 1434790 1151630 1087167 1046791 1144512 1432562 2130810 2799671 3298995 3483605
21082 3483605 3066594 2854869 2853351 2904538 2953280 2769028 2453976 2246705 2070141 2096495
21072 2096495 1788155 1627138 1821257 1811590 1906095 1940176 1564711 1073067 809636 754867
21062 754867 1089053 1190523 663065 501880 727988 631879 402871 581050 1135501 1705792
21052 1705792 2235246 2856000 3719196 4966637 6517190 7535968 6964454 5490371 4201864
21043D201864q22639j90622N0047j13173k49418j35759L69372L45775L43146O88806
21033D487399O25791K91859l45870r82848r60839n42964k20087k51216l72049
21024A729176l30348k00030j86519l49686j61332K38512O4430k51332l34907k44287
21014b6323K51125N2380J3065L64840k25562n24226q6282L45295j4077j87732
21004c7497p3936j6417O1684J27806M4792J78096K13010j45071l46929j53906
20994a48368R7729j36105K0305K9971j36978K9558J82256K22755M4024j41653
20984F3494l45239j66396L4267j3161l4580J44456K03334K09132K0444k39666
20974a23915k39893Q4345J20853j52568o2567L03991M05758Q5008l0967j12744
$$ plain form
21043 4201864 3379225 3188603 3238650 3125477 2876059 2740300 3109672 3455447 3798593 4487399
21033 4487399 5113190 5405049 5059179 4076331 3115492 2572528 2352441 2101225 1729176
21024 1729176 1398828 1198798 1012279 662593 501261 739773 804203 552871 217964 -26323
21014 -26323 224802 277182 290247 655087 429525 -94701 -180983 164312 150235 -37497
21004 -37497 -111433 -127850 -66166 61640 106432 284528 497538 352467 5538 -148368
20994 -148368 -50639 -186744 -166439 -136468 -273446 -243888 -61632 161123 205147 63494
20984 63494 -281745 -448141 -413874 -427035 -461615 -317159 -113825 95307 115751 -123915
20974 -123915 -363808 -279463 -158610 -311178 -373745 -69754 336004 421012 390045 277301
20964B77301k0910K7334N3232j07309k4043L64989K64043n6531j34222K9249J73761
20953H46894o3474k55971J35224Q2464j52420M7935j74999j30056j05449k71985
20943d1837k91372k27960j5348j96789r4873K01575M77998J05413j588J52907
20933F8126p4154l33979J85710K62194J25587j55056n28743l77714j56019R8945
20923h85103n3243O2731M54096J046168O38038K41757J54816l7515l90621l53521
20913H77603k90213l48489l17885K21061K89746m14609l16137K00088L81710j85311
20903I7564m00582k5589j60221j31816j64973J95332M41145j42791j5533L74408
20893F6944K80778R1436J52252l70238m73019m33820l31627L08428L08336K27047
$$ plain form
20964 277301 256391 283725 336957 229648 205605 570594 834637 778106 643884 673133 846894
20953 846894 783420 527449 662673 745137 592717 640652 465653 335597 230148 -41837
20943 -41837 -333209 -561169 -576517 -773306 -868179 -666604 -188606 -83193 -84781 68126
20933 68126 -6028 -340007 -154297 107897 233484 78428 -450315 -828029 -984048 -885103
20923 -885103 -938346 -875615 -421519 624649 1262687 1504444 1659260 1621745 1231124 877603
20913 877603 587390 238901 -78984 142077 431823 17214 -298923 -98835 282875 97564
20903 97564 -303018 -328607 -488828 -620644 -785617 -590285 -149140 -291931 -307464 66944
20893 66944 347722 439158 591410 221172 -251847 -685667 -1017294 -708866 -400530 -173483
20883a73483K05016n3208k31913m61372l31622p63J21555J64406P4077L1229L5456
20872f20622k15635l9069J11108J63590L28805K02276J86868j47663n18888m0917
20862e90147L54957L91817M7511l70859j95338K05714K06742j93511j25646R7517
20852a71243K6831r2559k4932k7636J43349M93187L09757J23797j61864m81075
20842A37612l97305k63063j45006J99824J74390J20315J33378J41693n910N0338
20832A46266R8101J45424O02822K26218j18161j60829r5304K044J70562k53658
20822G63485k65135J10188J88603k21772k92512n28884k72837j48620j93765k75499
20812a136748m82511k19466M72857O79264L02831J39175L20972L04362L06617
$$ plain form
20883 -173483 31533 -21675 -253588 -714960 -1046582 -1047345 -925790 -761384 -687307 -656078 -620622
20872 -620622 -836257 -875326 -764218 -600628 -271823 -69547 117321 -30342 -549230 -590147
20862 -590147 -235190 156627 204138 -166721 -362059 -156345 50397 -143114 -268760 -171243
20852 -171243 -144412 -236971 -261903 -289539 -146190 346997 656754 780551 618687 137612
20842 137612 -259693 -522756 -667762 -467938 -293548 -173233 -39855 101838 95928 146266
20832 146266 244367 389791 992613 1218831 1100670 939841 844537 846581 1017143 763485
20822 763485 498350 608538 797141 575369 282857 -246027 -518864 -667484 -861249 -1136748
20812 -1136748 -1619259 -1838725 -1365868 -686604 -383773 -244598 76374 380736 687353
20803F87353K34535N43464M73835k09560m19205k16076K5270R5045L4990M1748
20793A291399N2496J70310N9826J60373J10989n4831m28591j50185L18273j32535
20783A397524k17489j13170J5670J52622l65917m21471K24392L23918K70976Q8204
20773A355259N0472M4340J62354q6974l63422k30833m6482J58396M71039M41877
20763A956026K85054K79399R15551J084316N82884K0587q08123j065598q00291
20754B449805l36049j85696P6254L44722J15240r8848m5059k1714K9371L32969
20744B660995J94221K03045j98924l09824J39880J74378m29569k95157K23269
20735B362314L05691J29225j6638K34489O50823Q26310P38347L92168O28886Q46758
$$ plain form
20803 687353 921888 1465352 1939187 1729627 1310422 1094346 1119616 1214661 1249651 1291399
20793 1291399 1343895 1514205 1574031 1734404 1845393 1790562 1361971 1211786 1530059 1397524
20783 1397524 1180035 1066865 1082535 1235157 869240 447769 672161 996079 1267055 1355259
20773 1355259 1405731 1450071 1612425 1525451 1162029 931196 884714 1043110 1514149 1956026
20763 1956026 2241080 2520479 3436030 4520346 5103230 5123817 4315694 3250096 2449805
20754 2449805 2113756 1928060 2004314 2349036 2464276 2365428 2320369 2298655 2328026 2660995
20744 2660995 2855216 3058261 2859337 2549513 2689393 2863771 2434202 2139045 2362314
20735 2362314 2668005 2797230 2780592 3015081 3665904 4492214 5230561 5622729 6251615 7098373
20725G098373J329097J322245K016461K474309K501957K853390M300594O295184
20717C0191610R812908J4764261K2025637L3931902N4081803P0951478M6575154
20710B82334753l1006735p3132656n6811821l6440616k3370374j5903739j0588067
20703C5080745p297294m604464l487356l265485l435626k722799j706882j143120
20695G417719q55175l48267m87838n48424o82605k19674L68152K50530m65778
20686D428640m67828k71838l23755m48323m47048n19147n25355O5198L41578j11139
20676A720983k40088l28734k50288j22428m84599j49334L04911K28185K75843
20667I54451L37743J15939l28325J19599K50455j65338l1545O2816k14295j34831
$$ plain form
20725 7098373 8427470 9749715 11766176 14240485 16742442 19595832 23896426 30191610
20717 30191610 40004518 54768779 76794416 110726318 164808121 235759599 282334753
20710 282334753 251328018 178195362 121383541 84942925 61572551 45668812 35080745
20703 35080745 27783451 23178987 19691631 16426146 12990520 10267721 8560839 7417719
20695 7417719 6562544 6214277 5726439 5178015 4495410 4275736 4643888 4894418 4428640
20686 4428640 3960812 3688974 3365219 2916896 2469848 1950701 1425346 1490544 1832122 1720983
20676 1720983 1480895 1152161 901873 779445 294846 145512 450423 678608 954451
20667 954451 1292194 1408133 1079808 1199407 1449862 1284524 1252979 1315795 1101500 966669
20657I66669k84920j17363L54824J89533j09546J06022n1277m11283n50862l11284
20647b19487M3419L33181M7861N7582J44941K09647M08176L48147K37005K38131
20637A848603j30654k34236m66675k57150k07097j30848M49585N34761P5673J2419
20627A494381j6133j27334j86622p0156L32047M70151J1328J55410k53674o81997
20617A127401n40333P4407r1963k84805k52537J58185P39755K62917l32151k73777
20607E87099K71421M37276J83246l26951r2511K65949L45585L83646M40266O3112
20597B558138n04899l07853m41892n12423k69258R868k20643k34868r6500L66876
20587C46546N66139N31019K34263l42694j23748K26181j00802j82956J87207j65778
$$ plain form
20657 966669 681749 564386 919210 1108743 999197 1105219 1053942 642659 91797 -219487
20647 -219487 -176068 157113 204974 262556 407497 617144 1025320 1373467 1610472 1848603
20637 1848603 1717949 1483713 1017038 759888 552791 421943 871528 1406289 1481962 1494381
20627 1494381 1478248 1350914 1164292 1094136 1426183 1896334 1907662 2063072 1809398 1127401
20617 1127401 587068 661475 569512 284707 32170 190355 930110 1193027 860876 587099
20607 587099 858520 1295796 1479042 1152091 1059580 1325529 1671114 2054760 2495026 2558138
20597 2558138 2053239 1745386 1303494 791071 521813 531681 311038 76170 -20330 346546
20587 346546 912685 1443704 1677967 1335273 1211525 1437706 1336904 1153948 1341155 1175377
20577A175377k99349R7892K97895K68256J85911p071j75965R7830J30550l31894
20567A439432j23696L4449J35784Q4504k61661j91939k87591q5485R1151K09425
20557A044373L3953J29554P3591J65898k08821n01677l75750l62685P9814L86485
20547D64735L28099K64977J02098J94924R5328P7609q9167q8329O4233J11424
20537A525931P6139K68528J85991N4285L24041K79540j23288k8155K28020N79621
20527C370653K35816M30830R41385J174926O71025P12504N23718N44213Q60863
20518I465933J618981K199802L644714M386321N114337O608262R351074J3525641
20510E5915065K1404754L3264752N2580231P8648224Q4979401J6185196p1888578
$$ plain form
20577 1175377 876028 973920 1271815 1540071 1725982 1718911 1542946 1640776 1771326 1439432
20567 1439432 1315736 1350185 1485969 1570473 1308812 1116873 829282 743797 834948 1044373
20557 1044373 1078326 1207880 1281471 1447369 1238548 736871 361121 -1564 78250 464735
20547 464735 792834 1057811 1159909 1354833 1450161 1527770 1438603 1350274 1414507 1525931
20537 1525931 1602070 1870598 2056589 2110874 2434915 2714455 2591167 2563012 2791032 3370653
20527 3370653 3606469 4037299 4978684 6153610 6824635 7537139 8060857 8605070 9465933
20518 9465933 11084914 13284716 16929430 21315751 26430088 33038350 42389424 55915065
20510 55915065 77319819 110584571 163164802 241813026 326792427 342977623 271089045
20503B71089045q1396422n7277575l8389676k5849355j7399296j1867353q361082
20496C0548286n772975l588036k985794l313588k851004j804710j491620j444450
20488G296109j313641r50410k31384r0009p1604r9049o70080o16873k74751r6520
20478B881788l60354j69265j31841l09323m85372l03425l32185l84286k45183
20469A60554j03907K20390K74637J00961L9888M1523J6454j93912o102N608M3527
20458E99621P0413k57975j8760M3123m08773j57325J30064K0965k36870k00535
20448d16052k48903j46954O72302P41560M48187J90023Q460j725k78175j01372
20438H67351L11907L3645j23159K91778J80370k58250l35062l52583l87188o42807
$$ plain form
20503 271089045 189692623 132415048 94025372 68176017 50776721 38909368 30548286
20496 30548286 24775311 21187275 18201481 14887893 12036889 10232179 8740559 7296109
20488 7296109 5982468 5032058 4800674 4710665 4639061 4540012 3869932 3253059 2978308 2881788
20478 2881788 2521434 2352169 2220328 1911005 1425633 1122208 790023 405737 160554
20469 160554 56647 277037 551674 652635 692523 734046 750500 556588 550486 556094 599621
20458 599621 670034 412059 393299 436422 27649 -129676 388 21353 -215517 -416052
20448 -416052 -664955 -811909 -139607 601953 1050140 1240163 1248623 1246898 968723 867351
20438 867351 1179258 1212903 1089744 1381522 1561892 1303642 968580 615997 228809 -413998
20428d13998m91220M36081Q26304J85967L3396J45420J79537j11785m92829l59561
20418f2688L510j74888k30276K21885R17576R96548N27913J20207m70625o53310
20408A195852j12279l04398m41249j28271J15970M6583j09125L5482m2600N5381
20398C11346j32028k76631k25427k22357j96995j86585j98717K61706L89234L68088
20388a08366M84340L18698K9112r2020m4416Q5381L4305q2450k22863l61634k25051
20377a84964J72411J93025J85266J10208j77315n36884k08036N2757j5964L7192
20367c72304j08340Q1101N56609N28281M8306o4508l1885J72258j35471j99559
20357D74488K86234M28223j96186k69962k80777l79493R900j31429k56723J55016
$$ plain form
20428 -413998 -905218 -469137 357167 543134 576530 721950 901487 789702 296873 -62688
20418 -62688 -59178 -234066 -464342 -242457 675119 1671667 2199580 2319787 1849162 1195852
20408 1195852 1083573 779175 337926 209655 325625 372208 263083 298565 255965 311346
20398 311346 179318 -97313 -322740 -545097 -742092 -928677 -1127394 -865688 -476454 -108366
20388 -108366 375974 694672 723784 631764 587348 672729 707034 624584 401721 40087 -184964
20377 -184964 -12553 180472 365738 475946 298631 -238253 -446289 -393532 -409496 -372304
20367 -372304 -480644 -399543 157066 685347 733653 669145 637260 809518 674047 474488
20357 474488 760722 1188945 992759 722797 442020 62527 72427 -59002 -315725 -160709
20347a60709J43215j52397k23663J84188K8054m9519m1996l57851m21246l876
20337a055800M00624L15108O6465j01058J8456M7324K7984R2047Q0486L00258
20327A91894j19151l46603k29885N40333O52385j75606p30384n17069J28431M01836
20317b03819M61128Q3986k66267l73733l60478L589n6611j29519J31083L53933
20307c56708K07781K54777K64033K34375K40915n6629n82571n04274r6980n3944
20297d49225Q7854L11437K89715L6547l14774j31020P8180J15295o8976j69501
20287b14468j62012k60994k5719q4008j22987m8632N4876k05046k73370N7159
20277a285201o3796j58640Q5966L23951J28223o0549J62475K40824L15469L10579
$$ plain form
20347 -160709 -17494 -169891 -393554 -209366 -181312 -230831 -272827 -630678 -1051924 -1055800
20337 -1055800 -655176 -340068 -273603 -374661 -356205 -308881 -280897 -188850 -108364 191894
20327 191894 72743 -273860 -503745 36588 688973 513367 -217017 -734086 -605655 -203819
20317 -203819 257309 341295 75028 -298705 -659183 -655594 -712205 -841724 -710641 -356708
20307 -356708 -148927 105850 369883 604258 845173 788544 205973 -298301 -395281 -449225
20297 -449225 -361371 -49934 239781 276328 -38446 -169466 -91286 24009 -44967 -214468
20287 -214468 -376480 -637474 -663193 -747201 -870188 -918820 -863944 -1068990 -1342360 -1285201
20277 -1285201 -1348997 -1507637 -1421671 -1097720 -969497 -1030046 -867571 -626747 -311278 -699
20267f99p2818m77304m96003J03480J73249K55788N16239N85885L48479J47030
20257A083326n821o1186j40158l72524k73240M1635K40298J55007q4101k94087
20247B89149l85896l55741j0252K65847J94149o4321J56888K05305O3070J94019
20237E52217L12090J04171r4578m94061m13138K7596L13399M34523q2565N0708
20227G10362R5387r0660j96139k16707J24192K36472k25721p06717n09659N1403
20217g27787k5741K6447r0701N8829L43131K3679J67236K9403k00692k25762J07641
20206e14317M05067L92035J46030k64001j61570K50383K96606j34134k20725k92438
20196i7064k22189J20763K18413L16741k71889l87347m4679r1027J0798N35720
$$ plain form
20267 -699 -73517 -550821 -1046824 -943344 -770095 -514307 1932 587817 936296 1083326
20257 1083326 1077505 1016319 876161 503637 230397 272032 512330 667337 583236 289149
20247 289149 -96747 -452488 -462740 -196893 -2744 -67065 89823 295128 358198 552217
20237 552217 864307 968478 873900 379839 -33299 -5703 307696 742219 659654 710362
20227 710362 805749 715089 518950 302243 426435 662907 437186 -269531 -779190 -727787
20217 -727787 -753528 -727081 -817782 -758953 -415822 -392143 -224907 -195504 -396196 -621958 -514317
20206 -514317 -109250 282785 428815 164814 3244 253627 550233 416099 195374 -97064
20196 -97064 -319253 -198490 19923 336664 64775 -322572 -367251 -458278 -447480 88240
20186H8240K31320l21206j24402O57272L05644k58065m17260l85583j51225j22544
20176d97809l67044j58848K47589M03835J10183O8510L05518J95305Q103j93205
20166A22137n25983l67909L28205N63632K17466k56529k77714j7897J00650l3564
20156a47506k48340k17263O1653L8727j70421J45764L74384J7386r2324K1551
20146b16389J35599K85300k8062l1140L09383N85144M02321M0771L2669l14447
20136A201149l96828l53267k25684j78182k70434J18669K59991q1467l6303n435
20126C2209K43133K38829J34794K10894K12112k33085k86210O4323K68453K87244
20116A172696k20349m53722p6828n3877m74461l02570J83029M36686L14396M2397
$$ plain form
20186 88240 319560 -1646 -126048 531224 836868 578803 161543 -224040 -375265 -497809
20176 -497809 -864853 -1023701 -776112 -372277 -262094 -193584 111934 307239 315342 122137
20166 122137 -403846 -771755 -443550 120082 337548 81019 -196695 -214592 -113942 -147506
20156 -147506 -395846 -613109 -551456 -512729 -683150 -537386 -163002 -145616 -237940 -216389
20146 -216389 -80790 204510 176448 145308 454691 1039835 1442156 1482927 1515596 1201149
20136 1201149 804321 451054 225370 47188 -223246 -104577 155414 73947 37644 32209
20126 32209 275342 514171 648965 859859 1071971 838886 552676 616999 885452 1172696
20116 1172696 952347 498625 421797 367920 -106541 -409111 -226082 210604 525000 567397
20106E67397r073k04342l19302L9069J94446P8884M3422K30919L92592L45618
20096A359630Q57104J100546J240833J844822L104475M282238L358370j70909
20088A6977109l504567l870581k847180j714184j144266o34201n44051p18765
20080A999314j67364J72398k34386m50322m67477k12142m5905N3290K4833K94520
20070I66759M62442j57998n39378k23104n30416m48882J06912J10229j19584l5801
20060d08821j27916j48873J36338L56443N12700M14433O9138O7376J99563L28282
20050A398663J51550m08899k90642k04741k09860j14628k14560k20439l1621J1107
20040a34070k67137O7634N30681Q6190j4831L91073K58932R0872l04838n48113
$$ plain form
20106 567397 558324 353982 34680 73749 268195 347079 390501 621420 1014012 1359630
20096 1359630 2216734 3317280 4558113 6402935 9507410 13789648 17148018 16977109
20088 16977109 13472542 9601961 6754781 5040597 3896331 3262130 2718079 1999314
20080 1999314 1831950 2004348 1769962 1319640 852163 640021 594116 647406 672239 966759
20070 966759 1429201 1271203 731825 508721 -21695 -470577 -363665 -253436 -373020 -408821
20060 -408821 -536737 -685610 -549272 -192829 319871 734304 803442 870818 1070381 1398663
20050 1398663 1550213 1141314 850672 645931 436071 321443 106883 -113556 -145177 -134070
20040 -134070 -401207 -333573 197108 283298 268467 659540 918472 1009344 704506 156393
20030A56393j39114K08939J36615O3046p9787m4227K07856K86322j52026n92442
20020E1575k76205K94640L95516K96489K19409J92621k38214m42090K39731K13228
20010I46700P6383l8103k12664l38873m00209k522N94102O59517N53090K23858
20000B061279J5116m44327k19200K59061M35383J74902l5009M14351J158340K24954
19990D044850j072482k91321L72301O26877N38400R4674r12867j064342m19659
19981A916431l48958J6653N9241j64611l52737q7823N08785N57917M880j43055
19971A966723j52867N6065k74319m41313m9654N30593O27008L99411r910K31649
19961B883386j07631n26347o45246n26170k49076O94q9190J64380L35698K38674
$$ plain form
20030 156393 17279 226218 362833 425879 346092 301865 509721 796043 644017 51575
20020 51575 -224630 70010 465526 762015 981424 1174045 935831 493741 733472 946700
20010 946700 1023083 984980 772316 433443 33234 30712 624814 1284331 1837421 2061279
20000 2061279 2076395 1632068 1412868 1671929 2107312 2282214 2247205 2661556 3819896 4044850
19990 4044850 2972368 2681047 3053348 3680225 4218625 4313299 3400432 2336090 1916431
19981 1916431 1567473 1584126 1643367 1478756 1126019 1038196 1546981 2104898 2109778 1966723
19971 1966723 1813856 1869921 1595602 1154289 1104635 1635228 2262236 2661647 2651737 2883386
19961 2883386 2775755 2249408 1604162 1077992 828916 829610 740420 904800 1240498 1479172
19951A479172K6385j05691n2930j56786K07953N96828L54936L14502j17880l90420
19941B156069k37130R8702L13705N48631O82697M61669k62677l00157J63861M24406
19931D049776L89266J065509J204899J136044O69687k43901j136124q72941k62947
19922E999268o6679j86128k469K11136N52541Q80905J418398J504578K014132
19913A2325682K452506K781753K990096M691603P101540J0547276J5769474K4010281
19905H2670211L7682278O1616529Q6747284P5621028j2412743r0426506q1838742
19898A59659339n1999185l1914258k0446207j3628582r731106o847174m517085
19891B0575742k758455k651531k410981k317301j726809j723824j134654o82912
$$ plain form
19951 1479172 1505557 1399866 1346936 1190150 1398103 1994931 2349867 2664369 2546489 2156069
19941 2156069 1918939 2017641 2331346 2879977 3562674 4024343 3761666 3461509 3625370 4049776
19931 4049776 4439042 5504551 6709450 7845494 8515181 8271280 7135156 6262215 5999268
19922 5999268 5932589 5746461 5743992 5955128 6507669 7388574 8806972 10311550 12325682
19913 12325682 14778188 17559941 20550037 25241640 32343180 42890456 58659930 82670211
19905 82670211 120352489 181969018 268716302 344337330 331924587 241498081 159659339
19898 159659339 107660154 75745896 55299689 41671107 31940001 25092827 20575742
19891 20575742 17817287 15165756 12754775 10437474 8710665 6986841 5852187 5169275
19883E169275n00967p93343q37002l96115K8968O669R030m16295j96785l1345
19873B042090l07153n39468j15786J60828p8557j52537p9647J68434L90608K03142
19863A691954J1901J50559j12680m86261k09889J74197j65489l96466k31142j89375
19853B37309N17363M22800J2513k23766l76269j40562O166O9467L91767L59531
19843A276319Q1669L17229O11763M78491J36951j87008o76474o29582l7890L4597
19833A406065L36536P23194P12356L13818J96084j32654m39137n50825l87384
19824B178053m13483q7129L53082M00871j77252n77486j85518l25718k73913Q5717
19814I77224K66892l25201k55119j02092M0737K44691J74959k20922k66946l3750
$$ plain form
19883 5169275 4668308 3874965 3037963 2641848 2670816 2677485 2686515 2270220 2073435 2042090
19873 2042090 1734937 1195469 1079683 1240511 1161954 1009417 929770 1098204 1488812 1691954
19863 1691954 1703855 1854414 1741734 1255473 1045584 1219781 1054292 657826 426684 237309
19853 237309 754672 1177472 1189985 966219 589950 449388 455554 525021 916788 1276319
19843 1276319 1357988 1675217 2286980 2765471 2902422 2715414 2038940 1409358 1371468 1406065
19833 1406065 1742601 2465795 3178151 3491969 3688053 3555399 3116262 2565437 2178053
19824 2178053 1764570 1677441 2030523 2431394 2254142 1676656 1491138 1165420 891507 977224
19814 977224 1244116 918915 663796 561704 602441 847132 1022091 801169 534223 500473
19804E00473j687L1963J43932K63480J60272j82278m19624r9672k37688l92350
19794b33179j12928J74928L14765N17135K54935k43655k63966l64685J13512M07961
19784E64823j54174m58288k2161K67187r9015k24919J37977J07168J69930k6986
19774B61542l09374l41714k587L15117K48891J57928j5024J371j39715k60436
19764h4001j68930k55322k40927N3546M3369J3541M0505K827q1047j7474J18720
19753e75193k45568k4857L97511K03408l40144k05967M6302L08650L50872J35727
19743E0741L8557l37692L1618K33621r4443m17509j1814j7165k17158J19659J41799
19732d79786J00429J19475K12420L30307J07737J74238J75183Q2386k683m14657
$$ plain form
19804 500473 498786 530749 674681 938161 1098433 916155 496531 396859 159171 -233179
19794 -233179 -346107 -171179 143586 660721 915656 672001 408035 43350 156862 564823
19784 564823 410649 -47639 -69800 197387 98372 -126547 11430 118598 288528 261542
19774 261542 -47832 -389546 -392133 -77016 171875 329803 314779 316150 176435 -84001
19764 -84001 -252931 -508253 -749180 -695634 -652265 -638724 -598219 -595392 -676439 -693913 -575193
19753 -575193 -820761 -845618 -448107 -244699 -584843 -790810 -744508 -435858 -84986 50741
19743 50741 89298 -248394 -216776 16845 -77598 -495107 -506921 -524086 -741244 -621585 -479786
19732 -479786 -379357 -259882 -47462 282845 390582 564820 740003 822389 819706 405049
19722D05049m42502L34974N44108l3575k55076o2096J48395j26949k41235P7443
19712C48536Q8024k05948m98487n89178l53743l10353J78161O06526N36222j19064
19702c19304r8610L99500J59578q5223P5760k18772j55028j28216J17443p3923
19692c26795q7813K64373J22042j33763p5044L62250P17321j08020n2022m7053
19682F35476n09478n2195K77123L16291n7983q697K80837N26399M04496q4346
19672A727923j73758k39302k89587j02622J10883P1064L63102K29317O5965M08109
19662B171094L68671l35509n43797l49615l3497l91664j440M14195L97285L09139
19652B004862k51710m64915l83581l34135M3145N1064q2063j28515q231J10541
$$ plain form
19722 405049 -37453 297521 841629 808054 552978 490882 639277 512328 271093 348536
19712 348536 436560 230612 -267875 -857053 -1210796 -1521149 -1342988 -736462 -200240 -319304
19702 -319304 -417914 -18414 141164 55941 131701 -87071 -242099 -370315 -252872 -326795
19692 -326795 -414608 -150235 -28193 -161956 -237000 125250 842571 734551 682529 635476
19682 635476 125998 73803 350926 667217 609234 600537 881374 1407773 1812269 1727923
19672 1727923 1554165 1314863 1025276 922654 1033537 1104601 1467703 1697020 1762985 2171094
19662 2171094 2539765 2204256 1660459 1310844 1277347 885683 884243 1298438 1695723 2004862
19652 2004862 1753152 1288237 904656 570521 613666 664730 582667 454152 445921 556462
19642E56462L14178K1381j45787j04904K88296n9558j68885J80993k729m55339
19632D24108p6279J33764J09234n6501L01388K52126J82734K73967J04480k53339
19622A395682P149J6423J37348M28343P88487K15857L04547J84036M60736N21549
19612D460157N02420Q0302L99048R69202J821592J996170K717375L344577M151734
19603B0442577N594733Q552506J2244127J8209978K7975143M5176227O6489161
19596B04684452O4845429k204130o8889171o3796545m0669833k6042107j7575501
19589E0352594j1808917q230636n421630l866349k198331k159159k805968k517815
19581A1343789j930049j901166j428929r58494q02616o32590j98759k75791l59359
$$ plain form
19642 556462 870640 892021 746234 641330 929626 870068 701183 882176 879447 424108
19632 424108 347829 481593 590827 534326 835714 1087840 1270574 1544541 1649021 1395682
19622 1395682 1402831 1419254 1556602 1984945 2773432 2989289 3293836 3477872 3938608 4460157
19612 4460157 4962577 5042879 5441927 6411129 8232721 10228891 12946266 16290843 20442577
19603 20442577 26037310 34589816 46833943 65043921 93019064 138195291 204684452
19596 204684452 269529881 267325751 198436580 134640035 93970202 67928095 50352594
19589 50352594 38543677 30313041 24891411 21025062 18826731 16667572 13861604 11343789
19581 11343789 9413740 7512574 6083645 5125151 4322535 3689945 3491186 3215395 2856036
19572B856036j94287q3805k28262J02872J36971m094k79846k72481k60138p8572
19562A694394Q3871l64758o60647k97776j48238J02106K79368R2233r5980l879
19552F80694k71903l27700k89589p4972L40105K42032l7138j40037J32348J66467
19542D20307j83357k67397k73758l4961J02354M42079K682m95067m82968j92179
19532i62265K89738O00150j21084O168P39436P21962j90927j73261J0669L2092
19522I52678M5643M60209O28734L97626L18271J31888J67860J5733k04048k50820
19512B663774m03038n58879m97065l35549r0402J4329k47860l63564k1540K37852
19502C98058J27630O3685J10123K69500Q4224k35760k86023j08098K65085M17514
$$ plain form
19572 2856036 2661749 2577944 2349682 2452554 2589525 2585431 2305585 2033104 1772966 1694394
19562 1694394 1778265 1413507 752860 455084 306846 408952 688320 780553 684573 680694
19552 680694 408791 81091 -208498 -283470 56635 298667 261529 121492 253840 420307
19542 420307 236950 -30447 -304205 -339166 -236812 205267 207949 -287118 -770086 -962265
19532 -962265 -672527 -72377 -193461 -187293 552143 1274105 1083178 909917 920586 952678
19522 952678 998321 1458530 2087264 2484890 2803161 2935049 3102909 3118642 2914594 2663774
19512 2663774 2260736 1701857 1204792 869243 778841 793170 545310 181746 160206 398058
19502 398058 525688 589373 699496 968996 1053220 817460 531437 423339 688424 1105938
19492A105938r6800j24832r4776j92993j25j17619j36213O7895M32001M0071Q5180
19481I67727K43678K4257m54156l20910j06107J1978J01829J02227k45754l3761
19471B91008O3927j1214k76144j25715N7826J66787J65894Q8071P0677j05134
19461C85983L1187R1491J9833J61596L35901j16691k88291j41460K06480J55999
19451H42028j10127N089o430j2189J35643J59942N871n8293j96551n22117m60357
19440b17491J10502P4765L93670K13623n56064P7393j42330j71293q910q8822
19430c14957l51072k35301K57590L73978K68401K77088J33595k50444n09139l35486
19420f85747K46835N26745N73285K58943Q677m0211R0877o2884j80046k98240
$$ plain form
19492 1105938 1009138 884306 789530 596537 596412 478793 342580 410475 842476 882547 967727
19481 967727 1211405 1235662 781506 460596 354489 366467 468296 570523 324769 291008
19471 291008 354935 343721 67577 -58138 -312 166475 332369 420440 491117 385983
19461 385983 417170 508661 528494 690090 1025991 909300 621009 479549 686029 842028
19451 842028 731901 736990 730560 718371 854014 1013956 1019827 961534 764983 242866 -217491
19440 -217491 -106989 -32224 361446 575069 19005 96398 -45932 -217225 -226135 -314957
19430 -314957 -666029 -901330 -643740 -269762 -1361 275727 409322 158878 -350261 -685747
19420 -685747 -438912 87833 661118 920061 928738 888527 979404 916520 736474 438234
19410D38234j33791k37445m03265k09658k2648j00980K58767M44576m549L90517
19400D19758N60029R8051J79227K39464k15646k17713J04315L5965J86539j54682
19390A235307l58066L6422J98037o2074k59477k5479L8546j16813m56966n6234
19380A73203L73139K04619k1020j29339N1168L62143M08515K04687p4171J70740
19370A723684M38303q7189k78277J98445J38988K84779J84167j60403j87875o0363
19360B194259L66244M42215O13714O75738P06392Q38783J225353J893902K246343
19351A1202943L029069N211653Q689847J2457186J3017841L581644j0149945j3149479
19343C3890759r772523o868721m809166l182301j863838j001249o45910l08723
$$ plain form
19410 438234 304443 66998 -336267 -545925 -568573 -669553 -410786 33790 29241 419758
19400 419758 979787 1077838 1257065 1496529 1280883 1063170 1167485 1203450 1389989 1235307
19390 1235307 877241 913663 1111700 1049626 790149 764670 803216 686403 229437 173203
19380 173203 546342 750961 729941 600602 651770 1013913 1422428 1627115 1552944 1723684
19370 1723684 2161987 2074798 1796521 1994966 2133954 2418733 2602900 2442497 2254622 2194259
19360 2194259 2560503 3002718 3616432 4292170 4998562 5837345 7062698 8956600 11202943
19351 11202943 14232012 19443665 28133512 40590698 53608539 57190183 47040238 33890759
19343 33890759 24118236 17249515 12440349 9258048 7394210 6392961 5747051 5438328
19335E438328k55598m18523o32861r62612q50120m23586l5188K08607J66365j39022
19325B095790k35204j81604l25015k79665j29867K3889j44141k20296J32121j6790
19315G19218k21013K0746j70844j53082M2627j67009l09876o7468K69326J71570
19305A34195j33154j21482J36456P7134J23245j11488m50903k51077J64727L09972
19295a22375M96467K44089K1629k05434j01267R5155j26162j97438Q6863L82244
19285E73771Q006m9042l69399m80987j10776k13223K1335J82839K55818L64227
19275A82569K03328p6381K64159K62006K27424N0994j53635l2234J62221L33446
19265A423897Q8116m17463m27461k39804m36730p0332p3840R7256J70009m0157
$$ plain form
19335 5438328 5182730 4764207 4131346 3168734 2318614 1895028 1859840 2068447 2234812 2095790
19325 2095790 1860586 1678982 1353967 1074302 944435 968324 824183 603887 736008 719218
19315 719218 498205 518951 348107 195025 237652 70643 -239233 -306701 -37375 134195
19305 134195 1041 -120441 16015 93149 216394 104906 -345997 -597074 -432347 -122375
19295 -122375 374092 618181 639810 434376 333109 428264 302102 104664 191527 573771
19285 573771 581777 532735 163336 -317651 -428427 -641650 -620315 -437476 -181658 182569
19275 182569 385897 309516 573675 835681 1063105 1114099 960464 928230 1090451 1423897
19265 1423897 1512013 1094550 667089 427285 -9445 -79777 -153617 -56361 113648 73491
19255G3491j90440j33059l05316l27540J27473M36435L06129L2119j29859J72801
19245F2234M51599L6774m29113m27202k18261l0171K86572L60716M67196J54841
19235G15185k36518m12069m18045N7310Q3508L5564J96030K1401J57435M2678
19225B42479l62653j90784K93469N49266K09111q3448K4644k36465o06494n07921
19215f68796p4897R9797O362K12230K15987o0713j21158r4381K1987J17589L10830
19204c5163J34349j36872j63887J0345J98025O698q0082j09130n8294k3573J07457
19193a50127J53628j61158j03977L16924P23660L96604J01545M55594J59900m15573
19183A477020n39645k84503J39860K07850j18592o7921o8024J99746L76611L61791
$$ plain form
19255 73491 -116949 -250008 -555324 -882864 -755391 -318956 -12827 19292 -110567 62234
19245 62234 513833 550607 121494 -305708 -523969 -554140 -267568 93148 560344 715185
19235 715185 478667 66598 -351447 -294137 -210629 -175065 20965 42366 199801 242479
19225 242479 -120174 -310958 -17489 531777 740888 657440 682084 445619 -160875 -668796
19215 -668796 -743693 -643896 -637534 -425304 -209317 -270030 -391188 -485569 -463582 -345993 -35163
19204 -35163 99186 -37686 -201573 -191228 6797 13495 -66587 -175717 -234011 -257584 -150127
19193 -150127 3501 -157657 -261634 55290 778950 1175554 1277099 1732693 1892593 1477020
19183 1477020 937375 652872 792732 1000582 881990 814069 746045 945791 1322402 1684193
19173A684193m1584k06643l23319m63651j21540J73389K42393L23739P258J44555
19163A418790M28306L72597O10330N09501n1906l11874m91448j82518K06050k09197
19153B298631l08676j6971J57207J26932j81858k97342m9530j59792n16788j87631
19143H64182J9199p3209j00437J20968L19196K74162J02j98165P5022L88482J05374
19132A794876o2596K05061L17638N75739L27625O2237J35684J13780Q0177L34428
19122C884649P64234P32246J99074r398M17338N24372P67849J310284J455015
19113A0045663J264357J067727P35582M5704L6114O07909J268920J632194J993446
19104A8697616K788692L615436N014387O418260Q273386J1053865J5655742K2666298
$$ plain form
19173 1684193 1642609 1435966 1112647 648996 527456 700845 943238 1266977 1274235 1418790
19163 1418790 1847096 2219693 2830023 3339524 3287618 2975744 2484296 2301778 2507828 2298631
19153 2298631 1989955 1972984 2130191 2257123 2075265 1777923 1728393 1568601 1051813 864182
19143 864182 883381 810172 709735 830703 1149899 1424061 1424163 1225998 1301020 1689502 1794876
19132 1794876 1732280 1937341 2254979 2830718 3158343 3220580 3356264 3470044 3550221 3884649
19122 3884649 4648883 5381129 5580203 5570805 5988143 6512515 7280364 8590648 10045663
19113 10045663 11310020 12377747 13113329 13159033 13195147 13803056 15071976 16704170 18697616
19104 18697616 21486308 25101744 30116131 36534391 44807777 55861642 71517384 94183682
19096I4183682L3306108M8550309P0414372R0476360Q0337246J2094916o9119753
19089C60243240r2690744p4471336n1880837l5570961k4798982j6920108j2674368
19082E1235904j0156164p415943n439903m286599l434378k570491k304079j829818
19074A3798529j597204j206844j057262j196396r17630o19205l79306n46694o76199
19065E601789l41913L0102l15982n82906l03687l12743l73942l88471l26670j80538
19055B505039m6217k05140k98589j57678L98386M09493L31654M45424K81714k31836
19045C432250n54904k09836n9858l87045k14696k83746n52409l38525J9242R4931
19035I45404m01700l11167K22205K29260N5486J23813K07434K13140n38578n90798
$$ plain form
19096 94183682 127489790 176040099 246454471 336930831 417268077 429362993 360243240
19089 360243240 267552496 193081160 141200323 105629362 80830380 63910272 51235904
19082 51235904 41079740 33663797 28223894 23937295 20502917 17932426 15628347 13798529
19074 13798529 12201325 10994481 9937219 8740823 7823193 7203988 6824682 6277988 5601789
19065 5601789 5259876 5289978 4973996 4391090 4087403 3774660 3400718 3012247 2685577 2505039
19055 2505039 2458822 2253682 1955093 1797415 2195801 2605294 2936948 3382372 3664086 3432250
19045 3432250 2877346 2667510 2607652 2220607 2005911 1722165 1169756 831231 850473 945404
19035 945404 543704 232537 454742 684002 739488 863301 1070735 1283875 745297 154499
19025A54499J61066K49667L60837K53056k12628m89002k92007L70564N56827L63248
19015A476127K30448J08077J46565M65910M50748j00735m33879l16442j42918
19006A883901k7010n9993O30723M49070n86822q23575k93501o9303K05764L28812
18996A638066M8771N6409N5521r6592l82743j46651J46888L5429j65194j28645
18986A061259K9820L77520P5027r1856n66208n57389j43459j23914N8564Q3738
18976B03102N88J58732J43044j0380n0250J5932L0642m8886j90584J1753R2003
18965C55696K010N2614L91007K26109l17218o2447L35165J84800r0506l47226
18955G30004n85240m53157l04416J59814L86765k27703l53314L1837L78230L81381
$$ plain form
19025 154499 315565 565232 926069 1179125 966497 477495 185488 556052 1112879 1476127
19015 1476127 1706575 1814652 1961217 2427127 2877875 2777140 2343261 2026819 1883901
19006 1883901 1856891 1796898 2427621 2876691 2289869 1466294 1172793 1103490 1309254 1638066
18996 1638066 1686837 1743246 1798767 1702175 1319432 1172781 1319669 1355098 1189904 1061259
18986 1061259 1091079 1468599 1543626 1451770 885562 328173 184714 60800 119364 203102
18976 203102 203690 362422 505466 495086 444836 460768 491410 442524 251940 263693 355696
18965 355696 357706 410320 801327 1027436 710218 647771 982936 1167736 1077230 730004
18955 730004 144764 -308393 -612809 -452995 -66230 -293933 -647247 -615410 -237180 144201
18945A44201Q8995J11899P1771O1354j9143j25244O4323l2193k08184p4775L4573
18934A17577k22836k84300q9640P8496J46175K8751J86979J36914K34531M37606
18924G70253L16827m1464l98676m20430m63724k27824J99580J86302P9345K75608
18914B75797Q5662l27663l68285k303L95050L77276r3098j91352j27634J256N6811
18903H1517j10717l1427J56545K01751K09882l9755q2497j09291m09N267O5594
18892C46460L56215M9467P7864J23072j75198l14183j35077L3480J99634N4197
18882F15931q2327k93109l15643j49748J55112J18359k03846m16636l75586k38
18872i47731L91075L88134K45310K69506J95186K7064J08137K45845J51260l3373
$$ plain form
18945 144201 233196 345095 416866 478220 459077 333833 398156 365963 157779 83004 117577
18934 117577 -105259 -389559 -479199 -400703 -254528 -225777 -38798 98116 332647 770253
18924 770253 1087080 1045616 646940 226510 -237214 -465038 -265458 -79156 189 275797
18914 275797 361459 33796 -334489 -336792 58258 435534 342436 151084 23450 24706 81517
18903 81517 -29200 -60627 95918 297669 507551 467796 385299 276008 275599 280866 346460
18892 346460 702675 752142 830006 953078 777880 463697 328620 362100 561734 615931
18882 615931 533604 240495 -75148 -224896 -69784 48575 -155271 -571907 -947493 -947731
18872 -947731 -556656 -168522 76788 346294 541480 568544 676681 922526 1073786 1040413
18862A040413l13602J76586L61075J16627k4201m26267J53870L94439n673j97997
18852A275270j54024J6151K67664K43682K19866K60030Q6079j15002J54017K47836
18842B501569m0974j84857j77871N2462J24487O09541O26996J68295J16494J57377
18832C953519M6094j4577J87793L46905L23332m0354k33786k25980q9857O3890
18822D316979J48866J38337P2212K2046J17014m73998o99532k94461K90345K86147
18812C923955J50777J07866q5369j28145l40256p0353L40065K92065Q3074L41866
18802D615545M48981K12905L2370l05189k32901Q74832J057510L05502K09121
18793G218676L63055K60841O20291Q44118P02732O77961K18082L60291Q80472
$$ plain form
18862 1040413 726811 903397 1264472 1381099 1356898 930631 1084501 1478940 1473267 1275270
18852 1275270 1121246 1137397 1405061 1648743 1868609 2128639 2214718 2099716 2253733 2501569
18842 2501569 2460595 2275738 2097867 2150329 2274816 2884357 3511353 3679648 3796142 3953519
18832 3953519 3999613 3985036 4172829 4519734 4843066 4802712 4568926 4342946 4253089 4316979
18822 4316979 4465845 4604182 4676394 4698440 4815454 4341456 3641924 3347463 3637808 3923955
18812 3923955 4074732 4182598 4097229 3969084 3628828 3558475 3898540 4190605 4273679 4615545
18802 4615545 5064526 5277431 5309801 5004612 4771711 5646543 6704053 7009555 7218676
18793 7218676 7581731 7842572 8462863 9306981 10009713 10687674 10905756 11266047 12146519
18784A2146519J104866J636650K141669K280137K485732L480674N378249P893293
18776C8547789J1076929J3895359J3037842P529764J746510K695262R058795J8103077
18768A15691327K7987260L2318277J8671575r609390k3691190j7148266l648942
18761A40570651J0727002K1858109K0241543l208324k8776576l3149183k3878387
18754A04384835j3387587m809482K94807k213799j0558882j5179236j3601392
18747D4929264j0432203p206252m590811l393052l054635k524165j930566j469478
18739A0328102j046419q43263p36123l13795p66213o41871m35211n05225k75354
18730D764628k05136m27101l1515O3172j50016l80626j52535o5561o9273j6673
$$ plain form
18784 12146519 13251385 14888035 17029704 19309841 21795573 25276247 30654496 38547789
18776 38547789 49624718 63520077 76557919 84087683 85834193 88529455 97588250 115691327
18768 115691327 143678587 175996864 194668439 185059049 161367859 144219593 140570651
18761 140570651 151297653 173155762 193397305 190188981 161412405 128263222 104384835
18754 104384835 90997248 86187766 86482573 84268774 73709892 58530656 44929264
18747 44929264 34497061 27290809 22699998 19306946 16252311 13728146 11797580 10328102
18739 10328102 9281683 8438420 7702297 7388502 6622289 5980418 5545207 5039982 4764628
18730 4764628 4559492 4132391 4100876 4164048 4014032 3633406 3480871 3415310 3346037 3329364
18720C329364q6567k26112q6850Q9069J39665l0117n49419o47383n86281K125
18710A347494j89843l86107l15638k96318K43724K66732J70072L6646o4017L86856
18700A199601K41943O4874J64101p5117k29057j46257l6757j83548k05569l3109
18690G61105O22391Q40044M72622J45818j16036m40817m71741k59664q042L56802
18680A902482N24463K32648k78993o06798l50160n8393K25342L93378K97215J55385
18670B436569j91076l32695l27482N490J65127q9406k80285k79211o2561J379
18660A045849j26863Q5904R3576J28940j982j94217j89719l34993n86930l90519
18650d70954L59856O78167K22735P0417P6716L01101L34819r3726j31604o5388
$$ plain form
18720 3329364 3242797 3016685 2929835 3018904 3158569 3128452 2579033 1931650 1345369 1347494
18710 1347494 1157651 771544 455906 159588 403312 670044 840116 876762 812745 1199601
18700 1199601 1441544 1506418 1670519 1595402 1366345 1220088 1183331 999783 794214 761105
18690 761105 1383496 2223540 2696162 2841980 2725944 2285127 1813386 1553722 1545680 1902482
18680 1902482 2426945 2659593 2380600 1773802 1423642 1365249 1590591 1983969 2281184 2436569
18670 2436569 2245493 1912798 1585316 1590806 1755933 1666527 1386242 1107031 1044470 1045849
18660 1045849 918986 1004890 1098466 1227406 1225424 1031207 841488 506495 -80435 -470954
18650 -470954 -111098 567069 789804 860221 936937 1238038 1572857 1479131 1347527 1282139
18640A282139j64161k95499m2738J4982j09350N1890J36821M48596K78745l63070
18630A238355o23228l97565M4031K15024k53993k51373N48714O16031R7104Q3711
18620A316811K00129J35371K35116K77997K64756M17715P42739Q72061O30425
18611E093120P20977J262295K125254L471876N043079P279308J0705267J2137267
18603D7838443N524377p286210j2608769r813423o300352m447156l053641k111568
18595G741701j754679j249885p54884l29843l33453l25234l33008m70150j28392
18586B062173Q6899j16424j97775j45600J78089L1510r6669l26221n64746j35391
18576G75845j70561l11494N6557O3828j12958J33132k18312j43018r5088O1955
$$ plain form
18640 1282139 1117978 822479 779741 794723 685373 737263 874084 1322680 1601425 1238355
18630 1238355 615127 217562 261593 476617 222624 -28749 519965 1135996 1233100 1316811
18620 1316811 1516940 1652311 1887427 2165424 2430180 2847895 3590634 4462695 5093120
18611 5093120 5814097 7076392 9201646 12673522 17716601 24995909 35701176 47838443
18603 47838443 53362820 46076610 33467841 23654418 17354066 12906910 9853269 7741701
18595 7741701 5987022 4737137 3982253 3652410 3318957 2993723 2660715 2190565 2062173
18586 2062173 2149072 2032648 1834873 1689273 1867362 1898872 1802203 1475982 911236 775845
18576 775845 605284 293790 350347 414175 301217 434349 216037 73019 -22069 39886
18566C9886J89617M0822j25402K2291P0764k70124N0907L33027K12834j4257k52117
18555B98248k92970Q4446L25041M07307o0065j08710l92484m03410J52658L14340
18545C24401K84828J48063l6300J4523j56426k6024K69019j5004n2608o2572M96823
18534A188723Q21723J076641J324750Q48451k58255r24504q19127n00949m37997
18525B319456k66801l45727p28331m72121j03304M57307M48651K14923O2064l32765
18515A253352q0513k0067l78240k03947M19377M67798k43689n00062j56059K29236
18505G87186J96092K97908J45045J15096L62848K1108o04643m69523n9147O86606
18495A478576Q38030K13648J03768N09920L72790k04269j28440K23481j6151m0414
$$ plain form
18566 39886 229503 270325 144923 167214 237978 -32146 18761 351788 564622 550365 298248
18555 298248 5278 89724 414765 822072 762007 653297 260813 -142597 10061 324401
18545 324401 609229 757292 720992 735515 579089 553065 822084 807080 754472 691900 1188723
18534 1188723 2010446 3087087 4411837 5260288 5002033 4077529 3258402 2757453 2319456
18525 2319456 2052655 1706928 978597 506476 403172 860479 1309130 1524053 1586117 1253352
18515 1253352 1172839 1152772 774532 570585 989962 1457760 1214071 714009 557950 787186
18505 787186 983278 1281186 1426231 1541327 1904175 1925283 1320640 851117 791970 1478576
18495 1478576 2316606 2530254 2634022 3143942 3516732 3312463 3184023 3407504 3391353 3350939
18485C350939K46927N91388O72346K48881J94997M78050M31896O8926L30238P35597
18475G350185J048919Q26358Q60200J046160J556428K125703K460449L211786
18467B0486188M178341N420177O950871Q401471J0675486J4516403J9952146K8413256
18459A18994339M1733283O0884007Q2244798Q5816578L7402861m5757305q7932786
18452B93385775p8746641n7321854l9390659k7645356k0069185j4703750j1125028
18445D4383302q513765o395963m800989l709588l108695k877606k145361j021409
18437A1809926o90449j089322j056474j040065p14076l86649o88881o65870n85509
18428D892631l60884M2237J25473j85756r6226q4814r1630O8304K8098n32252
$$ plain form
18485 3350939 3597866 4189254 4861600 5110481 5305478 5783528 6215424 6284350 6614588 7350185
18475 7350185 8399104 9225462 10085662 11131822 12688250 14813953 17274402 20486188
18467 20486188 24664529 30084706 37035577 45437048 56112534 70628937 90581083 118994339
18459 118994339 160727622 221611629 303856427 389673005 427075866 381318561 293385775
18452 293385775 214639134 157317280 117926621 90281265 70212080 55508330 44383302
18445 44383302 35869537 29473574 24672585 20962997 17854302 14976696 12831335 11809926
18437 11809926 11119477 10030155 8973681 7933616 7219540 6832891 6144010 5478140 4892631
18428 4892631 4531747 4573984 4699457 4513701 4417475 4332661 4241031 4309335 4337433 3805181
18418C805181r33690m72080L86067j0425m68586n13223k80508L7146l3158k22211
18408A294513m3442j05582l00986l06066j7995K18503M32272M06803J82964q1885
18398A679099n8057k36279k55471l3996J51677k04376m10738j30640O4762J43861
18388G09842L22222j08190m31221l0825L79435r651p4257Q8136j54438k96572
18378C94481j71657o6685o7171K64111K49668K10288J07841P0456J13979L01708
18368A407019R75377P76624N45202M12129K70982n21057j303327j170488r80199
18359D12262m75975n4322j30309j61834L20452K64969J5188J67031J6087J46105
18349E19654p5876k23506k45429j64102K56645J08620j64727j94731J30027L54083
$$ plain form
18418 3805181 2871491 2399411 2785478 2775053 2306467 1793244 1512736 1549882 1516724 1294513
18408 1294513 1251071 1145489 844503 538437 520442 738945 1171217 1578020 1760984 1679099
18398 1679099 1621042 1384763 1129292 1095296 1246973 1042597 631859 501219 565981 709842
18388 709842 1032064 923874 492653 461828 841263 831612 757355 845491 691053 394481
18378 394481 222824 156139 88968 353079 602747 813035 920876 991332 1105311 1407019
18368 1407019 2382396 3159020 3704222 4116351 4387333 3866276 2562949 1392461 412262
18359 412262 -63713 -118035 -248344 -410178 -89726 175243 190431 357462 373549 519654
18349 519654 443778 220272 -25157 -189259 67386 176006 11279 -183452 -53425 300658
18339C00658K9175m20601n37477l9629J23782K83225M51548N37687K5499l33152
$$ plain form
18339 300658 329833 -90768 -628245 -667874 -544092 -260867 190681 728368 753867 420715
$$ [...]
##END NTUPLES=NMR SPECTRUM
##END=
