##TITLE=C13_DF-302
 DMSO, 1010 sc

 31.7.2019
##JCAMPDX= 6.0         $$ Bruker NMR JCAMP-DX V2.0
##DATA TYPE= NMR SPECTRUM
##DATA CLASS= NTUPLES
##ORIGIN= UXNMR, Bruker Analytische Messtechnik GmbH
##OWNER= root
$$ XWIN-NMR		Version 3.5
$$ Fri Aug  2 13:41:16 2019 Russian Standard Time (UT+4h)  she@DPX200
##.OBSERVE FREQUENCY= 50.327896
##.OBSERVE NUCLEUS= ^13C
##.ACQUISITION MODE= SIMULTANEOUS
##.ACQUISITION SCHEME= undefined
##.AVERAGES= 18675
##.DIGITISER RES= 17
##SPECTROMETER/DATA SYSTEM= spect
##.PULSE SEQUENCE= zgpg30
##.SOLVENT NAME= CDCl3
##.SHIFT REFERENCE= (INTERNAL, CDCl3, 0, 222.624)
##AUDIT TRAIL= $$ (NUMBER, WHEN, WHO, WHERE, WHAT)
$$ ##TITLE= Audit trail, XWIN-NMR		Version 3.5
$$ ##JCAMPDX= 5.01
$$ ##ORIGIN= Bruker BioSpin GmbH
$$ ##OWNER= she
$$ F:/spectra/data/she/nmr/c13/1/pdata/1/auditp.txt
$$ ##AUDIT TRAIL=  $$ (NUMBER, WHEN, WHO, WHERE, WHAT)
(   1,<2019-08-02 10:15:33.37 +0400>,<she>,<DPX200>,
      <created by zg, POWCHK disabled, PULCHK disabled
       terminated by command 'halt'
       configuration hash MD5:
       00 E9 B6 7A A2 85 ED C7 34 08 36 98 17 FE 4E 26
       data hash MD5: 32K
       31 AF 0B EB 93 AD 40 E4 CC BB 60 00 AE 34 E3 04>)
(   2,<2019-08-02 13:39:31.10 +0400>,<she>,<DPX200>,
      <Start of raw data processing
       efp BC_mod = 2 LB = 1 FT_mod = 6 PKNL = 1 PHC0 = -372.3448 PHC1 = 31.6064 SI = 32K 
       data hash MD5: 32K
       5F 5A 84 EE F0 18 9C 32 AF 98 38 6C B5 B0 16 FE>)
(   3,<2019-08-02 13:39:39.45 +0400>,<she>,<DPX200>,
      <abs ABSG = 5 
       data hash MD5: 32K
       98 15 07 93 5C 2A 3C EA E3 17 70 37 BA 95 BC CB>)
(   4,<2019-08-02 13:40:24.96 +0400>,<she>,<DPX200>,
      <pk PHC0 = -5.508404 PHC1 = 7.000001 
       data hash MD5: 32K
       6E 30 42 DB 08 3A F1 99 2D 09 12 88 B8 E3 DF 75>)
(   5,<2019-08-02 13:40:27.68 +0400>,<she>,<DPX200>,
      <abs ABSG = 5 
       data hash MD5: 32K
       21 A1 E6 64 D9 CF A6 54 C8 92 7A 65 00 E4 C6 7E>)
$$ ##END=
$$ 
$$ hash MD5
$$ AC 9E D2 26 2F 18 64 B5 60 2E 3A 4D 70 CE BA 19
##$RELAX= 
##$RELAX= 
##$RELAX= 
##$RELAX= 
##$RELAX= 
##$RELAX= 
##$RELAX= 
##$RELAX= 
$$ Bruker specific parameters
$$ --------------------------
##$DU= <F:/spectra>
##$EXPNO= 1
##$NAME= <c13>
##$PROCNO= 1
##$TYPE= <nmr>
##$USER= <she>
##$AMP= (0..31)
100 100 100 100 100 100 100 100 100 100 100 100 100 100 100 100 100 100 
100 100 100 100 100 100 100 100 100 100 100 100 100 100 
##$AQSEQ= 0
##$AQ_mod= 1
##$AUNM= <au_zg>
##$AUTOPOS= <>
##$BF1= 50.322709
##$BF2= 200.13
##$BF3= 50.322709
##$BF4= 500.13
##$BF5= 500.13
##$BF6= 500.13
##$BF7= 500.13
##$BF8= 500.13
##$BYTORDA= 1
##$CFDGTYP= 0
##$CFRGTYP= 5
##$CHEMSTR= <none>
##$CNST= (0..31)
1 1 145 1 1 1 1 1 1 1 1 1 1 1 1 1 1 1 1 1 1 1 1 1 1 1 1 1 1 1 1 1 
##$CPDPRG= <waltz16>
##$CPDPRG1= <>
##$CPDPRG2= <waltz16>
##$CPDPRG3= <>
##$CPDPRG4= <mlev>
##$CPDPRG5= <mlev>
##$CPDPRG6= <mlev>
##$CPDPRG7= <mlev>
##$CPDPRG8= <mlev>
##$CPDPRGB= <>
##$CPDPRGT= <>
##$D= (0..31)
$$ [...]
##$SUBNAM4= <"">
##$SUBNAM5= <"">
##$SUBNAM6= <"">
##$SUBNAM7= <"">
##$SUBNAM8= <"">
##$SUBNAM9= <"">
##$SW= 239.972175391363
##$SWIBOX= (0..15)
0 1 3 0 0 0 0 0 0 0 0 0 0 0 0 0 
##$SW_h= 12077.2946859903
##$TD= 32768
##$TD0= 1
##$TE= 0
##$TE2= 300
##$TE3= 300
##$TEG= 300
##$TL= (0..7)
120 120 120 120 120 120 120 120 
##$TP= (0..7)
150 150 150 150 150 150 150 150 
##$TP07= 0
##$TPNAME0= <>
##$TPNAME1= <>
##$TPNAME2= <>
##$TPNAME3= <>
##$TPNAME4= <>
##$TPNAME5= <>
##$TPNAME6= <>
##$TPNAME7= <>
##$TPOAL= (0..7)
0.5 0.5 0.5 0.5 0.5 0.5 0.5 0.5 
##$TPOFFS= (0..7)
0 0 0 0 0 0 0 0 
##$TUNHIN= 0
##$TUNHOUT= 0
##$TUNXOUT= 0
##$USERA1= <user>
##$USERA2= <user>
##$USERA3= <user>
##$USERA4= <user>
##$USERA5= <user>
##$V9= 5
##$VALIST= <valist>
##$VCLIST= <CCCCCCCCCCCCCCC>
##$VD= 0
##$VDLIST= <DDDDDDDDDDDDDDD>
##$VPLIST= <PPPPPPPPPPPPPPP>
##$VTLIST= <TTTTTTTTTTTTTTT>
##$WBST= 1024
##$WBSW= 4
##$XGAIN= (0..3)
0 0 0 0 
##$XL= 0
##$YL= 0
##$YMAX_a= 60349701
##$YMIN_a= -98597850
##$ZGOPTNS= <>
##$ZL1= 120
##$ZL2= 120
##$ZL3= 120
##$ZL4= 120
##$ABSF1= 222.624
##$ABSF2= -17.3728
##$ABSG= 5
##$ABSL= 3
##$ALPHA= 0
##$AQORDER= 0
##$ASSFAC= 0
##$ASSFACI= 0
##$ASSFACX= 0
##$ASSWID= 0
##$AUNMP= <proc_1d>
##$AZFE= 0.1
##$AZFW= 0.5
##$BCFW= 0
##$BC_mod= 2
##$BYTORDP= 0
##$COROFFS= 0
##$CY= -3
##$DATMOD= 1
##$DC= 0
##$DFILT= <>
##$DTYPP= 0
##$F1P= 0
##$F2P= 0
##$FCOR= 0.5
##$FTSIZE= 32768
##$FT_mod= 6
##$GAMMA= 0
##$GB= 0
##$INTBC= 1
##$INTSCL= 4.134877e-10
##$ISEN= 128
##$LB= 1
##$LEV0= 0
##$LPBIN= 0
##$MAXI= 10000
##$MC2= 0
##$MEAN= 0
##$ME_mod= 0
##$MI= 0.1934396
##$NCOEF= 0
##$NC_proc= 3
##$NLEV= 6
##$NOISF1= 120.0001
##$NOISF2= 80.00006
##$NSP= 0
##$NTH_PI= 0
##$NZP= 0
##$OFFSET= 222.624
##$PC= 1.4
##$PHC0= -377.8532
##$PHC1= 38.6064
##$PH_mod= 1
##$PKNL= yes
##$PPARMOD= 0
##$PSCAL= 0
##$PSIGN= 0
##$REVERSE= no
##$SF= 50.3227315989248
##$SI= 32768
##$SIGF1= 140
##$SIGF2= 120
##$SINO= 11.81781
##$SIOLD= 32768
##$SREGLST= <13C.CDCl3>
##$SSB= 0
##$STSI= 32768
##$STSR= 0
##$SW_p= 12077.2946859903
##$SYMM= 0
##$S_DEV= 0
##$TDeff= 32768
##$TDoff= 0
##$TI= <>
##$TILT= no
##$TM1= 0
##$TM2= 0
##$TOPLEV= 0
##$USERP1= <user>
##$USERP2= <user>
##$USERP3= <user>
##$USERP4= <user>
##$USERP5= <user>
##$WDW= 1
##$XDIM= 32768
##$YMAX_p= 357675623
##$YMIN_p= -1016618
$$ End of Bruker specific parameters
$$ ---------------------------------
##NTUPLES= NMR SPECTRUM
##VAR_NAME=  FREQUENCY,     SPECTRUM/REAL,   SPECTRUM/IMAG
##SYMBOL=    X,             R,               I
##VAR_TYPE=  INDEPENDENT,   DEPENDENT,       DEPENDENT
##VAR_FORM=  AFFN,          ASDF,            ASDF
##VAR_DIM=   32768,         32768,           32768
##UNITS=     HZ,            ARBITRARY UNITS, ARBITRARY UNITS
##FACTOR=    0.368581032318806, 1,           1
##FIRST=     11203.0474431902, 0,            0
##LAST=      -874.247242800138, 0,           0
##MIN=       -874.247242800138, -1016618,    0
##MAX=       11203.0474431902, 357675623,    0
$$ Real data points
##PAGE= N=1
##DATA TABLE= (X++(R..R)), XYDATA
$$ [...]
13303 -312048 -88075 56829 54766 -12927 -39899 -11080 63204 137808 169576 92464 79412
13292 79412 7982 -114504 -109074 4180 86887 85459 149999 295429 460509 400238 164751
13281 164751 29198 -45784 -55385 -275710 -421781 -173466 229066 405910 292508 218375
13271 218375 108262 -24638 -92732 -2797 217468 327811 101715 -45894 14989 54260
13261 54260 -83573 -277817 -155330 78158 122735 120701 56551 16422 -29100 -66477 -102480
13250 -102480 -213322 -410864 -482298 -393360 -259235 -286637 -308655 -277062 -302537 -361174 -195426
13239 -195426 35598 33176 -73411 -70221 -25777 -81539 -114622 46733 296194 342748 304009
13228 304009 257660 158075 -105434 -215316 -162949 -83497 -38683 66853 184626 80217
13218 80217 -29330 -130926 -352442 -384869 -182472 -133236 -261122 -399252 -408402 -187978
13208 -187978 91547 71075 11488 222572 438337 407946 133284 -175658 -292433 -191217
13198 -191217 20933 163067 99349 -41141 -137734 -294680 -250487 -90293 150818 383227
13188 383227 352684 279253 167852 143110 390808 570797 478748 336598 151533 82007
13178 82007 211477 176877 28213 -127369 -120702 -129504 -211765 -309582 -283318 -107204 -41518
13167 -41518 -141110 -224986 -295654 -427535 -331368 -233760 -237224 -177684 -58134 36453 -42987
13156 -42987 -223708 -236929 -287472 -446353 -573695 -497820 -380355 -203486 19544 50922
13146 50922 9884 -21471 -63165 -11623 167169 312315 319568 260882 114543 1383 -94009
13135 -94009 -13937 230471 258459 56714 -158322 -119376 14088 202979 176804 74473
13125 74473 69833 59062 41417 -25039 -206805 -271924 -199402 -142207 -90071 -51307 8735 68670
13113 68670 79613 199319 315990 150405 -19120 2397 76215 123208 174558 116255 83739
13102 83739 78935 9901 149065 313330 358106 493399 488362 452831 433597 388928 316707
13091 316707 239983 185589 237846 289913 189231 -30071 -176452 -152654 -185541 -382091 -416419
13080 -416419 -282631 -94024 36380 22911 -87050 -46983 -16950 -48148 52663 170298
13070 170298 187189 67771 21361 232932 459318 661015 760660 718588 621412 423271
13060 423271 374999 548015 562037 239312 -48356 -30939 55638 327102 717604 832058
13050 832058 713619 615865 570857 744372 636036 174903 -105135 -105790 741 63932 -122154
13039 -122154 -239632 -63966 37480 -26362 -237331 -169893 78969 275452 390836 352849
13029 352849 229370 165361 68061 19670 -129274 -295135 -309431 -273613 -318480 -201034 -109035
13018 -109035 -141428 -67164 -164062 -437497 -465276 -487085 -753559 -696147 -444171 -179289 -184592
13007 -184592 -504929 -420430 -128222 -6479 305333 559891 661842 660444 471650 332918
12997 332918 185912 -68193 -295805 -255941 -69765 -51913 -52432 28986 5878 -72020 69502
12986 69502 259914 272378 74677 77907 180673 157767 278940 442742 467462 572839 631375
12975 631375 393235 25414 -81112 -56480 -73762 -74555 -54331 -78295 -73098 58467 69089
12964 69089 52566 219456 421225 421996 438810 380930 159325 -15751 -65161 20722 139792
12953 139792 -11664 -300712 -184018 2728 150517 243680 190894 196576 188235 92616 68995
12942 68995 -46617 -235910 -155215 13060 155070 171837 70772 -10138 34573 260298
12932 260298 341897 254822 149688 44433 -131548 -254134 -236317 -104731 15964 62969
12922 62969 -2876 -40429 35876 138069 46946 -107989 -24432 160433 139652 -1838 -101921
12911 -101921 -229754 -209467 -280346 -238126 -115886 -133972 -88471 118656 156508 251762 269450
12900 269450 228729 9443 -229262 -239865 -168098 -84282 -57373 -232800 -347914 -424699 -269104
12889 -269104 -116319 -199727 -239935 -215630 -227427 -288319 -206335 -258871 -457924 -655902 -612974
12878 -612974 -599784 -578656 -346766 -178918 -98899 -21149 9553 -53957 -153385 -260944 -238800
12867 -238800 -108886 -60665 -341724 -736197 -879127 -838118 -800856 -887554 -878784 -738300 -620791
12856 -620791 -443683 -284883 -210406 -57621 -107663 -272316 -425416 -484857 -306812 5454
12846 5454 219745 -32278 -405391 -472055 -415797 -309941 -114658 75692 154660 47804
12836 47804 -38130 -167931 -327218 -396330 -371712 -234889 -180654 -126452 70273 170545 112479
12825 112479 19364 -61513 -139902 -148024 -215902 -278277 -170435 -177124 -325253 -164242 52318
12814 52318 174689 196156 167820 273462 441603 334795 93439 126410 107528 13231 -35381
12803 -35381 -154773 -102282 20219 48355 -111435 -207254 -120761 -102373 -71912 -77064 -133028
12792 -133028 -154207 -176080 -81219 262322 384177 192193 32840 -92328 -119325 -171752
12782 -171752 -280629 -320853 -299233 -144559 -81731 3145 78527 63421 60732 -21424 -261842
12771 -261842 -310824 -220079 -180119 -247628 -226643 -56268 181309 134185 -2972 -145574 -266263
12760 -266263 -125378 -28554 43675 75316 69652 -35171 -166802 -286174 -324208 -102252 169737
12749 169737 218179 106976 8853 -80415 -291777 -369134 -425171 -540653 -560469 -373215 -232063
12738 -232063 -246408 -163623 72323 259359 115668 45176 25865 219334 253121 190425 73739
12727 73739 -85664 -176634 -279252 -118583 164640 368498 275883 111288 85350 132610
12717 132610 130083 -1497 -140550 -291704 -403471 -437215 -507979 -482344 -411244 -340319 -333741
12706 -333741 -219520 -133242 -194444 -217157 -237143 -218339 -131851 -19345 132288 202506 138241
12695 138241 80242 3012 -34490 -43379 -47284 -60893 53363 180430 176114 332622 404496
12684 404496 328597 350665 360456 302478 310178 271540 120486 35853 -21686 -31851 -11542 63590
12672 63590 38769 58718 176343 249184 329043 338441 415809 518094 561168 353083 -103671
12661 -103671 -346336 -384576 -362989 -204398 -195437 -64283 151298 63750 -80996 -244220
12651 -244220 -246709 -56194 -28968 -141150 -223776 -375384 -555018 -683746 -612177 -598006 -761201
12640 -761201 -697251 -567075 -528046 -526715 -453311 -324476 -229053 -294489 -409192 -359482 -243166
12629 -243166 -165958 -161261 -209286 -181780 94094 346392 367819 50481 -202584 -176266 -181973
12618 -181973 -385804 -519731 -563645 -513915 -353401 -257461 -186590 -207514 -144590 -76628 38332
12607 38332 -27242 -304666 -458784 -550523 -522726 -310972 -97135 78394 180329 254805
12597 254805 157662 -14243 5012 147771 120658 133320 255611 339945 335762 243775 114112
12586 114112 -31142 -185641 -262280 -133257 -2353 310482 581722 515521 475841 360235
12576 360235 114758 -85197 -305127 -406572 -379561 -274329 -105314 -96271 -347695 -341496
12566 -341496 -205687 -156451 -39754 -15352 -57144 -24223 97195 198878 173574 114743 79128
12555 79128 135117 69715 -80165 38942 343392 418574 266521 -21503 -312309 -458723
12545 -458723 -563654 -444016 -355356 -219427 -11821 176858 259599 153111 162807 350511
12535 350511 549973 440413 156895 212593 464641 556635 456674 232142 97348 81288
12525 81288 51770 175231 388918 251996 182992 214180 297514 422386 382030 192440 168071
12514 168071 123170 24106 -77868 -176282 -256657 -472882 -455767 -83783 83705 -53943
12504 -53943 -233483 -318513 -253560 -57346 184835 325093 334324 317369 328890 298852 207990
12493 207990 83970 -61068 -166115 -282575 -434225 -390537 -471083 -443355 -416521 -455861
12483 -455861 -490228 -601624 -643465 -344643 -134923 -140253 -149206 -256708 -264936 -82694 25663
12472 25663 -108416 -118991 -54140 -52400 -135918 -235467 -299153 -242824 -112991 -37580 -27402
12461 -27402 -44852 14660 118194 86047 -15902 -46651 -58752 -96015 -58394 -2116 169735
12450 169735 287030 142192 -6279 13529 160747 243494 151452 19720 -133932 -292982
12440 -292982 -194900 -34051 -6003 -4237 -34762 -59007 929 49403 135252 172898 192572
12429 192572 178341 -58091 -222550 -157008 -60821 -68371 -99767 -80657 -122819 -239137 -283169
12418 -283169 -225782 -222183 -274262 -279716 -206753 -189043 -469159 -549546 -354756 -177065 36946
12407 36946 91121 51523 -3975 -63192 -234623 -398327 -392275 -468871 -524138 -428611 -447412
12396 -447412 -548254 -528207 -554007 -581263 -585349 -484897 -375996 -347992 -468606 -513997 -548809
12385 -548809 -568147 -427369 -188349 -78085 -192184 -120444 -151157 -260958 -349725 -448974
12375 -448974 -439613 -76380 180714 64119 18321 58895 61245 -28823 -240956 -344329 -339228
12364 -339228 -231358 -141474 -131128 -224363 -301043 -293117 -260892 -350684 -454076 -398896 -278070
12353 -278070 -120260 -118119 -131691 -14682 107524 119319 96384 133153 170026 164283 27821
12342 27821 -34227 -112423 -183522 -75196 114933 232670 157829 209348 251148 346341 481101
12331 481101 564373 491413 522419 527669 354947 264049 320755 184713 101796 -67946 -380230
12320 -380230 -472659 -344081 -136020 104761 332633 311167 250957 243735 83872 -135207
12310 -135207 -203769 -197998 -33572 126692 134864 105941 45109 16735 38190 -57039 -88562
12299 -88562 -75770 -87122 -112271 41219 103988 90834 324075 456100 438631 488926 421055
12288 421055 199191 -3909 119612 338114 419048 372869 265171 278303 219258 109751
12278 109751 70256 -53084 -139996 -164908 36919 32781 -258517 -378981 -242052 42535
12268 42535 194881 118696 -53941 -157974 -212353 -207568 -209361 -389033 -548290 -669543 -645671
12257 -645671 -566194 -539927 -494226 -234837 -15757 90125 169920 161849 31713 -93730 -40062
12246 -40062 124593 235741 182339 69306 23559 122907 141356 -39444 -215149 -447805
12236 -447805 -631035 -449101 -200290 -175713 -140986 -189721 -178915 -99247 127742 345227
12226 345227 380088 253314 102653 155900 142884 145269 185772 134726 -61585 -482743 -671116
12215 -671116 -480090 -227495 36549 168323 129706 52520 32775 -147082 -342855 -449909
12205 -449909 -267781 -38550 5179 124646 254257 338941 324036 308979 234565 -27747
12195 -27747 -209796 -173708 -156317 -83902 -78227 -141569 -60352 77116 10398 -114841 -252119
12184 -252119 -272722 -238279 -319859 -283026 -277795 -199764 101039 397573 329705 150286 92376
12173 92376 -14875 -138833 -355587 -536816 -560646 -637769 -539667 -214615 -32988 -66025
12163 -66025 -22967 162862 364951 358438 168837 119402 227236 232257 229535 126911 10289
12152 10289 50791 86175 17497 -12131 -84076 -133205 -78842 62486 144568 125148 59932
12141 59932 -20933 -164968 -210119 -212037 -236991 -162388 101735 322325 303331 201453 178614
12130 178614 63152 -214377 -515302 -675103 -705697 -679723 -796302 -852792 -853211 -778135 -565739
12119 -565739 -439037 -485053 -341321 -213947 -290237 -271298 -156796 -83564 -203780 -287249
12109 -287249 -163185 -75628 -140467 -307493 -435487 -434893 -429237 -267792 -139675 -127336 -160273
12098 -160273 -167476 51455 184001 -20340 -316392 -383506 -355046 -204209 17903 -15841
12088 -15841 -285724 -526741 -604113 -551495 -541514 -484120 -306263 -218059 -24376 287010 383477
12077 383477 245470 141730 190143 256739 313525 405378 461089 437398 253285 -53135 -172752
12066 -172752 -202929 -87326 111158 243284 332491 318962 80375 -206559 -316379 -277271
12056 -277271 -175235 -108751 -112772 97699 222187 62914 107989 298451 434733 247457
12046 247457 241295 424718 462458 430398 325003 183606 112634 88923 -76851 -172372 -217069
12035 -217069 -145177 -8751 163681 351119 190765 -211773 -407254 -417296 -270186 -77335
12025 -77335 60899 30792 112218 39559 -157895 -175568 -171151 -183193 -239503 -175908 -152871
12014 -152871 -84000 -68122 9001 -16194 14911 89607 -507 -88701 -78640 -52995 -38046
12003 -38046 -87996 -277995 -327819 -292067 -215814 -74498 -73446 -28002 165827 285548 261584
11992 261584 314579 362359 235582 133148 72974 85877 166995 229157 255409 294639 316231
11981 316231 302253 261846 258345 205386 10575 -207176 -395668 -483173 -491872 -349756 -218948
11970 -218948 25112 216806 247080 204553 132723 -125012 -372753 -459387 -447814 -246885
11960 -246885 -58695 40933 133872 186770 38021 25647 91938 -21115 -278678 -335262 -172269
11949 -172269 -5891 -894 -45157 58765 175477 128929 64224 58196 126912 131868 48454
11938 48454 -124389 -122369 -96768 -201123 -221227 -316106 -286485 14422 294550 322736 269546
11927 269546 328363 574897 558003 353784 147932 89187 136332 161700 217053 239709 75400
11916 75400 94287 200137 158754 -69979 -248910 -219653 -121702 -134419 30689 159761 71633
11905 71633 -39265 66847 24958 70137 261877 292655 222383 31101 -88104 -137297 -148430
11894 -148430 -135964 -173734 -258920 -407714 -545922 -549693 -397765 -353698 -397813 -489960 -357105
11883 -357105 -247198 -160538 -87451 -197334 -331296 -411804 -338939 -394125 -419355 -399089 -534061
11872 -534061 -678533 -514569 -351886 -316398 -313945 -302391 -217389 -164605 -307940 -287255 -110606
11861 -110606 198702 331174 154499 115558 244362 308975 270766 144764 5952 -62872
11851 -62872 -133613 -60781 105094 248362 361397 304447 73162 -59178 -193300 -208852
11841 -208852 192430 506019 373137 202075 80542 -6727 -23732 -96756 28336 210147
11831 210147 410156 432504 103777 -256350 -300150 -262279 -215061 -111421 -95949 -57423 -80758
11820 -80758 -122073 -62697 -127953 -96659 160953 342251 160009 58215 -2759 -251787 -488723
11809 -488723 -698809 -820947 -733616 -624733 -621514 -477946 -144634 129361 98016 -45232
11799 -45232 -59343 3834 -100489 -224720 -115610 -141517 -292945 -460857 -435550 -225505
11789 -225505 -137157 -108373 -120690 -100424 -16064 146626 316340 506222 607395 342754
11779 342754 89411 67756 176071 315911 407324 458743 458192 334273 206185 91661 83891
11768 83891 8171 -111076 -58764 -12305 -144439 -219177 -176822 -251373 -407679 -433280 -270242
11757 -270242 -315767 -424247 -248744 -167458 -450759 -447988 -115323 207096 337275 267758
11747 267758 209331 118264 -144982 -136920 131271 144883 -126713 -430027 -541287 -512965 -708851
11736 -708851 -854515 -746283 -544851 -456824 -178139 66826 57197 -157567 -271395 -355390
11726 -355390 -412248 -345809 -337384 -330760 -389981 -639034 -784847 -787217 -807022 -446849 -87549
11715 -87549 78999 420468 559429 585983 405156 200572 325698 371997 361325 365311 372782
11704 372782 196322 -27336 40261 214648 248006 117007 42503 -9986 -28961 35594 -63056
11693 -63056 -241244 -107403 118488 266306 341715 246237 166344 281588 374287 368189 327646
11682 327646 155698 129392 209716 243794 180383 178173 79627 -23884 242020 408545 300917
11671 300917 232283 -25220 -445823 -564028 -482232 -564573 -600750 -339381 -90985 52910
11661 52910 155021 95690 19624 -50616 24369 -76011 -173032 -118322 -9676 46599 46112
11650 46112 69585 183339 175980 39495 16359 62777 112333 36809 8829 126127 149306
11639 149306 127508 136335 197468 76767 -120343 -245769 -256600 -232591 -155109 -194671 -144704
11628 -144704 -21434 -124929 -330299 -396442 -272631 -140271 -78150 -255798 -531895 -621739
11618 -621739 -403250 44819 376636 401038 356213 554992 577917 395947 323487 253657
11608 253657 252322 315082 284704 474073 635501 422437 82138 -84208 11116 71933 96048
11597 96048 125512 50803 44233 -4744 -46056 -142187 -172222 -235680 -410343 -358615 -301891 -220715
11585 -220715 -114304 -181963 -183210 -222468 -319416 -298148 -391088 -474023 -483028 -529849 -545357 -388717
11573 -388717 -207220 -66446 -14659 -72480 -133385 -228029 -209032 -110579 35746 151495 31970
11562 31970 -215696 -422789 -498357 -276896 -63581 -47389 -37679 -111105 1476 98962 129895
11551 129895 375365 623016 661049 418701 112136 -49511 -113317 -29284 -17549 -163408
11541 -163408 -258571 -223087 -239876 -135656 136271 167735 10237 1883 -16250 -117553 -186360
11530 -186360 -101597 78420 125765 -67507 -142212 -37723 -99273 -190063 -238675 -221544 -200462
11519 -200462 -177201 -1507 280208 475948 385694 133347 93870 30970 31283 85090 126130
11508 126130 200040 144321 103971 143854 271485 207705 180576 36864 -165055 -136769 32286
11497 32286 373214 562428 475292 294395 134161 86684 118170 169991 104226 41493 -19201
11486 -19201 -72170 -95946 -95856 -138895 -94548 104981 323948 287951 14411 -80426 -201233
11475 -201233 -497750 -694753 -534404 -199012 -81521 -136364 -119823 38633 196209 195987
11465 195987 146513 70813 -30825 -69478 48866 175196 284150 388565 313224 151892
11455 151892 -26128 112420 350575 461849 437239 431667 390249 412073 486037 494623 370096
11444 370096 216980 209018 65937 -98857 -387997 -401337 -208746 -74257 98002 182788
11434 182788 93136 -142100 -227408 -84172 15906 -192895 -431534 -485364 -328161 -151524
11424 -151524 -10800 69843 3369 -43089 90527 260803 307772 227732 153172 169315 300803
11413 300803 402448 359855 240370 103133 108481 212265 116808 -1826 -19100 394 227409
11402 227409 330320 -176266 -330501 79432 234146 241280 322675 399771 355198 217172
11392 217172 48457 -41144 -162104 -227996 -172966 -156975 17616 163663 15136 -143374
11382 -143374 -243933 -218464 -48034 115025 218032 355999 307351 175888 236388 370259
11372 370259 566683 679872 651115 755487 955532 858132 746379 499546 165243 -26666
11362 -26666 -116450 -20635 146803 151032 155803 272045 253969 82415 176605 271296 70421
11351 70421 -192899 -434123 -453577 -331413 -327264 -493397 -553972 -491399 -444517 -454361 -369490
11340 -369490 -424284 -464610 -454730 -476898 -545172 -591496 -550465 -518309 -472479 -301955 -392264
11329 -392264 -525896 -313595 17423 210815 291558 239290 44366 -108342 -206100 -304792
11319 -304792 -245232 -225393 -184388 -145496 -82682 -122780 -339024 -494427 -529125 -254676 -155108
11308 -155108 -251953 -298441 -206575 -82103 43974 152128 29841 -31178 -88884 -113310 -111207
11297 -111207 -108691 -57673 -11290 -75700 -200308 -153999 -14539 108399 232255 198492 -52184
11286 -52184 -108243 69989 240218 231133 181524 119275 185537 338007 347772 171172 212809
11275 212809 264145 84585 -400654 -558860 -493351 -495834 -358791 -347040 -477165 -533340 -374953
11264 -374953 -205016 -115507 -93502 39315 54037 48344 -10594 -113799 -209017 -301683 -327804
11253 -327804 -379699 -423806 -500039 -502797 -499798 -504708 -516410 -546448 -676920 -759187 -633850 -532664
11241 -532664 -596351 -621420 -557219 -534242 -554643 -506045 -411370 -315630 -278008 -152150 41951
11230 41951 263015 323931 209551 189876 333468 430659 232880 13320 -101048 -107901 -117705
11219 -117705 -27453 -85071 -278576 -480007 -467570 -286194 94139 176922 -32949 -58930
11209 -58930 -194438 -320484 -298047 -117258 -93443 -116667 -101314 -10822 175320 206505 55272
11198 55272 -29537 -53213 -73506 -108414 -44342 -101884 -220968 -227695 -168450 -126617 -168378 -36557
11186 -36557 222746 165851 29404 -57261 -172427 -157015 -167318 -266962 -309509 -357369 -371930
11175 -371930 -349484 -309176 -180793 -139159 -189572 -175137 -79260 36783 134985 288750 399078
11164 399078 562337 580414 321385 113049 168874 418319 511113 472463 303744 166838
11154 166838 28002 52550 290294 473764 287063 -110509 -318358 -239591 -52034 -173667
11144 -173667 -397926 -466987 -523941 -528674 -607168 -590179 -500092 -287253 -158122 -149019 -157295
11133 -157295 61153 285755 347423 248963 135059 176526 164270 211350 452103 506879 490632
11122 490632 353415 107052 -70303 -131709 -81607 -95379 -201848 -321291 -145387 166268
11112 166268 263639 253587 223271 108112 -112930 -359284 -277552 -115465 -101546 48934
11102 48934 78162 -192289 -520844 -629782 -644056 -653765 -630920 -685121 -479903 -95182 -23975
11091 -23975 53319 51040 127094 187785 54156 153805 313580 342807 276656 187709 169002
11080 169002 123681 31443 32720 67121 179446 174191 2974 131052 544175 686169 647283
11069 647283 554337 391760 316609 156190 2015 32079 55243 11311 -111999 -179380 4630
11058 4630 135501 27566 -158857 -163271 -81450 -7497 152068 189476 158424 419195 691028
11047 691028 747006 710492 458617 248215 190265 92371 -15511 -123619 -144851 3469
11037 3469 137815 256838 279702 269183 59043 -150576 -85845 -78634 -39205 143599 233924
11026 233924 252689 162471 33306 -17796 109350 -73635 -226907 -205586 -141472 -186506 -212581
11015 -212581 -231255 -225302 -130869 -218396 -390299 -467746 -441066 -366154 -385255 -453975 -339638
11004 -339638 -309665 -443603 -338798 -53456 191012 198844 56809 21620 70308 74154 -47937
10993 -47937 -68308 -55477 -94413 -182663 -230995 -270213 -151555 -30958 -279530 -414517 -357869
10982 -357869 -274840 11229 308816 145087 -102499 -150890 -52504 -57432 -234420 -436410
10972 -436410 -547667 -328091 -86019 -131029 -155224 -24911 69912 50079 51477 61911 -91875
10961 -91875 -295705 -413092 -353884 -336940 -204315 126408 361719 248057 3566 -202312
10951 -202312 -8848 -9318 -173418 -16173 178921 351401 620037 736608 641942 569684
10941 569684 478094 409387 217752 200370 287172 300039 293463 344878 310959 146137 168125
10930 168125 91711 -87241 -130901 -178458 -205037 -223731 -250105 -187773 -142700 -119690 -182225
10919 -182225 -83729 149088 85149 -99133 -133923 -207829 -270812 -187611 2853 115828 197456
10908 197456 105785 94761 -11506 -137191 -196708 -312744 -214782 -119621 -84819 9038 82509
10897 82509 91188 179513 250640 260759 194155 250342 249074 213080 184364 134188 36985 55735
10885 55735 27219 -216405 -515829 -627261 -675838 -667358 -515036 -370775 -322469 -173908 38055
10874 38055 113670 6734 -59597 55056 106433 98507 11332 -81964 -98794 32193 102756
10863 102756 96929 181127 318873 377415 301742 183021 73842 69208 119390 78522 -88551
10852 -88551 -316208 -462712 -424963 -300740 -251638 -280861 -334685 -331348 -295874 -329090 -510160
10841 -510160 -683249 -607041 -252871 88973 118149 84164 -49469 -81663 -22933 -102920 -157078
10830 -157078 -117648 -118952 -101725 21908 -32122 -185362 -307429 -335292 -371293 -357365 -324182
10819 -324182 -503484 -675361 -563545 -187004 -98896 -164915 -26706 -188467 -327443 -345180
10809 -345180 -451949 -306250 -23873 112886 224529 348282 452524 496995 494523 407074
10799 407074 276067 91175 -177217 -360299 -256620 113006 362537 419800 298960 173455
10789 173455 80849 14439 90953 212065 75448 -30859 138059 250356 204295 225055
10779 225055 416389 594721 534591 341196 214478 222903 116168 -4141 -11418 -51234 -154860
10768 -154860 -168681 -178795 -225454 -294222 -429760 -332882 -321011 -497027 -563457 -468844 -249001
10757 -249001 -295138 -466734 -463720 -410525 -237705 -27722 129479 182046 169716 209384 34171
10746 34171 -180796 -282128 -341635 -256007 -171732 -90363 -26732 54842 57915 51310 127025 62406
10734 62406 -42267 89507 54467 -70850 -177370 -190822 -129962 -19323 -55699 -50778 -13470
10723 -13470 -102588 -228191 -127675 -20395 -134738 -261233 -241737 -164115 -27161 102151
10713 102151 174872 209113 167159 177079 151393 90843 -50185 -41584 -40210 -138718 -239580 -179870
10701 -179870 -150565 -147821 -135615 -47593 -49351 -295670 -424729 -310501 -223299 -42202 103364
10690 103364 117218 19215 -44771 -26070 -65690 -84417 -202408 -208695 43820 61551 106580
10679 106580 183232 127079 61668 117662 264706 328472 261765 93291 -15460 -133577 -321033
10668 -321033 -445104 -332202 -278303 -353732 -542528 -561564 -440996 -334802 -249676 -85617
10658 -85617 108321 248840 321194 266028 -25393 -150474 102173 250979 254121 264360 230379
10647 230379 87381 3762 -227627 -331515 -258827 -112992 -3234 55167 244094 136532
10637 136532 -137926 -292771 -308476 -188533 -158301 -15886 114308 238272 364282 413281
10627 413281 319541 206303 201988 282201 273546 82180 -126299 -120541 19987 98730 99347 -35312
10615 -35312 -121852 -173512 -177440 -262771 -217429 22225 146821 239007 310689 168153 -57373
10604 -57373 -41802 -78150 -79880 14829 46026 154487 243037 275137 204567 79094 39115
10593 39115 83391 2080 -161776 -273655 -208961 298 77603 -113081 -310470 -284482 -167178
10582 -167178 -144052 -259319 -282091 -196384 -103140 90004 40750 37181 233468 390224 249372
10571 249372 -14133 -179621 -395949 -506813 -362372 -307292 -412339 -457575 -403466 -266756
10561 -266756 -201034 -199579 -149906 -227076 -309931 -354853 -260748 -136877 73116 340327 484377
10550 484377 413717 295854 151876 13697 -110294 -150155 20025 206079 206760 180979 103059
10539 103059 -97180 -427498 -685347 -658387 -462871 -282338 -148795 -23625 23165 -137671
10529 -137671 -247632 -3475 283768 258977 98764 57617 38044 149048 87415 -47155
10519 -47155 92781 237617 72299 -219841 -409173 -470308 -452120 -529983 -699082 -633184
10509 -633184 -457986 -164873 164160 159190 -8093 29076 111513 55467 63305 101251 190969
10498 190969 319357 296562 278065 235914 117822 -3521 95302 243439 400007 549606
10488 549606 453411 139953 -133849 -188333 -140941 -138229 -75181 -78083 -232327 -168679 -81704
10477 -81704 -174176 -358586 -613455 -634737 -465882 -283639 -232931 -318677 -285931 -153981 -129883
10466 -129883 -266294 -277935 -186229 -52492 76520 58576 43657 138532 108698 39632 83219
10455 83219 140695 145718 160274 192084 56355 -36530 -17469 -17331 14361 -245456 -510748 -572718
10443 -572718 -637476 -687454 -663320 -521034 -360119 -278174 -269332 -371614 -432353 -443351 -458571
10432 -458571 -367299 -331381 -248522 -52236 -34502 71659 116201 -11529 -511 62556 131814
10421 131814 279055 240680 200596 159192 143016 218521 343309 341996 30598 -160945 -64455
10410 -64455 28469 -53919 -163411 -176068 -33232 -121087 -292007 -561744 -690499 -535192
10400 -535192 -196341 -63391 -168344 20908 153847 -41287 -182136 -317821 -505438 -661858
10390 -661858 -372016 -2864 15867 -41850 -7918 67947 -30453 -248537 -336914 -185780 -125859
10379 -125859 -171033 -165487 -217345 -239809 -309186 -301465 -178155 -88762 42862 111037 4075
10368 4075 -127136 -163502 -91248 -25931 -144445 -180665 -16066 -117825 -282173 -165463 52155
10357 52155 104757 85699 -3132 19700 34124 -244911 -343524 -285514 -315059 -217391 -122934
10346 -122934 -63181 38343 20676 -122635 -145192 49986 56505 52740 -13752 75301 279547
10335 279547 193272 -33841 -185474 -331866 -330762 -230736 -259814 -376874 -369706 -226902 -365354
10324 -365354 -417559 -285153 -175070 84206 279806 297159 54937 -262913 -199903 -49687
10314 -49687 9231 -11125 -166078 -361609 -251083 82761 381612 435837 396807 396912 283879
10303 283879 171288 148958 102798 -118142 -246902 -133782 4059 48409 -1078 -151380
10293 -151380 -235035 -198087 -188971 -72055 40047 -117307 -485082 -764863 -807503 -747465 -786102
10282 -786102 -872993 -684668 -466989 -492744 -461768 -383870 -194709 -47069 120032 318982
10272 318982 348934 240412 112096 19931 -103637 -88238 54526 123613 62673 55283 217086
10261 217086 308633 310066 236392 139050 -8709 -153304 -316383 -431366 -347333 -78740 171963
10250 171963 157279 -82335 -386767 -426388 -314358 -354504 -357187 -304927 -490248 -424678 -95192
10239 -95192 -217466 -381974 -253982 -318389 -495456 -535315 -511587 -397528 -259152 -246507
10229 -246507 -343272 -368662 -362672 -379885 -412009 -505583 -431872 -319116 -274314 -247099 -233303
10218 -233303 -110872 -177410 -388627 -451367 -622180 -752451 -764539 -813300 -674409 -457717
10208 -457717 -201303 -65556 34985 11722 -289894 -379446 -267672 -191853 -213268 -166099
10198 -166099 -118317 -109648 -201150 -230203 -131548 -207739 -405499 -291676 -227800 -123514 -108541
10187 -108541 -31253 74269 36568 154514 77744 -46077 96049 191283 191176 175394 117040
10176 117040 -71754 -173425 -181849 -175233 -190968 -271531 -221732 -183061 -290199 -476012 -610565
10165 -610565 -525632 -416771 -382174 -278425 -154046 33264 113420 39386 -93413 -202402
10155 -202402 -258526 -253291 -380037 -319326 -181404 -180553 -12416 182562 152534 60689 92322
10144 92322 115748 142638 157495 -8469 -140773 -10592 42879 -96089 -289550 -411018
10134 -411018 -388800 -297351 -343347 -384204 -323005 -238365 -233595 -181967 -104942 81525 227368
10123 227368 225482 84320 -144875 -153788 -60928 -182492 -314592 -286025 -107303 21841 95857
10112 95857 43992 -86579 62844 100099 -65506 -213199 -248692 45885 257633 118680
10102 118680 -44458 -164243 -215094 -18101 230893 186239 130440 35856 -297418 -549487
10092 -549487 -476056 -340670 -172810 94379 165750 148733 -127049 -574281 -726295 -654670
10082 -654670 -419923 -194519 111053 305500 77872 -165252 -168281 -276834 -343419 -313978
10072 -313978 -339329 -418401 -377861 -318807 -322932 -207238 -92234 -118103 -153483 -125891 -156783
10061 -156783 -173998 -91927 28532 125433 37686 -165674 -244729 -207041 -98460 -83736 65702
10050 65702 193430 125852 93605 35426 -57149 -80531 -105128 -192445 -343630 -497376 -439696
10039 -439696 -220588 -119552 -1643 215752 195563 152253 160286 -70689 -333174 -410096
10029 -410096 -397882 -319166 -261426 -310406 -200673 -133227 -280972 -352164 -279679 -251444 -328111
10018 -328111 -447049 -549203 -668217 -635372 -380220 -223114 -427462 -706468 -746890 -532035
10008 -532035 -156361 -52738 -132302 -98568 -113015 -88212 -126953 -263486 26942 320961
9998 320961 398479 237514 71984 160652 233922 104540 3696 -74467 -48118 58203 103711
9987 103711 58201 49577 114288 259334 249409 185869 64656 -86840 -25118 83959 164733
9976 164733 60107 17239 24848 -94643 -87427 121091 340852 361743 213091 211782 228190
9965 228190 122365 3113 -4969 -21023 -249076 -493326 -439303 -197875 54148 190777
9955 190777 306865 356799 215246 -91672 -126953 144074 428286 567875 483732 286967
9945 286967 53565 -191055 -215787 -95988 -154910 -338876 -554337 -648783 -407969 -175779
9935 -175779 -233412 -243437 -115080 -81723 -145923 -340578 -277342 -205368 -434906 -550389 -527528
9924 -527528 -373657 -326687 -363702 -449975 -476783 -504519 -439055 -228366 -99809 -213495 -318814
9913 -318814 -409469 -479171 -328709 -54623 -68391 6812 266094 364210 243533 95951 -827
9902 -827 -215969 -311136 -253406 -70690 86610 255050 307060 111190 -228918 -327149 -183852
9891 -183852 -91853 -357323 -587499 -670124 -736881 -771978 -588451 -290534 -114182 -160111 -263833
9880 -263833 -258250 -288856 -390446 -451344 -434796 -297849 -261323 -368082 -367982 -270048 -149366
9869 -149366 -185544 -357640 -448419 -454395 -614160 -639022 -327493 -183595 -144214 -35186 -121642
9858 -121642 -157810 -132999 -174469 -121054 -84713 -110874 -141630 -89122 20418 -31885 -112875
9847 -112875 -455467 -942991 -1016618 -837528 -446687 -280460 -288538 -256841 -267909 -270490 -159263
9836 -159263 124767 230158 227524 232769 263973 275736 -27138 -466320 -615677 -534589 -290152
9825 -290152 -81811 86443 32713 3492 102388 207658 176133 -191608 -496567 -306559
9815 -306559 -53473 161498 383837 345296 317905 366455 244005 154633 94101 4843 -41315
9804 -41315 -40479 -41787 70209 121626 147988 255419 259513 280871 404134 418137 276009 71679
9792 71679 -103762 -208436 -126712 -31573 -213588 -351539 -317478 -262118 -247830 -171481 9068
9781 9068 35563 -52885 -50120 48485 217123 316012 379213 451072 279194 95767 46444 -106438
9769 -106438 -118235 150052 287334 338971 311002 65193 129931 369047 443314 324694 256095
9758 256095 410123 391449 310901 360852 446564 354268 154707 181441 275887 357222 260846
9747 260846 52196 -282622 -562435 -706785 -702046 -436153 -265580 -71943 140643 213530
9737 213530 254574 250573 189073 219884 94712 93277 100880 181888 377526 499024 565520 453928
9725 453928 333729 272175 151540 8530 -12188 -140263 -261006 -123912 125808 239268
9715 239268 430733 490116 368221 276478 231250 154684 69776 82562 75307 201724 381648
9704 381648 290980 63700 99344 99844 -47742 15261 217966 334030 275898 330546 461615
9693 461615 511539 368914 90465 -259547 -367234 -379342 -312283 -298634 -310092 -213788 54661
9682 54661 267509 263288 140352 -81356 -144676 -64414 119543 263149 299652 278976 338879
9671 338879 441254 334539 185390 105685 9098 -85622 -65097 -88071 -145362 -92017 93483
9660 93483 125191 32946 -46735 -55213 -72493 -117327 -91946 -153366 -122083 -207967 -260217 -175938
9648 -175938 -38795 70587 3752 -227300 -272865 -193877 -183276 -142702 -122136 -177744 -207277
9637 -207277 -244240 -208047 -72248 -7933 -13935 34286 -263541 -443110 -265901 114590 351770
9626 351770 148202 -111995 -166745 -115901 -91567 142982 400190 622711 574572 203042
9616 203042 -55131 -44249 -5366 -64314 30965 155555 170420 309282 300962 280310 551697
9605 551697 755238 695573 520489 491170 420215 319563 258087 161188 46245 -190779 -434540
9594 -434540 -465322 -210758 -49435 -17270 284107 492905 521940 485012 452799 282708 -10210
9583 -10210 -112036 -75297 -109168 -223175 -266259 -124113 -63357 -186226 -185164 54777 295575
9572 295575 430223 572136 529671 427905 437415 505378 455332 145587 -237336 -397280 -438014
9561 -438014 -433651 -501498 -403237 -347384 -298859 -249354 -289112 -260525 -178971 -186280 -234772 -273466
9549 -273466 -326659 -218402 34164 286255 388178 412306 369480 283870 288119 298717 268778
9538 268778 249741 195827 148715 42274 -28610 -99688 -175156 -182537 -74070 101336 273345
9527 273345 306768 234802 190588 202266 123466 2189 -31672 14435 182018 273994 239526
9516 239526 -41928 -229080 -98527 59425 128100 115001 167599 395283 177901 63141
9506 63141 204111 281322 321106 168143 -36757 -77278 -138001 -235723 -303482 -185732 2372
9495 2372 -5679 -90191 -123202 -15339 52544 42035 -29009 -50162 32243 35272 -160047 -116064
9483 -116064 105308 187328 184034 163196 138606 -26108 -189940 -159437 57119 312580 472405
9472 472405 394674 236980 115784 151743 300308 227375 92577 9233 -48425 116179 246635
9461 246635 185622 68173 -86288 -237931 -298736 -522847 -568938 -359105 -133400 -147448
9451 -147448 -235721 -324648 -286808 -230172 -282558 -304188 -310991 11007 276954 337291 465706
9440 465706 588461 432627 306725 255781 88464 -56498 -210928 -182594 18741 1084
9430 1084 -157767 -262971 -332106 -245695 -39523 -22374 68248 124037 -34648 -230996 -218194
9419 -218194 -172904 -267672 -487503 -400988 -306193 -474036 -515890 -473724 -414885 -416609 -239967
9408 -239967 46461 69015 76234 12818 -209275 -258149 -181545 -103231 -18333 52135 40728
9397 40728 -35866 -176851 -247665 -193401 -30948 -64823 -250077 -322776 -413634 -333310 -203853
9386 -203853 -205934 -288723 -274459 -289241 -308460 -279408 -59767 39359 174923 268056 204944
9375 204944 33255 -30794 29677 4746 106873 276290 500066 587040 538520 328328 247691
9364 247691 439764 463910 316218 133279 29176 21782 -84585 -206672 -277205 -210875 -124612
9353 -124612 -193291 -283603 -354124 -432795 -422712 -252319 23702 304743 509948 575446 539431
9342 539431 432237 398478 381077 347105 364639 184633 2974 -99995 -234010 -262689 -195243
9331 -195243 -202334 -176503 1093 158197 213388 161282 27338 6032 95329 260102 522686
9320 522686 746021 674378 677012 670432 670497 804264 877949 786724 701213 692676 663965 630168
9308 630168 504951 564420 735452 907735 1070144 1239215 1285727 1324145 1378821 1408487 1514214
9297 1514214 1583716 1537655 1368564 1321957 1580015 2009961 2328393 2379584 2565709 2760980
9287 2760980 2990078 3229273 3572439 4187652 5040824 6029158 6866133 7631173 8707118
9278 8707118 10314099 12168627 14300933 16665892 18941450 20891962 22190448 22671787
9270 22671787 22468057 21310719 19512511 17422031 15208552 12972044 10838100 9300679
9262 9300679 8236294 7376090 6518128 5646550 5013329 4419709 3944162 3543142 3336568
9253 3336568 3171470 3068356 2859245 2613289 2324627 2116575 2097581 1780882 1454001 1289973
9243 1289973 1212905 1180443 1062762 920376 836466 827446 714370 734444 979259 1070178 1089894
9232 1089894 1079261 969735 909817 829370 662247 812172 1186610 1454868 1404523 1465080
9222 1465080 1360957 1364797 1566537 1670981 1832047 2041472 2022017 1925512 1900291 1879043 1930557
9211 1930557 2159446 2450900 2753554 3176245 3567544 3860017 4224081 4684123 5263214 6086899
9201 6086899 7101381 8026049 9171563 10773571 12543053 14435550 16660834 19050968
9193 19050968 21088071 22666800 23340088 22625671 20954495 18908088 16710482 14452214
9185 14452214 12361506 10499974 9024071 7709451 6436913 5337757 4558383 4064847
9177 4064847 3418180 2973255 2672190 2447329 2255046 2003041 1840712 1808632 1735219 1698796
9167 1698796 1751383 1586866 1306805 1055939 898515 790527 621489 478737 437814 329198
9157 329198 389519 586262 706347 734670 807373 849347 587230 234104 -48138 -10780 21699
9146 21699 -4641 115892 119469 11405 75812 176925 192129 36142 -14341 223130 518505
9135 518505 591200 412020 211875 124196 117820 119583 2770 -43478 36695 81420 100830
9124 100830 107851 53637 35928 221595 427921 643871 730106 648935 642206 487077 221456
9113 221456 270476 573755 745538 635018 519034 504861 541572 606479 552221 418496 404988
9102 404988 500376 592823 466567 160133 1708 122730 408183 653069 758427 727272
9092 727272 540738 363271 237693 279031 344931 380494 415574 334619 262063 290454 283105
9081 283105 351154 398261 309534 288204 390448 256583 -7025 7462 12123 -227745 -427706
9070 -427706 -446600 -414173 -420180 -341135 -75274 -37465 -208984 -322294 -188427 55809 89717
9059 89717 61569 156359 201996 198878 297166 416620 367507 153210 -129085 -203956 -58246
9048 -58246 13100 62378 137458 135837 115366 92844 -47327 12683 172329 154321 104140 51759
9036 51759 17019 -69828 -142614 -227529 -281198 -215847 -238522 -168156 82611 132633 -30456
9025 -30456 -199313 -305625 -397953 -478912 -463597 -362497 -180404 -48958 24864 67844 -57764
9014 -57764 -102324 -20758 -131619 -69769 140370 30136 -305475 -408888 -459405 -484137 -332257
9003 -332257 -67090 80879 -21667 -230894 -236847 -106063 -121213 -222980 -270365 -118430
8993 -118430 93437 -66355 -198629 -182637 -343815 -428480 -327625 -272722 -311289 -282543 -145453
8982 -145453 -154105 -245004 -229588 -166878 -372802 -528283 -282591 -50143 77388 98396 -11124
8971 -11124 -189673 -256157 -199139 -198912 -48484 55691 -101143 -496227 -723308 -710528 -636151
8960 -636151 -624327 -562616 -448744 -335403 -112343 -156369 -303683 -331142 -370786 -579687 -570670
8949 -570670 -330965 -378025 -470493 -456002 -410810 -374478 -383183 -249401 -66476 3206 69682
8938 69682 177633 244329 51323 87270 216318 60428 -66740 -20541 115705 85644 -74116
8927 -74116 3750 182268 257038 244932 153805 -11937 -202657 -100791 1786 173012 289843
8916 289843 371315 421725 505707 439227 235860 110639 20190 -56483 -88047 22231 35871
8905 35871 -119349 -170812 -293649 -249510 47496 309015 360435 289016 259696 268254 189127
8894 189127 166658 228017 431375 530880 358635 295705 425478 562381 448485 335395
8884 335395 385035 441016 313544 101796 138887 66967 -2449 65653 59407 -36563 -22707
8873 -22707 -127367 -76265 69573 -19627 22652 4474 3617 61138 32316 -7261 -4358 117506
8861 117506 168042 110450 33312 62199 12661 19485 10573 -88960 -30560 98007 83927 -57069
8849 -57069 -126849 9980 196561 121352 34717 98829 84062 30256 58647 116384 231923
8838 231923 423369 411138 320519 119220 -97474 -62916 106945 293933 389910 387590 276755
8827 276755 184019 194767 234587 306474 264270 206737 121640 239967 264214 24370 -65807
8816 -65807 -19818 -99436 -97052 -31645 -81770 16584 217198 425568 445661 480201 463812 412068
8804 412068 381084 266831 4838 -152999 87977 391368 432245 278910 70579 -28430
8794 -28430 100495 307399 415904 411853 288567 112615 164299 186902 49520 24660 180461
8783 180461 194931 134437 202563 204644 404856 446139 280487 157166 153469 235084 191656
8772 191656 -131225 -229662 -16872 94078 211051 161304 -36816 24840 98633 2999 -221
8761 -221 -70417 -120630 -133927 -263549 -442757 -489524 -163633 145494 236785 212819 162814
8750 162814 210088 195678 174958 222844 238350 203448 10677 -117831 -244385 -342394 -453980
8739 -453980 -277628 -383 -17180 -101462 43480 347653 732207 850083 644271 309060
8729 309060 94014 -121924 -198454 -157849 -215706 -249141 -354760 -294661 -285139 -147563 -112483
8718 -112483 -117332 48870 85431 60130 57132 184764 238935 141473 -32011 -100210 -164173
8707 -164173 -89019 29195 85757 171157 114761 71640 16844 -90296 -169646 -206068 -275451
8696 -275451 -218058 -65309 104584 237018 115516 -169603 -450187 -408587 25495 323063
8686 323063 312591 328966 282041 253986 297345 319095 65402 -184210 -395672 -629652 -531713
8675 -531713 -211252 -52048 4771 84559 81497 -38695 -179899 -176129 -115563 -171376 -247160
8664 -247160 -243695 -95185 -81119 -197474 -356683 -393472 -311996 -307765 -218664 -164216 -162484 -77577
8652 -77577 -6305 20717 92519 11638 -86520 49132 166596 -26320 -209486 -192623 -21929
8641 -21929 81417 84050 -112127 -294953 -222851 -93236 -59534 -79405 -58814 -139921 -272821
8630 -272821 -321446 -423727 -559934 -556653 -690167 -716910 -393511 52606 425850 519061 457875
8619 457875 366537 315142 155063 92222 128866 96619 267168 322185 261645 224076 101510
8608 101510 109005 242778 523843 801609 791474 494622 104263 -69010 -14279 90545
8598 90545 89071 15833 -52708 -104299 -59963 -121140 -250675 -416825 -594717 -557131 -347401
8587 -347401 -285561 -377382 -289859 -131033 -5085 135221 135621 136222 369789 724331 1046281
8576 1046281 1010452 582972 259113 149158 168984 164781 333025 500767 349600 248177
8566 248177 258337 447556 559800 466346 410530 338381 318261 429458 426243 302056 320228
8555 320228 393132 367199 156736 -56796 -208320 -232524 -208077 5884 304836 317407 235699
8544 235699 72390 10459 141241 84211 -116718 -169506 7050 91513 1794 -130519 -48486
8533 -48486 196113 382179 417091 435928 488898 556453 534596 469351 443183 518985 778971
8522 778971 820149 685312 676529 567846 476728 436870 397528 330095 277263 396887 519936
8511 519936 524978 545723 520845 471831 404680 282069 127966 -31258 -372995 -390995 -150453
8500 -150453 -134586 -186092 -108256 46965 185894 482809 690067 681547 634737 735402 802752
8489 802752 397311 17811 -30551 79734 165420 226236 280490 299042 367502 268616 222762
8478 222762 239298 120485 25480 22365 93132 150718 266306 232208 144636 308134 416357
8467 416357 357170 316205 449113 578745 545037 405098 305520 370551 429588 295411 264551
8456 264551 252454 298170 303511 269717 282751 365281 434824 371395 258678 226601 126093
8445 126093 71228 274356 492132 542090 484724 424223 367744 308415 235817 210667 51783
8434 51783 -80168 13084 91892 172969 204742 271212 342621 229190 168549 143800 133680
8423 133680 -63888 -226387 -152695 41734 365737 477990 480317 490354 342945 107120
8413 107120 -78403 -135907 -41729 108794 185620 242522 191552 73746 160812 392615 605433
8402 605433 671726 720440 705029 645262 642036 722418 667484 516696 580503 608394 499049
8391 499049 498086 461187 441303 611936 775378 648396 612082 725718 764962 782264 586050
8380 586050 353531 267407 152456 138407 394059 593404 841040 1035912 1097371 1132913
8370 1132913 1074353 927948 763467 630429 677430 967318 998899 740544 609338 634437
8360 634437 799348 890305 953885 1096117 1123906 1080620 976633 726869 546580 642553 914989
8349 914989 1264746 1443263 1595091 1539935 1536151 1703083 1792601 1907362 2025204 2168121
8339 2168121 2318976 2402640 2461078 2392662 2477138 2597000 2731224 3202778 3662663 4123243
8329 4123243 4571298 5099427 5611590 6308692 7346318 8427177 9516245 11015661 13076836
8320 13076836 15497171 17972948 20242824 22105853 23157169 23359524 22431421 20791836
8312 20791836 18798792 16548556 14333450 12448560 10744775 9125097 7843329 6972126
8304 6972126 6271630 5522267 4717819 4065964 3621809 3258413 3041089 2851917 2661765 2620277
8294 2620277 2409662 2079502 1805601 1639215 1605444 1705778 1760359 1705466 1608559 1568418
8284 1568418 1584358 1587014 1525596 1301136 1157157 1214149 1108531 1016297 1067292 1256906 1409970
8273 1409970 1395735 1420731 1286809 1049983 952733 927007 861542 927356 1003767 994696 977707
8262 977707 1091456 1279354 1276447 1213846 1229574 1155888 1016588 971823 942975 1009108 1066136
8251 1066136 1120481 1125904 1005050 1034863 1090418 1230037 1227921 1110713 1006850 975302 848380
8240 848380 611045 599241 636038 796639 818934 633977 440866 308567 319216 474206
8230 474206 529467 519007 628100 640851 620293 738275 892739 682059 520562 792655
8220 792655 1022637 1162184 1179104 1021778 791123 675138 579686 410324 501159 586332
8210 586332 653922 650042 674647 669354 571970 511803 588322 592622 850863 1106904 1098105 909336
8198 909336 797178 859057 1067383 1200622 1171036 1229397 1269325 1099760 978554 832990
8188 832990 740711 645929 701494 806971 731417 585387 692180 808291 776037 603518 602821
8177 602821 758562 742997 764532 829004 846934 631398 442958 451533 363450 392057 560852
8166 560852 607389 694366 702266 479614 364749 427455 557882 670616 794933 945523 1137389
8155 1137389 1215319 1088755 1023368 958168 897930 994776 1025580 1052220 1036393 1023931 1250584
8144 1250584 1358080 1252267 1276258 1382374 1198443 977689 900645 1073190 1315233 1565871
8134 1565871 1657837 1482176 1363236 1605222 1968820 2172512 2224792 2150756 1957625 1940429
8124 1940429 1816368 1588997 1552912 1634646 1762453 1990382 2233020 2333484 2223620 2065323
8114 2065323 2079839 2081171 2154075 2258515 2282638 2294305 2303049 2530381 2900124 3204882 3467131
8103 3467131 3933788 4515348 5041992 5692051 6734797 7929535 9403955 11442112 14187874
8094 14187874 17958301 23167300 29848175 37065752 42076893 41758577 36540057 29410873
8086 29410873 22934839 17805538 13901290 11240750 9266603 7652641 6357404 5467040
8078 5467040 4949470 4377824 3874643 3605544 3327264 3128589 2968768 2879700 2932946 3016670
8068 3016670 2867756 2778694 2821687 2760854 2459577 2067805 1743669 1564319 1554727 1599765 1638597
8057 1638597 1680336 1703423 1899050 2212664 2354614 2239452 2137090 2095014 1976322 1775724
8047 1775724 1651222 1741890 1804036 1830495 1993646 2102309 2089017 2028548 1948649 1888755 1802039
8036 1802039 1741450 1703460 1519526 1351035 1452804 1626227 1852100 2018038 1930489 1919405
8026 1919405 2041905 2013816 1921783 2027811 2407951 2587012 2564040 2554191 2535491 2525629 2558671
8015 2558671 2813016 2934886 3015884 3090250 3093503 3100565 3185453 3299786 3290100 3561781 4082635
8004 4082635 4738641 5399655 5939526 6512637 7153098 8123932 9394517 10714700 12613085
7995 12613085 15561399 19396810 23945098 29046137 34792366 40952038 46265986 49790151
7987 49790151 51055594 49706888 46247098 41596920 36131166 30454788 25409953 21290372
7979 21290372 17911116 15321735 13396430 11818017 10719426 9967889 9481087 9116318 8894205
7970 8894205 8983983 9448651 9910785 10035528 9973625 9913299 9888244 9698430 9238368 8684224
7960 8684224 8264929 8027194 7835010 7663036 7749817 7978232 8024918 8283054 8712721 9061867
7950 9061867 9382851 9848822 10520469 11356526 12472309 13948918 15596574 17739708 20590736
7941 20590736 24194038 28931204 35202673 43413702 54015944 67592736 83780939 101943210
7933 101943210 120836431 137633880 149069119 153199878 149481081 138850250 123058808
7926 123058808 104882961 87222813 71699414 58688243 48195622 40006368 33857491
7919 33857491 29331439 25890902 23343965 21600031 20523803 19915927 19749384 19920967 20276451
7910 20276451 20584624 20822455 20777090 20021502 18848999 17657619 16692489 16044338 15525996
7901 15525996 15128515 14894642 14864666 15047937 15363774 15796880 16312731 16832132 17627836 18704898
7891 18704898 20081194 21843301 24023113 26758366 30007692 34262905 39807428 46949537
7883 46949537 56363017 68984279 85516785 106833701 133571092 165971594 202608977
7876 202608977 240048485 272989216 295985621 304266124 296227182 273786583 241437369
7869 241437369 204869609 169114003 137471980 111282769 90610565 74608154 62333035
7862 62333035 53225899 46629250 41541268 37724636 34916158 32925753 31770904 31222770
7854 31222770 31102696 31126806 31038445 30653294 29682391 28000750 25993363 24072081 22551003
7845 22551003 21345088 20428395 19784369 19330951 19223973 19183874 19516242 20383415 21346513
7836 21346513 22284043 23423164 24884768 26706175 29111297 32172120 36334067 41405585
7828 41405585 47731817 55929800 66915195 81514309 100343918 124941884 156446964
7821 156446964 194717132 237884229 282057871 321012533 347987190 357675623 348119429
7814 348119429 321224189 282313714 238573367 195985469 158377487 127334995 102725802
7807 102725802 83745832 69321603 58543419 50299194 43848436 38966824 35468936 32989040
7799 32989040 31317501 30182359 29428749 28813895 28157102 27315440 26197289 24826092 23363789
7790 23363789 21895099 20612179 19575875 18781801 18195084 17729538 17692568 17977980 18318629
7781 18318629 18701772 19234431 20067224 21130370 22736116 24552468 26743214 29523257 32960857
7772 32960857 37217116 42642814 49931570 59302461 71548546 87768605 108946906 135534750
7764 135534750 167460088 203694905 240624119 273139167 295421610 303096517 294584119
7757 294584119 271555295 238609808 201356007 164865438 132721997 106406899 85770103
7750 85770103 69821897 57614865 48333874 41253655 35730569 31531591 28154383 25564229
7742 25564229 23616243 21974662 20766012 19733644 18731226 17979839 17312023 16557412 15684470
7733 15684470 14672789 13693043 12811228 12241408 11784223 11609937 11643163 11522747 11329210
7724 11329210 11155507 11259147 11777168 12470856 13170105 13957914 14929064 16094239 17660165
7715 17660165 19858680 22636994 26118168 30731660 36994349 45175372 55643403 68983996
7707 68983996 84990855 102984323 121283843 137234282 148086791 151714820 147256102
7700 147256102 135652317 119175197 100496258 82257559 66185005 52939885 42715450
7693 42715450 34809489 28453844 23571742 19873061 17025732 14855154 13183779 11743665
7685 11743665 10583023 9573723 8761886 8133607 7377439 6931926 6679097 6292685 5799188
7676 5799188 5400626 5178212 5039986 4923553 4846920 4629794 4371581 4314965 4380719 4468229
7666 4468229 4690273 5025039 5132994 5291594 5355564 5492009 5933983 6718378 7720687 8728670
7656 8728670 10106787 11833738 14024429 16962634 20278647 24162490 28976054 34523560
7648 34523560 40257767 45135328 48640218 49939510 48462995 44756619 39535107 33638266
7640 33638266 27690802 22361091 18074997 14550371 11836084 9822063 8262172 6920702
7632 6920702 5704278 4773415 4036904 3468666 3175360 3052706 3024933 2755140 2359727 1982818
7622 1982818 1685865 1611275 1513772 1272029 1084575 1160549 1138371 1051773 1130816 1199058 1249206
7611 1249206 1294517 1118403 786329 592474 443839 506171 654275 630707 450087 260031
7601 260031 217832 321879 569372 778155 908918 855293 764788 737878 798652 839412 801571
7590 801571 817559 838735 647572 549900 605211 522528 373138 115572 57613 130126 204608
7579 204608 550382 850021 859566 793431 729303 689790 720090 851315 902153 923324 961848
7568 961848 1011380 867288 634604 383123 348130 415703 533023 736110 772435 501389
7558 501389 225497 67076 138741 293971 298058 334627 427048 366831 403307 386416 122362
7547 122362 46685 171594 251933 132474 60045 238831 436160 485303 558677 577095 632383
7536 632383 782395 867259 681464 485767 422149 308958 124652 130739 233857 452256
7526 452256 705627 822064 775863 583996 234939 159894 175336 188326 231239 439675 677492
7515 677492 609373 471667 399404 338004 386241 450607 394485 391088 284233 43777 -126065
7504 -126065 -122657 -148606 -363615 -499193 -330762 -152473 -214355 -221846 -228931 -161386 75502
7493 75502 268002 409046 327843 168017 82825 43976 -49501 -67475 -26553 19028 166841
7482 166841 273094 331258 155773 -66342 66930 311433 472091 480174 323275 173861
7472 173861 220717 168611 160480 314531 488941 589757 509576 244164 200794 303074 279771
7461 279771 184550 97537 7262 52046 -30767 -2807 248691 418125 522495 497347 365413
7450 365413 166988 209768 330646 274338 139662 63412 145014 118837 140237 313657 425673
7439 425673 319711 229972 158123 -50672 -161962 -196754 -252644 -234471 -217708 -197052 -38859
7428 -38859 405434 779083 688824 454963 370555 190793 36669 159327 212574 255774 183251
7417 183251 40554 -72071 -43319 -46969 70460 323797 382694 292325 120183 -10746 -59008
7406 -59008 -29716 87505 302385 392683 344835 393016 376849 197065 -81584 -214605 -221586
7395 -221586 -101090 100344 456261 721431 675956 562625 574328 593751 694327 633376
7385 633376 383186 149063 228788 230779 53837 128892 191879 140545 150280 387662 519583
7374 519583 399647 260587 307529 347430 307590 187104 175065 29087 -87422 -25593 134553
7363 134553 415799 568903 649425 785517 642090 391259 296137 341637 423796 248756
7353 248756 13283 -56439 -195561 -252458 -81635 42583 -8478 -62464 -66824 -136691 -218264
7342 -218264 -244331 -106381 227154 450471 566147 651823 566030 420076 250330 136488
7332 136488 120368 34274 -98783 -94870 -74210 86817 206656 153497 -57992 -142011 -30361
7321 -30361 208632 413172 342773 367937 593097 616574 576820 622167 613564 445746 364891
7310 364891 479733 601957 507256 250914 33685 4917 32055 -28087 -74270 -134485 -27070
7299 -27070 130879 235054 235118 155018 281648 322673 226781 232052 401982 495035 369224 192811
7287 192811 230926 315177 423043 440789 444150 399069 260054 130740 196339 248053 328028
7276 328028 546154 513713 280176 -2286 -247914 -214796 138248 246939 102043 38882
7266 38882 259032 439283 435747 263767 285452 258875 23097 -103180 -96727 32201 53039
7255 53039 80205 128459 110447 207254 89303 91272 398064 492663 364029 135495 30593
7244 30593 29202 4815 69208 221611 174134 170727 330343 403588 371402 191569 -67118
7233 -67118 -86425 179182 585185 773507 663162 530140 365740 310137 271979 270303 25391
7222 25391 -349172 -405829 -274576 -19024 274486 384649 323978 190513 176839 167777 15120
7211 15120 -7396 -4192 -67596 2629 65242 60683 96245 251989 373579 337075 230798 124408
7199 124408 11098 -11512 36763 108772 190659 250594 293062 285074 165865 59524 81733
7188 81733 177499 125085 -78051 -206179 -284602 -185344 -80517 -175292 -329298 -316165 -43709
7177 -43709 -41238 -36914 49417 78801 95108 53917 -94197 -217405 -206192 -130223 -89570 -62912
7165 -62912 -18957 -124937 -271766 -273427 -234517 -247306 -308147 -330613 -400851 -359845 -115852
7154 -115852 37688 -31936 -98725 -71937 -67811 98044 145005 56603 183034 165199 103202
7143 103202 283951 511880 528960 440682 504571 419165 355311 189964 145685 26076 -108516
7132 -108516 13898 103928 91383 -24667 -146470 -193628 -292172 -260048 -121872 -150881 -287713
7121 -287713 -272613 5515 247162 335396 328560 288265 214883 162960 168381 185444 85317
7110 85317 -30034 -204446 -192281 12605 35214 -116980 -201241 -194503 -54008 92587 115777
7099 115777 10076 -72578 -86253 -35760 -58438 -78399 9875 -121882 -300468 -381190 -238024
7088 -238024 -127074 -112660 -26044 -21357 25447 125916 103216 -38125 -251361 -263983 -99226
7077 -99226 -144932 -185786 -90490 -38502 -30946 -122791 -117537 -111435 -149573 -173466 -141679 -4034
7065 -4034 147497 191203 334226 470214 317229 155921 153419 191719 304056 430814 503571
7054 503571 527154 676509 707406 759923 799900 843221 594377 310390 202113 267018 492375
7043 492375 536606 442347 294132 34680 -104985 -60178 -21432 19527 13986 44225 45484
7032 45484 -51252 -97437 10384 143008 450941 620268 511929 290966 87376 -39839
7022 -39839 -98094 -115130 -42974 103807 336851 595437 668391 506717 386487 250542 176836
7011 176836 263768 448170 450898 415479 437795 463680 473373 474651 280381 11650 -110124
7000 -110124 7570 252150 333095 205412 109203 40308 42675 252281 372690 206666 41211
6989 41211 158609 436992 435488 305938 227876 36428 -146566 -135176 -155134 -108926 -3601
6978 -3601 123025 96362 -1984 21206 22925 62360 115279 52482 102006 87708 -110852 -158440
6966 -158440 -246638 -344969 -328077 -406055 -485878 -640059 -606552 -446061 -287475 -158670 -29672
6955 -29672 54532 137943 50790 -193143 -203148 -255421 -121311 108414 529652 1027374 1119794
6944 1119794 900656 723355 463304 107630 -20924 -6136 -97793 66967 147003 80128
6934 80128 185268 183113 287772 448564 523513 368559 155450 210715 263521 190791 134344
6923 134344 117104 39651 -74863 -93677 -58152 -68120 62787 159123 275824 190644 150249
6912 150249 222749 297910 432362 755740 805922 549480 193383 -60724 -53696 -88899 -149793
6901 -149793 -285094 -264280 97770 335449 150238 35246 85029 366259 685173 684329 601504
6890 601504 609690 530264 320680 120498 105471 193431 321994 543525 566522 488246 390747
6879 390747 332905 557389 604533 418390 287696 242553 338885 453646 559930 577976 597546
6868 597546 652255 641541 415275 302331 334521 371885 614671 857838 817904 621786 523140
6857 523140 566123 680778 594908 650400 965969 1299376 1477205 1522556 1721460 1963837
6847 1963837 2185914 2379710 2739337 3202433 3717287 4348842 5277155 6415984 7733807
6838 7733807 9333394 11012546 12860447 15224020 17903613 20235626 22046563 23231592
6830 23231592 23482099 22834985 21334061 19231950 16799865 14376601 12269608 10378091
6822 10378091 8809702 7602585 6468749 5455762 4721410 4437668 4331229 3962071 3403151
6813 3403151 2895935 2461420 2297251 2316336 2117335 1753986 1642267 1653986 1487946 1456096
6803 1456096 1565901 1297958 904028 731805 692106 768153 844831 932872 983749 850688
6793 850688 563708 385406 300160 322018 290608 312799 449860 413959 421774 517935 670870
6782 670870 715908 631800 584511 630613 561476 572124 749110 720304 618911 498202 529959
6771 529959 595506 593118 529478 571257 818208 927334 844186 724439 441832 374677 578772
6760 578772 750905 820810 653198 444676 488825 490351 308992 209650 294333 497179 838122
6749 838122 828275 525945 428471 496171 427615 382516 471000 622042 617032 562956 647021 514034
6737 514034 276633 74366 -39055 -89961 -97333 -22107 107370 183607 227883 280335 210204
6726 210204 56487 66397 339053 399228 340420 360612 479332 700760 770308 654578 659624
6715 659624 702697 661404 464880 364785 438775 415161 268379 271899 281150 155999 -6679
6704 -6679 -296929 -483598 -276169 33145 178140 143094 -58163 -206662 -239653 -67931
6694 -67931 122272 191351 407207 398655 232490 161839 109790 -74924 -201335 -86268 86797
6683 86797 76368 -134311 -142708 -188326 -288963 -169264 2691 102434 299325 406732 345349
6672 345349 176173 95703 3503 -124923 -241381 -377750 -349637 -102540 97012 271128
6662 271128 282703 101137 48714 112704 277422 269004 -8531 -156007 -99136 122178 366072
6651 366072 514961 427725 291916 173231 126872 130353 120980 258652 503377 755271 581042
6640 581042 271023 105271 138460 331506 284397 291337 354008 296515 273456 347542 400797
6629 400797 436923 483185 564266 830742 1306452 1465641 1220406 764851 429792 266517
6619 266517 189740 288657 363269 334026 133629 2080 -146868 -269935 -280225 -317054 -278550
6608 -278550 -10291 167227 140986 165195 186834 243279 416909 383157 394432 385492 210934
6597 210934 70191 90950 213321 281523 267314 246956 320751 205275 107675 175679 230730
6586 230730 153035 115536 93654 -120886 -207812 -25108 109849 25945 -11865 -46308 -118624
6575 -118624 -141602 -75725 -141524 -336809 -544111 -827910 -940088 -761502 -716234 -741928 -572846
6564 -572846 -378098 -299277 -235923 -315546 -300708 65708 220899 158370 18646 -82138 -206966
6553 -206966 -234299 -189155 -39945 164567 279707 159060 -89395 -38378 121550 51637
6543 51637 81730 270580 334437 296354 242920 158871 171645 309970 276622 203743 270407
6532 270407 270903 175026 -173862 -260860 -78715 -13961 -41075 -255867 -298814 -280962 -261019
6521 -261019 -180946 -136004 -99567 -73416 -90944 -146371 -125339 -84800 -10522 -50740 -113213 -37535
6509 -37535 37260 -77355 -279827 -398161 -278453 -129406 -168884 -68691 66626 143201
6499 143201 114907 75751 -45440 -102544 -133340 -85892 83159 -7933 -299438 -198247 34124
6488 34124 253431 516089 479147 255187 69506 50399 101620 52854 -28103 -125696 -118645
6477 -118645 -6975 -53139 -164658 -343280 -532687 -474750 -407216 -344417 -363240 -443346 -472900
6466 -472900 -396085 -510032 -580547 -472664 -404101 -198471 -124326 24040 99073 166849 331208
6455 331208 356142 233566 46984 -63139 -70730 -59073 -7397 -132419 -172300 -58725 64274
6444 64274 21869 -82093 -70182 139607 386276 418176 324984 98203 -148057 -253288 -200811
6433 -200811 42476 152072 222776 246555 43207 -91142 -231622 -343784 -149975 208184
6423 208184 409172 383895 196888 -34029 -12389 37991 58011 9422 -34177 113066 130736
6412 130736 117191 365747 619624 611046 485736 435431 353549 192496 -10938 -28277 -63976
6401 -63976 -139885 -78097 -224389 -171175 120927 335308 354724 188622 141016 125178 24421
6390 24421 -49952 -65975 -143641 -217451 -127523 -8151 -122875 -239288 -233953 -125181 147076
6379 147076 250940 282120 323345 305591 334766 336812 175208 51205 10724 32648 -113506
6368 -113506 -371247 -281978 15102 31669 -255336 -536140 -473997 -261866 74252 198571
6358 198571 28661 -86884 -137267 -212339 -276152 -329746 -327217 -31811 270428 205726 36450
6347 36450 -7975 -39193 -93745 -218729 -383184 -381624 -282293 -290449 -276927 -249502 -158416 -123426
6335 -123426 -145871 -63747 77960 138874 91114 130177 75856 -50112 -102002 -55628 -17101
6324 -17101 20960 112691 50336 -103994 -218878 -255158 -62478 -17067 -83506 -36777 115742
6313 115742 172518 66741 -25965 31871 172719 133434 -91360 -139235 87157 152717 -39783
6302 -39783 -166982 -100933 62875 46662 -44158 -170223 -87352 67207 286490 473240 348951
6291 348951 130782 7187 37499 268987 371220 419547 467234 298813 219446 178800 171971
6280 171971 184832 193715 81779 90811 202948 168767 134114 318097 304890 11763 -200925
6269 -200925 -193435 -178541 -141836 -187472 -126448 35064 144779 279616 353683 265874 -39134
6258 -39134 -399729 -310155 -135893 -241391 -259558 -179395 -114554 -34827 18439 114417 264122
6247 264122 247397 205145 176861 66454 -259084 -476796 -583480 -566769 -405620 -223815
6237 -223815 -238015 -179104 -131120 19593 223757 286861 316082 309421 162629 169336 298222
6226 298222 443805 382017 20759 -277288 -377645 -331642 -369531 -445501 -357622 -224050 -199027
6215 -199027 -89413 -27016 171788 211551 -31041 -205764 -59280 195598 264369 104094
6205 104094 -192730 -394992 -500682 -353882 -16551 187643 140489 28511 -81285 -72944
6195 -72944 -28442 -86705 -29807 190642 279791 270677 396837 478507 483752 281500 -20907
6184 -20907 -159841 -176518 -182651 -74942 -169280 -303501 -453525 -531882 -440094 -274198 -228344
6173 -228344 -269203 -234092 -74941 -127423 -319900 -319982 -231687 -249229 -247926 -92320 207955 384895
6161 384895 368702 445909 377202 24390 -135968 -47902 -24717 -64139 55277 143164 59360
6150 59360 38233 -79950 -206128 -78733 52179 165005 324075 337407 423234 448576 269745
6139 269745 158951 48438 -114027 -408353 -589004 -564644 -439572 -370096 -364190 -198477
6129 -198477 -111387 105631 530116 732395 809411 794246 813614 909027 892610 582259 283860
6118 283860 208101 -21671 -381682 -605729 -528720 -425648 -274509 -85050 26590 -74911
6108 -74911 -263335 -232613 -165906 -122732 -120162 -171188 -315231 -386369 -359543 -389913 -283737
6097 -283737 -43923 190525 263206 236552 305956 384608 531975 653430 752984 756918 513489
6086 513489 264931 106998 125643 404734 604398 435965 243663 156114 -3685 -102769
6076 -102769 -77413 -59658 -85555 -148147 -289576 -190865 -10591 83067 26069 -38500 2219
6065 2219 115080 176161 107059 59256 100759 293375 259989 294974 471360 219258 -161963
6054 -161963 -269582 -226441 -366861 -520106 -287463 -31588 54680 134276 188540 196686 151627
6043 151627 247165 222389 -94183 -273864 -217038 -151941 -214825 -233813 -159412 -261870 -310157
6032 -310157 -57076 46233 102948 95652 172902 148955 -13637 -90835 -141361 -73551 13904
6021 13904 63298 -53438 -276007 -217142 35302 134291 95765 9725 -97193 -4389 244776
6010 244776 294965 281450 168892 -78163 -114951 -87613 -68509 -122929 -86805 157946 244151
5999 244151 375773 516702 362627 129302 -20347 30519 153497 196654 133394 27869
5989 27869 -205465 -427159 -555803 -473592 -176813 25140 -10869 -45545 -29345 148451 231531
5978 231531 371514 527718 599940 553836 539242 592804 707100 730283 620444 376466 191850
5967 191850 112251 -110240 -327444 -402860 -239984 -165989 -243371 -110402 120693 149283 85780
5956 85780 102990 147570 170942 222962 259688 120425 -96073 -126728 -38540 -217008 -430832
5945 -430832 -337568 -302581 -417439 -380366 -137575 24058 88607 -66075 -312211 -397151 -285854
5934 -285854 -174332 -39946 17754 36719 68668 46015 -12869 -79668 -72740 6098 -161909
5923 -161909 -245964 -64836 165202 436777 595390 674442 794301 871451 916874 729208
5913 729208 323859 123918 64132 53846 143228 14254 -130528 -78416 -187858 -385407
5903 -385407 -332995 -188280 -256471 -262328 -134186 52687 122695 44666 147508 140650 176192
5892 176192 328071 388336 231341 138686 133480 93167 75693 8936 81089 263211 453509
5881 453509 481110 460734 414356 405014 341467 33063 -285401 -299758 -267629 -135355 -36967
5870 -36967 -41060 -132718 -219827 -393482 -420402 -405908 -495606 -440907 -244414 -140504 -261782
5859 -261782 -377772 -323491 135594 440113 492640 456037 470654 483866 430589 294599 137614
5848 137614 86845 32178 -85335 -48333 7993 1126 101415 251932 323250 412996 382056
5837 382056 193338 74243 61043 248790 332326 340616 351669 330905 294740 396828 685941
5826 685941 858637 671352 429462 282670 88696 167005 301847 363076 169705 -57572
5816 -57572 -283845 -404622 -249941 -128716 -45770 -35444 -285816 -441419 -434029 -296698 -322402
5805 -322402 -317073 -165019 -46908 -35677 5364 5497 70614 284713 365673 332337 239507 132736
5793 132736 57084 118650 -19409 -217197 -213951 -175502 -358952 -428147 -306714 -126203 -7715
5782 -7715 64239 19395 94328 217674 211507 227254 258158 207641 254998 346678 266268 270680
5770 270680 378419 512162 546008 394895 326669 303738 292913 284340 57159 -256431 -377066
5759 -377066 -313174 -204186 -138209 -229657 -524082 -657491 -542014 -468219 -458966 -246873 -123868
5748 -123868 -124291 -72065 -50658 52672 58502 -91185 -319717 -394508 -175812 26404 57173
5737 57173 100053 31402 -4358 52469 5182 121526 219027 270292 276289 358527 464215 272375
5725 272375 98027 -85583 -367872 -408887 -251899 -145769 -217803 -314223 -246076 -121075
5715 -121075 12247 77071 209417 172512 52445 31822 -49964 -262825 -486630 -411094 -376502
5704 -376502 -509676 -490459 -298326 -110021 -71421 -235941 -274853 -101064 49579 12043
5694 12043 -150022 -205083 -156938 10567 167533 290888 390332 350502 248032 89318 -58537
5683 -58537 -12394 -7196 -169004 -138121 -51580 -78443 -203967 -329518 -356435 -436638 -257571
5672 -257571 -21285 94229 160942 157625 143560 119200 80038 -55522 -47137 -112282 -284960
5661 -284960 -53882 226232 218157 99050 -70346 -249522 -454326 -581832 -563079 -348726
5651 -348726 -65328 -100738 -318841 -397287 -347809 -449326 -567944 -508709 -448379 -280344 164653
5640 164653 363469 317265 170665 106933 88272 -107894 -162778 -79463 -816 8793 61055
5629 61055 103559 141807 175889 109167 90622 -71695 -292425 -237753 140733 490985 615750
5618 615750 533843 365198 314864 204703 117718 113743 144682 -51102 -391131 -576756 -713333
5607 -713333 -604371 -292723 -81264 -58396 -190480 -315963 -323156 -254208 -242495 -123542 17596
5596 17596 111602 163546 98172 -86213 -229016 -266836 -280080 -193619 -221466 -317625 -216648
5585 -216648 -75988 -79585 -73249 -194424 -413743 -453825 -366630 -364669 -66320 237013 174130
5574 174130 -107688 -162680 -85994 -117595 -135224 -14768 61743 -15937 -119253 -66206 194674
5563 194674 293474 252002 123610 -13624 -5659 -133119 -271693 -296204 -458982 -443248 -217670
5552 -217670 29833 143506 111830 72960 105157 188617 193039 108197 -62422 -168652 -99032
5541 -99032 -89480 -108517 -7543 -41806 -123593 -99908 13645 -80529 -230025 -191770 -300670
5530 -300670 -458225 -456290 -294173 -47446 -7608 -130939 -177426 -81324 36846 14859 16972
5519 16972 -25036 -315186 -508435 -334765 -155244 -46706 85824 108228 177703 293058
5509 293058 331018 179486 124108 148087 -61613 -263826 -118907 157108 171158 363769
5499 363769 528807 592853 627225 573819 427225 247567 27971 -146747 -265335 -157389
5489 -157389 -91263 -369856 -502271 -457888 -438083 -434771 -387558 -285362 -177256 -132155 -218593
5478 -218593 -277633 -326606 -358174 -210400 -68169 -240294 -336996 -276692 -258045 -223371 -107067
5467 -107067 -207313 -373243 -431090 -409644 -380461 -230966 -137572 -179051 -115268 -3657 281051
5456 281051 530814 516947 462260 461009 486314 461033 407149 324100 220174 190175 258321
5445 258321 353340 262331 21720 -61779 -7745 -15828 -110090 -258327 -390562 -442189 -451528
5434 -451528 -543663 -583071 -426107 -115160 197891 231930 157627 102405 145049 227018 337534
5423 337534 394597 411683 297262 298676 440239 432781 233311 169788 183592 129494 50548
5412 50548 102686 120577 114159 121801 67061 52121 103073 118375 -33440 -235065 -334592 -312881
5400 -312881 -405481 -254801 9128 -30164 -207919 -186750 -72213 -120022 -227857 -140274 -134047
5389 -134047 -184425 -269984 -304522 -284935 -171095 -178015 -167789 27443 295795 431294 434576
5378 434576 230760 -36915 -160545 -42650 200887 281637 315836 291196 257540 144736
5368 144736 -91330 -117005 -68514 -203362 -342033 -367477 -253440 -228426 -363441 -427213 -432423
5357 -432423 -376419 -139182 -44333 -47576 33456 122048 123510 13943 -14855 -30693 -178927
5346 -178927 -263961 -165046 4167 57873 -16369 -108512 4028 79849 -20982 -128038 -44638
5335 -44638 202320 418186 593616 651182 686298 596894 657615 855096 1063556 1250440 1476210
5324 1476210 1785114 1998615 2021298 2141784 2622381 3259525 4032027 5202870 6743491
5315 6743491 8662025 11318851 15230271 21413793 30709990 42196569 50239996 47555957
5307 47555957 36931734 26651132 19204242 14278549 10971081 8512381 6782189 5512211
5299 5512211 4371599 3385162 2626327 2238890 2192403 2118388 1917493 1509576 1133795 843670
5289 843670 603040 543496 472270 489688 595605 650986 554035 718955 782028 768199 569426
5278 569426 362198 525447 719300 755284 697716 629024 753717 864620 743108 439326
5268 439326 250335 346393 437754 677353 807836 705193 710076 847004 769688 574475 141171
5257 141171 -145105 -81506 -68032 -85605 98303 281505 466203 627314 595314 493804
5247 493804 307070 45809 -5182 55765 164880 153314 119635 231946 361536 323161 261007
5236 261007 195130 140218 234000 301305 320618 448496 554033 550675 481762 484822 551742 529977
5224 529977 604177 712410 479799 268254 184670 -78611 -261730 -172694 -83289 -86960 -239378
5213 -239378 -132555 51126 14477 33195 98009 155719 330486 301916 268142 431204 630740
5202 630740 611451 519657 582447 585097 268550 45777 -43767 -57076 37043 175137 286790
5191 286790 336185 305367 205032 136975 137461 241199 257696 174195 157363 196251 282551 482765
5179 482765 630755 604680 489527 604537 577571 503879 360794 201794 99176 -105992
5169 -105992 -225877 -91541 42123 54846 228340 333294 231803 6834 -11181 137637
5159 137637 372448 459451 362445 330739 262170 280944 332115 381993 455089 429317 368364
5148 368364 303432 147364 27836 4394 53802 158827 257465 395115 439022 452653 669383
5137 669383 765623 554146 477531 385991 111240 7253 86419 124686 16948 91483 368107
5126 368107 672027 769047 519761 171392 -81427 -179714 -148524 -13489 219380 590729
5116 590729 717595 581668 558239 536470 420930 321793 342636 374702 430699 496194 472619
5105 472619 449918 519842 624919 611562 612380 798473 887520 843019 724452 755912 829026
5094 829026 864083 795116 478908 443278 600196 705794 990919 1312627 1570879 1714182
5084 1714182 1607890 1483637 1554689 1550959 1314318 1087012 1205932 1371550 1722467 2143002
5074 2143002 2399900 2463883 2430825 2645504 2862640 2960789 3265740 3589247 3870784 4217482
5064 4217482 4605594 5073193 5959008 7254846 8818285 10427832 12205408 14174096 16423482
5055 16423482 18805497 20982555 22624128 23185798 22480141 20821319 18674187 16349512
5047 16349512 14135831 12100751 10179907 8677665 7539263 6567336 5789461 5125299 4433679
5038 4433679 3704251 3195638 2887863 2563027 2393649 2381426 2375116 2160381 1760002 1498924
5028 1498924 1306863 1218387 1252431 1460501 1420156 1237672 1050871 1047644 1087881 1004481 1000627
5017 1000627 1043403 1042612 881140 752784 662552 627797 661427 761977 657494 337042 152873
5006 152873 118811 171202 257741 341620 548807 465492 456210 782029 1059712 1005950 816674
4995 816674 670399 596128 635126 654361 615608 323682 184216 353505 378040 306156 169058
4984 169058 91733 17811 20486 73999 118093 153460 29067 49310 287016 293560 335865 599621
4972 599621 522036 293417 114089 126460 29046 -114431 -114720 -4732 148270 247390 137367
4961 137367 -1306 9908 93258 224859 220827 305580 326251 115082 -21843 -2793 33125
4950 33125 10890 -172091 -411883 -443239 -238836 -87148 61462 42619 -171551 -259073 -77850
4939 -77850 83736 44023 -97680 -160465 24416 247031 368474 356997 321186 261026 142760
4928 142760 150529 250791 216847 78316 -31262 38052 106536 167516 225323 11139 -155456
4917 -155456 -144266 -15250 239868 299996 92011 13923 111505 174838 232866 60211 17874
4906 17874 188021 117738 -162438 -235940 -214676 -190103 -218638 -165062 -127230 -184108 -266284
4895 -266284 -369081 -330599 -137686 111155 362723 416676 336418 418131 497277 533749 558028
4884 558028 442530 430784 544945 530174 582358 678232 519244 249662 209446 466544 662694
4873 662694 869585 1062072 1032821 934323 899725 789362 613906 611012 447991 233034 192304
4862 192304 69154 -65323 79418 317749 518385 591289 529842 527755 555547 555338 469697
4851 469697 359258 428831 421463 219790 -27963 -259213 -272218 -296725 -429006 -437393 -396749
4840 -396749 -331239 -200858 -68186 205082 239443 182834 122885 159907 110312 -44911 -25329
4829 -25329 1459 -47855 -202075 -472882 -602635 -352847 -203880 -213899 -179480 -95407 131487
4818 131487 206472 83144 65390 273678 480585 597271 505770 147758 -79963 -136395
4808 -136395 -14674 153883 227972 196786 98366 -123337 -315467 -279164 -189144 -87187 -170810
4797 -170810 -302989 -316154 -138529 -86093 -205933 -203108 -139380 -146295 -142471 -138603 -96341 -70317
4785 -70317 -65011 86614 236428 293108 355987 251783 131275 65436 71938 249370 238523
4774 238523 106377 171827 317219 288020 390873 428803 287229 146112 43917 -63587
4764 -63587 -69188 -106801 -138403 -118219 47800 181472 224646 273191 315466 266436 289497 337969
4752 337969 386343 322515 446472 526054 375547 262260 226224 402864 530613 572309 675380
4741 675380 496818 225237 113720 60558 -40904 -71921 -138936 -220564 -162432 -176168 -44866
4730 -44866 38277 -94465 -141787 -158556 -252089 -183503 -157231 -93871 -3252 123839 232664
4719 232664 142509 36029 51575 166844 208622 141304 126018 51254 62598 53926 63001 236980
4707 236980 333158 379700 398215 347116 403413 461625 488006 280133 -53226 -388013 -621755
4696 -621755 -509105 -200767 -91477 -115003 -115228 -58589 -22136 -44055 -189476 -135614 -63188
4685 -63188 -45128 -107802 -78337 -60472 -158988 -303185 -400496 -268776 -47110 158716 182374
4674 182374 146423 149574 207432 137779 100117 -25107 -271696 -328003 -325458 -256363 -71112
4663 -71112 -139935 -167017 -74821 -54200 -155889 -177821 -163130 -153907 -165123 -162100 -87346 -42706
4651 -42706 -34061 -44305 -142507 -224250 -297273 -314157 -160159 48236 -37655 -232379 -260039
4640 -260039 -300893 -366162 -264515 -16765 253369 518127 637746 536747 352036 218233
4630 218233 121641 78255 73799 -24249 -196373 -311207 -219231 -64656 31473 28496 -166442
4619 -166442 -345248 -213355 -112513 -70025 -44706 -123505 -179677 -84683 17763 207735 245074
4608 245074 138917 258743 324747 338389 624245 918484 982602 887909 745154 647935 405887
4597 405887 -17097 -154147 -142569 -50226 183919 259288 130915 -222742 -414062 -410627 -259657
4586 -259657 -145668 -164409 -297771 -317497 -287774 -325427 -275917 -100010 12593 13362 -76504
4575 -76504 -184526 -234299 -130881 -33068 -99039 -102486 -70508 -97342 -15757 23951 -92580
4564 -92580 -181985 -86083 -29632 -31267 -59106 -132819 -199638 -203068 -148755 -87387 -80271 -104046
4552 -104046 -91136 -124883 42446 360528 477348 434281 306996 145732 -71711 -190992
4542 -190992 -274610 -342549 -211281 -244790 -371046 -299977 -111765 -185533 -414510 -333482 -112590
4531 -112590 5491 3956 -81309 -268960 -464395 -432626 -306964 -148971 -73369 -167797 -179478
4520 -179478 -148291 -162178 -184583 -98472 24298 -32037 -194204 -247023 -239685 -204443 -287306
4509 -287306 -453267 -364610 -109273 3791 25833 49556 -9027 -54125 -96209 35725 170492
4498 170492 125595 -19116 -267376 -312680 -27917 201240 188507 109843 93928 113907 188409
4487 188409 443252 483182 365562 428317 600472 705350 625213 510287 393831 273962
4477 273962 206848 247354 279917 263679 145685 103716 99431 34413 21041 77728 188314
4466 188314 132503 -30135 -106213 -213696 -303759 -27400 297317 494491 547843 364754
4456 364754 146810 47937 47567 -78381 -141645 -139967 -171406 -290501 -196876 47578 148891
4445 148891 263286 364423 445287 486237 531896 482340 321507 184648 154206 67951 -46026
4434 -46026 -176692 -162313 112554 84970 -30495 30471 48277 16345 -14505 -260710 -426437
4423 -426437 -449472 -467274 -453811 -490069 -364088 102363 438864 471588 606651 659515 532475
4412 532475 393577 91851 -90237 -104339 -411470 -516702 -310109 -194939 -116971 86494
4402 86494 191523 192835 332894 376669 404877 417149 389567 298217 310111 273821 31856
4391 31856 -328198 -662285 -727577 -699210 -599741 -347122 -269178 -268972 -459487 -508266 -343825
4380 -343825 -326205 -139590 -68544 35041 94737 82583 -27988 -84246 -217301 -296506 -362263
4369 -362263 -356659 -192504 -145783 -29430 109630 267050 325183 302395 197485 33017 98399
4358 98399 230417 230120 151304 35889 -148834 -360144 -519627 -419514 -397000 -372977 -100813
4347 -100813 91367 173986 237594 376472 391741 451993 428972 271160 107457 -84575 -118346
4336 -118346 -32715 -70940 34102 251056 370536 352030 165753 -103356 -93403 -28029 -91770
4325 -91770 -182974 -200450 -111725 -63144 -273826 -416988 -327301 -195829 -168583 -245234 -222154
4314 -222154 -119165 14435 206943 329099 293840 151958 70829 115738 43781 168562
4304 168562 331825 234033 120448 36233 -212039 -311635 -281137 -372000 -430070 -391773 -298123
4293 -298123 -109611 160826 329797 235839 78492 -60684 -43244 -23767 -79691 -14830 12471
4282 12471 79200 145707 18675 18995 93473 180578 327570 251654 -26670 -231057 -182630
4271 -182630 51483 223000 195961 108839 3617 -210419 -402138 -370900 -270404 -225082
4261 -225082 -298930 -262604 -283460 -191689 -15655 67335 58051 -91228 -23451 102399 27939
4250 27939 -9816 91933 24470 -179102 -332155 -388813 -333534 -202689 -16925 61624 108497
4239 108497 150913 96362 190615 277781 301739 191221 172195 104612 -37932 -62565 -12462
4228 -12462 -25385 -124784 -226635 -79946 140392 144670 117469 160062 238690 249005 256978 265144
4216 265144 175917 236402 229741 165864 113228 1527 -93432 -143583 -84026 25887 218684
4205 218684 157301 -112129 -258379 -247582 -176082 -87068 -72634 -19699 132239 247844 182538
4194 182538 116503 253939 450055 555894 637367 619937 456035 316486 154425 198436
4184 198436 316854 247187 108029 19882 -167863 -320667 -345708 -357763 -421649 -434802 -426307
4173 -426307 -437753 -408059 -282903 -176794 -133595 -34119 49199 224786 397134 521725 461085
4162 461085 358014 188432 11799 34190 21197 -72472 -195635 -190522 -134490 -116037 -48906
4151 -48906 -41446 -85389 -69552 -180338 -345842 -319822 -159017 -90705 -66448 -148892 -328448
4140 -328448 -228683 -57747 10029 -71992 164276 500985 493787 376190 288786 185995 158986
4129 158986 94766 58078 -38876 -221039 -182650 20826 262596 279894 116560 -27043 -12123
4118 -12123 89728 78542 32022 -58010 -252849 -369863 -520164 -491349 -307667 38424 188048
4107 188048 -10236 -186032 -211479 -63978 41243 83483 6466 -109705 -58306 -52165 -90660
4096 -90660 -148967 -153535 -129650 -755 66227 63391 3981 46289 236862 348439 420170 460960
4084 460960 528157 328816 111286 126570 275109 262626 186643 104196 -59462 -114116 -137226
4073 -137226 -316558 -344214 -223611 -184227 -72655 79194 182552 319564 566305 530099
4063 530099 219572 76366 131003 181550 213825 133653 7693 -74267 -6327 146781 359228
4052 359228 289918 -88014 -392535 -476791 -415347 -343047 -252431 -129063 22270 -54333 25754
4041 25754 124360 -1957 -233170 -227936 -144414 -293845 -406058 -403183 -448696 -417065 -354362
4030 -354362 -285686 -242152 -271040 -365047 -355115 -370252 -398183 -447798 -561993 -684206 -611010
4019 -611010 -483485 -500586 -412563 -297852 -387255 -400987 -374177 -502978 -527554 -470250 -516260
4008 -516260 -398782 -219663 -212644 -210218 -159802 -126245 -160177 -456845 -666573 -616474 -490824
3997 -490824 -323708 -194941 -258905 -246057 -125487 -62954 -52617 -91373 -165154 -245968 -280936
3986 -280936 -386393 -496350 -502564 -445124 -226942 -8928 -89094 -204595 -298764 -390025 -317400
3975 -317400 -206146 -142360 -40519 2540 30726 -99542 -299813 -390639 -429110 -431166 -277885
3964 -277885 -146177 -56193 -156421 -233732 -10633 171662 148083 122669 68020 -159934 -127204
3953 -127204 -106762 -257569 -239257 -309748 -307734 -230810 -191130 -94336 124830 178944 -47042
3942 -47042 -139306 -115363 -190519 -250527 -239895 -247733 -200137 -142921 -32872 -9073 -142328 -187195
3930 -187195 37876 168553 220178 287198 149464 -51947 -129479 -146840 -229578 -352432 -450186
3919 -450186 -323036 -167736 -79886 -33410 -188195 -170591 6234 55780 -15574 -184511 -255257
3908 -255257 -287662 -341146 -273772 -146516 -24305 182458 369524 341123 -92400 -356055
3898 -356055 -306743 -275836 -185618 -105641 -250729 -327234 -399619 -463892 -397989 -284265 -260156
3887 -260156 -346948 -469940 -474372 -451761 -335254 -30283 186797 874 -247781 -177942 34499
3876 34499 54703 -72175 -77429 -98213 -280128 -361924 -351268 -310951 -159031 192242 411716
3865 411716 342728 236786 277815 415377 428334 246946 160687 419547 466013 485063 471315
3854 471315 389048 160957 -137652 -366055 -368682 -159904 16931 109435 110625 81607 75916
3843 75916 -12979 -18231 68880 120137 145065 151708 124840 95844 -197758 -524018 -465567 -240856
3831 -240856 83394 216467 64452 -112829 -220544 -100890 -136539 -357215 -408680 -347504
3821 -347504 -203446 -221227 -67607 82630 -24235 -239575 -320513 -152695 65395 144223
3811 144223 134037 -3641 -163542 -157622 -193422 -332374 -603646 -716767 -363938 -40382
3801 -40382 102548 105975 8902 -29357 -220656 -379276 -350112 -145808 123247 364305 492460
3790 492460 256215 -34407 -262713 -364710 -384422 -238399 -104636 -55167 -128957 -144763
3780 -144763 -163666 -214916 -164962 -80081 -80099 -297683 -426566 -349211 -276820 -226015 -159558 -51586
3768 -51586 136522 228987 211608 220244 129945 66007 179926 79863 -231255 -365586 -339259
3757 -339259 -204565 -19621 -28557 -86263 -79771 -207044 -386324 -267703 -142608 109493 327146
3746 327146 186282 167969 180896 18482 -14338 24284 34185 -39859 -115522 -35426 -136446
3735 -136446 -482664 -533343 -244437 -6208 -2519 11166 42597 63688 -64277 -278702 -337343
3724 -337343 -341448 -467437 -454050 -321286 -82847 -24617 67340 10619 -73686 97103 391346
3713 391346 358022 14400 -59488 34103 32468 80721 145240 96946 -29602 -98814 -145160
3702 -145160 -145963 -221321 -206987 -48171 147182 130625 -161441 -225975 21464 270471 245449
3691 245449 98867 -2199 29581 52714 58420 14205 -115349 -216988 -206362 -95916 -81991
3680 -81991 -319502 -465907 -308982 -208688 -175349 -91964 -18644 92980 121880 226219 268159
3669 268159 -12611 -316647 -396539 -344786 -219091 -55219 204118 330134 154556 -79145
3659 -79145 -103196 -99103 56258 149312 -3072 -122798 -43007 16847 -31161 -162940 -293505
3648 -293505 -345205 -287196 -255891 -102700 -58640 -90597 -142176 -76192 174296 414154 315349
3637 315349 111697 3401 30068 263665 501424 464127 305738 253728 369504 474624
3627 474624 497180 587893 419386 203540 213696 148306 238780 325115 199167 9436 -166004
3616 -166004 -118135 -149210 -202444 -222785 -201257 -155606 -231030 -384784 -470866 -530703 -384791
3605 -384791 -225710 -252773 -198839 -58870 -61367 -75902 -51678 -155750 -138532 -183555 -167460
3594 -167460 -289779 -493018 -441039 -402021 -309106 -127227 -14006 -12382 66468 78183 8453
3583 8453 -124082 -104224 11432 205332 342737 308022 125643 -3811 -798 164978 207929
3572 207929 85299 128986 320336 520098 768221 791446 706408 703818 497974 199668 140334
3561 140334 332395 493902 500614 594925 656522 493531 481730 463291 372082 282665 144137
3550 144137 88464 46412 113678 300736 270097 253650 192836 45079 63499 63552 -93481 -267236
3538 -267236 -363021 -147239 18925 70232 248705 198657 -106570 -256630 -214273 -326317
3528 -326317 -493488 -515493 -514610 -457496 -272007 -188992 -103459 36259 178897 140155 -164539
3517 -164539 -252828 -126794 -29017 -34604 -130422 -32354 81019 123756 79446 -44954 -199213
3506 -199213 -265439 -156196 64258 90430 -90415 -134986 -173824 -254146 -512145 -587656 -702449
3495 -702449 -819313 -675255 -445034 -205008 -186126 -301184 -151614 -96747 -256967 -482172
3485 -482172 -594967 -515638 -592350 -588124 -561898 -592933 -649694 -504619 -388243 -391229 -427493
3474 -427493 -406773 -254579 -197168 -266650 -162129 -76243 -30671 -119344 -111505 -7013 -4488
3463 -4488 65013 105642 -26711 -192481 -324201 -277204 -207271 -186446 -9067 106032 19114
3452 19114 -125092 -172235 -132701 -60709 14215 -50565 -158332 -115303 -109725 -124039 -180144 -235823
3440 -235823 -137242 -103131 -142989 -138918 -18914 125540 111297 53911 -136047 -200609 -144073
3429 -144073 -18256 178447 304334 211210 119177 60172 45955 8987 48946 18667 -68044
3418 -68044 84289 258252 425994 661913 763969 695537 286074 -217733 -366717 -275427
3408 -275427 20662 162495 170579 281536 396458 393646 196118 -58044 -88055 45787 185301
3397 185301 268735 418997 512585 307430 88277 12064 166796 335049 395086 376323 479078
3386 479078 677065 702911 503227 240711 -170187 -327835 -143648 -128335 -309967 -468544
3376 -468544 -414028 -417529 -356316 -199141 -122701 -151925 -274761 -325274 -192220 -29053 38411
3365 38411 55358 -112581 -307485 -248232 -252060 -235828 -141720 -110008 -94997 114306 162040
3354 162040 79490 -28641 -103228 -91423 -151195 -177726 -129461 -61815 -174970 -366719 -531399
3343 -531399 -601212 -424977 -67935 264407 350202 409237 289116 -43881 -223602 -231046 -27350
3332 -27350 25426 -227595 -154133 -13565 -14199 20751 206219 358102 330432 349541 377603
3321 377603 177229 -18171 -92778 -130490 -12539 58406 290786 299027 107022 -46399 -179313
3310 -179313 -239754 -143802 -56600 -139815 -293941 -326706 -265329 -95707 -56763 -55866 -66170 -45321
3298 -45321 -56126 -97241 -130373 -109835 -202709 -274096 -15690 120148 17989 -109390 -163337
3287 -163337 -264990 -322417 -447695 -406992 -372082 -230240 41683 139732 79937 -42734 -264304
3276 -264304 -308740 -82089 60075 148688 117821 -176585 -437374 -554698 -588121 -446604
3266 -446604 -419902 -444263 -549294 -564233 -405598 -373120 -334098 -229514 -220745 -304787 -339236
3255 -339236 -279522 -182484 -180156 -308806 -383409 -412256 -287134 -156369 -66134 5877 -35368
3244 -35368 -15678 189105 243775 27537 -212920 -318758 -416471 -542661 -499945 -333007 -146602
3233 -146602 -45067 62208 105541 100771 4773 27766 80409 80598 13618 -29693 132833 113716
3221 113716 -1217 20086 91100 172202 302815 364411 394545 212023 -23797 -157302 -116006
3210 -116006 -174888 -184481 -140628 5386 122184 -1520 56872 152956 161211 39906 -127844
3199 -127844 -6805 213682 335210 406146 226362 31838 23279 21358 954 -45414 -27766
3188 -27766 -36509 -198402 -178067 -192879 -251360 -275977 -333655 -473773 -570628 -395174 -125967
3177 -125967 18151 29859 -195850 -200131 -102720 47587 179629 164824 197222 357853 573034
3166 573034 469373 94697 -187713 -299941 -345353 -302670 -424441 -349310 -86993 92329
3156 92329 180826 114458 171083 367296 366633 142736 3442 38040 120334 160048 300987
3145 300987 478270 601263 566857 458947 366074 206979 84784 -78596 -165215 -226622
3135 -226622 -310523 -273590 -152067 -94813 -26754 127112 193470 161443 118630 132351 -50715
3124 -50715 -281932 -290785 -91252 138724 43673 -245516 -295555 -258971 -263134 -235655 -85765
3113 -85765 -65157 27950 132153 34664 -118336 -175029 -113305 53816 132514 101884 110021
3102 110021 186183 17675 -349262 -393312 -155659 -6411 -28629 -27675 136729 192836 90302
3091 90302 103404 37753 12568 -6556 -149708 -164992 42574 -12076 -49502 20871 43602
3080 43602 13802 105165 159430 148811 90279 -75345 -84364 -42932 -37448 -43191 101025 133026
3068 133026 -36108 -64644 -57166 -109080 -107003 -99148 -174634 -274538 -198370 -99805 -64726 -242907
3056 -242907 -358561 -151556 55016 153019 184618 210613 77343 -79831 -171205 -118498 51655
3045 51655 146943 127837 167874 49174 -223526 -200427 -172933 -261667 -443545 -553415 -657513
3034 -657513 -669886 -636137 -577879 -319504 -181270 -60647 70967 139028 -46077 -225665
3024 -225665 -127075 28075 113255 144956 200271 53354 -63066 -12496 -74989 -201724 -279699
3013 -279699 -183758 13810 268328 486083 494261 341883 324429 329728 199799 76624 -32667
3002 -32667 -59225 -54854 -21912 23691 136200 313475 344460 373156 415861 281496 59503
2991 59503 -263456 -427334 -362959 -265624 -213686 -183716 -155505 -55039 191121 233961 -43890
2980 -43890 -45936 169685 328352 332945 288338 236932 120798 30448 -91737 -237592 -150810
2969 -150810 153608 273435 162995 29456 12983 106459 134197 -3031 -25458 100614
2959 100614 124515 39465 21606 10403 -76921 -121131 24250 38871 -327385 -516581 -442117
2948 -442117 -598969 -669640 -493816 -297171 -219566 -229342 -344792 -632005 -764506 -626735
2938 -626735 -485741 -291729 -225856 -264549 -137562 76983 129289 131010 103730 199222 213964
2927 213964 63484 -2132 131438 251879 297935 308470 208496 52789 -107907 -205401 -385835
2916 -385835 -484764 -283684 -144199 -112243 -289071 -400852 -363928 -447161 -324081 -54548
2906 -54548 47395 253620 571499 611122 487604 284059 -54768 -174329 -75593 158754
2896 158754 305168 282493 82867 -152705 -136845 -147434 -274340 -299396 -295679 -195020 -79772
2885 -79772 105406 234278 261257 249577 225983 102092 -138124 -232181 -262554 -276135 -326155
2874 -326155 -410659 -541988 -508184 -371633 -313968 -150501 154599 371900 476799 405482
2864 405482 331975 355528 342438 155428 -56229 -71014 91830 97090 -16844 40308 25375
2853 25375 -36407 -15816 -145683 -128170 -38244 -205308 -367694 -321538 -122113 105206 86275
2842 86275 -12269 -68320 -118003 -116568 -382596 -503165 -451543 -480365 -360467 -129766 159061
2831 159061 422770 368616 146330 140869 376204 505730 364477 211166 -80270 -306757
2821 -306757 -273881 -248002 -332369 -285904 -324449 -391705 -397365 -308181 -238404 -146344 -18017 10028
2809 10028 22764 89702 288233 304355 29800 -88256 8957 47926 17099 4529 -74862
2798 -74862 -251246 -344951 -267173 -164481 -51602 51755 49513 -83507 -63482 169922 348626
2787 348626 166985 18550 -17972 -220082 -261511 -1803 146806 113127 31160 25890 60367
2776 60367 56143 36162 26619 -70403 -143216 -149273 -141329 -152434 -176038 -296846 -393348 -164377
2764 -164377 93217 56295 -42061 -65883 -50057 -12821 139451 338662 387379 370525 342248
2753 342248 100097 -235657 -465111 -572506 -443033 -197772 132156 352490 392194 372240
2743 372240 313627 120554 -97632 -264175 -307567 -108394 54911 -64067 -97092 20024
2733 20024 25980 -857 68728 194238 269160 94253 -245843 -471875 -710714 -730110 -633663
2722 -633663 -551747 -403275 -361277 -377599 -447786 -408563 -248279 -152230 -272392 -318832 -129172
2711 -129172 -10839 -57802 -186751 -402693 -455868 -288697 -223331 -282647 -427627 -533250
2701 -533250 -549758 -483020 -382644 -347993 -352283 -384700 -575707 -723727 -599398 -583837 -425396
2690 -425396 -132755 62963 84008 -47640 8859 139640 131074 -115859 -345485 -421676 -412555
2679 -412555 -388213 -227925 10317 66638 260548 435896 419190 332728 273200 149305 35212
2668 35212 129994 207961 169570 244548 262661 210725 17461 -111258 -147628 -221743 -318541
2657 -318541 -318735 -243299 -88583 -61079 -262119 -267669 -50582 50560 87701 164658 317762
2646 317762 287764 119314 -46881 -14316 119291 -24232 -174913 -109276 58067 191075
2636 191075 270390 413456 451867 402778 301705 165587 87847 34824 240502 218472 115620
2625 115620 45189 -136457 -386162 -520742 -536247 -486807 -351117 -249765 -153871 32760
2615 32760 90634 136828 41471 -89146 -74878 -130184 -326178 -373083 -185200 -131517 -83490
2604 -83490 -56 -155444 -269231 -290847 -98546 103905 -24323 -94759 7852 -102807
2594 -102807 -298494 -258146 -201179 -243468 -306486 -195676 -84021 -262243 -466579 -445336 -384938
2583 -384938 -356692 -439275 -549145 -622652 -513860 -477801 -500614 -396608 -242477 -152803 -36742
2572 -36742 103416 110565 187753 338046 297933 228643 144044 12663 -39452 -75906 -91573
2561 -91573 -109988 -281372 -315314 -269388 -353998 -317465 -382510 -385113 -253290 -17194 -42632
2550 -42632 -38745 65584 166596 156776 8238 -181552 -150594 -46986 -70815 -14819 158362
2539 158362 265482 159864 36489 -50605 56489 85741 111055 119573 -114814 -386949 -390997
2528 -390997 -275570 -225596 -264684 -431125 -516369 -313568 -150920 -271725 -336641 -229792
2518 -229792 95276 431141 447953 262620 -127551 -331288 -209860 -14176 69982 -125400
2508 -125400 -314109 -442351 -437166 -469337 -517801 -570694 -465104 -340247 -356467 -464774 -555454
2497 -555454 -491583 -404420 -287536 -164893 4594 162937 276890 140402 -37766 -85814
2487 -85814 75350 191744 102179 62974 151526 64229 -60270 -123987 -201090 -184288 -235966
2476 -235966 -523569 -598172 -335147 -33985 1763 -123000 -56049 997 -175080 -144647 52269
2465 52269 78040 71843 -33937 -212515 -222125 -142634 -157591 -306240 -192347 -43895 -53002
2454 -53002 101232 126205 -2346 -64663 22293 264327 580692 919024 1282135 1389880
2444 1389880 1101602 710595 483802 404859 409699 540788 600641 571168 468321 336766
2434 336766 103616 -662 -102117 -283068 -249938 -232004 -375311 -433221 -341122 -383682 -359967
2423 -359967 -148937 -80405 3837 237770 488465 483977 285136 145566 16369 -16256 35686
2412 35686 10198 -135102 -390569 -527929 -492819 -376366 -210945 -19999 -37297 -98465 75264
2401 75264 -26711 -178570 61514 176990 147827 253267 364495 332690 276920 166240
2391 166240 123082 297153 498805 386923 91824 -68143 -150780 -290097 -409813 -454667
2381 -454667 -323736 -111440 30198 283940 285443 104719 22417 4112 136623 246593
2371 246593 324917 498946 437825 285451 279031 210630 177590 107395 118253 190427 42030
2360 42030 -200278 -342769 -433982 -401365 -163727 -31037 -49582 -98057 -177801 -164201 -170010
2349 -170010 -277233 -284104 -137073 -24830 -72924 -93746 -160872 -184021 -90695 -145002 -296065
2338 -296065 -205512 16296 131510 46563 -97457 -157207 -155642 -172822 -115016 -30787 -162321
2327 -162321 -302851 -327395 -331241 -193788 14877 164123 198442 -19032 -193078 -187447 -84102
2316 -84102 139114 320218 240612 108725 122093 43959 115214 170984 127082 40199 -52815
2305 -52815 -312745 -288397 -259743 -376886 -363254 -290299 -143107 39735 -86146 -301033 -332600
2294 -332600 -331541 -269821 -232728 -404334 -438064 -250600 -73468 332 78422 221512 111562
2283 111562 73386 109239 2083 -143089 -63300 57315 1084 -68669 -155639 -212363 -108239
2272 -108239 -58933 -64320 -55995 -75150 -197060 -436434 -499207 -431257 -393358 -325964 -335495 -395195
2260 -395195 -311363 -51494 95394 205971 72942 -157637 -119293 218855 265754 37800
2250 37800 -90893 -99671 47664 78361 -33665 -109151 -2729 183467 205138 327085 513389
2239 513389 351512 237160 248845 215891 166438 -4402 -240670 -335393 -307106 -260068 -147548
$$ [...]
##END NTUPLES=NMR SPECTRUM
##END=
