##TITLE=C13_CG-2352x
 DMSO, 22200 sc

 1.6.2022
##JCAMPDX= 6.0         $$ Bruker NMR JCAMP-DX V2.0
##DATA TYPE= NMR SPECTRUM
##DATA CLASS= NTUPLES
##ORIGIN= UXNMR, Bruker Analytische Messtechnik GmbH
##OWNER= root
$$ XWIN-NMR		Version 3.5
$$ Thu Jun  2 13:40:03 2022 Russian Standard Time (UT+4h)  she@DPX200
##.OBSERVE FREQUENCY= 50.327896
##.OBSERVE NUCLEUS= ^13C
##.ACQUISITION MODE= SIMULTANEOUS
##.ACQUISITION SCHEME= undefined
##.AVERAGES= 17060
##.DIGITISER RES= 17
##SPECTROMETER/DATA SYSTEM= spect
##.PULSE SEQUENCE= zgpg30
##.SOLVENT NAME= CDCl3
##.SHIFT REFERENCE= (INTERNAL, CDCl3, 0, 222.089)
##AUDIT TRAIL= $$ (NUMBER, WHEN, WHO, WHERE, WHAT)
$$ ##TITLE= Audit trail, XWIN-NMR		Version 3.5
$$ ##JCAMPDX= 5.01
$$ ##ORIGIN= Bruker BioSpin GmbH
$$ ##OWNER= she
$$ F:/spectra/data/she/nmr/c13/1/pdata/1/auditp.txt
$$ ##AUDIT TRAIL=  $$ (NUMBER, WHEN, WHO, WHERE, WHAT)
(   1,<2022-06-02 08:44:13.32 +0400>,<she>,<DPX200>,
      <created by zg, POWCHK disabled, PULCHK disabled
       terminated by command 'halt'
       configuration hash MD5:
       00 E9 B6 7A A2 85 ED C7 34 08 36 98 17 FE 4E 26
       data hash MD5: 32K
       57 1E F6 5C 29 E7 30 BA C0 BE 5A B1 A4 53 A6 FC>)
(   2,<2022-06-02 08:44:17.17 +0400>,<she>,<DPX200>,
      <Start of raw data processing
       efp BC_mod = 2 LB = 1 FT_mod = 6 PKNL = 1 PHC0 = -361.5742 PHC1 = 22.56232 SI = 32K 
       data hash MD5: 32K
       DC 7A 45 25 A0 8D 16 77 0F 95 C6 24 95 00 06 6A>)
(   3,<2022-06-02 13:38:14.84 +0400>,<she>,<DPX200>,
      <pk PHC0 = -15.31092 PHC1 = 0 
       data hash MD5: 32K
       38 65 D7 30 58 09 62 E0 79 21 05 CC C0 11 7C 0A>)
(   4,<2022-06-02 13:38:18.75 +0400>,<she>,<DPX200>,
      <abs ABSG = 5 
       data hash MD5: 32K
       3A 8A 28 7B A3 44 2B A1 94 23 5A 99 9B EC E8 48>)
(   5,<2022-06-02 13:39:26.76 +0400>,<she>,<DPX200>,
      <pk PHC0 = -5.895562 PHC1 = 7.599999 
       data hash MD5: 32K
       62 65 C3 91 3D 67 B5 1E E0 95 E2 1A BF 2A A1 94>)
(   6,<2022-06-02 13:39:30.45 +0400>,<she>,<DPX200>,
      <abs ABSG = 5 
       data hash MD5: 32K
       DE 6B EF 3D 5B 4F 83 2C C2 0B 4B 16 55 09 CE B6>)
$$ ##END=
$$ 
$$ hash MD5
$$ DB D8 7A D5 86 2B AD 89 00 1E 7F 18 80 9B 59 E2
##$RELAX= 
##$RELAX= 
##$RELAX= 
##$RELAX= 
##$RELAX= 
##$RELAX= 
##$RELAX= 
##$RELAX= 
$$ Bruker specific parameters
$$ --------------------------
##$DU= <F:/spectra>
##$EXPNO= 1
##$NAME= <c13>
##$PROCNO= 1
##$TYPE= <nmr>
##$USER= <she>
##$AMP= (0..31)
100 100 100 100 100 100 100 100 100 100 100 100 100 100 100 100 100 100 
100 100 100 100 100 100 100 100 100 100 100 100 100 100 
##$AQSEQ= 0
##$AQ_mod= 1
##$AUNM= <au_zg>
##$AUTOPOS= <>
##$BF1= 50.322709
##$BF2= 200.13
##$BF3= 50.322709
##$BF4= 500.13
##$BF5= 500.13
##$BF6= 500.13
##$BF7= 500.13
##$BF8= 500.13
##$BYTORDA= 1
##$CFDGTYP= 0
##$CFRGTYP= 5
##$CHEMSTR= <none>
##$CNST= (0..31)
1 1 145 1 1 1 1 1 1 1 1 1 1 1 1 1 1 1 1 1 1 1 1 1 1 1 1 1 1 1 1 1 
##$CPDPRG= <waltz16>
##$CPDPRG1= <>
##$CPDPRG2= <waltz16>
##$CPDPRG3= <>
$$ [...]
##$SUBNAM4= <"">
##$SUBNAM5= <"">
##$SUBNAM6= <"">
##$SUBNAM7= <"">
##$SUBNAM8= <"">
##$SUBNAM9= <"">
##$SW= 239.972175391363
##$SWIBOX= (0..15)
0 1 3 0 0 0 0 0 0 0 0 0 0 0 0 0 
##$SW_h= 12077.2946859903
##$TD= 32768
##$TD0= 1
##$TE= 0
##$TE2= 300
##$TE3= 300
##$TEG= 300
##$TL= (0..7)
120 120 120 120 120 120 120 120 
##$TP= (0..7)
150 150 150 150 150 150 150 150 
##$TP07= 0
##$TPNAME0= <>
##$TPNAME1= <>
##$TPNAME2= <>
##$TPNAME3= <>
##$TPNAME4= <>
##$TPNAME5= <>
##$TPNAME6= <>
##$TPNAME7= <>
##$TPOAL= (0..7)
0.5 0.5 0.5 0.5 0.5 0.5 0.5 0.5 
##$TPOFFS= (0..7)
0 0 0 0 0 0 0 0 
##$TUNHIN= 0
##$TUNHOUT= 0
##$TUNXOUT= 0
##$USERA1= <user>
##$USERA2= <user>
##$USERA3= <user>
##$USERA4= <user>
##$USERA5= <user>
##$V9= 5
##$VALIST= <valist>
##$VCLIST= <CCCCCCCCCCCCCCC>
##$VD= 0
##$VDLIST= <DDDDDDDDDDDDDDD>
##$VPLIST= <PPPPPPPPPPPPPPP>
##$VTLIST= <TTTTTTTTTTTTTTT>
##$WBST= 1024
##$WBSW= 4
##$XGAIN= (0..3)
0 0 0 0 
##$XL= 0
##$YL= 0
##$YMAX_a= 46146518
##$YMIN_a= -90919876
##$ZGOPTNS= <>
##$ZL1= 120
##$ZL2= 120
##$ZL3= 120
##$ZL4= 120
##$ABSF1= 222.0892
##$ABSF2= -17.90747
##$ABSG= 5
##$ABSL= 3
##$ALPHA= 0
##$AQORDER= 0
##$ASSFAC= 0
##$ASSFACI= 0
##$ASSFACX= 0
##$ASSWID= 0
##$AUNMP= <proc_1d>
##$AZFE= 0.1
##$AZFW= 0.5
##$BCFW= 0
##$BC_mod= 2
##$BYTORDP= 0
##$COROFFS= 0
##$CY= -3
##$DATMOD= 1
##$DC= 0
##$DFILT= <>
##$DTYPP= 0
##$F1P= 0
##$F2P= 0
##$FCOR= 0.5
##$FTSIZE= 32768
##$FT_mod= 6
##$GAMMA= 0
##$GB= 0
##$INTBC= 1
##$INTSCL= 4.134877e-10
##$ISEN= 128
##$LB= 1
##$LEV0= 0
##$LPBIN= 0
##$MAXI= 10000
##$MC2= 0
##$MEAN= 0
##$ME_mod= 0
##$MI= 0.1934396
##$NCOEF= 0
##$NC_proc= 3
##$NLEV= 6
##$NOISF1= 120.0001
##$NOISF2= 80.00006
##$NSP= 0
##$NTH_PI= 0
##$NZP= 0
##$OFFSET= 222.0892
##$PC= 1.4
##$PHC0= -382.7807
##$PHC1= 30.16232
##$PH_mod= 1
##$PKNL= yes
##$PPARMOD= 0
##$PSCAL= 0
##$PSIGN= 0
##$REVERSE= no
##$SF= 50.3227585034004
##$SI= 32768
##$SIGF1= 140
##$SIGF2= 120
##$SINO= 11.81781
##$SIOLD= 32768
##$SREGLST= <13C.CDCl3>
##$SSB= 0
##$STSI= 32768
##$STSR= 0
##$SW_p= 12077.2946859903
##$SYMM= 0
##$S_DEV= 0
##$TDeff= 32768
##$TDoff= 0
##$TI= <>
##$TILT= no
##$TM1= 0
##$TM2= 0
##$TOPLEV= 0
##$USERP1= <user>
##$USERP2= <user>
##$USERP3= <user>
##$USERP4= <user>
##$USERP5= <user>
##$WDW= 1
##$XDIM= 32768
##$YMAX_p= 312607304
##$YMIN_p= -1204080
$$ End of Bruker specific parameters
$$ ---------------------------------
##NTUPLES= NMR SPECTRUM
##VAR_NAME=  FREQUENCY,     SPECTRUM/REAL,   SPECTRUM/IMAG
##SYMBOL=    X,             R,               I
##VAR_TYPE=  INDEPENDENT,   DEPENDENT,       DEPENDENT
##VAR_FORM=  AFFN,          ASDF,            ASDF
##VAR_DIM=   32768,         32768,           32768
##UNITS=     HZ,            ARBITRARY UNITS, ARBITRARY UNITS
##FACTOR=    0.368581032318806, 1,           1
##FIRST=     11176.1413227862, 0,            0
##LAST=      -901.153363204117, 0,           0
##MIN=       -901.153363204117, -1204080,    0
##MAX=       11176.1413227862, 312607304,    0
$$ Real data points
##PAGE= N=1
##DATA TABLE= (X++(R..R)), XYDATA
$$ [...]
$$ plain form
10885 180215 91785 -255464 -491091 -503776 -480788 -450649 -119627 141110 14372 3034
10875 3034 -103548 -414076 -730491 -789208 -581197 -139628 207370 211737 34306 -48015 -109545
10864 -109545 -251427 -327006 -171801 -164318 -236184 -62805 153586 196893 94603 -32663
10854 -32663 -88931 -14076 -9966 -283746 -699314 -712144 -558171 -642393 -624616 -467021 -404526
10843 -404526 -455875 -314079 -69165 -21531 -52917 -136674 -271464 -209255 54262 242609
10833 242609 247246 148442 252766 431317 572178 485662 300169 105346 -160704 -447467
10823 -447467 -705373 -656294 -398908 -108827 -56 -36332 -51741 99848 232021 161203
10813 161203 -10722 -104792 -67770 23479 200102 425941 393225 400040 502770 531386 390060
$$ packed form
10885A80215q8430l47249k35627j2685K2988L0139L31022K60737j26738j1338
10875C034j06582l10528l16415n8717K08011M41569L46998M367j77431q2321o1530
10864a09545j41882p5579J55205P483p1866J73379K16391M3307j02290j27266
10854c2663n6268P4855M110k73780m15568j2830J53973q4222J7777J57595O2495
10843d04526n1349J41796K44914M7634l1386q3757j34790O2209K63517J88347
10833B42609M637r8804J04324J78551J40861q6516j85493j94823k66050k86763
10823d47467k57906M9079K57386K90081J08771l6276j5409J51589J32173p0818
10813A61203j71925r4070L7022R1249J76623K25839l2716O815J02730K8616j41326
$$ plain form
10802 390060 170649 116626 323271 290971 177958 -66063 -243089 -312345 -257126 -201251
10792 -201251 -348786 -370832 -354784 -227706 -106113 -102715 -82437 -89048 -129984 -2051 72526
10781 72526 43315 77128 108410 110792 232590 451628 626531 505629 330820 251457 153183
10770 153183 121296 237654 193012 -125623 -290786 -250289 -241970 -407749 -441412 -398524 -363738
10759 -363738 -264180 -282709 -398677 -269122 -107208 -168568 -240784 -176242 101954 277737
10749 277737 172775 15225 -94954 -168109 -381979 -554072 -437587 -302569 -330155 -461755
10739 -461755 -450613 -330791 -54561 131616 192177 225279 203884 175128 209807 212012 261674
10728 261674 305390 214562 63733 56814 413181 787182 773945 637955 493768 379027
$$ packed form
10802C90060k19411n4023K06645l2300j13013k44021j77026o9256N5219N5875
10792b01251j47535k2046J6048J27078J21593L398K0278o611m0936J27933P4577
10781G2526k9211L3813L1282K382J21798K19038J74903j20902j74809p9363r8274
10770A53183l1887J16358m4642l18635j65163M0497Q319j65779l3663M2888L4786
10759c63738R9558j8529j15968J29555J61914o1360p2216O4542K78196J75783
10749B77737j04962j57550j10179p3155k13870j72093J16485J35018k7586j31600
10739d61755J1142J19822K76230J86177O0561L3102k1395k8756L4679K205M9662
10728B61674M3716r0828j50829o919L56367L74001j3237j35990j44187j14741
$$ plain form
10718 379027 191080 -22872 1284 172241 172050 -103927 -145674 -42273 -115623 -228597 -245072
10707 -245072 -114923 59379 185630 220583 217770 6138 -74615 10881 -49952 -299817 -465148
10696 -465148 -416737 -232497 -89490 13734 -60079 -215469 -264612 -127499 -12706 14905
10686 14905 -15778 -2576 42978 91188 37419 -2031 -241445 -351456 -388837 -489787 -410395
10675 -410395 -429879 -495371 -287600 81850 115845 47110 154441 195102 -55628 -295075
10665 -295075 -369883 -352756 -287016 -179811 18679 150746 -9213 -219831 -316996 -398016
10655 -398016 -476442 -391461 -228401 -220032 -231071 -173158 -79641 84658 145531 -162 -11963
10644 -11963 -65385 -282920 -354332 -337176 -399133 -451116 -420258 -388656 -373671 -489236 -557856
$$ packed form
10718C79027j87947k13952K4156J70957j91k75977m1747J03401p3350j12974j6475
10707b45072J30149J74302J26251L4953k813k11632q0753Q5496o0833k49865j65331
10696d65148M8411J84240J43007J03224p3813j55390m9143J37113J14793K7611
10686A4905l0683J3202M5554M8210n3769l9450k39414j10011l7381j00950P9392
10675d10395j9484o5492K07771L69450L3995o8735J07331M0661k50730k39447
10665b95075p4808J7127O5740J07205J98490J32067j59959k10618r7165q1020
10655c98016p8426Q4981J63060Q369j1039N7913R3517J64299O0873j45693j1801
10644a1963n3422k17535p1412J7156o1957n1983L0858L1602J4985j15565o8620
$$ plain form
10633 -557856 -529019 -486768 -427393 -227583 -85906 -60055 -88537 -189306 -163607 -115792 -810
10622 -810 -68222 -240810 -311604 -297032 -324487 -477397 -619008 -671274 -756579 -604468 -412580
10611 -412580 -267214 -55185 125997 393883 537434 560302 397299 230728 145420 64890
10601 64890 41363 96682 120070 -42652 -255915 -481346 -613118 -519770 -363702 -205102
10591 -205102 -24184 73304 239331 405002 229616 -55640 -87419 -20948 -110593 -270732
10581 -270732 -283728 -176151 36456 270583 393328 393683 342860 288467 171096 69464 113272
10570 113272 216074 226381 143820 -11229 -261768 -552510 -803501 -984716 -1001393 -910159
10560 -910159 -787771 -680473 -661857 -718098 -570167 -336546 -345168 -375689 -325603 -429429 -468392
$$ packed form
10633e57856K8837M2251N9375J99810J41677K5851k8482j00769K5699M7815J14982
10622h10o7412j72588p0794J4572k7455j52910j41611n2266q5305J52111J91888
10611d12580J45366K12029J81182K67886J43551K2868j63003j66571q5308q0530
10601F4890k3527N5319K3388j62722k13263k25431j31772R3348J56068J58600
10591b05102J80918R7488J66027J65671j75386k85256l1779O6471q9645j60139
10581b70732j2996J07577K12607K34127J22745L55n0823n4393j17371j01632M3808
10570A13272J02802J0307q2561j55049k50539k90742k50991j81215j6677R1234
10560i10159J22388J07298J8616n6241J47931K33621q622l0521N0086j03826l8963
$$ plain form
10549 -468392 -239927 9839 18586 -126796 -101514 -110584 -119704 72562 237323 271866 346092
10538 346092 481202 530082 402717 55317 -165572 97536 448033 436797 202715 47050
10528 47050 63542 111657 113291 171255 163405 181444 289808 341273 291908 202254 89934 97529
10516 97529 260434 344035 408413 419295 125564 94045 242171 123932 33616 19688 43590
10505 43590 28743 -6634 146399 176131 135220 191727 191478 199183 152194 193060 203246 40929
10493 40929 51419 145010 147700 110880 181210 280059 251570 200733 188761 82741 48026 75998
10481 75998 76339 232264 397103 457683 387950 413395 334536 205862 81006 -156437 -349257
10470 -349257 -398041 -366771 -179890 54101 214839 243517 135216 -114097 -395610 -617590
$$ packed form
10549d68392K28465K49766Q747j45382K5282r070r120J92266J64761L4543P4226
10538C46092J35110M8880j27365l47400k20889K63108L50497j1236k34082j55665
10528D7050J6492M8115J634N7964p850J8039J08364N1465m9365q9654j12320P595
10516I7529J62905Q3601O4378J0882k93731l1519J48126j18239r0316j3928K3902
10505D3590j4847l5377J53033K9732m0911N6507k49P705m6989M0866J0186j62317
10493D0929J0490R3591K690l6820P0330R8849k8489n0837j1972j06020l4715K7972
10481G5998L41J55925J64839O0580o9733K5445p8859j28674j24856k37443j92820
10470c49257m8784L1270J86881K33991J60738K8678j08301k49313k81513k21980
$$ plain form
10460 -617590 -507737 -450629 -431543 -410707 -301240 -90861 76864 62049 -49602 -255978
10450 -255978 -416801 -478404 -454014 -187624 155395 327598 290306 34577 -94852 45098
10440 45098 111111 42522 116452 310213 307314 190186 56244 -41215 117524 353855 479287
10429 479287 233084 -53838 -282537 -358466 -476777 -392342 -206679 -56495 -10240 62539
10419 62539 190619 221861 162006 282003 387500 338559 216237 269767 308330 121794 56030
10408 56030 148531 218327 295332 221525 136197 273880 486186 599747 447443 178516 172099
10397 172099 211648 189207 224776 338612 471304 583039 612384 489673 447767 411404 385733
10386 385733 244409 278830 504997 683727 626779 595320 835516 969417 845615 737004
$$ packed form
10460f17590J09853N7108J9086K0836J09467K10379J67725j4815j11651k06376
10450b55978j60823o1603K4390K66390L43019J72203l7292k55729j29429J39950
10440D5098O6013o8589P3930J93761k899j17128j33942r7459J58739K36331J25432
10429D79287k46203k86922k28699p5929j18311Q4435J85663J50184M6255P2779
10419F2539J28080L1242n9855J19997J05497m8941j22322N3530L8563j86536o5764
10408E6030R2501O9796P7005p3807q5328J37683K12306J13561j52304k68927o417
10397A72099L9549k2441L5569J13836J32692J11735K9345j22711m1906l6363k5671
10386C85733j41324L4421K26167J78730n6948l1459K40196J33901j23802j08611
$$ plain form
10376 737004 701734 889608 1040570 953335 631881 572276 715100 983736 1184334 1220511
10366 1220511 1332314 1680563 2063856 2627582 3385888 4592006 6037225 7893159 10704403
10357 10704403 14933727 20891121 26217057 24887514 18591606 13013307 9376850 7351538
10349 7351538 5979348 4838206 4007614 3567263 3117050 2629348 2337659 2364354 2377154
10340 2377154 2231511 2055774 1923839 1840555 1809526 1793662 1507013 1301860 1334999 1233360
10330 1233360 1206053 1150471 1145689 904466 423132 179952 162099 287910 492217 525156
10320 525156 501115 567382 646814 700409 643027 431487 348559 467096 668667 734156 729738
10309 729738 598265 333496 110118 -36656 -65825 -81270 -152784 -297341 -233393 -104063
$$ packed form
10376G37004l5270J87874J50962q7235l21454n9605J42824K68636K00598L6177
10366A220511J11803L48249L83293N63726P58306J206118J445219J855934K811244
10357A0704403M229324N957394N325936j329543o295908n578299l636457k025312
10349G351538j372190j141142q30592m40351m50213m87702k91689K6695J2800
10340B377154j45643j75737j31935q3284l1029j5864k86649k05153L3139j01639
10330A233360k7307n5582m782k41223m81334k43180j7853J25811K04307L2939
10320E25156k4041O6267P9432N3595n7382k11540q2928J18537K01571O5489m418
10309G29738j31473k64769k23378j46774k9169j5445p1514j44557O3948J29330
$$ plain form
10299 -104063 -37123 -221715 -209327 47795 250492 354652 349623 378494 264252 116444
10289 116444 -32292 -327271 -440364 -425256 -560459 -744591 -773446 -808384 -650117 -492064
10279 -492064 -355115 -284645 -337928 -388390 -313603 -55089 38788 7700 -113057 -113823 -157255
10268 -157255 -314886 -508111 -617384 -411669 -89863 86848 191443 358571 418281 438222
10258 438222 554079 439980 373969 213187 142413 164096 139560 132978 91088 69565 84221
10247 84221 -40864 -156281 -253998 -409470 -591782 -543420 -345228 -131778 166058 247286
10237 247286 173287 71907 -169855 -334612 -236623 -129134 -18130 193991 393358 396728
10227 396728 200380 -32109 -237600 -460877 -381161 -257279 -192149 -83341 61300 33317
$$ packed form
10299a04063O6940j84592J2388K57122K02697J04160n029K8871j14242j47808
10289A16444j48736k94979j13093J5108j35203j84132k8855l4938J58267J58053
10279d92064J36949P0470n3283n0462P4787K58514R3877l1088j20757p66m3432
10268a57255j57631j93225j09273K05715L21806J76711J04595J67128N9710J9941
10258D38222J15857j14099o6011j60782p0774K1683k4536o582m1890k1523J4656
10247H4221j25085j15417r7717j55472j82312M8362J98192K13450K97836Q1228
10237B47286p3999j01380k41762j64757R7989J07489J11004K12121J99367L370
10227C96728j96348k32489k05491k23277P9716J23882O5130J08808J44641k7983
$$ plain form
10217 33317 -100706 -137290 -85719 -66116 -148814 -177635 -259935 -340085 -186487 -97938 -63856
10206 -63856 -19810 -112880 -49238 123402 264092 327471 301366 364644 429967 385935 382641
10195 382641 318307 139721 -106337 -189084 -186393 -98280 28081 -17425 -31759 -40191 -6342
10184 -6342 86004 192396 201270 148975 180859 199579 14631 -113226 -183681 -222483 -279710
10173 -279710 -134596 320281 507877 340299 275946 224481 109868 25394 67838 59051 -39191
10162 -39191 -98592 -137389 -213027 -374349 -635705 -663024 -610391 -660035 -525055 -303068 -190413
10151 -190413 -175917 -232538 -329017 -382463 -516410 -687221 -714625 -547676 -518952 -615834 -479437
10140 -479437 -229678 -151265 -184457 -190447 -159790 -103259 -234357 -465737 -489412 -228861 20018
$$ packed form
10217C3317j34023l6584N1571J9603q2698k8821q2300q0150J53598Q8549L4082
10206f3856M4046r3070O3642J72640J40690O3379k6105O3278O5323m4032l294
10195C82641o4334j78586k46058q2747K691Q8113J26361m5506j4334q432L3849
10184f342R2346J06392Q874n2295L1884J8720j84948j27857p0455l8802n7227
10173b79710J45114M54877J87596j67578o4353n1465j14613q4474M2444q787r8242
10162c9191n9401l8797p5638j61322k61356k7319N2633m9644J34980K21987J12655
10151a90413J4496n6621r6479n3446j33947j70811k7404J66949K8724r6882J36397
10140d79437K49759P8413l3192n990L0657N6531j31098k31380k3675K60551K48879
$$ plain form
10129 20018 116650 237232 100777 -25731 -65668 -96962 -36776 -121971 -230028 -69911 98354
10118 98354 81723 -5655 -61558 -22817 72590 9246 -54618 60771 245237 129546 98133
10107 98133 285238 202363 103786 219203 266079 312342 374488 304323 206545 241146 512292
10096 512292 727506 585964 311281 121841 -51893 -175162 -230463 -228319 17899 355015
10086 355015 317157 99068 -117667 -321415 -509375 -508349 -403441 -332824 -172867 54562
10076 54562 41297 -95968 -264895 -365863 -201567 -98761 -205025 -274879 -188516 -88250
10066 -88250 41835 97493 -43226 -76538 94265 128515 60083 -121564 -308682 -273818 -136846
10055 -136846 35071 279203 273371 95005 -146965 -366045 -372275 -332278 -325698 -195950 -77051
$$ packed form
10129B0018R6632J20582j36455j26508l9937l1294O0186q5195j08057J60117J68265
10118I8354j6631q7378n5903L8741R5407o3344o3864J15389J84466j15691l1413
10107I8133J87105q2875r8577J15417M6876M6263O2146p0165r7778L4601K71146
10096E12292K15214j41542k74683j89440j73734j23269n5301K144K46218L37116
10086C55015l7858k18089k16735k03748j87960J026J04908P0617J59957K27429
10076E4562j3265j37265j68927j00968J64296J02806j06264o9854Q6363J00266
10066h8250J30085N5658j40719l3312J70803L4250o8432j81647j87118L4864J36972
10055a36846J71917K44132n832j78366k41970k19080o230L9997O580J29748J18899
$$ plain form
10044 -77051 -143725 -476942 -669817 -701809 -705158 -602368 -329978 -112389 -142662 -331336 -306901
10033 -306901 -177334 -188754 -144553 -115273 -214965 -290752 -228291 -120100 85029 31403 -144784
10022 -144784 -212672 -193922 -139771 91162 275028 309227 198708 79549 1732 -2587 -63419
10011 -63419 -384725 -471559 -354662 -246137 -194963 -118301 -133260 -256646 -473890 -348045
10001 -348045 127031 223494 83041 -1627 -68701 125354 307314 75646 26437 193441
9991 193441 278275 341588 420050 190693 -56521 -26969 108549 28953 -86749 -32190 33043
9980 33043 -82687 -139783 -136544 -213306 -121672 147338 330329 172831 -44897 -48245 -61516
9969 -61516 -52186 -42891 -70430 -303041 -464228 -530603 -617007 -552441 -431334 -377026 -405809 -253039
$$ packed form
10044g7051o6674l33217j92875l1992l349J02790K72390K17589l0273j88674K4435
10033c06901J29567j1420M4201K9280r9692p5787O2461J08191K05129n3626j76187
10022a44784o7888J8750N4151K30933J83866L4199j10519j19159p7817m319o0832
10011f3419l21306q6834J16897J08525N1174P6662j4959j23386k17244J25845
10001c48045M75076R6463j40453q4668o7074J94055J81960k31668m9209J67004
9991A93441Q4834O3313P8462k29357k47214K9552J35518p9596j15702N4559O5233
9980C3043j15730n7096L239p6762R1634K69010J82991j57498k17728l348j3271
9969f1516R330R295k7539k32611j61187o6375q6404O4566J21107N4308k8783J52770
$$ plain form
9957 -253039 -109195 -73772 -118146 -151059 -114080 31975 20667 89946 233833 76457 -83626
9946 -83626 113219 482682 518338 177995 -202088 -250620 6951 282138 559417 393751
9936 393751 74576 -54069 -141063 -328683 -337069 -178741 -174263 -178536 -206033 -267250 -396586
9925 -396586 -566830 -543168 -372959 -295669 -251825 -35415 121843 129248 52476 -63368 -9424
9914 -9424 51022 -95124 -185102 -91629 -57145 181843 364481 285825 121434 137981 252710
9903 252710 190035 184095 160214 144000 270619 264900 193031 190538 183374 144419 130046 201816
9891 201816 240046 363403 478923 500771 271529 -33087 -150330 -74904 -108041 -59003 120488
9880 120488 326230 352353 51223 -42619 146324 269928 393564 341217 247349 312809 421503
$$ packed form
9957b53039J43844L5423m4374l2913L6979J46055j1308O9279J43887j57376j60083
9946h3626J96845L69463L5656l40343l80083m8532K57571K75187K77279j65666
9936C93751l19175j28645q6994j87620q386J58328M478m273k7497o1217j29336
9925c96586j70244K3662J70209P7290M3844K16410J57258P405p6772j15844N3944
9914i424O0446j46146q9978R3473L4484K38988J82638p8656j64391J6547J14729
9903B52710o2675n940k3881j6214J26619n719p1869k493p164l8955j4373P1770
9891B01816L8230J23357J15520K1848k29242l04616j17243P5426l3137M9038J79491
9880A20488K05742K6123l01130r3842J88943J23604J23636n2347r3868O5460J08694
$$ plain form
9869 421503 389026 262075 150062 253660 407638 305663 121520 56033 214525 407562
9859 407562 435991 348610 210118 264591 370029 614194 742325 767457 587741 223538
9849 223538 156241 119476 -1250 -115390 -76665 -31615 -26425 31256 102135 91875 125019
9838 125019 254799 425266 539400 430862 117066 122039 317395 286921 78890 -27629
9828 -27629 49589 -2134 -11892 -27610 45012 293204 396261 358614 361631 400080 347277 173077
9816 173077 63319 39228 69085 43953 -31160 -174748 -278649 -285123 -316929 -256404 -256040 -313025
9804 -313025 -345901 -242766 -201588 -288481 -394195 -375733 -290394 -99562 -33475 -181408 -215333
9793 -215333 -166393 -256970 -215837 -102676 -33915 -80351 37773 348347 527341 444934 313844
$$ packed form
9869D21503l2477j26951j12013J03598J53978j01975j84143o5487J58492J93037
9859D07562K8429q7381j38492N4473J05438K44165J28131K5132j79716l64203
9849B23538o7297l6765j20726j14140L8725M5050N190N7681P0879j0260L3144
9838A25019J29780J70467J14134j08538l13796M973J95356l0474k08031j06519
9828b7629P7218n1723r758j5718P2622K48192J03057l7647L017L8449n2803j74200
9816A73077j09758k4091K9857k5132p5113j43588j03901o474l1806O0525L64n6985
9804c13025l2876J03135M1178q6893j05714J8462Q5339J90832O6087j47933l3925
9793b15333M8940r0577M1133J13161O8761m6436J18124L10574J78994q2407j31090
$$ plain form
9782 313844 150751 -75905 -101821 -132603 -122874 -119578 -160957 -272167 -266774 -39670 129169
9771 129169 279458 336584 189585 142923 280796 334564 281340 314876 406942 486560 581841
9760 581841 548449 315011 -83616 -313571 -365301 -316096 -355359 -415459 -152778 235678 366032
9749 366032 360351 258110 189723 142198 13979 -210920 -356250 -276900 -155589 -110561 -100200
9738 -100200 -112959 -71513 -71648 -222352 -65442 142643 157205 196408 96992 75858 139251
9727 139251 151101 23127 -106674 -49736 140068 102427 143613 293520 339220 197744 125799
9716 125799 238948 248236 161525 196604 239731 92117 -83602 -168782 -77630 101364 338150
9705 338150 505292 491755 545671 707141 744999 575472 447112 364400 458010 656700 669475
$$ packed form
9782C13844j63093k26656k5916l0782R729L296m1379j11210N393K27104J68839
9771A29169J50289N7126j46999m6662J37873N3768n3224L3536R2066P9618R5281
9760E81841l3392k33438l98627k29955n1730M9205l9263o0100K62681L88456J30354
9749C66032n681j02241o8387m7525j28219k24899j45330P9350J21311M5028J0361
9738a00200j2759M1446j35j50704J56910K08085J4562L9203r9416k1134O3393
9727A39251J1850j27974j29801N6938J89804l7641M1186J49907M5700j41476p1945
9716A25799J13149R288q6711L5079M3127j47614j75719q5180R1152J78994K36786
9705C38150J67142j3537N3916J61470L7858j69527j28360q2712R3610J98690J2775
$$ plain form
9694 669475 575949 612176 692083 770397 803516 693986 489970 442491 456319 403797 537658
9683 537658 551992 411756 513479 457100 369028 155216 52679 38688 152614 367691
9673 367691 424691 465085 312301 16924 -23014 71635 -4935 -9702 56721 104644 209560
9662 209560 314008 342254 399132 273430 118954 78420 139326 162681 235010 310800 360865
9651 360865 334494 310559 201798 -119554 -294966 -214519 -33385 96828 32495 45561 140508
9640 140508 286681 343501 300319 191739 172261 133888 333800 607034 741651 732306 648368
9629 648368 554604 452859 539609 517694 514633 624219 289516 -4100 70818 335806 524980
9618 524980 562615 468291 429073 315094 332592 476599 450327 518817 446064 330319 450526
$$ packed form
9694F69475r3526L6227P9907P8314L3119j09530k04016m7479J3828n2522J33861
9683E37658J4334j40236J01723n6379q8072k13812j02537j3991J13926K15077
9673C67691N7000M0394j52784k95377l9938R4649p6570m767O6423M7923J04916
9662B09560J04448K8246N6878j25702j54476m0534O0906K3355P2329P5790N0065
9651C60865k6371k3935j08761l21352j75412Q0447J81134J30213o4333J3066R4947
9640A40508J46173N6820m3182j08580j9478l8373J99912K73234J34617r345q3938
9629F48368r3764j01745Q6750k1915l061J09586l34703k93616P4918K64988J89174
9618E24980L7635r4324l9218j13979J7498J44007k6272O8490p2753j15745J20207
$$ plain form
9607 450526 407709 241407 73331 -81048 -56938 36273 83459 168431 269355 437622 468495
9596 468495 391619 381616 196071 -139517 -222609 -179096 -117296 -174583 -224546 -240579 31347
9585 31347 204609 4338 -130493 -159384 -193872 -132479 48890 82358 5306 -69119 -29759
9574 -29759 -1773 130699 250829 179462 184002 17872 -176577 -181221 -98150 48794 183079
9563 183079 287904 380727 453843 438058 447703 542289 482825 320671 139361 -98490 -183790
9552 -183790 -85973 1739 -185671 -478606 -519769 -267854 -158440 -225370 -237487 -95169 156431
9541 156431 216470 132118 160001 205276 -3134 -145403 29029 147238 154685 21647 -17122
9530 -17122 -190287 -480843 -636417 -718144 -695953 -646128 -601002 -464401 -325189 -218548 -211547
$$ packed form
9607D50526m2817j66302j68076j54379K4110R3211M7186Q4972J00924J68267L0873
9596D68495p6876j0003j85545l35588q3092M3513O1800n7287m9963j6033K71926
9585C1347J73262k00271j34831k8891l4488O1393J81369L3468p7052p4425L9360
9574b9759K7986J32472J20130p1367M540j66130j94449m644Q3071J46944J34285
9563A83079J04825R2823P3116j5785R645R4586n9464j62154j81310k37851q5300
9552a83790R7817Q7712j87410k92935m1163K51915J09414o6930j2117J42318K51600
9541A56431O0039q4352K7883M5275k08410j42269J74432J18209P447j33038l8769
9530a7122j73165k90556j55574q1727K2191M9825M5126J36601J39212J06641P001
$$ plain form
9519 -211547 -218499 -143829 -176312 -149791 32169 265908 337344 300156 203126 55513 -43149
9508 -43149 -120313 -207285 -128287 -124875 -153366 -231916 -217653 -196719 -171763 63284 270550 429340
9496 429340 488273 419571 394767 403382 380330 363122 404758 644593 689599 548759 584679
9485 584679 455596 192860 163057 260959 461611 359902 234663 276493 291547 220615 277544
9474 277544 267746 -35015 -378417 -562291 -726147 -772792 -588916 -339618 -127884 -49890
9464 -49890 11253 32820 35271 58065 340869 433106 218429 -14241 -105392 -109499 -150509 -149503
9452 -149503 -174093 -99876 -15047 28452 -34600 -4034 255050 460695 439578 451621 406201
9441 406201 224328 106891 -9664 -164735 -324495 -392310 -470106 -453577 -301405 -191490
$$ packed form
9519b11547o952P4670l2483K6521J81960K33739P1436l7188r7030j47613r8662
9508d3149p7164q6972P8998L412k8491p8550J4263K0934K4956K35047K07266J58790
9496D29340N8933o8702k4804Q615k3052j7208M1636K39835M5006j40840L5920
9485E84679j29083k62736k9803R7902K00652j01709j25239M1830J5054p0932N6929
9474B77544r798l02761l43402j83874j63856m6645J83876K49298K11734P7994
9464d9890O1143K1567K451K2794K82804R2237k14677k32670r1151m107m1010J006
9452a49503k4590P4217Q4829M3499o3052L0566K59084K05645k1117J2043m5420
9441D06201j81873j17437j16555j55071j59760o7815p7796J6529J52172J09915
$$ plain form
9431 -191490 -117593 -139186 -21269 139318 39123 -149644 -276734 -123422 67634 288305
9421 288305 462077 548486 661652 669323 488568 177686 -135513 -231538 -108549 -71521 23679
9410 23679 171404 92455 -125692 -166860 -168309 56675 163938 -15310 -204845 -224387 -53143
9399 -53143 -31219 -127415 -172259 -223237 -288091 -234057 -207450 -215907 -35641 188129 254873 164396
9387 164396 -144921 -433663 -341666 -132931 -203652 -491660 -570723 -438656 -283277 -258292
9377 -258292 -184056 -82320 -56868 -96476 53203 10606 -102861 -104376 90150 188813 87083
9366 87083 -105605 -265373 -392840 -241170 55943 258350 292637 99573 -21696 69996
9356 69996 36243 -72415 -9656 223565 179651 -192852 -343738 -175962 -84662 -141573 -309347
$$ packed form
9431a91490P3897k1593J17917J60587j00195j88767j27090J53312J91056K20671
9421B88305J73772Q6409J13166P671j80755l10882l13199r6025J22989L7028R5200
9410B3679J47725p8949k18147m1168j449K24984J07263j79248j89535j9542J71244
9399e3143K1924r6196m4844n0978o4854N4034K6607q457J80266K23770O6744r0477
9387A64396l09317k88742R1997K08735p0721k88008p9063J32067J55379K4985
9377b58292P4236J01736K5452l9608J49679m2597j13467j515J94526R8663j01730
9366H7083j92688j59768j27467J51670K97113K02407L4287j93064j21269R1692
9356F9996l3753j08658O2759K33221m3914l72503j50886J67776R1300n6911j67774
$$ plain form
9345 -309347 -580991 -859615 -758607 -526117 -611483 -762955 -737152 -651236 -571575 -299955
9335 -299955 -3274 243468 96665 -203192 -287329 -187703 -75413 -48099 -89393 -224107
9325 -224107 -372929 -214695 18428 8387 -154734 -224370 -98186 -17836 19438 -339 96307
9314 96307 -46431 -157902 -66169 -159302 -332253 -427969 -299866 -125448 -140343 -101719 -151780
9303 -151780 -182117 -116059 -215607 -260225 -155256 2049 81459 -16311 -115738 -113698 -211686
9292 -211686 -224298 -106128 84749 59940 71784 15663 -7132 -57623 -177917 -222009 -191017
9281 -191017 -154985 -244035 -411811 -265941 -149323 -78035 44492 63423 -2568 -54667 -26588
9270 -26588 34771 97684 245407 92222 -223759 -319538 -262265 -197543 -197684 -168962 -117324 -149959
$$ packed form
9345c09347k71644k78624J01008K32490q5366j51472K5803Q5916P9661K71620
9335b99955K96681K46742j46803k99857q4137R9626J12290K7314m1294j34714
9325b24107j48822J58234K33123j0041j63121o9636J26184Q0350L7274j9777R6646
9314I6307j42738j11471R1733r3133j72951r5716J28103J74418j4895L8624n0061
9303a51780l0337O6058r9548m4618J04969J57305P9410r7770r9427K040r7988
9292b11686j2612J18170J90877k4809J1844n6121k2795n0491j20294m4092L0992
9281a91017L6032q9050j67776J45870J16618P1288J22527J8931o5991n2099K8079
9270b6588O1359O2913J47723j53185l15981r5779N7273O4722j41K8722N1638l2635
$$ plain form
9258 -149959 -173440 36921 263570 435217 493219 297934 88130 94899 277046 347679 399648
9247 399648 367808 366544 308671 213976 146380 270671 160381 -217871 -431200 -311417 -124249
9236 -124249 70941 261891 439274 576104 601441 513841 463217 333996 131039 24109
9226 24109 18344 96580 207703 421603 600678 549379 446175 227312 89211 45711 188323
9215 188323 420568 731477 1038663 1119617 1034799 1006977 1101580 1193611 1551709 2070469 2651885
9204 2651885 3428616 3860810 3415665 2802233 2474042 2234633 2219592 2307747 2311759 2426032
9194 2426032 2627918 2728934 2932420 3357026 3847754 4492283 5071806 5658134 6330276 7062506
9184 7062506 7737581 8679763 9786170 11033322 12213454 12903919 13000916 12691303 12006810
$$ packed form
9258a49959k3481K10361K26649J71647N8002j95285k09804O769J82147P0633N1969
9247C99648l1840j264n7873r4695o7596J24291j10290l78252k13329J19783J87168
9236a24249J95190J90950J77383J36830K5337q7600n0624j29221k02957j06930
9226B4109n765P8236J11123K13900J79075n1299j03204k18863j38101m3500J42612
9215A88323K32245L10909L07186Q0954q4818k7822R4603R2031L58098N18760N81416
9204B651885P76731M32194m45145o13432l28191k39409j5041Q8155M012J14273
9194B426032K01886J01016K03486M24606M90728O44529N79523N86328O72142P32230
9184G062506O75075R42182J106407J247152J180132O90465R6997l09613o84493
$$ plain form
9175 12006810 10742146 9288188 8140594 7118102 6306575 5711646 5179243 4683201 4245680
9166 4245680 3889303 3521669 3255866 3042307 2826322 2474190 2120970 1705618 1621612 1709237
9156 1709237 1606354 1563720 1334186 1264032 1368851 1435592 1497906 1504439 1485853 1449699 1343628
9145 1343628 1196030 1079445 1109331 1250824 1144760 853038 528286 424802 459223 407764
9135 407764 564930 635964 545018 559707 662504 726881 742064 819368 941884 895658 763863
9124 763863 722416 733901 736946 860432 925624 1051609 937265 852366 1011189 1120315 1268601
9113 1268601 1371862 1382681 1493337 1674046 1723157 1583833 1346477 1177263 1229605 1171183
9103 1171183 1156072 1147625 1064209 947744 751470 632989 524294 589204 585463 390691 285433
$$ packed form
9175A2006810j264664j453958j147594j022492q11527n94929n32403m96042m37521
9166D245680l56377l67634k65803k13559k15985l52132l53220m15352q4006Q7625
9156A709237j02883m2634k29534p0154J04819O6741O2314O533j8586l6154j06071
9145A343628j47598j16585K9886J41493j06064k91722l24752j03484L4421n1459
9135D07764J57166P1034r0946J4689J02797O4377J5183P7304J22516m6226j31795
9124G63863m1447J1485L045J23486O5192J25985j14344q4899J58823J09126J48286
9113A268601J03261J0819J10656J80709M9111j39324k37356j69214N2342n8422
9103A171183j5111q447q3416j16465j96274j18481j08695O4910l741j94772j05258
$$ plain form
9092 285433 219862 156625 145420 223990 397205 584043 702206 753712 657318 531240 329075
9081 329075 286032 466598 291477 62397 -11241 -14708 -39433 -22590 -1226 -26289 -7037
9070 -7037 -136929 -248545 -247164 -211731 -181255 -222496 -209159 -235721 -210550 -97394 91408
9059 91408 386773 637859 660160 534711 345255 216995 107523 75218 -36811 -124894
9049 -124894 -89450 -12310 -125739 -464496 -512901 -338130 -225319 -91018 88638 186962
9039 186962 100439 37873 78222 -24294 -152233 -232242 -417001 -498324 -471471 -561573 -615152
9028 -615152 -610699 -557282 -359482 -142830 -215861 -437101 -406004 -222354 -69226 33569 97327
9017 97327 67989 6872 -76051 -414617 -621924 -419170 -210538 -253521 -206539 -188795 -202509
$$ packed form
9092B85433o5571o3237j1205P8570J73215J86838J18163N1506r6394j26078k02165
9081C29075m3043J80566j75121k29080p3638l467k4725J6843K1364k5063J9252
9070g037j29892j11616J381L5433L0476m1241J3337k6562K5171J13156J88802
9059I1408K95365K51086K2301j25449j89456j28260j09472l2305j12029q8083
9049a24894L5444P7140j13429l38757m8405J74771J12811J34301J79656R8324
9039A86962q6523o2566M0349j02516j27939q0009j84759q1323K6853r0102n3579
9028f15152M453N3417J97800K16652p3031k21240L1097J83650J53128J02795O3758
9017I7327k9338o1117q2923l38566k07307K02754K08632m2983M6982J7744j3714
$$ plain form
9006 -202509 -174469 -192131 -34144 138502 141883 -82466 -254785 -216554 -174283 -264028 -290662
8995 -290662 -250089 -204431 -100567 -103220 -262272 -301677 -352217 -408409 -482250 -520945 -372577
8984 -372577 -238894 -235655 -182657 -92754 -88685 -50400 -55915 -85738 -76251 -33006 -182285 -257276
8972 -257276 -206371 -260831 -631584 -882066 -717813 -467651 -308700 -363467 -354018 -174082 -80222
8961 -80222 -13396 -114822 -424216 -597428 -597655 -638332 -496270 -243545 -15972 138130 192477
8950 192477 123722 113406 146887 205140 110004 -67297 -134331 -340146 -408948 -297753 -279630
8939 -279630 -208202 -150253 -206717 -208883 -230849 -321823 -401357 -548207 -568712 -608831 -524019 -261597
8927 -261597 -89227 52458 104748 126743 -99011 -169335 -173845 -186739 -167401 -137032 48817
$$ packed form
9006b02509K8040j7662J57987J72646L381k24349j72319L8231M2271q9745k6634
8995b90662M0573M5658J03864k653j59052l9405n0540n6192p3841l8695J48368
8984c72577J33683L239N2998Q9903M069L8285n515k9823R487M3245j49279p4991
8972b57276N0905n4460l70753k50482J64253K50162J58951n4767R449J79936R3860
8961h0222O6826j01426l09394j73212k27m0677J42062K52725K27573J54102N4347
8950A92477o8755j0316L3481N8253r5136j77301o7034k05815o8802J11195J8123
8939b79630P1428N7949n6464k166k1966r0974p9534j46850k0505m0119Q4812K62422
8927b61597J72370J41685N2290K1995k25754p0324m510j2894J9338L0369J85849
$$ plain form
8916 48817 147321 270306 389026 364174 219478 -41375 -233238 -140411 -183292 -274784 -271268
8905 -271268 -242781 5645 77008 -60972 -173954 -217536 -306568 -279688 -185249 -298380 -319025
8894 -319025 -160683 -42048 22060 164151 182536 5040 -112754 173 67502 87276
8884 87276 74276 241793 312435 190248 -68987 -323062 -432267 -217824 5521 143 -9879
8873 -9879 71458 265328 376861 312598 44488 -82082 -228109 -320336 -460976 -631239 -654278
8862 -654278 -531693 -274005 -90513 41188 93845 113731 187485 111140 -17232 -78218 -120321
8851 -120321 -155019 -151545 -134741 -64469 3462 -21993 -114922 -77998 27360 152954 174113
8840 174113 -37630 -218285 -311469 -333814 -246504 -359409 -408216 -318264 -146014 -46644 -172476
$$ packed form
8916D8817R8504J22985J18720k4852j44696k60853j91863R2827m2881r1492L516
8905b71268K8487K48426P1363j37980j12982m3582q9032K6880R4439j13131k0645
8894c19025J58342J18635O4108J42091J8385j77496j17794J12927O7329J9774
8884H7276j3000J67517P0642j22187k59235k54075j09205K14443K23345n378j0022
8873i879Q1337J93870J11533o4263k68110j26570j46027r2227j40640j70263k3039
8862f54278J22585K57688J83492J31701N2657J9886P3754p6345j28372o0986m2103
8851a20321l4698L474J6804P0272O7931k5455r2929L6924J05358J25594K1159
8840A74113k11743j80655r3184k2345Q7310j12905m8807Q9952J72250R9370j25832
$$ plain form
8829 -172476 -165662 -18786 37138 130117 144860 43745 -109296 -337549 -477612 -360399 -220688
8818 -220688 -109320 -11083 -70030 -265427 -222333 -101680 -24549 -56788 -203364 -219200 -144347
8807 -144347 -151807 -281862 -253714 -53410 28013 -89951 -162545 -78234 -76435 -143551 -73196
8796 -73196 184061 460386 466940 336442 162322 66307 -79108 -387204 -586823 -455903
8786 -455903 -241705 -165772 -19140 117555 136631 233381 482297 441744 264577 321423 494615
8775 494615 507397 317073 139661 517 -106604 -261250 -315177 -340487 -353144 -219443
8765 -219443 -159500 -193837 -160445 -118108 -144956 75746 343274 437100 314225 168425 19466
8754 19466 -156397 -260978 -246783 -162051 -60746 34344 72176 92303 127739 107402 32172
$$ packed form
8829a72476O814J46876N5924R2979J4743j01115j53041k28253j40063J17213J39711
8818b20688J11368R8237n8947j95397M3094J20653P7131l2239j46576j5836P4853
8807a44347p460j30055K8148K00304Q1423j17964p2594Q4311J799o7116P0355
8796g3196K57257K76325O554j30498j74120r6015j45415l08096j99619J30920
8786d55903K14198P5933J46632J36695J9076R6750K48916m0553j77167N6846J73192
8775D94615J2782j90324j77412j39144j07121j54646n3927k5310j2657J33701
8765b19443N9943l4337L3392M2337k6848K20702K67528R3826j22875j45800j48959
8754A9466j75863j04581J4195Q4732J01305R5090L7832K0127L5436k0337p5230
$$ plain form
8743 32172 154954 406393 357679 186603 139752 121355 259343 349763 420787 548980 524515
8732 524515 256853 131877 186481 226643 149449 135605 161550 196257 226294 80693 -18965
8721 -18965 560 -97878 -103249 -93136 -131774 -187492 -217919 -288941 -322574 -287576 -331730 -372021
8709 -372021 -277862 -241226 -196399 -122170 -113971 -70886 -124780 -224829 -258263 -158499 -93335 102156
8697 102156 310915 271045 140826 7868 -132913 -269353 -248379 -127387 -20694 -51327
8687 -51327 -49935 -93702 -203368 -98628 84779 144908 80112 37067 21101 47834 -55115
8676 -55115 -388356 -618146 -516459 -303125 -138210 -33581 93001 65817 -206087 -428409
8666 -428409 -466992 -390707 -301181 -256721 -233930 -242366 -260033 -278511 -216861 -99400 -60103 77249
$$ packed form
8743C2172J22782K51439m8714j71076m6851j8397J37988R0420P1024J28193k4465
8732E24515k67662j24976N4604M0162p7194j3844K5945L4707L0037j45601r9658
8721a8965J9525r8438n371J0113l8638n5718l0427p1022l3633L4998m4154m0291
8709c72021R4159L6636M4827P4229Q199M3085n3894j00049l3434R9764O5164J95491
8697A02156K08759l9870j30219j32958j40781j36440K0974J20992J06693l0633
8687e1327J392m3767j09666J04740J83407O0129o4796m3045j5966K6733j02949
8676e5115l33241k29790J01687K13334J64915J04629J26582k7184k71904k22322
8666d28409l8583P6285Q9526M4460K2791q436j7667j8478O1650J17461L9297J37352
$$ plain form
8654 77249 213222 265398 95515 -324114 -453803 -378388 -184498 -54812 -16696 -9730 -71068
8643 -71068 -72301 -55807 -49395 -288712 -512953 -359388 -108921 -193340 -349536 -449473 -510244
8632 -510244 -534612 -561485 -342692 -170489 -143244 -152051 -42153 -47850 -126576 -278585 -490309
8621 -490309 -439828 -308478 -216756 -192190 -179841 -263694 -386469 -455910 -408284 -427947 -496997
8610 -496997 -502270 -383793 -67441 -14491 -152291 -387585 -549154 -488114 -210536 -37649
8600 -37649 166246 316704 185770 94040 119079 157411 188449 51035 -137993 -206748 -335961
8589 -335961 -400869 -322766 -281534 -292013 -230990 -147883 -23104 239808 426489 259726 -13071
8578 -13071 -330734 -453235 -246535 22176 199378 442721 651846 627983 281223 -20700
$$ packed form
8654G7249J35973N2176j69883m19629j29689P5415J93890J29686L8116O966o1338
8643g1068j233J6494O412k39317k24241J53565K50467q4419j56196r9937o0771
8632e10244k4368k6873K18793J72203K7245q807J09898n697p8726j52009k11724
8621d90309N0481J31350R1722K4566J2349q3853j22775o9441M7626j9663o9050
8610d96997n273J18477L16352N2950j37800k35294j61569O1040K77578J72887
8600c7649K03895J50458j30934r1730K5039L8332L1038j37414j89028o8755j29213
8589c35961o4908P8103M1232j0479O1023Q3107J24779K62912J86681j66763k72797
8578a3071l17663j22501K06700K68711J77202K43343K09125k3863l46760l01923
$$ plain form
8568 -20700 -145800 -113557 -606 103882 176094 231373 176422 5705 -152695 -37259 51648
8557 51648 -68076 -195103 -147662 -15546 115939 160847 134816 131316 128654 100068 4041
8546 4041 75533 77906 -37286 -191450 -173096 -131649 -181721 -27422 212971 133380 -32993
8535 -32993 28833 276387 469211 586571 621877 511476 324875 348726 503222 553299 609913
8524 609913 595430 520274 394183 313926 326364 178589 110050 -95288 -348154 -412449 -365085
8513 -365085 -138486 -31027 -85544 -119190 -106832 -61803 -139024 -140385 41954 118186 -136
8502 -136 6378 273974 441800 366422 225282 135108 237981 453200 503330 464715 564835
8491 564835 570660 438796 173906 -306070 -604907 -490632 -294287 -147457 -73520 -1332
$$ packed form
8568b0700j25100L2243J12951J04488P2212N5279n4951j70717j58400J15436Q8907
8557E1648j19724j27027M7441J32116J31485M4908k6031l500k662k8586r6027
8546D041P1492K373j15192j54164J8354M1447n0072J54299K40393p9591j66373
8535c2993O1826K47554J92824J17360L5306j10401j86601K3851J54496N0077N6614
8524F09913j4483p5156j26091q0257J2438j47775o8539k05338k52866o4295M7364
8513c65085K26599J07459n4517l3646J2358M5029p7221j361J82339P6232j18322
8502a36O514K67596J67826p5378j41140r0174J02873K15219N0130l8615J00120
8491E64835N825j31864k64890m79976k98837J14275J96345J46830P3937P2188
$$ plain form
8481 -1332 -29133 -100048 30905 155106 201409 155360 61539 76318 104043 110600 124457 133892
8469 133892 111580 37060 123986 303713 440614 343432 -61657 -317353 -229674 -67229 74553
8458 74553 33334 -26985 -60531 -9955 97499 102245 169648 330938 460070 382454 191503
8447 191503 95379 165036 167029 37382 64115 106692 131199 80886 96973 67177 -83249
8436 -83249 -34891 168727 266619 349400 412948 543361 567670 486942 360798 145339 92181
8425 92181 -37116 -68261 41181 56149 60640 1213 -56849 -42831 -34686 -57839 8787 -124165
8413 -124165 -240561 -181348 16943 206272 267931 151867 -41429 -4911 188666 256147
8403 256147 182473 127947 -3080 -202905 -224824 -65460 -62975 -203420 -265283 -264880 -210868
$$ packed form
8481a332k7801p0915J30953J24201M6303m6049r3821J4779K7725O557J3857R435
8469A33892k2312p4520Q6926J79727J36901r7182m05089k55696Q7679J62445J41782
8458G4553m1219o0319l3546N0576J07454M746O7403J61290J29132p7616j90951
8447A91503r6124O9657J993j29647K6733M2577K4507n0313J6087k9796j50426
8436h3249M8358K03618R7892Q2781O3548J30413K4309q0728j26144k15459n3158
8425I2181j29297l1145J09442J4968M491n9427n8062J4018Q145k3153O6626j32952
8413a24165j16396N9213J98291J89329O1659j16064j93296L6518J93577O7481
8403B56147p3674n4526j31027j99825k1919J59364K485j40445o1863M03N4012
$$ plain form
8392 -210868 -151495 2695 289973 586222 822730 914139 966780 1056015 952530 727795
8382 727795 541300 448434 513879 644516 652860 535787 452756 551774 639184 648123 572115
8371 572115 608766 529592 448481 581737 861211 1034332 1169496 1165886 1277234 1422332 1292934
8360 1292934 1039038 1013920 981345 1034238 1201063 1200969 1134877 1223038 1453833 1495546 1500019 1509682
8348 1509682 1405158 1358349 1499645 1553383 1623490 1803422 2006096 2255718 2428646 2504929
8338 2504929 2835141 3268303 3472121 3659695 4080565 4608689 5023625 5366033 6016244 6882927
8328 6882927 7855715 8859133 9958871 11354489 12986848 14638383 16076845 17534452
8320 17534452 18729235 19458651 19909282 20058768 20024652 19871231 19739313 19845932 19729274
$$ packed form
8392b10868N9373J54190K87278K96249K36508R1409N2641Q9235j03485k24735
8382G27795j86495r2866O5445J30637Q344j17073q3031R9018Q7410Q939p6008
8371E72115L6651p9174q1111J33256K79474J73121J35164l610J11348J45098j29398
8360A292934k53896k5118l2575N2893J66825r4o6092Q8161K30795M1713M473R663
8348A509682j04524m6809J41296N3738P0107J79932K02674K49622J72928P6283
8338B504929L30212M33162K03818J87574M20870N28124M14936L42408O50211Q66683
8328F882927R72788J003418J099738J395618J632359J651535J438462J457607
8320A7534452J194783P29416M50631J49486l4116j53421j31918J06619j16658
$$ plain form
8311 19729274 19008681 17740441 16049638 14354349 12662977 11139298 9759111 8401495
8303 8401495 7250066 6426110 5795790 5252898 4742882 4299123 3794809 3371682 3176450
8294 3176450 2988118 2749426 2500715 2369684 2215283 2178633 2229393 2289092 2165300 1825505
8284 1825505 1803720 1720042 1500111 1407115 1456351 1491544 1440346 1338718 1254591 1358250 1543636
8273 1543636 1633827 1711715 1702458 1535574 1451386 1476734 1441416 1361428 1377294 1570455 1599294
8262 1599294 1535795 1416024 1345680 1261150 1141874 1082027 1241216 1430021 1206566 835568
8252 835568 708576 836566 1165845 1470901 1556038 1355704 1412000 1593724 1735736 1721984
8242 1721984 1628667 1541490 1582052 1738172 2012002 2177293 2271365 2277627 2220199 2311025 2427529
$$ packed form
8311A9729274p20593j268240j690803j695289j691372j523679j380187j357616
8303H401495j151429q23956o30320n42892n10016m43759n04314m23127j95232
8294C176450j88332k38692k48711j31031j54401l6650N0760N9699j23792l39795
8284A825505k1785q3678k19931r2996M9236L5193n1198j01628q4127J03659J85386
8273A543636R0191P7888r257j66884q4188K5348l5318p9988J5866J93161K8839
8262A599294o3499j19771p0344q4530j19276n9847J59189J88805k23455l70998
8252H35568j26992J27990L29279L05056Q5137k00334N6296J81724J42012j3752
8242A721984r3317q7177M0562J56120K73830J65291R4072O262n7428R0826J16504
$$ plain form
8231 2427529 2535091 2760101 3077550 3293433 3525393 3964846 4583364 5051906 5373628 6098411
8221 6098411 6720172 7232332 8050254 9331683 10755470 11969889 12844628 13287827 12948816
8212 12948816 12133693 11035719 9782743 8460417 7303587 6277929 5356361 4840885 4560820
8203 4560820 4387705 4135331 3786096 3279480 2965472 2935358 2845582 2542347 2433701 2393426
8193 2393426 2299702 2297426 2276976 2146731 1895547 1869598 2056027 2303912 2353375 2135217 2046498
8182 2046498 2062126 1973866 1718328 1507355 1482986 1566907 1708460 1743513 1697617 1676080 1713589
8171 1713589 1792850 1616481 1510278 1336879 1140387 1135226 1075307 1094182 1358236 1506736
8161 1506736 1571589 1681081 1582785 1448521 1455280 1545527 1669777 1927468 2089056 2170551 2249504
$$ packed form
8231B427529J07562K25010L17449K15883K31960M39453O18518M68542L21722P24783
8221F098411O21761N12160Q17922J281429J423787J214419Q74739M43199l39011
8212A2948816q15123j097974j252976j322326j156830j025658r21568n15476k80065
8203D560820j73115k52374l49235n06616l14008l0114q9776l03235j08646m0275
8193B393426r3724k276k0450j30245k51184k5949J86429K47885M9463k18158q8719
8182B046498J5628q8260k55538k10973k4369Q3921J41553L5053m5896k1537L7509
8171A713589P9261j76369j06203j73399j96492n161n9919J8875K64054J48500
8161A506736O4853J09492r8296j34264O759R0247J24250K57691J61588Q1495P8953
$$ plain form
8150 2249504 2365426 2383481 2268469 2158167 2156208 2235613 2311790 2478642 2640355 2500561
8140 2500561 2385498 2318812 2263761 2261074 2212374 2284660 2416625 2426984 2347509 2255799 2105884
8129 2105884 1939195 2025268 2396947 2673759 2902770 3058622 3097178 3131318 3087506 3137261
8119 3137261 3225740 3382067 3686598 4099843 4478966 4722993 5209359 5549717 6085095 6633728
8109 6633728 7135622 7783138 8555392 9459328 10626696 12042291 13502577 15230214 17206162
8100 17206162 19291495 21640120 23824749 25618848 26693503 27015400 26507616 25064482
8092 25064482 22839915 20351573 18252439 16511855 14796950 13251945 11907135 10754898
8084 10754898 9708966 8952832 8292464 7682567 7033947 6487843 6166643 5884178 5679230
$$ packed form
8150B249504J15922J8055j15012j10302j959P9405P6177J66852J61713j39794
8140B500561j15063o6686n5051k687m8700P2286J31965J0359p9475r1710j49915
8129B105884j66689Q6073L71679K76812K29011J55852L8556L4140m3812M9755
8119C137261Q8479J56327L04531M13245L79123K44027M86366L40358N35378N48633
8109F633728N01894O47516P72254R03936J167368J415595J460286J727637J975948
8100A7206162K085333K348625K184629J794099J074655L21897n07784j443134
8092B5064482k224567k488342k099134j740584j714905j545005j344810j152237
8084A0754898j045932p56134o60368o09897o48620n46104l21200k82465k04948
$$ plain form
8075 5679230 5637974 5586421 5336692 5053477 5042505 5027256 4787957 4620182 4395515 4107154
8065 4107154 3995856 3930480 3889730 3789796 3728509 3896550 4080661 4155177 4241454 4195333 4185596
8054 4185596 4172963 4238531 4435438 4629087 4713589 4560237 4650467 4912056 4921040 4748226 4630098
8043 4630098 4649680 4695034 4814129 5024445 5051820 5184383 5280858 4980985 4903081 5302639
8033 5302639 5652036 5722863 5815428 5794186 5669499 5611182 5596376 5603166 5658780 5856610 5897363
8022 5897363 5788638 5739152 5784996 5871833 5971358 5908178 5757950 5535251 5697149 5940619
8012 5940619 6063374 6286372 6345976 6409030 6539751 6736968 6973091 7312737 8064124 9105343
8002 9105343 10205046 11575180 13446701 15781662 18464691 21571689 25300607 29803077
$$ packed form
8075E679230m1256n1553k49729k83215j0972j5249k39299j67775k24667k88361
8065D107154j11298o5376m0750r9934o1287J68041J84111P4516Q6277m6121r737
8054D185596j2633O5568J96907J93649Q4502j53352R0230K61589Q984j72814j18128
8043D630098J9582M5354J19095K10316K7375J32563R6475k99873p7904L99558
8033E302639L49397P0827R2565k1242j24687n8317j4806O790N5614J97830M0753
8022E897363j08725m9486M5844Q6837R9525o3180j50228k22699J61898K43470
8012E940619J22755K22998N9604O3054J30721J97217K36123L39646P51387J041219
8002I105343J099703J370134J871521K334961K683029L106998L728918M502470
$$ plain form
7994 29803077 34783020 39451747 43034851 44958592 44867759 42936199 39356968 35089111
7986 35089111 30750231 26568370 22822302 19683388 17334516 15411474 13663394 12248006
7978 12248006 11295270 10733043 10271836 9835358 9696331 9702334 9640808 9495954 9290023 9064592
7968 9064592 9080341 9152335 9035192 8784018 8385455 8007918 7791742 7755832 7804720 7867042
7958 7867042 8115283 8453527 8761050 9180845 9693984 10286390 11107711 12147510 13374080
7949 13374080 14805273 16435898 18398879 21116312 24661472 28979866 34140107 40398883
7941 40398883 48421269 58678753 71164894 85641302 101215256 116098660 127908043
7934 127908043 134392525 134486195 128375616 117116533 102805285 87992390 74191858 62145765
$$ packed form
7994B9803077M979943M668727L583104J923741r0833j931560l579231m267857
7986C5089111m338880m181861l746068l138914k348872j923042j748080j415388
7978A2248006r52736n62227m61207m36478j39027O003o1526j44854k05931k25431
7968I064592J5749P1994j17143k51174l98563l77537k16176l5910M8888O2322
7958G867042K48241L38244L07523M19795N13139N92406Q21321J039799J226570
7949A3374080J431193J630625J962981K717433L545160M318394N160241O258776
7941D0398883Q022386J0257484J2486141J4476408J5573954J4883404J1809383
7934A27908043O484482R3670o110579j1259083j4311248j4812895j3800532j2046093
$$ plain form
7926 62145765 52306800 44626617 38789340 34071368 30349966 27461684 25084508 23174675
7918 23174675 21827608 20867266 20180111 19671564 19224407 18947236 18595506 18096645 17531890
7909 17531890 17001179 16392526 15646403 15072056 14817142 14779276 15000042 15296865 15767714 16297642
7899 16297642 17019233 17862888 18805263 19938148 21373110 23272766 25583980 28450027 31871240
7890 31871240 36296199 41863971 48423535 56345631 66396530 79208857 95362200 115662235
7882 115662235 140561738 169186017 199880961 229201728 252689310 265926156 266262346
7875 266262346 253754582 230940118 202401627 172473945 144481759 120253396 100456280
7868 100456280 84745113 72205405 62425896 54884091 48787383 43867126 40000376 36760800
$$ packed form
7926F2145765r838965p680183n837277m717972l721402k888282k377176j909833
7918B3174675j347067r60342o87155n08547m47157k77171l51730m98861n64755
7909A7531890n30711o08653p46123n74347k54914l7866K20766K96823M70849N29928
7899A6297642P21591Q43655R42375J132885J434962J899656K311214K866047L421213
7890C1871240M424959N567772O559564P922096J0050899J2812327J6153343K0300035
7882A15662235K4899503K8624279L0694944K9320767K3487582J3236846L36190
7875B66262346j2507764k2814464k8538491k9927682k7992186k4228363j9797116
7868A00456280j5711167j2539708r779509p541805o096708m920257l866750l239576
$$ plain form
7860 36760800 34236629 32620449 31578103 30546199 29669756 28958873 27938525 26688854
7852 26688854 25545737 24439766 23324385 22366091 21496002 20933140 20718402 20639824 20821574
7843 20821574 21266891 21897054 22650381 23809727 25472194 27504151 29608111 31951135 35021507
7834 35021507 38884548 43720926 49870332 57496798 67020931 78865926 94030748 113144123
7826 113144123 136876292 165768614 199419726 235572286 269954791 297399111 312607304
7819 312607304 312363620 296831658 269278351 235144794 199569903 166222368 137426525
7812 137426525 114032053 95582055 81125410 69701997 60719080 53567143 47602291
7805 47602291 42747376 38854184 35871950 33600906 31566247 29845497 28374604 27201735
$$ packed form
7860C6760800k524171j616180j042346j031904q76443p10883j020348j249671
7852B6688854j143117j105971j115381r58294q70089n62862k14738p8578J81750
7843B0821574M45317O30163P53327J159346J662467K031957K103960K343024L070372
7834C5021507L863041M836378O149406P626466R524133J1844995J5164822J9113375
7826A13144123K3732169K8892322L3651112L6152560L4382505K7444320J5208193
7819C12607304k43684j5531962k7553307l4133557l5574891l3347535k8795843
7812A37426525k3394472j8449998j4456645j1423413q982917p151937n964852
7805D7602291m854915l893192k982234k271044k034659j720750j470893j172869
$$ plain form
7797 27201735 26302666 25299303 24074804 22606106 21552890 20867148 20113736 19578772 19453098
7788 19453098 19491635 19602734 19887195 20416064 20992510 21757467 22854287 24391983 26333563
7779 26333563 28559396 31370979 34793681 38849219 44064926 50416278 58366684 68670570
7771 68670570 81752804 98096039 118310105 142989680 171422336 201658931 230435281
7764 230435281 253147636 265502075 264934941 251694402 228232899 199002659 168683903
7757 168683903 140422741 116026059 96066807 80144832 67653083 57981036 50164839
7750 50164839 43735475 38616438 34596447 31201616 28278606 25555328 23409460 22068416
7742 22068416 20983258 19987987 18933306 17866085 16826702 15703093 14692425 13932711
$$ packed form
7797B7201735q99069j003363j224499j468698j053216o85742p53412n34964j25674
7788A9453098L8537J11099K84461N28869N76446P64957J096820J537696J941580
7779B6333563K225833K811583L422702M055538N215707O351352P950406J0303886
7771F8670570J3082234J6343235K0214066K4679575K8432656L0236595K8776350
7764B30435281K2712355J2354439n67134j3240539k3461503k9230240l0318756
7757A68683903k8261162k4396682j9959252j5921975j2491749r672047p816197
7750E0164839o429364n119037m019991l394831k923010k723278k145868j341044
7742B2068416j085158r95271j054681j067221j039383j123609j010668p59714
$$ plain form
7734 13932711 13274728 12818908 12630492 12556957 12389070 12294846 12422287 12516092 12733213 13196613
7724 13196613 13825512 14819029 16188684 17551568 18993981 21041746 23449775 26407632
7716 26407632 30592775 35848129 42217246 50097544 60065355 72331695 86480368 101569562
7708 101569562 115760514 126946152 133020645 132725581 125887315 113848357 99054568 83660394
7700 83660394 69290175 57080779 47241487 39560428 33431784 28517285 24643069 21385601
7692 21385601 18523559 16282648 14394197 12752250 11274685 10138173 9160063 8322607
7684 8322607 7833466 7492523 7172768 6768886 6333990 5870928 5601059 5541352 5572466 5467973
7674 5467973 5333867 5153786 4975788 5020578 5111940 5269644 5451048 5596529 5816756 5979649
$$ packed form
7734A3932711o57983m55820j88416p3535j67887r4224J27441R3805K17121M63400
7724A3196613O28899R93517J369655J362884J442413K047765K408029K957857
7716B6407632M185143N255354O369117P880298R967811J2266340J4148673J5089194
7708A01569562J4190952J1185638O074493k95064o838266j2038958j4793789j5394174
7700H3660394j4370219j2209396r839292p681059o128644m914499l874216l257468
7692B1385601k862042k240911j888451j641947j477565j136512r78110q37456
7684H322607m89141l40943l19755m03882m34896m63062k69869n9707L1114j04493
7674E467973j34106j80081j77998M4790R1362J57704J81404J45481K20227J62893
$$ plain form
7664 5979649 6227185 6873463 7644076 8399395 9417037 10743774 12511698 14734150 17283887
7655 17283887 20398520 24333337 28984800 33885015 38382188 41719838 43346855 43060882
7647 43060882 41128653 37568930 32995713 28133791 23464428 19501760 16161753 13319737
7639 13319737 11028101 9375876 8097778 6995422 6063978 5239355 4511867 4129397 3910212
7630 3910212 3552093 3162777 2839417 2717123 2593352 2361930 2096444 1882625 1854063 1905762
7620 1905762 1769670 1574912 1500282 1399565 1258924 1040047 1022023 1059835 1047871 1190347
7610 1190347 1329592 1313348 1262114 1036957 845284 723762 600483 456144 486362 604479
7600 604479 651712 625372 483823 419498 624178 846438 952389 912885 824957 698384 611065
$$ packed form
7664E979649K47536O46278P70613P55319J017642J326737J767924K222452K549737
7655A7283887L114633L934817M651463M900215M497173L337650J627017k85973
7647D3060882j932229l559723m573217m861922m669363l962668l340007k842016
7639A3319737k291636j652225j278098j102356r31444q24623p27488l82470k19185
7630C910212l58119l89316l23360j22294j23771k31422k65486k13819k8562N1699
7620A905762j36092j94758p4630j00717j40641k18877j8024L7812j1964J42476
7610A190347J39245j6244n1234k25157j91673j21522j23279j44339L0218J18117
7600F04479M7233k6340j41549o4325K04680K22260J05951l9504q7928j26573q7319
$$ plain form
7589 611065 425081 394008 381954 582966 873628 833543 650340 391393 316600 369108 268342
7578 268342 170095 207696 284923 404087 421385 437558 372852 307880 229338 74717 -22438
7567 -22438 55007 106406 143153 211875 94958 -192290 -305264 -146659 -41013 -110829 -260964
7556 -260964 -138646 133227 3670 -269222 -159404 8585 1308 10042 -154858 -392395
7546 -392395 -488010 -218274 38436 66979 14287 -188863 -178605 31058 332814 407651 364915
7535 364915 444874 399131 91385 -373969 -415797 -256787 -134696 24880 66899 56964 18728
7524 18728 102497 249436 288184 154220 -71522 -212952 -136190 15416 -87654 -227495
7514 -227495 -221720 -293186 -291430 -121472 135223 353144 426403 372532 281944 143348 182472
$$ packed form
7589F11065j85984l1073j2054K01012K90662m0085j83203k58947p4793N2508j00766
7578B68342r8247L7601P7227J19164J7298J6173o4706o4972p8542j54621r7155
7567b2438P7445N1399L6747O8722j16917k87248j12974J58605J05646o9816j50135
7556b60964J22318K71873j29557k72892J09818J67989p277Q734j64900k37537
7546c92395r5615K69736K56710K8543n2692k03150J0258K09663L01756P4837m2736
7535C64915P9959m5743l07746m65354m1828J59010J22091J59576M2019r935l8236
7524A8728Q3769J46939L8748j33964k25742j41430P6762J51606j03070j39841
7514b27495N775p1466J756J69958K56695K17921P3259n3871r0588j38596L9124
$$ plain form
7503 182472 183401 212607 406568 457764 462189 344041 132742 98768 301452 277689 196952
7492 196952 213355 357579 537446 680164 477598 346713 292133 -105698 -212121 -215931
7482 -215931 -362171 -236636 68402 328481 288410 151530 111622 -19414 -77231 27878
7472 27878 78664 165796 115897 -17471 -140663 -328281 -383048 -198264 17976 85616 177429
7461 177429 215395 201663 125640 69419 47111 21619 -78520 -226091 -202139 -245590 -385980
7450 -385980 -354842 -193575 19171 -50898 -267208 -252605 -96667 -132161 -339960 -400503 -268309
7439 -268309 -216599 -306658 -318244 -204873 -165798 -271282 -297393 -331766 -394145 -380692 -399126
7428 -399126 -427794 -566454 -656754 -580825 -586163 -515002 -210354 65799 216857 233623 -23736
$$ packed form
7503A82472R29K9206J93961N1196M425j18148k11299l3974K02684k3763q0737
7492A96952J6403J44224J79867J42718k02566j30885n4580l97831j06423l810
7482b15931j46240J25535L05038K60079m0071j36880l9908j31036n7817J05109
7472B7878N0786Q7132m9899j33368j23192j87618n4767J84784K16240O7640R1813
7461A77429L7966j3732p6023n6221k2308k5492j00139j47571K3952m3451j40390
7450c85980L1138J61267K12746p0069k16310J4603J55938l5494k07799o0543J32194
7439b68309N1710r0059j1586J13371L9075j05484k6111l4373o2379J3453j8434
7428c99126k8668j38660r0300P5929n338P1161L04648K76153J51058J6766k57359
$$ plain form
7417 -23736 -80241 80330 70119 94422 105891 95957 92343 85421 202777 239096 -23379 -417487
7405 -417487 -410223 -343684 -453450 -489857 -362042 -183289 1011 197987 165774 19656 41355
7394 41355 56036 80517 -47048 -274773 -155215 82749 216057 223735 226767 146334 -36914
7383 -36914 -110188 -63056 121220 302695 312835 317227 309506 289100 238941 211930 388081 450498
7371 450498 407385 400425 600829 811398 887995 826694 809284 901264 1023750 1196881 1294242
7360 1294242 1332267 1375250 1359183 1265710 1409666 1551629 1842645 2222506 2531912 3010970
7350 3010970 3440589 3735101 4380952 5195078 5899765 6787051 7844938 9148703 10464035
7341 10464035 11707259 12681579 13297054 13476254 12913323 11839120 10662502 9481002 8441969
$$ packed form
7417b3736n6505J60571j0211K4303J1469r934l614o922J17356L6319k62475l94108
7405d17487P264O6539j09766l6407J27815J78753J84300J96976l2213j46118K1699
7394D1355J4681K4481j27565k27725J19558K37964J33308P678L032q0433j83248
7383c6914p3274M7132J84276J81475J0140M392p721k0406n0159k7011J76151O2417
7371D50498m3113o960K00404K10569P6597o1301j7410R1980J22486J73131R7361
7360A294242L8025M2983j6067r3473J43956J41963K91016L79861L09406M79058
7350C010970M29619K94512O45851Q14126P04687Q87286J057887J303765J315332
7341A0464035J243224R74320O15475J79200n62931j074203j176618j181500j039033
$$ plain form
7332 8441969 7535074 6582622 5584402 4706097 4083401 3749992 3621774 3394544 3159194 2786898
7322 2786898 2406224 2111354 1937389 1891764 1754881 1596462 1429084 1330377 1210279 1166737
7312 1166737 1252933 1246699 1142393 1121734 1127994 987151 799564 582427 410971 502061 536800
7301 536800 471690 613258 653622 591774 507715 501302 515380 577645 745739 698618 411332
7290 411332 129089 137861 284713 458545 633818 669925 525971 403621 492815 578716 560137
7279 560137 468003 510595 517628 475141 487853 526600 482342 489094 376230 207075 267410 215324
7267 215324 160655 352280 497603 504297 617008 620077 408815 277238 219200 148751 137392
7256 137392 66492 45716 183532 361852 347326 194283 37173 -73386 -235848 -386478
$$ packed form
7332H441969r06895r52452r98220q78305o22696l33409j28218k27230k35350l72296
7322B786898l80674k94870j73965m5625j36883j58419j67378r8707j20098m3542
7312A166737Q6196o234j04306k0659O260j40843j87587k17137j71456R1090L4739
7301E36800o5110J41568M0364o1848q4059o413J4078O2265J68094m7121k87286
7290D11332k82243Q772J46852J73832J75273L6107j43954j22350Q9194Q5901j8579
7279E60137r2134M2592P033m2487J2712L8747m4258O752j12864j69155O0335n2086
7267B15324n4669J91625J45323O694J12711L069k11262j31577n8038p0449j1359
7256A37392p0900k0776J37816J78320j4526j53043j57110j10559j62462j50630
$$ plain form
7246 -386478 -376654 -198328 -98511 -57140 -150180 -125976 56419 109079 163893 243526 241550 271278
7234 271278 447619 449832 161281 -67727 49391 238660 402617 382759 207842 221395
7224 221395 327910 347037 487465 548300 521135 468125 391014 369717 306625 167829 185074
7213 185074 213491 199238 134326 170168 155794 30911 -16315 13723 -120262 -398731 -519234
7202 -519234 -546967 -525214 -403709 -312691 -179205 -130686 -87002 -50296 -7416 -40035 -160555
7191 -160555 -305201 -393435 -345570 -246709 -99759 39419 299484 557626 600596 544745 313555
7180 313555 95478 -67851 -190077 -160121 -116560 -168378 -388711 -463146 -460298 -264297 8962
7169 8962 239392 325846 396452 255649 -30799 -120164 -111257 46227 337103 438728 353154
$$ packed form
7246c86478R824J78326R9817M1371r3040K4204J82395N2660N4814P9633j976K9728
7234B71278J76341K213k88551k29008J17118J89269J63957j9858j74917J3553
7224B21395J06515J9127J40428O0835k7165n3010p7111k1297o3092j38796J7245
7213A85074K8417j4253o4912L5842j4374j24883m7226L0038j33985k78469j20503
7202e19234k7733K1753J21505R1018J33486M8519M3684L6706M2880l2619j20520
7191a60555j44646q8234M7865R8861J46950J39178K60065K58142M2970n5851k31190
7180C13555k18077j63329j22226K9956M3561n1818k20333p4435K848J96001K73259
7169H962K30430Q6454P0606j40803k86448q9365Q907J57484K90876J01625q5574
$$ plain form
7158 353154 437467 386206 180855 -38186 -148244 -110566 -2021 41478 -147844 -130494 -37941
7147 -37941 102502 313684 502662 542736 340956 -2040 -247281 -138755 -68313 -221282
7137 -221282 -199312 -18991 104457 169285 158697 72827 83772 146326 187996 79756 -83687
7126 -83687 -57784 -21223 -91864 -154426 -159985 -226051 -234608 -246329 -192579 -99178 -94245 17662
7114 17662 177886 196416 141563 54495 -10776 -62437 90028 192595 139455 -65611 -223562
7103 -223562 -223489 -72838 65865 50908 -106508 -225691 -191775 -19192 225313 552408 713985
7092 713985 739161 711934 556642 473625 429374 524511 559044 608853 492616 211570 -52505
7081 -52505 -150547 -5120 73251 13206 -52841 -201003 -286560 -273422 -79265 113405 124408
$$ packed form
7158C53154Q4313n1261k05351k19041j10058L7678J08545M3499j89322J7350R2553
7147c7941J40443K11182J88978M0074k01780l42996k45241J08526P0442j52969
7137b21282K1970J80321J23448O4828j0588q5870J0945O2554M1670j08240j63443
7126h3687K5903L6561p0641o2562n559o6066q557j1721N3750R3401M933J11907
7114A7662J60224J8530n4853q7068o5271n1661J52465J02567n3140k05066j57951
7103b23562P3J50651J38703j4957j57416j19183L3916J72583K44505L27095J61577
7092G13985K5176k7227j55292q3017m4251R5137L4533M9809j16237k81046k64075
7081e2505r8042J45427P8371o0045o6047j48162q5557J3138J94157J92670J1003
$$ plain form
7070 124408 132305 214701 236804 162947 158240 205156 181756 52837 24075 161968 168164 155609
7058 155609 171613 134107 149125 113061 -109042 -121815 139557 331318 248495 58112 34442
7047 34442 217973 389507 632104 742911 493812 261537 229620 297126 363358 298114 307776
7036 307776 356469 401860 433815 346525 156475 213176 307455 404751 413259 362680 299504 230210
7024 230210 70603 -53929 -30239 175989 333069 136632 12433 110203 371584 595603
7014 595603 628514 379137 400100 578368 577658 485047 495160 463627 374817 376724 423721 398611
7002 398611 256470 114877 -30681 -71969 -103186 -78005 -95272 -119419 -63530 -92700 -146556
6991 -146556 -163363 -184677 -296855 -332354 -213836 -116104 -29854 56134 200116 87012 -223904
$$ packed form
7070A24408P897Q2396K2103p3857m707M6916k3400j28919k8762J37893O196j2555
7058A55609J6004l7506J5018l6064k22103j2773K61372J91761q2823j90383k3670
7047C4442J83531J71534K42597J10807k49099k32275l1917O7506O6232o5244R662
7036C07776M8693M5391L1955q7290j90050N6701R4279R7296Q508n0579o3176o9294
7024B30210j59607j24532K3690K06228J57080j96437j24199R7770K61381K24019
7014E95603L2911k49377K0963J78268p10r2611J0113l1533q8810J907M6997k5110
7002C98611j42141j41593j45558m1288l1217K5181j7267k4147N5889k9170n3856
6991a46556j6807k1314j12178l5499J18518R7732Q6250Q5988J43982j13104l10916
$$ plain form
6980 -223904 -345717 -187545 -22063 93768 188646 74708 -13708 -190605 -239552 -243871 -355420
6969 -355420 -499738 -390955 -131811 151216 240591 224018 68250 -146303 -169236 -130137
6959 -130137 -79407 -128441 -297763 -241108 -161323 -122031 74329 272681 258185 214744 138263
6948 138263 -32338 -207593 -154577 -137699 -284215 -316316 -340638 -250775 -80145 1730 -41635
6937 -41635 -149291 -111435 83286 179313 191497 302368 449472 501626 473115 464993 513515
6926 513515 588457 684862 636206 593304 619069 638395 524057 458144 449696 497550 551080 506665
6914 506665 643631 764773 786378 884353 929462 969673 1129100 1502371 1838592 1949445
6904 1949445 2072535 2301535 2357042 2580857 2749158 2728407 2511694 2163553 1962793 1871606
$$ packed form
6980b23904j21813J58172J65482J15831R4878j13938q8416j76897m8947m319j11549
6969c55420j44318J08783K59144K83027Q9375j6573j55768k14553k2933L9099
6959a30137N0730m9034j69322N6655P9785L9292J96360J98352j4496m3441p6481
6948A38263j70601j75255N3016J6878j46516l2101k4322Q9863J70630Q1875m3365
6937d1635j07656L7856J94721R6027J2184J10871J47104N2154k8511q122M8522
6926E13515P4942R6405m8656m2902K5765J9326j14338o5913q448M7854N3530m4415
6914E06665J36966J21142K1605R7975M5109M0211J59427L73271L36221J10853
6904A949445J23090K29000N5507K23815J68301k0751k16713l48141k00760r1187
$$ plain form
6894 1871606 1910987 1938505 1995349 2171663 2296923 2320293 2516991 2795636 3011603 3393609
6884 3393609 3919387 4063755 3682136 3350951 3056905 2760494 2759811 2802066 2717210 2476746
6874 2476746 2435782 2284720 1942083 1614609 1398806 1241537 1132736 905376 782376 778403
6864 778403 585056 394967 300587 190697 194048 431853 682500 740480 661529 524763 450064
6853 450064 489816 581526 734714 971162 1386574 1516060 1346309 1263840 1115776 945603
6843 945603 1023637 1013004 868420 686078 707117 857193 817009 818546 738934 681796 745353
6832 745353 925481 1098064 1254346 1372504 1355862 1453467 1591584 1666943 1813755 2221758
6822 2221758 2832514 3293907 3736398 4421557 5205788 6103556 7289737 8757167 10973643
$$ packed form
6894A871606L9381K7518N6844J76314J25260K3370J96698K78645K15967L82006
6884C393609N25778J44368l81619l31185k94046k96411o83M2255q4856k40464
6874B476746m0964j51062l42637l27474k15803j57269j08801k27360j23000l973
6864G78403j93347j90089r4380j09890L351K37805K50647N7980p8951j36766p4699
6853D50064L9752R1710J53188K36448M15412J29486j69751q2469j48064j70173
6843I45603P8034j0633j44584j82342K1039J50076m0184J537p9612n7138O3557
6832G45353J80128J72583J56282J18158j6642R7605J38117P5359J46812M08003
6822B221758O10756M61393M42491O85159P84231Q97768J186181J467430K216476
$$ plain form
6813 10973643 14080141 18303809 24234694 33072052 45800818 58016454 57173662 44426176
6805 44426176 32473570 24421380 18996793 14966629 12066660 9910785 8240491 6864350
6797 6864350 5833239 5113060 4467550 3986023 3632462 3186615 2850696 2575213 2260370
6788 2260370 1914541 1580027 1279647 1216247 1196046 1213609 1323103 1356440 1180310 1093254
6778 1093254 1173171 1130321 826910 501946 401304 421089 408050 479450 450131 514895 606743
6767 606743 668529 726375 814338 948568 1080253 1199789 1157947 993842 897435 933940 936363
6756 936363 905861 675067 335957 173908 273584 535287 645354 470803 297317 159989
6746 159989 67232 -82147 -358561 -255894 129189 377784 293503 95544 81656 253057
$$ packed form
6813A0973643L106498M223668N930885Q837358J2728766J2215636q42792j2747486
6805D4426176j1952606q052190n424587m030164k899969k155875j670294j376141
6797F864350j031111p20179o45510m81527l53561m45847l35919k75483l14843
6788B260370l45829l34514l00380o3400k0201J7563J09494L3337j76130q7056
6778A093254P9917m2850l03411l24964j00642J9785j3039P1400k9319O4764R1848
6767F06743O1786N7846Q7963J34230J31685J19536m1842j64105r6407L6505K423
6756I36363l0502k30794l39110j62049R9676K61703J10067j74551j73486j37328
6746A59989r2757j49379k76414J02667L85083K48595q4281j97959j3888J71401
$$ plain form
6736 253057 225113 -71687 -235498 -85962 139258 225705 274083 284410 293594 168525 -29319
6725 -29319 -148027 -86523 -2727 24595 -15375 69752 370066 607743 542175 288416 208723
6714 208723 192224 167635 159571 305290 417812 170539 -110525 -161254 -102148 -24151 -100621
6703 -100621 -232874 -210803 -6023 175658 424544 620182 560908 394300 307608 322971
6693 322971 163223 -125367 -261833 -146267 -64513 -212550 -296634 -345777 -188979 -126266
6683 -126266 -280182 -320544 -208026 -93798 -112586 -100226 -47130 89886 117728 185308 358955
6672 358955 449051 348214 352077 408635 509949 383303 214527 275984 315926 122742 -25371
6661 -25371 -31590 10047 -127632 -210582 -131396 119565 302576 289578 264408 98804 -46001
$$ packed form
6736B53057k7944k96800j63811J49536K25220Q6447M8378J0327R184j25069j97844
6725b9319j18708O1504Q3796K7322l9970Q5127L00314K37677o5568k53759p9693
6714B08723j6499k4589q064J45719J12522k47273k81064n0729N9106P7997p6470
6703a00621j32253K2071K04780J81681K48886J95638n9274j66608q6692J5363
6693C22971j59748k88590j36466J15566Q1754j48037q4084m9143J56798O2713
6683a26266j53916m0362J12518J14228j8788J2360N3096J37016K7842O7580J73647
6672C58955R0096j00837L863N6558J01314j26646j68776O1457L9942j93184j48113
6661b5371o219M1637j37679q2950P9186K50961J83011j2998k5170j65604j44805
$$ plain form
6650 -46001 -45125 -1848 -68050 -187905 -221554 -40692 25112 -53295 -151174 -255473 -199931 -110058
6638 -110058 -80636 77204 223210 380821 547303 477855 226643 -20019 23471 123451
6628 123451 47674 8732 317703 772302 1207758 1738309 1996689 1693884 1102066 826436
6618 826436 880887 789286 657954 675253 666954 541426 482895 437884 457255 344260 33520
6607 33520 -163713 -54597 143290 350767 541064 663041 634420 460411 313397 92122
6597 92122 -137266 -119527 -18029 92521 184583 248390 299745 246227 18139 -250024 -277138
6586 -277138 -41790 56313 -16362 32402 98730 80905 95119 181713 236821 208684 122592
6575 122592 -110929 -295165 -189839 -75620 -259291 -388267 -349952 -320346 -415835 -427502
$$ packed form
6650d6001Q76M3277o6202j19855l3649J80862O5804p8407r7879j04299N5542Q9873
6638a10058K9422J57840J46006J57611J66482o9448k51212k46662M3490R9980
6628A23451p5777l8942L08971M54599M35456N30551K58380l02805n91818k75630
6618H26436N4451r1601j31332J7299q299j25528n8531m5011J9371j12995l10740
6607C3520j97233J09116J97887K07477J90297J21977k8621j74009j47014k21275
6597I2122k29388J7739J01498J10550R2062O3807N1355n3518k28088k68163k7114
6586b77138K35348R8103p2675M8764O6328j7825J4214Q6594N5108k8137q6092
6575A22592k33521j84236J05326J14219j83671j28976L8315K9606r5489j1667
$$ plain form
6565 -427502 -291445 -200243 -170846 -119185 -83322 -179147 -257081 -204832 8751 138538 241955
6554 241955 341233 408679 527229 689336 824110 784880 542038 477996 532831 481571 431113
6543 431113 357955 389811 281333 -8174 50488 348911 589722 738202 745556 758023 703530
6532 703530 561803 373935 399907 539526 540327 625011 831378 931598 949105 1207265 1409331
6521 1409331 1370975 1394548 1505032 1624806 1704965 1686375 1748902 1532317 1215853 1139741 1355610
6510 1355610 1661144 1863226 2038849 2061834 1949683 2012749 2335382 2613262 2832316 3131156
6500 3131156 3563882 4052413 4588935 4895126 5365718 6089470 6997822 8147785 9425357
6491 9425357 11044729 12981497 15354718 18029650 21326788 25352004 30095770 35830097
$$ packed form
6565d27502J36057R1202K9397N1661L5863r5825p7934N2249K13583J29787J03417
6554B41955R9278O7446J18550J62107J34774l9230k42842o4042N4835n1260n0458
6543D31113p3158L1856j08478k89507N8662K98423K40811J48480P354J2467n4493
6532G03530j41727j87868K5972J39619Q01Q4684K06367J00220J7507K58160K02066
6521A409331l8356K3573J10484J19774Q0159j8590O2527k16585l16464p6112K15869
6510A355610L05534K02082J75623K2985j12151O3066L22633K77880K19054K98840
6500C131156M32726M88531N36522L06191M70592P23752R08352J149963J277572
6491I425357J619372J936768K373221K674932L297138M025216M743766N734327
$$ plain form
6483 35830097 42333243 47648406 49303343 46640036 41249788 35211636 29831838 25334415
6475 25334415 21685317 18863479 16625233 14694652 13219638 12135581 11071521 9830619
6467 9830619 8760192 7919537 7168031 6536637 5988133 5449516 4965925 4709356 4497330
6458 4497330 4157163 3805397 3556787 3243282 2898601 2811899 2936458 2967656 2820520 2614088
6448 2614088 2379044 2159455 2038015 2121140 1901713 1507437 1564870 1847382 1903077 1784430
6438 1784430 1798515 1802513 1860695 1987820 2028386 1940738 1978391 2177646 2228598 2113921 1895591
6427 1895591 1843270 2137882 2555941 2949215 2963518 2800231 2974582 3361743 3715906 4153287
6417 4153287 4743796 5559459 6585783 7719984 9208261 11247593 13680738 16121760 18316077
$$ packed form
6483C5830097O503146N315163J654937k663307n390248o038152n379798m497423
6475B5334415l649098k821838k238246j930581j475014j084057j064060j240902
6467I830619j070427q40655p51506o31394n48504n38617m83591k56569k12026
6458D497330l40167l51766k48610l13505l44681q6702J24559L1198j47136k06432
6448B614088k35044k19589j21440Q3125k19427l94276N7433K82512N5695j18647
6438A784430J4085L998N8182J27125M0566q7648L7653J99255N0952j14677k18330
6427A895591n2321K94612M18059L93274J4303j63287J74351L87161L54163M37381
6417D153287N90509Q15663J026324J134201J488277K039332K433145K441022K194317
$$ plain form
6408 18316077 19584914 19111513 17136975 14629673 12129645 10003828 8400920 7052787
6400 7052787 6106810 5118851 4041304 3620825 3671041 3509347 3046429 2560240 2346689 2147371
6390 2147371 1953347 1745835 1468504 1086022 881908 1049058 1426819 1626070 1453058 1349138
6380 1349138 1206816 1170327 1296059 1268534 916937 629873 464930 518854 748846 984129
6370 984129 1067923 1089549 1053724 807579 646990 638225 514977 260539 92415 157119 154864
6359 154864 44406 65471 177117 217931 260530 416600 392784 350750 288999 144324 65716
6348 65716 101682 206855 441654 400377 393105 245383 -102524 -82813 58157 342105 585758
6337 585758 549055 470982 317376 137504 34305 175596 286788 415385 443062 309019
$$ packed form
6408A8316077J268837m73401j974538k507302k500028k125817j602908j348133
6400G052787r45977r87959j077547m20479N0216j61694m62918m86189k13551j99318
6390B147371j94024k07512k77331l82482k04114J67150L77761J99251j73012j03920
6380A349138j42322l6489J25732k7525l51597k87064j64943N3924K29992K35283
6370I84129Q3794K1626l5825k46145j60589q765j23248k54438j68124O4704k255
6359A54864j10458K1065J11646M0814M2599J56070k3816m2034o1751j44675p8608
6348F5716L5966J05173K34799m1277p272j47722l47907J9711J40970K83948K43653
6337E85758l6703p8073j53606j79872j03199J41291J11192J28597K7677j34043
$$ plain form
6327 309019 361142 431444 358877 265837 252066 183581 22808 -140863 -63906 -18504 -34060
6316 -34060 84186 324669 436782 435260 451598 377072 197779 51585 15720 -99614 -107624
6305 -107624 -37413 -4880 46288 55754 1472 -6328 120310 240746 208117 156193 282683
6294 282683 324441 422517 480461 460456 370579 319691 260776 213615 205691 136097 140921 26930
6282 26930 30904 140550 70806 -90094 -43283 89502 162101 234955 262749 337764 429252
6271 429252 450522 445571 446346 453386 421114 388949 466251 481217 408398 268810 251031 377747
6259 377747 505840 522912 465446 201239 -17158 2459 -89100 -76469 120007 70034 -157279
6248 -157279 -176681 -302645 -325125 -306079 -221081 56670 15614 -22825 63488 98174 170626
$$ packed form
6327C09019N2123P0302p2567r3040j3771o8485j60773j63671P6957M5402j5556
6316c4060J18246K40483J12113j522J6338p4526j79293j46194l5865j15334q010
6305a07624P0211L2533N1168R466n4282p800J26638J20436l2629n1924J26490
6294B82683M1758R8076N7944k0005q9877n0888n8915m7161p924o9594M824j13991
6282B6930L974J09646o9744j60900M6811J32785P2599P2854K7794P5015R1488
6271D29252K1270m951P75P040l2272l2165P7302J4966p2819j39588j7779J26716
6259C77747J28093J7072n7466k64207k18397J9617r1559J2631J96476m9973k27313
6248a57279j9402j25964k2480J9046Q4998K77751m1056l8439Q6313L4686P2452
$$ plain form
6237 170626 227652 203236 172211 304426 157371 -80172 -142964 -46895 99447 232823 188846
6226 188846 49044 26833 -25631 -6415 51528 -83235 -233589 -36040 184784 180072 -31002
6215 -31002 -143557 -141307 -193796 -353441 -647801 -785611 -722397 -749384 -600349 -253272 1232
6204 1232 223363 344843 332810 344323 289252 210253 148027 47779 -50635 10446 3205 -36722
6192 -36722 -57596 20071 75696 85876 132498 186436 120754 257494 321143 340904 463179
6181 463179 512533 330138 -65337 -269486 -363559 -184165 -23458 -94710 -121559 31482
6171 31482 287933 527245 581018 399741 199222 -25188 -259257 -181104 -34490 -255945
6161 -255945 -427328 -440861 -399181 -311186 -44464 90789 119316 194997 146501 102011 52250
$$ packed form
6237A70626N7026k4416l1025J32215j47055k37543o2792R6069J46342J33376m3977
6226A88846j39802k2211n2464J9216N7943j34763j50354J97549K20824m712k11074
6215c1002j12555K250n2489j59645k94360j37810O3214k6987J49035L47077K54504
6204A232K22131J21480j2033J1513n5071p8999o2226j00248r8414O1081p241l9927
6192c6722k0874P7667N5625J0180M6622N3938o5682J36740O3649J9761J22275
6181D63179M9354j82395l95475k04149r4073J79394J60707p1252k6849J53041
6171C1482K56451K39312N3773j81277k00519k24410k34069P8153J46614k21455
6161b55945j71383j3533M1680Q7995K66722J35253K8527P5681m8496m4490m9761
$$ plain form
6150 52250 211275 492322 636593 537888 400070 205609 87416 -3707 -126712 -108481
6140 -108481 -75310 -172031 -345330 -216141 112224 194258 357283 649494 761240 484666
6130 484666 281846 637699 1376735 1899699 1672110 1063378 675131 446495 269583 261449
6120 261449 171058 53058 133690 134159 -97684 -272336 -93862 186660 196115 88788 255372
6109 255372 501419 483628 348577 375143 392510 458620 355594 296660 224609 168578 122160
6098 122160 85665 202075 260069 207555 -26217 -201843 -245025 -351412 -433932 -407064 -365796
6087 -365796 -244024 -232995 -366765 -431082 -321967 -69068 109286 173992 99453 -137049
6077 -137049 -137850 107828 212180 32306 -25714 83808 120940 155213 241947 381039 568077
$$ packed form
6150E2250J59025K81047J44271r8705j37818j94461j18193r1123j23005J8231
6140a08481L3171r6721j73299J29189L28365Q2034J63025K92211J11746k76574
6130D84666k02820L55853P39036N22964k27589o08732l88247k28636j76912q134
6120B61449r0391j18000Q0632M69k31843j74652J78474K80522R455j07327J66584
6109B55372K46047j7791j35051K6566J7367O6110j03026n8934p2051n6031m6418
6098A22160l6495J16410N7994n2514k33772j75626m3182j06387q2520K6868M1268
6087c65796J21772J1029j33770o4317J09115K52899J78354O4706p4539k36502
6077a37049q01K45678J04352j79874n8020J09522L7132L4273Q6734J39092J87038
$$ plain form
6066 568077 651037 802268 830480 669302 506018 371127 253506 170661 179164 62146 -10833
6055 -10833 -91648 -258894 -365270 -375715 -239374 -41353 97948 81004 -2755 106633 217453
6044 217453 118474 86811 262337 418970 488909 395301 279942 302464 440957 401391 358022
6033 358022 381669 297833 42425 -47899 13774 40034 118530 114405 -69532 -160293 -207630
6022 -207630 -311030 -223279 27689 89820 87908 1603 -187047 -453775 -746237 -759628 -367448
6011 -367448 -68900 -6284 -14611 114941 286544 298197 294167 320392 388307 404242 513832
6000 513832 360942 99126 36181 76648 112881 237272 350226 383512 485787 328880
5990 328880 118494 159941 214317 118912 -7534 -35048 -23315 -50869 32148 73461 95767
$$ packed form
6066E68077Q2960J51231K8212j61178j63284j34891j17621q2845Q503j17018p2979
6055a0833q0815j67246j06376j0445J36341J98021J39301j6944q3759J09388J10820
6044B17453r8979l1663J75526J56633O9939r3608j15359K2522J38493l9566m3369
6033C58022K3647q3836k55408r0324O1673K6260P8496m125j83937r0761m7337
6022b07630j03400Q7751K50968O2131j912q6305j88650k66728k92462j3391L92180
6011c67448K98548O2616q327J29552J71603J1653m030K6225O7915J5935J09590
6000E13832j52890k61816o2945M0467L6233J24391J12954L3286J02275j56907
5990C28880k10386M1447N4376r5405j26446k7514J1733k7554Q3017M1313K2306
$$ plain form
5979 95767 -27998 -129084 -261972 -343287 -100592 193131 303158 147194 117731 146325
5969 146325 -86796 -432688 -503953 -224385 12756 186526 329895 418249 476473 264994
5959 264994 59228 127959 256017 256609 127078 -89456 -324066 -376822 -268561 -115677 -91159
5948 -91159 -43462 -41593 -58503 170146 297499 142984 -230421 -412303 -227711 -206823 -219975
5937 -219975 -62547 -43830 6649 43469 49451 -105539 -289962 -299153 -283235 -131214 188491
5926 188491 330390 297829 212826 282611 191796 -40001 -154167 -127735 -16607 15442 -50623
5915 -50623 -52760 15251 -5132 -166225 -485415 -650583 -461357 -280628 -356893 -528698 -708805
5904 -708805 -655088 -359400 -178480 -132869 -212443 -151641 -5230 97952 198366 273372 175975
$$ packed form
5979I5767j23765j01086j32888q1315K42695K93723J10027j55964k9463K8594
5969A46325k33121l45892p1265K79568K37141J73770J43369Q8354N8224k11479
5959B64994k05766O8731J28058N92j29531k16534k34610n2756J08261J52884K4518
5948i1159M7697J869j6910K28649J27353j54515l73405j81882J84592K0888j3152
5937b19975J57428J8717N0479L6820N982j54990j84423r191J5918J52021L19705
5926A88491J41899l2561q5003O9785r0815k31797j14166K6432J11128L2049o6065
5915e0623k137O8011k0383j61093l19190j65168J89226J80729p6265j71805j80107
5904g08805N3717K95688J80920M5611p9574O0802J46411J03182J00414P5006r7397
$$ plain form
5893 175975 78625 11458 9728 45854 46360 -172667 -218751 -322093 -410301 -268705 -246931 -434624
5881 -434624 -767282 -746672 -629101 -516698 -306576 -245197 -237894 -220367 -348959 -364152 -214456
5870 -214456 -260574 -166636 -128913 -354207 -607866 -733939 -655395 -716202 -840929 -664581 -443897
5859 -443897 -351716 -325034 -113150 68663 80626 -9291 -72766 -56516 -229276 -461248 -451658
5848 -451658 -303211 -346323 -502440 -526513 -506963 -407744 -226543 -17298 48793 -140153 -229403
5837 -229403 -145109 61020 141180 144042 95434 -8703 -130037 -206914 -255480 -269116 -350835
5826 -350835 -340149 -180907 -74913 -1524 -132629 -311060 -426621 -502147 -506414 -537875 -545134
5815 -545134 -540688 -481154 -384428 -237621 -61928 -295243 -374836 -292714 -459707 -445415 -318836
$$ packed form
5893A75975r7350o7167j730L6126N06k19027m6084j03342q8208J41596K1774j87693
5881d34624l32658K0610J17571J12403K10122O1379P303J7527j28592j5193J49696
5870b14456m6118R3938L7723k25294k53659j26073P8544o0807j24727J76348K20684
5859d43897R2181K6682K11884J81813J1963q9917o3475J6250j72760k31972R590
5848d51658J48447m3112j56117k4073J9550R9219J81201K09245O6091j88946q9250
5837b29403Q4294K06129Q0160K862m8608j04137j21334p6877m8566j3636q1719
5826c50835J0686J59242J05994P3389j31105j78431j15561p5526m267l1461p259
5815e45134M446N9534R6726J46807J75693k33315p9593Q2122j66993J4292J26579
$$ plain form
5804 -318836 -376804 -415685 -265673 -126145 -291059 -440749 -409823 -163821 79669 187490
5794 187490 175256 20803 33314 53238 -27430 -58806 -176314 -152779 44508 128803 -59239
5783 -59239 -300078 -390090 -358051 -140465 113668 268758 158207 -109358 -297145 -304156 -283005
5772 -283005 -389904 -305686 -240926 -312632 -437078 -520950 -291964 -121193 -29503 154501 373057
5761 373057 497010 519071 279878 139704 81745 114773 242364 401314 350019 264293 190937
5750 190937 -15328 -321030 -609173 -559732 -231257 41830 223109 209594 179380 21695
5740 21695 -240806 -429466 -425188 -324227 -312972 -270239 -109732 -2190 28027 74480 202812
5729 202812 142999 -44843 -215666 -343044 -492551 -558801 -438266 -227032 -181896 -216543
$$ packed form
5804c18836n7968l8881J50012J39528j64914j49690L0926K46002K43490J07821
5794A87490j2234j54453J2511J9924q0668l1376j17508K3535J97287Q4295j88042
5783e9239k40839r0012L2039K17586K54133J55090j10551k67565j87787p011K1151
5772b83005j06899Q4218O4760p1706j24446q3872K28986J70771R1690J84004K18556
5761C73057J23953K2061k39193j40174n7959L3028J27591J58950n1295q5726p3356
5750A90937k06265l05702k88143M9441L28475K73087J81279j3515l0214j57685
5740B1695k62501j88660M278J00961J1255M2733J60507J07542L0217M6453J28332
5729B02812n9813j87842j70823j27378j49507o6250J20535K11234M5136l4647
$$ plain form
5719 -216543 -71863 135078 198448 184397 180020 52289 19146 -118701 -185527 -60305 46896
5708 46896 -41973 -164234 -288842 -369792 -298810 -229486 -181075 -172688 -259010 -142274 68426
5697 68426 209661 385766 315642 108932 22940 -40220 -267857 -574712 -585545 -502433 -512057
5686 -512057 -525357 -516361 -269862 92875 170296 26838 -58597 -54972 -23148 -22845 -188402 -254683
5674 -254683 -307639 -254947 -58029 -140752 -487371 -480518 -186524 -81190 -96862 11276 226571
5663 226571 309776 226354 65907 -89957 -89491 -106452 -107493 -109258 -33156 40687 -46064 -150268
5651 -150268 -89734 -44602 -262913 -416065 -327453 -235596 -286041 -280045 -226743 -275915 -418576
5640 -418576 -347259 -194254 -156428 -142458 -266455 -314123 -142978 4063 237898 275266 168870
$$ packed form
5719b16543J44680K06941O3370j4051m377j27731l3143j37847o6826J25222J07201
5708D6896q8869j22261j24608q0950P0982O9324M8411Q387q6322J16736K10700
5697F8426J41235J76105p0124k06710q5992o3160k27637l06855j0833Q3112r624
5686e12057j3300Q996K46499L62737P7421j43458q5435L625L1824L03j65557o6281
5674b54683n2956N2692J96918q2723l46619O853K93994J05334j5672J08138K15295
5663B26571Q3205q3422j60447j55864M66j6961j041j765P6102P3843q6751j04204
5651a50268O0534M5132k18311j53152Q8612R1857n0445N996N3302m9172j42661
5640d18576P1317J53005L7826J3970j23997m7668J71145J47041K33835L7368j06396
$$ plain form
5629 168870 307294 575370 634741 531520 324627 162466 338802 507841 419524 221106
5619 221106 -102992 -409869 -707693 -785222 -655484 -524873 -468088 -417983 -218298 19521
5609 19521 61993 -66881 -172224 -166663 -83114 -187025 -495022 -439129 -22601 302939 327332
5598 327332 225644 173408 142273 154556 112664 159153 220049 178446 -120382 -461624 -612071
5587 -612071 -587528 -380206 -203062 -60810 136499 242448 14367 -285935 -446348 -598367
5577 -598367 -525991 -383674 -384528 -339335 -277508 -251869 -314232 -300029 -225456 -348870 -594983
5566 -594983 -646444 -534930 -380415 -298785 -277187 -235612 -298981 -291637 -128753 -133105 -294846
5555 -294846 -379091 -476600 -295022 -6480 -19096 -151166 -144216 -170799 -48391 95065 138109
$$ packed form
5629A68870J38424K68076N9371j03221k06893j62161J76336J69039q8317j98418
5619B21106l24098l06877k97824p7529J29738J30611N6785N0105J99685K37819
5609A9521M2472j28874j05343N561Q3549j03911l07997N5893M16528L25540K4393
5598C27332j01688n2236l1135J2283m1892M6489O0896m1603k98828l41242j50447
5587f12071K4543K07322J77144J42252J97309J05949k28081l00302j60413j52019
5577e98367P2376J42317q54M5193O1827K5639o2363J4203P4573j23414k46113
5566e94983n1461J11514J54515Q1630K1598M1575o3369P344J62884m352j61741
5555b94846q4245r7509J81578K88542j2616j32070O950k6583J22408J43456M3044
$$ plain form
5544 138109 53540 -37624 62609 67295 5448 -60448 -184224 -403330 -469205 -331909 -180068
5533 -180068 -208029 -221437 -165442 -51846 -3596 -138452 -173040 -87097 131466 240608 60427
5522 60427 -157651 -221114 -106706 -36781 -152428 -266939 -240528 -112886 -243615 -431915
5512 -431915 -628624 -728535 -650046 -548494 -574608 -518423 -411606 -286799 -110401 17026
5502 17026 94795 141361 132653 77871 119275 -318 18981 155452 128708 59153 68001 -59789
5490 -59789 -159064 -116851 -153691 -109409 17896 212195 327498 142404 -41562 47300 213956
5479 213956 170947 -3220 -88233 -68328 -157679 8573 151473 79617 -47093 -121513 -266135
5468 -266135 -458135 -531180 -422100 -222874 -104623 -92947 -227195 -524966 -500479 -163044
$$ packed form
5544A38109q4569r1164J00233M686o1847o5896j23776k19106o5875J37296J51841
5533a80068k7961j3408N5995J13596M8250j34856l4588Q5943K18563J09142j80181
5522F0427k18078o3463J14408O9925j15647j14511K6411J27642j30729j88300
5512d31915j96709r9911P8489J01552k6114N6185J06817J24807J76398J27427
5502A7026P7769M6566q708n4782M1404j19593J9299J36471k6744o9555Q848j27790
5490e9789r9275M2213l6840M4282J27305J94299J15303j85094j83966Q8862J66656
5479B13956m3009j74167q5013J9905q9351J66252J42900p1856j26710p4420j44622
5468b66135j92000p3045J09080J99226J18251J1676j34248k97771K4487L37435
$$ plain form
5458 -163044 92517 35348 -25788 -148708 -278406 -197595 -122001 -70819 -41637 -28854 -3054
5447 -3054 41510 64838 171099 111601 -41252 -68672 25603 193712 331770 336098 235779
5436 235779 100310 77251 230605 385501 410097 408067 392619 289094 197309 131720 184223
5425 184223 138002 157052 179543 6536 -72748 29633 -12750 -265869 -353816 -262837 -240094
5414 -240094 -247488 -409603 -327533 -44319 78069 27616 -92194 -87133 -135708 -348393 -540073
5403 -540073 -497247 -287064 -154914 -125954 -122540 -112626 -41365 228148 365997 198828 34607
5392 34607 -150850 -316890 -472364 -500596 -352787 -95405 -33238 -19274 -95449 -182415 -155794
5381 -155794 -88039 -120722 -164749 -134860 2668 -15915 -89292 -40237 114698 239310 227864
$$ packed form
5458a63044K55561n7169o1136j22920j29698Q0811P5594N1182K9182J2783K5800
5447c054M4564K3328J06261n9498j52853k7420R4275J68109J38058M328j00319
5436B35779j35469k3059J53354J54896K4596k030j5448j03525r1785o5589N2503
5425A84223m6221J9050K2491j73007p9284J02381m2383k53119q7947R0979K2743
5414b40094p394j62115Q2070K83214J22388n0453j19810N061m8575k12685j91680
5403e40073M2826K10183J32150K8960L414R914P1261K69513J37849j67169j64221
5392C4607j85457j66040j55474k8232J47809K57382O2167J3964p6175q6966K6621
5381a55794O7755l2683m4027K9889J37528j8583p3377M9055J54935J24612j1446
$$ plain form
5370 227864 93949 -124 -100832 -55681 79293 30151 -97053 -73623 -152043 -333723 -428032
5359 -428032 -435383 -505581 -457126 -373410 -238234 -229344 -426220 -418616 -341182 -201560 138073
5348 138073 318123 161256 1525 -248768 -452476 -350389 -150193 -41975 40115 70917
5338 70917 67739 45731 -7573 -65334 -80202 -36281 4615 52437 95969 323792 363921 189472
5326 189472 26484 -141071 -272828 -99996 9403 -108935 -304206 -530332 -613035 -506653
5316 -506653 -544128 -607710 -320368 -122169 -91125 -122511 -235155 -323507 -333576 -150889 179756
5305 179756 242644 191406 2914 -233507 -297563 -266735 -104154 73916 259182 304128 272638
5294 272638 219439 247247 429452 595118 708440 588020 340446 160108 72925 19186
$$ packed form
5370B27864j33915r4073j00708M5151J34974m9142j27204K3430p8420j81680r4309
5359d28032p351p0198M8455Q3716J35176Q890j96876P604P7434J39622L39633
5348A38073J80050j56867j59731k50293k03708J02087K00196J08218Q2090L0802
5338G0917l178k2008n3304n7761j4868M3921M0896M7822M3532K27823M0129j74449
5326A89472j62988j67555j31757J72832J09399j18338j95271k26126q2703J06382
5316e06653l7475o3582K87342J98199L1044l1386j12644q8352j0069J82687L30645
5305A79756O2888n1238j88492k36421o4056L0828J62581J78070J85266M4946l1490
5294B72638n3199K7808J82205J65666J13322j20420k47574j80338q7183n3739
$$ plain form
5284 19186 1643 -174686 -245237 -164678 -23785 99368 309300 339556 277157 269746 320075
5273 320075 447609 401803 430247 465413 546139 715137 686193 777217 831757 830805 735742 688662
5261 688662 689360 739548 975794 1241566 1423063 1450628 1368735 1325302 1555915 1758649 1949064
5250 1949064 1981389 2000144 2017210 2202944 2551344 2968754 3444236 4112301 4921819 5563659
5240 5563659 5907553 6339554 7230999 8754153 10633369 13142655 16589567 21190109 27165167
5231 27165167 31647580 29975623 24538297 19670973 15988163 13273224 11289825 9460311
5223 9460311 7774365 6603990 5490189 4490867 3618282 2892010 2427126 2029820 1680964
5214 1680964 1605254 1563922 1485213 1431736 1248412 706896 312669 264733 285538 370409 529120
$$ packed form
5284A9186j7543j76329p0551Q0559J40893J23153K09932L0256o2399p411N0329
5273C20075J27534m5806K8444L5166Q0726J68998k8944R1024N4540r52r5063m7080
5261F88662O98N0188K36246K65772J81497K7565q1893m3433K30613K02734J90415
5250A949064L2325J8755J7066J85734L48400M17410M75482O68065Q09518O41840
5240E563659L43894M32001Q91445J523154J879216K509286L446912M600542N975058
5231B7165167M482413j671957n437326m867324l682810k714939j983399j829514
5223I460311j685946j170375j113801r99322q72585p26272m64884l97306l48856
5214A680964p5710m1332p8709n3477j83324n41516l94227m7936K0805Q4871J58711
$$ plain form
5203 529120 612617 601842 389144 424558 500766 382628 298418 449037 500536 389459 404559
5192 404559 335129 190069 271665 296869 113414 10786 61558 254902 311984 171371 10380
5181 10380 -36338 94069 64643 66208 71133 -42 -143809 -111202 -34726 -15392 165 173976
5169 173976 587739 731237 555344 170715 -80456 -155454 -115965 94317 146516 47768
5159 47768 131486 260989 280274 68024 -160504 -184389 -96814 -1265 -18645 65248 211385
5148 211385 241820 60635 -149410 -204626 -229854 -60792 7649 24777 13480 27593 164293
5137 164293 343609 327118 98071 37507 56252 -39008 -153354 -129382 -91696 39433 101782
5126 101782 161279 192210 78690 -146206 -327312 -422368 -422831 -426954 -382077 -201847 9469
$$ packed form
5203E29120Q3497j0775k12698L5414P6208j18138q4210J50619N1499j11077J5100
5192D04559o9430j45060Q1596K5204j83455j02628N0772J93344N7082j40613j60991
5181A0380m6718J30407k9426J565M925p1175j43767L2607P6476J9334J5557J73811
5169A73976M13763J43498j75893l84629k51171p4998L9489K10282N2199r8748
5159D7768Q3718J29503J9285k12250k28528k3885Q7575R5549j7380Q3893J46137
5148B11385L0435j81185k10045n5216k5228J69062O8441J7128j1297J4113J36700
5137A64293J79316j6491k29047o0564J8745r5260j14346K3972L7686J31129O2349
5126A01782N9497L0931j13520k24896j81106r5056m63m123M4877J80230K11316
$$ plain form
5115 9469 42001 51187 309 -325818 -409378 -150436 38754 -37785 -95529 -43143 -59045 -70689
5103 -70689 42494 217257 135575 -59185 31704 217082 167017 -63320 -153206 -119433 -160331
5092 -160331 -116170 -207800 -164435 -51167 34901 39959 120632 318977 479214 607448 587686
5081 587686 527795 624025 838561 943326 691727 441380 292918 164323 168003 165694 258480
5070 258480 216772 85681 -12497 -2668 -31252 92775 267117 251540 311744 337637 262061
5059 262061 291706 428241 355883 101783 -99585 -227195 -441187 -531236 -319522 17091
5049 17091 186422 230399 361994 300961 -45190 -288537 -187991 67084 238968 234533 140120
5038 140120 65949 14023 -169762 -175939 -139735 -286915 -536900 -520964 -409857 -258686 -195615
$$ packed form
5115I469L2532R186n0878l26127q3560K58942J89190p6539n7744N2386j5902j1644
5103g0689J13183J74763q1682j94760R0889J85378n0065k30337q9886L3773m0898
5092a60331M4161r1630M3365J13268Q6068N058Q0673J98345J60237J28234j9762
5081E87686n9891R6230K14536J04765k51599k50347j48462j28595L680k309R2786
5070B58480m1708j31091r8178R829k8584J24027J74342j5577O0204K5893p5576
5059B62061K9645J36535p2358k54100k01368j27610k13992r0049K11714L36613
5049A7091J69331M3977J31595o1033l46151k43347J00546K55075J71884m435r4413
5038A40120p4171n1926j83785o177L6204j47180k49985J5936J11107J51171O3071
$$ plain form
5027 -195615 -159379 -218230 -263110 -51117 22434 -105121 -81008 -104507 -245478 -239440 -164767
5016 -164767 30178 262840 443879 282301 69343 56746 91699 -1080 46893 172744
5006 172744 236008 193417 173860 253747 261229 236871 156783 148478 149335 -105824 -185136 -139545
4994 -139545 -223201 -276841 -375378 -492531 -340351 4605 157115 200037 305417 258059 11981
4983 11981 -178762 -57683 123712 249048 265885 268926 289129 330135 212920 47709 94966
4972 94966 170153 224293 253765 252003 240747 224781 146916 151156 119484 21056 93726 327135
4960 327135 444989 384120 320386 178041 -26769 -133127 -71802 -118880 -173010 -19636 64266
4949 64266 -36954 -143499 -215291 -23872 238245 414873 378689 200957 60023 106265
$$ packed form
5027a95615L6236n8851m4880K11993P3551j27555K4113k3499j40971O038P4673
5016a64767J94945K32662J81039j61578k12958j2597L4953r2779M7973J25851
5006A72744O3264m2591j9557P9887P482k4358q0088q305Q57k55159p9312M5591
4994a39545q3656n3640r8537j17153J52180L44956J52510M2922J05380m7358k46078
4983A1981j90743J21079J81395J25336J6837L041K0203M1006j17215j65211M7257
4972I4966P5187N4140K9472j762j1256j5966p7865M240l1672r8428P2670K33409
4960C27135J17854o0869o3734j42345k04810j06358O1325m7078n4130J53374Q3902
4949F4266j01220j06545p1792J91419K62117J76628l6184j77732j40934M6242
$$ plain form
4939 106265 163965 -45181 -225818 -204820 -9389 260458 526076 620099 575401 327385
4929 327385 -50456 -277038 -83117 43146 -33221 -125984 -112950 -133053 -108791 -84738 -77257
4918 -77257 -111203 -177267 -73908 110150 189069 113402 -13111 103816 116200 150349 355340
4907 355340 402217 351503 212596 -8237 86105 252483 307221 252919 238965 203884 -107043
4896 -107043 -358679 -521086 -589159 -355117 -139956 -85797 -43495 -45630 -20286 132872 193902
4885 193902 232703 320080 532617 799869 786499 508516 368493 451562 571250 625301 556093
4874 556093 437659 308114 235655 136912 44481 -50180 -105717 -31497 5510 -205524 -448131
4863 -448131 -399035 -149018 -19596 -112755 -44930 -117054 -360847 -419238 -363357 -183264 -92718
$$ packed form
4939A06265N7700k09146j80637K0998J95431K69847K65618R4023m4698k48016
4929C27385l77841k26582J93921J26263p6367r2763J3034k0103K4262K4053P481
4918g7257l3946o6064J03359J84058P8919p5667j26513J16927J2384L4149K04991
4907C55340M6877n0714j38907k20833R4342J66378N4738n4302j3954l5081l10927
4896a07043k51636j62407o8073K34042K15161N4159M2302k135K5344J53158O1030
4885A93902L8801Q7377K12537K67252j3370k77983j40023Q3069J19688N4051o9208
4874E56093j18434j29545p2459r8743r2431r4661n5537P4220L7007k11034k42607
4863d48131M9096K50017J29422r3159O7825p2124k43793n8391N5881J80093R0546
$$ plain form
4852 -92718 -140131 -150909 -245025 -301845 -362816 -269104 -57949 55194 158392 125360 11287
4841 11287 -70594 -141821 -291009 -402473 -401442 -251129 -91715 -127237 -154781 -75260 -19409
4830 -19409 -20673 -2769 161327 323424 404510 526310 527891 448225 397507 410993 238446
4819 238446 -90015 -132284 145851 485632 494266 171488 -15622 -12030 40230 -135602 -554624
4808 -554624 -860944 -986995 -906498 -720645 -572591 -478742 -445676 -415163 -422044 -306824 -128193
4797 -128193 -83686 -68989 -169742 -376780 -380449 -268236 -252255 -271006 -262688 -356992 -482583
4786 -482583 -460278 -274117 -179144 -355281 -481871 -252243 30581 122156 156888 116421 206767
4775 206767 214912 -20892 -211474 -375641 -615935 -795741 -730131 -384342 -137355 67199
$$ packed form
4852i2718m7413j0778r4116n6820o0971R3712K11155J13143J03198l3032j14073
4841A1287q1881p1227j49188j11464J031J50313J59414l5522k7544P9521N5851
4830a9409j264J7904J64096J62097Q1086J21800J581p9666n0718J3486j72547
4819B38446l28461m2269K78135L39781Q634l22778j87110L592N2260j75832m19022
4808e54624l06320j26051Q0497J85853J48054R3849L3066L0513o881J15220J78631
4797a28193M4507J4697j00753k07038l669J12213J5981j8751Q318r4304j25591
4786d82583K2305J86161R4973j76137j26590K29628K82824R1575L4732m0467R0346
4775B06767Q145k35804j90582j64167k40294j79806O5610L45789K46987K04554
$$ plain form
4765 67199 161664 168838 75458 -91473 -210039 -176716 -5339 256105 351236 188415 11120
4754 11120 -83230 -49063 31978 79433 -20780 -60188 -133477 -257000 -295001 -337553 -298858
4743 -298858 -408973 -449206 -334601 -304432 -371581 -365590 -241397 -84956 49957 122462 141847
4732 141847 313819 395839 249570 121332 80119 132265 206374 147469 160674 295972 427078
$$ packed form
4765F7199R4465P174r3380j66931j18566L3323J71377K61444R5131j62821j77295
4754A1120r4350L4167Q1041M7455j00213l9408p3289j23523l8001m2552L8695
4743b98858j10115m0233J14605L0169o7149N991J24193J56441J34913P2505J9385
4732A41847J71972Q2020j46269j28238m1213N2146P4109n8905J3205J35298J31106
$$ [...]
##END NTUPLES=NMR SPECTRUM
##END=
