##TITLE=C13_CG-1146-x1
 DMSO-d6, 25800 sc

 22.12.2023
##JCAMPDX= 6.0         $$ Bruker NMR JCAMP-DX V2.0
##DATA TYPE= NMR SPECTRUM
##DATA CLASS= NTUPLES
##ORIGIN= UXNMR, Bruker Analytische Messtechnik GmbH
##OWNER= root
$$ XWIN-NMR		Version 3.5
$$ Fri Dec 22 13:51:15 2023 Russian Standard Time (UT+4h)  she@DPX200
##.OBSERVE FREQUENCY= 50.327896
##.OBSERVE NUCLEUS= ^13C
##.ACQUISITION MODE= SIMULTANEOUS
##.ACQUISITION SCHEME= undefined
##.AVERAGES= 25801
##.DIGITISER RES= 17
##SPECTROMETER/DATA SYSTEM= spect
##.PULSE SEQUENCE= zgpg30
##.SOLVENT NAME= CDCl3
##.SHIFT REFERENCE= (INTERNAL, CDCl3, 0, 222.624)
##AUDIT TRAIL= $$ (NUMBER, WHEN, WHO, WHERE, WHAT)
$$ ##TITLE= Audit trail, XWIN-NMR		Version 3.5
$$ ##JCAMPDX= 5.01
$$ ##ORIGIN= Bruker BioSpin GmbH
$$ ##OWNER= she
$$ F:/spectra/data/she/nmr/c13/1/pdata/1/auditp.txt
$$ ##AUDIT TRAIL=  $$ (NUMBER, WHEN, WHO, WHERE, WHAT)
(   1,<2023-12-22 13:40:22.53 +0400>,<she>,<DPX200>,
      <created by zg, POWCHK disabled, PULCHK disabled
       terminated by command 'halt'
       configuration hash MD5:
       00 E9 B6 7A A2 85 ED C7 34 08 36 98 17 FE 4E 26
       data hash MD5: 32K
       A3 FF F0 C7 BB C4 39 C0 86 72 0D 38 EC C1 11 92>)
(   2,<2023-12-22 13:47:46.04 +0400>,<she>,<DPX200>,
      <Start of raw data processing
       efp BC_mod = 2 LB = 2 FT_mod = 6 PKNL = 1 PHC0 = -391.2722 PHC1 = 30.73753 SI = 32K 
       data hash MD5: 32K
       B6 63 5F 17 42 61 15 89 16 B7 49 F0 ED 89 FF 2F>)
(   3,<2023-12-22 13:49:44.14 +0400>,<she>,<DPX200>,
      <pk PHC0 = 0.1305265 PHC1 = 3.2 
       data hash MD5: 32K
       53 34 31 3D 5B EC D3 4C 4E 80 42 44 50 F9 93 A3>)
(   4,<2023-12-22 13:49:50.70 +0400>,<she>,<DPX200>,
      <abs ABSG = 5 
       data hash MD5: 32K
       94 86 F9 BC 02 DB DA A8 79 69 04 56 85 04 8A 2F>)
(   5,<2023-12-22 13:49:57.35 +0400>,<she>,<DPX200>,
      <abs ABSG = 5 
       data hash MD5: 32K
       93 A7 41 F9 4D 07 B6 0A EF 72 2C BE 9E C6 BF D1>)
$$ ##END=
$$ 
$$ hash MD5
$$ 05 70 B5 98 59 49 8E 74 94 6C E3 79 A7 5D 98 01
##$RELAX= 
##$RELAX= 
##$RELAX= 
##$RELAX= 
##$RELAX= 
##$RELAX= 
##$RELAX= 
##$RELAX= 
$$ Bruker specific parameters
$$ --------------------------
##$DU= <F:/spectra>
##$EXPNO= 1
##$NAME= <c13>
##$PROCNO= 1
##$TYPE= <nmr>
##$USER= <she>
##$AMP= (0..31)
100 100 100 100 100 100 100 100 100 100 100 100 100 100 100 100 100 100 
100 100 100 100 100 100 100 100 100 100 100 100 100 100 
##$AQSEQ= 0
##$AQ_mod= 1
##$AUNM= <au_zg>
##$AUTOPOS= <>
##$BF1= 50.322709
##$BF2= 200.13
##$BF3= 50.322709
##$BF4= 500.13
##$BF5= 500.13
##$BF6= 500.13
##$BF7= 500.13
##$BF8= 500.13
##$BYTORDA= 1
##$CFDGTYP= 0
##$CFRGTYP= 5
##$CHEMSTR= <none>
##$CNST= (0..31)
1 1 145 1 1 1 1 1 1 1 1 1 1 1 1 1 1 1 1 1 1 1 1 1 1 1 1 1 1 1 1 1 
##$CPDPRG= <waltz16>
##$CPDPRG1= <>
##$CPDPRG2= <waltz16>
##$CPDPRG3= <>
##$CPDPRG4= <mlev>
##$CPDPRG5= <mlev>
##$CPDPRG6= <mlev>
##$CPDPRG7= <mlev>
##$CPDPRG8= <mlev>
##$CPDPRGB= <>
##$CPDPRGT= <>
##$D= (0..31)
$$ [...]
##$SUBNAM4= <"">
##$SUBNAM5= <"">
##$SUBNAM6= <"">
##$SUBNAM7= <"">
##$SUBNAM8= <"">
##$SUBNAM9= <"">
##$SW= 239.972175391363
##$SWIBOX= (0..15)
0 1 3 0 0 0 0 0 0 0 0 0 0 0 0 0 
##$SW_h= 12077.2946859903
##$TD= 32768
##$TD0= 1
##$TE= 0
##$TE2= 300
##$TE3= 300
##$TEG= 300
##$TL= (0..7)
120 120 120 120 120 120 120 120 
##$TP= (0..7)
150 150 150 150 150 150 150 150 
##$TP07= 0
##$TPNAME0= <>
##$TPNAME1= <>
##$TPNAME2= <>
##$TPNAME3= <>
##$TPNAME4= <>
##$TPNAME5= <>
##$TPNAME6= <>
##$TPNAME7= <>
##$TPOAL= (0..7)
0.5 0.5 0.5 0.5 0.5 0.5 0.5 0.5 
##$TPOFFS= (0..7)
0 0 0 0 0 0 0 0 
##$TUNHIN= 0
##$TUNHOUT= 0
##$TUNXOUT= 0
##$USERA1= <user>
##$USERA2= <user>
##$USERA3= <user>
##$USERA4= <user>
##$USERA5= <user>
##$V9= 5
##$VALIST= <valist>
##$VCLIST= <CCCCCCCCCCCCCCC>
##$VD= 0
##$VDLIST= <DDDDDDDDDDDDDDD>
##$VPLIST= <PPPPPPPPPPPPPPP>
##$VTLIST= <TTTTTTTTTTTTTTT>
##$WBST= 1024
##$WBSW= 4
##$XGAIN= (0..3)
0 0 0 0 
##$XL= 0
##$YL= 0
##$YMAX_a= 63502086
##$YMIN_a= -147342684
##$ZGOPTNS= <>
##$ZL1= 120
##$ZL2= 120
##$ZL3= 120
##$ZL4= 120
##$ABSF1= 222.624
##$ABSF2= -17.3728
##$ABSG= 5
##$ABSL= 3
##$ALPHA= 0
##$AQORDER= 0
##$ASSFAC= 0
##$ASSFACI= 0
##$ASSFACX= 0
##$ASSWID= 0
##$AUNMP= <proc_1d>
##$AZFE= 0.1
##$AZFW= 0.5
##$BCFW= 0
##$BC_mod= 2
##$BYTORDP= 0
##$COROFFS= 0
##$CY= -3
##$DATMOD= 1
##$DC= 0
##$DFILT= <>
##$DTYPP= 0
##$F1P= 0
##$F2P= 0
##$FCOR= 0.5
##$FTSIZE= 32768
##$FT_mod= 6
##$GAMMA= 0
##$GB= 0
##$INTBC= 1
##$INTSCL= 4.134877e-10
##$ISEN= 128
##$LB= 2
##$LEV0= 0
##$LPBIN= 0
##$MAXI= 10000
##$MC2= 0
##$MEAN= 0
##$ME_mod= 0
##$MI= 0.1934396
##$NCOEF= 0
##$NC_proc= 3
##$NLEV= 6
##$NOISF1= 120.0001
##$NOISF2= 80.00006
##$NSP= 0
##$NTH_PI= 0
##$NZP= 0
##$OFFSET= 222.624
##$PC= 1.4
##$PHC0= -391.1417
##$PHC1= 33.93753
##$PH_mod= 1
##$PKNL= yes
##$PPARMOD= 0
##$PSCAL= 0
##$PSIGN= 0
##$REVERSE= no
##$SF= 50.3227315983092
##$SI= 32768
##$SIGF1= 140
##$SIGF2= 120
##$SINO= 11.81781
##$SIOLD= 32768
##$SREGLST= <13C.CDCl3>
##$SSB= 0
##$STSI= 32768
##$STSR= 0
##$SW_p= 12077.2946859903
##$SYMM= 0
##$S_DEV= 0
##$TDeff= 32768
##$TDoff= 0
##$TI= <>
##$TILT= no
##$TM1= 0
##$TM2= 0
##$TOPLEV= 0
##$USERP1= <user>
##$USERP2= <user>
##$USERP3= <user>
##$USERP4= <user>
##$USERP5= <user>
##$WDW= 1
##$XDIM= 32768
##$YMAX_p= 458769202
##$YMIN_p= -994061
$$ End of Bruker specific parameters
$$ ---------------------------------
##NTUPLES= NMR SPECTRUM
##VAR_NAME=  FREQUENCY,     SPECTRUM/REAL,   SPECTRUM/IMAG
##SYMBOL=    X,             R,               I
##VAR_TYPE=  INDEPENDENT,   DEPENDENT,       DEPENDENT
##VAR_FORM=  AFFN,          ASDF,            ASDF
##VAR_DIM=   32768,         32768,           32768
##UNITS=     HZ,            ARBITRARY UNITS, ARBITRARY UNITS
##FACTOR=    0.368581032318806, 1,           1
##FIRST=     11203.0474430531, 0,            0
##LAST=      -874.247242937185, 0,           0
##MIN=       -874.247242937185, -994061,     0
##MAX=       11203.0474430531, 458769202,    0
$$ Real data points
##PAGE= N=1
##DATA TABLE= (X++(R..R)), XYDATA
$$ [...]
10941a16127R133o817m4113p0552q4035p2733l2533J3309N5672O8315N0772K2702
$$ -116127 -106994 -113811 -157924 -228476 -312511 -385244 -417777 -404468 -348796 -280481 -229709 -207007
10929b07007k1826o5167p5908m1934R927M6480N4942N2592N9636N0503l648p5696
$$ -207007 -228833 -294000 -369908 -411842 -401915 -355435 -300493 -247901 -188265 -137762 -141410 -217106
10917b17106j11854r9103m5657K8454P1109P0224O1909L9116R108K4151N3525
$$ -217106 -328960 -428063 -473720 -445266 -374157 -303933 -242024 -202908 -193800 -169649 -116124
10906a16124L8694M172j0622j697K2127L7903K7309J5741J4829j3039o8767r7369
$$ -116124 -77430 -73258 -83880 -85577 -63450 -25547 1762 17503 32332 19293 -49474 -146843
10894a46843q4344p0585n5936m944N9042J01636R3248L5991j3679m1631n4959
$$ -146843 -231187 -301772 -357708 -362652 -303610 -201974 -108726 -72735 -86414 -128045 -183004
10883a83004l6547J3081N8817P2684M2169J6093M2730P6470P1262M0642J8471
$$ -183004 -219551 -206470 -147653 -74969 -32800 -16707 26023 102493 173755 214397 232868
10872B32868J6201N174j2261o497p512k8508k2421j5211k8016k6048k6392n0142
$$ 232868 249069 254243 241982 235485 227973 199465 177044 161833 133817 107769 81377 31235
10860C1235n8078k6626L1991P1919O6271N0485M8069L5449O452k8791m9482l4586
$$ 31235 -26843 -53469 -21478 50441 116712 167197 215266 250715 257167 228376 178894 144308
10848A44308o3K1942K4470J8702K6948M3258M4200L0731J0582O966J0861n468
$$ 144308 144245 166187 190657 209359 236307 279565 323765 354496 365078 372044 382905 377437
10836C77437k2612l1142o8840j18506j11637n5433N824M4280M3820K3407k0137
$$ 377437 354825 323683 254843 136337 24700 -30733 -24909 19371 63191 86598 66461
10825F6461p5234q0577m7955l0764n397L2571K0323p690K3541P6056J01564R0660
$$ 66461 -8773 -89350 -137305 -168069 -173466 -140895 -120572 -128262 -104721 -28665 72899 163559
10813A63559L9080r765j3967k342l786j2290r478k4961n2967o3456o5172n6178
$$ 163559 202639 192874 178907 176565 172779 160489 151011 126050 73083 9627 -55545 -111723
10801a11723k0910K2113L2996O035k2997m0872m9604n5682p1652q4891m0462N0852
$$ -111723 -132633 -110520 -77524 -71489 -94486 -135358 -184962 -240644 -312296 -397187 -437649 -386797
10789c86797J01262P8683M6348N1297O0981M4854J7912J0610L0369M6968J9614
$$ -386797 -285535 -206852 -160504 -109207 -48226 -3372 14540 25150 55519 102487 122101
10778A22101m7120r8679r1340m9661j2792J5731J7172j6826m9847m3500k2439
$$ 122101 74981 -23698 -115038 -164699 -177491 -161760 -144588 -161414 -211261 -254761 -277200
10767b77200l157J4346K9373L9808K1195o538j0292o192j5168j0079J9271M2828
$$ -277200 -280357 -266011 -236638 -196830 -175635 -182173 -192465 -198657 -213825 -223904 -204633 -161805
10755a61805N8527O4834P5091R9777R9104J8413r8428j38711r2215k5574J7711
$$ -161805 -103278 -38444 36647 136424 235528 253941 155513 16802 -75413 -100987 -83276
10744h3276K6815p935m9410m8595m8705q8423j20567q6686k0745K2761K6322M554
$$ -83276 -56461 -64396 -113806 -162401 -211106 -299529 -420096 -506782 -527527 -504766 -478444 -473890
10732d73890Q152L4374N0427N0022K4316j4401n5781p4233m5445j6781j7351o995
$$ -473890 -465738 -431364 -380937 -330915 -306599 -321000 -376781 -451014 -496459 -513240 -530591 -537586
10720e37586K3501L6875k6m6342m9355m3140m5508j8169M6093R1385Q4413M8011
$$ -537586 -514085 -477210 -477236 -523578 -572933 -616073 -661581 -679750 -633657 -542272 -457859 -409848
10708d09848J5786J3762L7855M6429K6387M900j4910l4491l1432R03K6025K7957
$$ -409848 -394062 -380300 -342445 -296016 -269629 -264729 -279639 -314130 -345562 -344659 -318634 -290677
10696b90677K2808N643j6110l315L7541O9378R3634J07905R7305N9583p866o9577
$$ -290677 -267869 -262226 -278336 -281651 -244110 -174732 -81098 26807 124112 183695 175829 106252
10684A06252q2580l5319M0178Q3829O1884j835p0327q8100k7981L0326J1706m4408
$$ 106252 23672 -11647 28531 112360 174244 172409 102082 13982 -13999 16327 28033 -16375
10672a6375q6731r1322m1024L0312O7351P1554Q5739J04959P5508m464m9415j0409
$$ -16375 -103106 -194428 -235452 -205140 -137789 -66235 19504 124463 199971 195507 146092 135683
10660A35683P0808R4838J3330j10235j70077j51945r4408m2328j8780K0045N5487
$$ 135683 206491 301329 314659 204424 34347 -117598 -212006 -254334 -273114 -253069 -197582
10649a97582O0372N3899K1431l000Q730N4129J05933J07595M7075l2663p4290
$$ -197582 -137210 -83311 -61880 -64880 -56150 -2021 103912 211507 258582 225919 151629
10638A51629o7679m6219l2324m2939q2387j17474j05751l1066L5319K5819K973
$$ 151629 83950 37731 5407 -37532 -119919 -237393 -343144 -374210 -338891 -313072 -310099
10627c10099J5371J7709l2860q6838q7862m5873J184M3672R4290J36980J38878
$$ -310099 -294728 -277019 -309879 -396717 -484579 -530452 -529268 -485596 -391306 -254326 -115448
10616a15448J04790O8090O9951R4530Q5274M1310k0652p7783j01127q4273m9843
$$ -115448 -10658 57432 127383 221913 307187 348497 327845 250062 148935 64662 14819
10605A4819k0710J0413K8525J4724k8037n7824l8465k3906n6719p1369k6611L7824
$$ 14819 -5891 4522 33047 47771 19734 -38090 -76555 -100461 -157180 -228549 -255160 -217336
10593b17336Q1311R8800P4235P648j2390O0564J37697J29331O3469n780m5905
$$ -217336 -136025 -37225 37010 44658 32268 92832 230529 359860 423329 417549 371644
10582C71644l7775k131L28l9739p3384n1635L9314J07212P8720J3278l4944m9540
$$ 371644 333869 331738 332066 292327 218943 167308 206622 313834 392554 405832 370888 321348
10570C21348m0259k3353j7018m5934q3330r7160p7727m9527l4930k129O1692J24081
$$ 321348 281089 257736 240718 194784 111454 14294 -63433 -112960 -147890 -150019 -88327 35754
10558C5754J57202J49028R1123k257q5621j36282j33835o9508q083N527J5056
$$ 35754 192956 341984 433107 430850 345229 208947 75112 5604 -2479 3048 18104
10547A8104J4599J5333M8690P8711O9219M2174J6406j3743o0699r3190q0228n2451
$$ 18104 32703 48036 96726 175437 244656 286830 303236 289493 228794 135604 55376 2925
10535B925k8219j3375N704K6964K8396L3288O9591R8684P4069M5047N1936M8041
$$ 2925 -25294 -38669 -32965 -6001 22395 55683 125274 223958 298027 343074 395010 443051
10523D43051J0899j5930L304L4527M3879M3951M3515M7022M0249J4295j6466k8348
$$ 443051 453950 438020 441324 475851 519730 563681 607196 654218 694467 708762 692296 663948
10511F63948j7831q923o003j7454l8428n2372n6701m6747k1096q695l4867n7247
$$ 663948 646117 637194 631191 613737 575309 522937 466236 419489 398393 389698 354831 297584
10499B97584m5135J3581R1044J01789K9354n5670q9591n5068J0640K7069j3927
$$ 297584 252449 266030 357074 458863 488217 432547 342956 287888 298528 325597 311670
10488C11670n5694o6439n2231o5114j15862j40854q8756j602M9453O1612O3393
$$ 311670 255976 189537 137306 72192 -43670 -184524 -273280 -274882 -225429 -163817 -100424
10477a00424P0545P6837O6132M2344J1644j2211j7608j3980j7324n1068r8280
$$ -100424 -29879 46958 113090 155434 167078 154867 137259 123279 105955 54887 -43393
10466d3393r3633k2144J9566m918j8279j4883o804K6418O6952O2049O340n8302
$$ -43393 -137026 -159170 -139604 -144522 -162801 -177684 -184488 -158070 -91118 -29069 -22729 -81031
10454h1031j10231j14408p7317j6053O2365J33834J36654Q4174J5476o1588r9088
$$ -81031 -191262 -305670 -382987 -399040 -336675 -202841 -66187 17987 33463 -28125 -127213
10443a27213p7497k9236J3971K9815K0328J5732Q894L340J1707N004o220J4073
$$ -127213 -204710 -233946 -219975 -190160 -169832 -154100 -145206 -141866 -130159 -125155 -131375 -117302
10431a17302L0854j66l6047k4521L0114Q1345R2941P8764L2920j6843j1246K1967
$$ -117302 -86448 -86614 -122661 -147182 -117068 -35723 57218 135982 168902 152059 140813 162780
10419A62780L1040K4023K0841K3963J6678L2703O0021N0044k532p2013p9748k0965
$$ 162780 193820 217843 238684 262647 279325 312028 372049 422093 419561 347548 267800 246835
10407B46835K6714M2461N4264L8470J0573L895l477J466K9157L9480L0510J1967
$$ 246835 273549 316010 370274 408744 419317 423212 419735 421201 450358 489838 520348 532315
10395E32315n715k8792m8077m0116l6389n0225o8099n4193P575N2828M2300O555
$$ 532315 526600 497808 449731 409615 373226 323001 254902 200709 208284 261112 303412 309967
10383C09967j5016k7008k2859k0175k6653r833L3208O2890N1588K5440K7601N0456
$$ 309967 294951 267943 245084 224909 198256 188423 221631 284521 336109 361549 389150 439606
10371D39606P5254P7046O9302O3027K3151n7838j19103r2253j538Q0950J11605
$$ 439606 514860 591906 661208 724235 747386 689548 570445 478192 476654 557604 669209
10360F69209J16852R0694J2375o0961p1774m6240M417P4305J01793Q8788N4306
$$ 669209 786061 876755 889130 828169 756395 710155 714572 788877 890670 979458 1033764
10349A033764L729p892K7835P4277P8268N6516M6790M9570O3285Q7320J15846
$$ 1033764 1037493 1029601 1057436 1131713 1209981 1266497 1313287 1362857 1426142 1513462 1629308
10338A629308J43709J95993K71320L25125L46278L31490K78934K56120K98097
$$ 1629308 1773017 1969010 2240330 2565455 2911733 3243223 3522157 3778277 4076374
10329D076374L53900L99035M68919N50373O16431O57656O77037P26584Q48474
$$ 4076374 4430274 4829309 5298228 5848601 6465032 7122688 7799725 8526309 9374783
10320I374783J036546J311007J682092K126153K634886L056998K951249J719702
$$ 9374783 10411329 11722336 13404428 15530581 18165467 21222465 24173714 25893416
10312B5893416n67091k635875l467646l315340k815681k303112j839641j428816
$$ 25893416 25326325 22690450 19222804 15907464 13091783 10788671 8949030 7520214
10304G520214j075884q13959o39004n23534m63058m27338l72425l15225k77346
$$ 7520214 6444330 5630371 4991367 4467833 4004775 3577437 3205012 2889787 2612441
10295B612441k34242j73180j48410j54026j32424j08952r9926p4069n8580r4294
$$ 2612441 2378199 2205019 2056609 1902583 1770159 1661207 1561281 1487212 1428632 1334338
10285A334338j64584k31726k22394j25748j4427N2044P9153O7219L2924J1440
$$ 1334338 1169754 938028 715634 589886 575459 627503 706656 773875 806799 818239
10275H18239l34j3996P537N0259N4183K2471j4812n6068j08868j25606r9152n7355
$$ 818239 817905 803909 811446 861705 915888 938359 923547 867479 758611 633005 533853 476498
10263D76498j9331j5368k6435m5215n1920j8696K2620N8195R6830J35471J57909
$$ 476498 457167 441799 415364 370149 318229 299533 322153 380348 477178 612649 770558
10252G70558J36797N1169n6069j16161j40117j41245j26965j20241j02637o5786
$$ 770558 907355 958524 902455 786294 646177 504932 377967 257726 155089 89303
10242H9303m5605m2035j9369P792P35k2350j9141J7355N1824M2378j1262m4319
$$ 89303 43698 1663 -17706 -9914 -9179 -31529 -50670 -33315 18509 60887 49625 5306
10230E306k8111o173j657L966R968j211O389M5888P2942O3554L4343j2157n8854
$$ 5306 -22805 -28978 -30635 -26669 -16701 -17912 -11523 34365 107307 170861 205204 193047 134193
10217A34193o6190k4730K9241N9050M7381J0121m966J4114M0619M9015K1028l3982
$$ 134193 68003 43273 72514 131564 178945 189066 184100 198214 238833 287848 308876 274894
10205B74894o5937l5892K6019M2487j0713o6921o4229K69N5407O4358L9190P153
$$ 274894 208957 173065 199084 241571 230858 163937 99708 99977 155384 219742 258932 266085
10193B66085j6288m1865p8828r2727n6068j8584j0659r862j0999r504M731K2394
$$ 266085 249797 207932 129104 36377 -19691 -38275 -48934 -58796 -69795 -79299 -74568 -52174
10181e2174K8392L1862L6824L9985M7649N6144R6674J49350J36973N8398j3324
$$ -52174 -23782 8080 44904 84889 132538 188682 285356 434706 571679 630077 616753
10170F16753l8476l7980m0997m0571k8190j7127q645Q155K372m4696j03137j18286
$$ 616753 578277 540297 499300 458729 430539 413412 404767 412922 415294 370598 267461 149175
10158A49175p9877l3136k5420l9989l1518j5570n87K9535M9292K3700n699n321
$$ 149175 69298 36162 10742 -29247 -60765 -76335 -76922 -47387 1905 25605 19906 14585
10146A4585j3626m4334n0636k3221J5329P4944J06797O7350N168p935K5509M1646
$$ 14585 959 -43375 -94011 -117232 -101903 -26959 79838 147188 152356 144421 169930 211576
10134B11576J1241k9750l5692l5666m2593j7276K9304O8819Q3306O4049J8982
$$ 211576 222817 193067 157375 121709 79116 61840 91144 159963 243269 307318 326300
10123C26300l4834p8814r5724n8680Q347L1997N1j5294J2952L4992L3810K4464
$$ 326300 291466 212652 116928 58248 66595 98592 98643 83349 96301 131293 165103 189567
10111A89567N7077R4291O7622J6070k0158m596P1222J27571J42856J24544M3522
$$ 189567 246644 340935 408557 424627 404469 399873 471095 598666 741522 866066 909588
10100I09588o1528j32455j71556j89982j47379p0897m4477o5549o3305l2214j1366
$$ 909588 848060 715605 544049 354067 206688 135791 91314 25765 -37540 -69754 -81120
10089h1120j3976k1563l268M9991Q6919P5905O4447O2037J6590n3930r8563j13481
$$ -81120 -95096 -116659 -119927 -69936 16983 92888 157335 219372 235962 182032 83469 -30012
10077c0012j04739p2555n0587n7516l9388M5710J20777J10763L6883l1006o7225
$$ -30012 -134751 -207306 -257893 -315409 -354797 -309087 -188310 -77547 -40664 -71670 -138895
10066a38895q3733m6839J4252K1167j9392k9199N574L1127M5464N4507N6528M6214
$$ -138895 -222628 -269467 -255215 -234048 -253440 -282639 -277065 -245938 -200474 -145967 -89439 -43225
10054d3225J6039K464L2345O6986Q0255P3863M2843k595k7583m8138r3074j02040
$$ -43225 -27186 -24722 7623 74609 154864 228727 271570 268975 241392 193254 100180 -1860
10042a860o4018K688Q6740J07223J9272r5584j37479j07719p1582n3465j6488
$$ -1860 -65878 -63190 23550 130773 150045 54461 -83018 -190737 -262319 -315784 -332272
10031c32272J2041L595r587k8424m3164m8782o3699n5618j4968M8941J13955J35665
$$ -332272 -320231 -316636 -326223 -354647 -397811 -446593 -510292 -565910 -580878 -531937 -417982 -282317
10019b82317J07551M3129l9517r2866r3868n8608j7635J3758L7873O3106Q1740
$$ -282317 -174766 -131637 -171154 -264020 -357888 -416496 -434131 -420373 -382500 -319394 -237654
10008b37654R2536J03671J02815R2343N6600j4676p5493p0560j8070L8261N7629
$$ -237654 -145118 -41447 61368 153711 210311 195635 120142 49582 31512 69773 127402
9997A27402K7089j3700l8319l5967p445K5846N2890M2383J0478l3481q6189q6641
$$ 127402 154491 140791 102472 66505 59060 84906 137796 180179 190657 157176 70987 -15654
9985a5654m3505j6063m314L464j7957n5972q5739q2671l4931K8557P5586J00228
$$ -15654 -59159 -75222 -79536 -76072 -94029 -150001 -235740 -318411 -353342 -324785 -249199 -148971
9973a48971P6354J7688k6241m6150j5435O2000J07611P4576M4301O6929R1701
$$ -148971 -72617 -54929 -81170 -127320 -142755 -80755 26856 101432 145733 212662 304363
9962C04363O4712J5188l296J1918L8741N1640L9422J1221j8101m2919o5240p1725
$$ 304363 369075 384263 380967 392885 431626 483266 522688 533909 515808 472889 407649 335924
9950C35924n0790j2043L5646O1858L3715k8939r3747j14264p7501l0745j2551
$$ 335924 285134 273091 308737 370595 404310 375371 281624 167360 89859 59114 46563
9939D6563K1049P3285Q9209N0009k101k2529j4922j2861l8613p0389r1052r6403
$$ 46563 67612 140897 230106 280115 278014 255485 240563 227702 189089 118700 27648 -68755
9927f8755p3914j9877L9754P8164P0322K1728j8205k9489l3211m0408m7114m5946
$$ -68755 -142669 -162546 -122792 -44628 25694 47422 29217 -272 -33483 -73891 -121005 -166951
9915a66951k7074J368J9608K7285K7986O891m5221q1644p3863m3342j5705j949
$$ -166951 -194025 -192657 -173049 -145764 -117778 -110887 -156108 -237752 -311615 -354957 -370662 -372611
9903c72611J7230N0856P3517O9249O8217N6399R532k3374j7297k2642m7473o6461
$$ -372611 -355381 -304525 -231008 -161759 -93542 -37143 -27611 -50985 -68282 -90924 -138397 -204858
9891b04858o4449m8671l8449n1042o9754n3288j5715J0614J0789K3191P0611Q5538
$$ -204858 -269307 -317978 -356427 -407469 -477223 -530511 -546226 -535612 -524823 -501632 -431021 -345483
9879c45483P3917O7523O2838P2847M7663k7999n5004r390K3142K3941J0995l437
$$ -345483 -271566 -204043 -141205 -68358 -20695 -48694 -103698 -113088 -89946 -66005 -55010 -58447
9867e8447k0770k9633k4146j5387p132r288k8590n5417p7633o4472J225P2131
$$ -58447 -79217 -108850 -132996 -148383 -155515 -164803 -193393 -248810 -326443 -390915 -389690 -317559
9855c17559R1333M6274N120J0686L3316K1045l3701p9702p3590j2494L2790K5447
$$ -317559 -226226 -179952 -174832 -164146 -130830 -109785 -143486 -223188 -296778 -309272 -276482 -251035
9843b51035L124k1398n5191o2773k7559K8549O6210N8917K8367o497j1709K3257
$$ -251035 -247911 -269309 -324500 -387273 -414832 -386283 -320073 -261156 -232789 -239286 -250995 -227738
9831b27738K6007K748r508m2967q7821r0972o0137k0874N382K9033O8263J06215
$$ -227738 -201731 -198983 -208491 -251458 -339279 -430251 -490388 -511262 -505880 -476847 -408584 -302369
9819c02369J14476J09455Q2141L5553K3213M6596P0925N0579j4189o4629q7430
$$ -302369 -187893 -78438 3703 39256 62469 109065 179990 230569 216380 151751 64321
9808F4321q7332n1125J4933M8992M205n6574p8753o6142l4768o534m465j283K729
$$ 64321 -23011 -74136 -59203 -10211 -6006 -62580 -141333 -207475 -242243 -248777 -253242 -254525 -251796
9795b51796k4840m1898J2858P0948M2094l2952p6677o5137j4415L2780M9991N0361
$$ -251796 -276636 -318534 -305676 -234728 -192634 -225586 -302263 -367400 -381815 -349035 -299044 -248683
9783b48683L0113K0565O0171Q9051O7327j790p5270r2418n6830j3362K6443O2816
$$ -248683 -218570 -198005 -137834 -48783 18544 16754 -58516 -150934 -207764 -221126 -194683 -131867
9771a31867Q2690N8590R62o3230r7887q0234k4671M9299P4853M5927N180l2053
$$ -131867 -49177 9413 10375 -52855 -150742 -230976 -255647 -206348 -131495 -85568 -80388 -112441
9759a12441o0722n4946j7926J0073J7123K6028K8143L3619L6183L5778L3604J4157
$$ -112441 -173163 -228109 -246035 -235962 -218839 -192811 -164668 -131049 -94866 -59088 -25484 -11327
9747a1327l4672q8888q5967n0919m6330o0223k3249N8831Q0336M5633L6269N5702
$$ -11327 -45999 -134887 -220854 -271773 -318103 -378326 -401575 -342744 -262408 -216775 -180506 -124804
9735a24804N0665J4153J9714Q5118J21455P4959M323k4820j3155N390J2065J3144
$$ -124804 -74139 -59986 -40272 44846 166301 241260 245583 220763 207608 212998 225063 238207
9723B38207J0599m101j5760k7922l2095l4748n6022o8526m6921j388K0078J2776
$$ 238207 248806 244705 228945 201023 168928 134180 78158 9632 -37289 -38677 -18599 -5823
9711e823K8467M2773J3183j5947q104M436o399j2697J3401L8096K5730p866l9515
$$ -5823 22644 65417 78600 62653 54549 58985 52586 39889 53290 91386 117116 109250 69735
9698F9735n5410p7804j13688j01478l2791J4901M2209P9598Q6701M9063K4736
$$ 69735 14325 -63479 -177167 -278645 -311436 -296535 -254326 -174728 -88027 -38964 -14228
9687a4228M6695Q5900J05282R8849J03407J06664O3379o111m8004n6069m3478
$$ -14228 32467 118367 223649 322498 425905 532569 595948 589837 541833 485764 442286
9676D42286k9295l2891n7993r4672q2684j0098K9086M088k2059k3854j6104l475
$$ 442286 412991 380100 322107 227435 144751 134653 163739 167827 145768 121914 105810 102335
9664A02335M89k9892q1593j29277j34173p6780K0455J02778J22857J03944O2136
$$ 102335 102824 72932 -8661 -137938 -272111 -348891 -328436 -225658 -102801 1143 63279
9653F3279j1019q0174j05187q4892l0234L3418M7407J1164j8344m1277m4946k463
$$ 63279 52260 -27914 -133101 -217993 -248227 -214809 -167402 -156238 -174582 -215859 -260805 -263268
9641b63268N6420O5392M0319M0854N9130O3021O3661N6160K1341J936J6276J9132
$$ -263268 -206848 -141456 -101137 -60283 -1153 61868 125529 181689 203030 204966 221242 240374
9629B40374k686k2332j7774N50j237j9773k0185n632k4267p7851r5334n3449J6169
$$ 240374 237688 215356 197582 198132 196895 177122 156937 151305 127038 49187 -46147 -99596 -83427
9616h3427O2127O6841M0307j658l601L3724L7668J3604m851l9668r3780j19647
$$ -83427 -21300 45541 85848 84190 80589 114313 151981 165585 160734 121066 27286 -92361
9604i2361r2055j7231M5750O3290N6642L9283J8008j4354m5792n3551l2460R41
$$ -92361 -184416 -201647 -155897 -92607 -35965 3318 21326 6972 -38820 -92371 -124831 -123890
9592a23890K2109L6613O6561J10913J31168J28825J33490J18257P9316K4703m4915
$$ -123890 -101781 -65168 1393 112306 243474 372299 505789 624046 703362 728065 683150
9581F83150q4156o9334k0465K0581R932k5709l8731m4676q3149j28717j26987
$$ 683150 598994 529660 509195 529776 539708 513999 475268 430592 347443 218726 91739
9570I1739o4457n869O110l171j3516j4707O558M0993M6834L3187K6619P573j1684
$$ 91739 27282 21413 27523 24352 10836 -3871 2687 43680 90514 123701 150320 157893 146209
9557A46209k7320n0318n9974l1528J4207K7469K5370J0499m0494r3054r5053n1588
$$ 146209 118889 68571 8597 -22931 -8724 18745 44115 54614 14120 -78934 -173987 -225575
9545b25575J7058O4467Q4246R7122P5726K3127k2329k9767k7017m5107n9726n3484
$$ -225575 -208517 -144050 -59804 37318 113044 136171 113842 84075 57058 11951 -47775 -101259
9533a01259k5092K1696M7603O0573O3894K7581O462J4045L859j6951j3304r899
$$ -101259 -126351 -104655 -57052 3521 67415 94996 101458 115503 119362 102411 89107 79208
9521G9208m1381o2176k1951M5646O0698R137n7174r2700p8690k6665Q600j3054
$$ 79208 37827 -24349 -46300 -654 60044 69181 12007 -80693 -159383 -186048 -177448 -190502
9509a90502o1548p1430n1590o552M1296L1299k8188p0582n4522J9123R8792J05894
$$ -190502 -252050 -323480 -375070 -381622 -340326 -309027 -337215 -407797 -462319 -443196 -344404 -238510
9497b38510M1861j9175j4521L5130P0523P6564N6493M1400M0783J9827j2368j9307
$$ -238510 -196649 -215824 -230345 -195215 -124692 -48128 8365 49765 90548 110375 98007 78700
9485G8700J563K1355K6682M0298P3431R8881R3521N7996M270o0741j15851j39171
$$ 78700 80263 101618 128300 168598 242029 340910 434431 492427 496697 435956 320105 180934
9473A80934j48058j14759l2258L4648M7578L4755N4446Q6422O1749J0739J2628
$$ 180934 32876 -81883 -114141 -79493 -31915 2840 57286 143708 205457 216196 228824
9462B28824L7774J0761p5971j40929j34096p5534J1747R4506J16677P8685N5244
$$ 228824 266598 277359 201388 60459 -73637 -149171 -137424 -42918 73759 152444 207688
9451B07688O2851P0979O6611K3413m0310r0695j18455j21129p9808M042Q3973
$$ 207688 270539 341518 408129 431542 391232 300537 182082 60953 -18855 -14813 69160
9440F9160J39542J42426O4856l3903p7751p9826q4509o5027m525M6585M9085L8220
$$ 69160 208702 351128 415984 382081 304330 224504 139995 74968 70443 117028 166113 204333
9428B04333N9797R7567R6115M7826o148m4366n3554n4268n8936m0926L957M9917
$$ 204333 264130 361697 457812 505638 499490 455124 401570 347302 288366 247440 251397 301314
9416C01314Q1962J00474J12683J03306M7443l1229q2182r0324r5082j19592j39501
$$ 301314 383276 483750 596433 699739 747182 715953 633771 543447 448365 328773 189272
9405A89272j32708q1239j1460J1603N420J9889Q713n6881j30822j81914j68758
$$ 189272 56564 -24675 -36135 -24532 -19112 777 9490 -47391 -178213 -360127 -528885
9394e28885r8700k6025J449J2944N8075Q9616P8072N4765M0773M5896P0325R5158
$$ -528885 -627585 -653610 -652161 -639217 -581142 -491526 -413454 -358689 -317916 -272020 -201695 -106537
9382a06537J11527J11143P4174K4666o117j6694O490K5497k218o5018j11402r0377
$$ -106537 4990 116133 190307 214973 208856 192162 198652 224149 221931 156913 45511 -44866
9370d4866k4186J5879M1645O7795M6516L077L149M0629N8295K5333J238L1553
$$ -44866 -69052 -53173 -11528 56267 102783 105860 109009 149638 207933 233266 234504 266057
9358B66057Q7584J10882O4373n106m0392k7116K2774Q0241J11903R5199N5313
$$ 266057 353641 464523 528896 523790 483398 456282 479056 559297 671200 766399 821712
9347H21712K1417j364N018J3870j0136l3774k9257K344K3758M0355O3977P2821
$$ 821712 843129 841765 846783 860653 850517 816743 787486 789830 813588 853943 917920 990741
9335I90741P8026R5324J07676J06061J44360K07027J95478J28758P2632L6510
$$ 990741 1068767 1164091 1271767 1377828 1522188 1729215 1924693 2053451 2126083 2162593
9325B162593k154k004Q0911J94279K81021L56665L82467L39103K85247K38995
$$ 2162593 2160439 2158435 2239346 2433625 2714646 3071311 3453778 3792881 4078128 4317123
9315D317123K12341K70145L84886M97179N92781O54670O81327O69373O75133P25171
$$ 4317123 4529464 4799609 5184495 5681674 6274455 6929125 7610452 8279825 8954958 9680129
9305I680129P62069P34527O66651N43138L60261J38135j35870m25458o30744p15423
$$ 9680129 10442198 11176725 11843376 12386514 12746775 12884910 12749040 12323582 11692838 10977415
9295A0977415p31249p19103o92412o66614o28009n92695n81653n44677m63608
$$ 10977415 10246166 9527063 8834651 8168037 7540028 6947333 6365680 5821003 5357395
9286E357395l89299l33530k97243k87317k70028k26456j97122k06419k37019k69074
$$ 5357395 4968096 4634566 4337323 4050006 3779978 3553522 3356400 3149981 2912962 2643888
9276B643888k80680k49037j94321j51360j24964j18135j06894o6309j9902N872
$$ 2643888 2363208 2114171 1919850 1768490 1643526 1525391 1418497 1352188 1332286 1338158
9266A338158L1250O2763O4537L0257J0967Q204p239j662L0954L0529L797P080
$$ 1338158 1369408 1432171 1496708 1526965 1537932 1546136 1538897 1537235 1568189 1598718 1602515 1609595
9254A609595J1699n196j6375K6559J14245J77224J53606Q4019P6778J31367J57424
$$ 1609595 1621294 1616098 1599723 1626282 1740527 1917751 2071357 2155376 2232154 2363521 2520945
9243B520945J35443J27055J44878J71604J82192J98167K49628L01056L05065K58846
$$ 2520945 2656388 2783443 2928321 3099925 3282117 3480284 3729912 4030968 4336033 4594879
9233D594879K25414K68990L73435M84970N78862O63603P41195Q14175Q69457Q52243
$$ 4594879 4820293 5089283 5462718 5947688 6526550 7190153 7931348 8745523 9614980 10467223
9223A0467223P93590P54524O83490N26856L38078J37787r6257l29559n46063p16420
$$ 10467223 11260813 12015337 12698827 13225683 13563761 13701548 13605291 13275732 12729669 12013249
9213A2013249q00879q24251q10687p24372n75801m39306l68421l36731l11389
$$ 12013249 11212370 10388119 9577432 8853060 8277259 7837953 7469532 7132801 6821412
9204F821412k70257j94251j24932r2096o0562K9613J43696K06536K62398L61181
$$ 6821412 6551155 6356904 6231972 6139876 6079314 6108927 6252623 6459159 6721557 7082738
9194G082738M58233M80661M67992N22233O22269O80520O96219P79820R16413R54324
$$ 7082738 7540971 8021632 8489624 9011857 9634126 10314646 11010865 11790685 12707098 13661422
9184A3661422Q52593O80027M89802K70291M454k98800n80403p81370r13587r93043
$$ 13661422 14514015 15194042 15683844 15954135 15958589 15659789 15079386 14298016 13384429 12391386
9174A2391386j029233j025091r51320q13639o67531n92136n87569n89128n56593
$$ 12391386 11362153 10337062 9385742 8572103 7904572 7312436 6724867 6135739 5579146
9165E579146m92810m10316l31462k95986k86379k64369k24328j67771j24906j19913
$$ 5579146 5086336 4676020 4344558 4048572 3762193 3497824 3273496 3105725 2980819 2860906
9155B860906j16330r0946n2730l3339l1690n4425j25580k08097k18843j51228
$$ 2860906 2744576 2653630 2600900 2567561 2535871 2481446 2355866 2147769 1928926 1777698
9145A777698q8311p9686p2675j0456N4262N8462J7467m2111j24066j93851j76006
$$ 1777698 1689387 1609701 1537026 1526570 1580832 1639294 1656761 1614650 1490584 1296733 1120727
9134A120727j28669j19177j21850j23298j21443j04394m1353N4967J07095J03228
$$ 1120727 992058 872881 751031 627733 506290 401896 360543 415510 522605 625833
9124F25833O2152k1061n1854N5155J76151J80243R5972K6007J2485O099l2607
$$ 625833 687985 666924 615070 670225 846376 1026619 1122591 1148598 1161083 1167182 1134575
9113A134575r6665j58994k00582k11961j74679j06734k8437M3392P2542L5403
$$ 1134575 1037910 878916 678334 466373 291694 184960 156523 199915 272457 307860
9103C07860r496m012R071J2039M485j2236j9905m601K1366M1079O2569Q2595Q6530
$$ 307860 298364 294352 303423 315462 319947 307711 287806 283205 304571 345650 408219 490814 577344
9090E77344P7806N0082j618m8259o0123l3366J0662M5100M9710M6232M0461R740
$$ 577344 655150 705232 703614 655355 595232 561866 572528 617628 667338 713570 754031 763771
9078G63771j6995j2563J0782K3846j0391p7068q8501n0403m6201q7481j05266
$$ 763771 746776 734213 744995 768841 758450 681382 592881 542478 496277 408796 303530
9067C03530o9363m1450k0077L9052J10033J24221P8057J5694l3426n0024l5077
$$ 303530 234167 192717 172640 211692 321725 445946 524003 539697 506271 456247 421170
9056D21170J9959J07739J38409Q7182K8700L150k0086p1872j22067j28693r6277
$$ 421170 441129 548868 687277 774459 803159 806309 786223 714351 592284 463591 367314
9045C67314m6480j5858j7449M177K8343p258n5790o9058o4909m1857k8696l0802
$$ 367314 320834 304976 287527 291704 320047 312789 256999 187941 123032 81175 52479 21677
9033B1677j8547m7339q5890n3227Q379K9145J5344q482l629N0337Q8302O6781
$$ 21677 3130 -44209 -130099 -183326 -174947 -145802 -130458 -138940 -142569 -92232 -3930 62851
9021F2851K9982K7212L2855J3351o73J3783J7857k8608r0533j08021p5672l7164
$$ 62851 92833 120045 152900 166251 165578 179361 197218 168610 78077 -29944 -105616 -142780
9009a42780j9065q898j8664m4683m1610j0829N738J7702L2051M5083N1207N8517
$$ -142780 -161845 -170743 -189407 -234090 -275700 -286529 -280791 -263089 -231038 -185955 -134748 -76231
8997g6231M4527J2971K0140O9553J10384J39166J50793J21272K5953o7641q8225
$$ -76231 -31704 -18733 1407 70960 181344 320510 471303 592575 618528 550887 462662
8986D62662q3639q7844r6290j10545j00647m8698P760N3637P4592O6875N3127
$$ 462662 379023 291179 194889 84344 -16303 -65001 -57241 -3604 70988 137863 190990
8975A90990L5552K0782Q201j0835M525P2432J33150J25445N3766l6116j12544
$$ 190990 226542 247324 255525 244690 249215 321647 454797 580242 634008 597892 485348
8964D85348j47194j37277j04139p8731q5736r9132p9958l0924M0530R5326R0678
$$ 485348 338154 200877 96738 18007 -67729 -166861 -246819 -277743 -237213 -141887 -51209
8953e1209N9525M2365K7709K6745Q1358J17717O4665k648j2668j05k1356o2484
$$ -51209 8316 50681 78390 105135 186493 304210 368875 366227 353559 353454 332098 269614
8941B69614q8703q8436r4925q8244j7011M3924L0655J4050N8688J15319J24987
$$ 269614 180911 92475 -2450 -90694 -107705 -63781 -33126 -19076 39612 154931 279918
8930B79918R4395N1573K2947Q769j488L221L4938M8489J1666m0863p5178o6951
$$ 279918 374313 425886 448833 457602 456114 459335 494273 542762 554428 513565 438387 371436
8918C71436l8017k9181l9871m9237m1986j5973K1443M5649L5931R634k6843o0471
$$ 371436 333419 304238 264367 215130 173144 157171 178614 224263 260194 269828 242985 182514
8906A82514o1672m5604k4428Q146M0516M6134L2590K6224L8273N4826L4810p129
$$ 182514 120842 75238 50810 58956 99472 145606 178196 204420 242693 297519 332329 325200
8894C25200k2451k2606l3374k9140J4135N0751L8264j7096m6790J794O5656P0488
$$ 325200 302749 280143 246769 217629 231764 282515 320779 303683 256893 258687 324343 394831
8882C94831L1260l690k1490l2220j8158M038O599O261j0430k7392p428L6659O4998
$$ 394831 426091 422401 400911 368691 350533 354571 361170 367431 357001 329609 322181 358840 423838
8869D23838P5083P8454P3297K4151p4829j40450j07477m4745l1897j8035L246
$$ 423838 498921 577375 650672 674823 599994 459544 352067 307322 275425 257390 260636
8858B60636j181k5391n3609m8657j7485K3480Q3213J29218R4364J681m5865k2650
$$ 260636 259455 234064 180455 131798 114313 137793 221006 350224 444588 446269 400404 377754
8846C77754k825j1196j7263R343M4621N0131L7988l509o6462r4047q2685p0555
$$ 377754 374929 363733 346470 355813 400434 450565 488553 485044 418582 324535 241850 171295
8834A71295n5035k7703j0415j3589j1856q362Q447M4220P8121J04705R6426M4514
$$ 171295 116260 88557 78142 64553 52697 44335 52782 97002 175123 279828 376254 420768
8822D20768j841k377K8646M2651J1074m2735p7003r5097r2818m8210K893K4141
$$ 420768 418927 416550 445196 487847 498921 456186 379183 284086 191268 143058 145951 170092
8810A70092J1827j5281j8277l036j699O531Q694L246J4788K7300K2352J7414M884
$$ 170092 181919 166638 148361 145325 143626 150157 158851 162097 176885 204185 226537 243951 248835
8797B48835n184K4556M7784M6037M8984N6536O6991O1310M7716K4743k9066o2217
$$ 248835 243651 268207 315991 362028 411012 467548 534539 595849 643565 668308 639242 577025
8785E77025n5975o0832p4282q4582q6782o0895k2348j8189j7364p728n641J1132
$$ 577025 521050 460218 385936 301354 214572 153677 131329 113140 95776 88048 82407 93539
8773I3539K7621J6222j5867k8081K236K6719J1591P678J4790M758k4730m6610
$$ 93539 121160 137382 121515 93434 95670 122389 133980 141658 156448 161206 136476 89866
8761H9866k7243K6109P4194O5155R05m7749k8322R867J5284K395j5204n338L4765
$$ 89866 62623 88732 162926 228081 228986 181237 152915 162782 178066 180461 165257 159919 194684
8748A94684M8425J4183p001Q631K2606J9416K4817K2882J0748M0654P3365N7326
$$ 194684 243109 257292 250291 258922 281528 300944 325761 348643 359391 400045 473410 530736
8736E30736J0562m2245j00323j31691p8613Q139L9525J5490J496J2384j668m7618
$$ 530736 541298 499053 398730 267039 188426 196565 236090 251580 253076 265460 263792 216174
8724B16174p9173o3326j2931K8650K0810l6487r1052r8340o8683m9303n8251n3405
$$ 216174 137001 73675 60744 89394 110204 73717 -17335 -115675 -184358 -233661 -291912 -345317
8712c45317P173Q8540J61548K11956K02409J47953Q8033L5851Q639j1737l6355
$$ -345317 -338144 -249604 -88056 123900 326309 474262 562295 598146 606785 595048 558693
8701E58693p7591j38745j60321j20693p2082l8954q251K8170O5494J02754J22909
$$ 558693 481102 342357 182036 61343 -10739 -49693 -57944 -29774 35720 138474 261383
8690B61383J04390R0302J09505J22745J10710Q6376N3814K6301k4667o9488j03101
$$ 261383 365773 456075 565580 688325 799035 885411 939225 965526 940859 871371 768270
8679G68270j35501j32004j05919q8422p0171k8671K6900L5486j7219p7509p6088
$$ 768270 632769 500765 394846 306424 236253 207582 234482 269968 252749 175240 99152
8668I9152j7720L3854L8875R353k7498o6974q4329o9594l6931J2432L9319L383
$$ 99152 81432 115286 154161 163514 136016 69042 -15287 -84881 -121812 -109380 -70061 -66678
8656f6678o1817q5010o0752j9780P011J0904J8200L0877N4264P6300J07741J35407
$$ -66678 -128495 -213505 -274257 -294037 -287026 -276122 -257922 -227045 -172781 -96481 11260 146667
8644A46667J10362N9499M4617O6300O1834M64q0422j28850j24296q4645l9999
$$ 146667 257029 316528 361145 427445 489279 489743 409321 280471 156175 71530 31531
8633C1531o888K7440L2732j6786n6108m8770l819N8767J05256R8030N7362L2439
$$ 31531 24643 52083 84815 68029 11921 -36849 -40668 18099 123355 221385 278747 311186
8621C11186L6214N9155O0258m339n9751m1407J6769N0721M2560K9159L7775O4384
$$ 311186 347400 406555 466813 462474 402723 361316 378085 428806 471366 500525 538300 602684
8609F02684J07870J43856J30638O4093m0133j04344j12119j26660j46136j41768
$$ 602684 710554 854410 985048 1049141 1009008 904664 792545 665885 519749 377981
8599C77981j14316p0334k7888P176L8751O1436N7126L7324O954k8144l9177l5070
$$ 377981 263665 193331 165443 172619 211370 272806 329932 367256 374210 346066 306889 271819
8587B71819l5271l2098m0311o1466p6695q6607r4737r6712r1123m6070K5645N6422
$$ 271819 236548 204450 164139 102673 25978 -60629 -155366 -252078 -343201 -389271 -363626 -307204
8575c07204M5914L6710L2436J0858Q314L6157M4455K4355N686M775p080k2432
$$ -307204 -261290 -224580 -192144 -181286 -172972 -136815 -92360 -68005 -62319 -57544 -64624 -87056
8563h7056J2681Q1203J15589R5242M7492j318l0940q554J7727m611m8420n4678
$$ -87056 -74375 6828 122417 217659 265151 263833 232893 224339 242066 237455 189035 134357
8551A34357R32N8339N5593k4147j10113j01576l6921J0805K4410O920n953J333
$$ 134357 135289 193628 249221 225074 114961 13385 -23536 -12731 11679 18599 12646 13979
8539A3979J3914M0258N4615L6427N660R227L0829J8900N971K4568M8685K2824
$$ 13979 27893 68151 122766 159193 164853 174080 204909 223809 229780 254348 303033 325857
8527C25857l8490o3476o1489p0416r5629j09334q9748m0639j4669j7984j6993
$$ 325857 287367 223891 162402 91986 -3643 -112977 -202725 -243364 -258033 -276017 -293010
8516b93010j474J7576M6382R6763J33955J17375P1426K1673j0602J856M4268Q1431
$$ -293010 -294484 -276908 -230526 -133763 192 117567 188993 210666 200064 201920 246188 327619
8504C27619Q9823P1480L2480l1100j08636j49358j22060l8484K9248L5456K1133
$$ 327619 417442 488922 521402 490302 381666 232308 110248 71764 101012 136468 157601
8493A57601K6481L9366M6636L9954O059l0906l1372q73K1334j945m0652n9700
$$ 157601 184082 223448 270084 310038 316097 285191 253819 252946 274280 272335 231683 171983
8481A71983n6393m5106n3165o6758l2449L6272P2007O4159N6213P0024Q7351J00099
$$ 171983 115590 70484 17319 -49439 -81888 -45616 26391 90550 146763 216787 304138 404237
8469D04237R3152P0332P7268R2093M1083l8983q4313j02885j15493r8664n0991
$$ 404237 497389 567721 644989 737082 778165 739182 654869 551984 436491 337827 286836
8458B86836k3817j6171p409j9909k8786j6718N422K4109P51m5305n2679k7267
$$ 286836 263019 246848 239439 219530 190744 174026 179448 203557 204308 159003 106324 79057
8446G9057J541N0463J15949J55833J45461J22838R9026P2316N8875L4073j6254
$$ 79057 80598 131061 247010 402843 548304 671142 770168 842484 901359 935432 919178
8435I19178m6698m1271m439M3017N1924J1745n9860j17572j26660j06776n1984
$$ 919178 872480 831209 826770 869787 921711 933456 873596 756024 629364 522588 470604
8424D70604L0729P4474O5648N7094N6044M8003K4116K2577O3256R3675J09909
$$ 470604 501333 575807 641455 698549 754593 802596 826712 849289 912545 1006220 1116129
8413A116129J15450P8895M3785N1729L5128j8583n0654m0761p226O069K3102M5307
$$ 1116129 1231579 1310474 1354259 1405988 1441116 1422533 1371879 1331118 1323892 1329961 1353063 1398370
8401A398370K3923k546K2148N3794N4541N8213R2291J50820J94424J80284Q9653
$$ 1398370 1422293 1419747 1441895 1495689 1550230 1608443 1700734 1851554 2045978 2226262 2315915
8390B315915o556l6920k9724J6383J01265J70488J90438J96626K01809J82884
$$ 2315915 2309359 2272439 2242715 2259098 2360363 2530851 2721289 2917915 3119724 3302608
8380C302608J64904J76994K10179K37357K55803K70598K73460K48264K17081K50562
$$ 3302608 3467512 3644506 3854685 4092042 4347845 4618443 4891903 5140167 5357248 5607810
8370E607810L50601M42032M98756N59396O26897P09787Q23635R17722R51906R85120
$$ 5607810 5958411 6400443 6899199 7458595 8085492 8795279 9618914 10536636 11488542 12473662
8360A2473662J100250J259063J391518J538191J711094J830406J866306J804235
$$ 12473662 13573912 14832975 16224493 17762684 19473778 21304184 23170490 24974725
8352B4974725J604680J283449R10943N42931J86751j34839m17355p06786j019909
$$ 24974725 26579405 27862854 28773797 29316728 29503479 29368640 28951285 28244499 27224590
8343B7224590j333129j592704j777444j898062j905071j796182j636386j449912
$$ 27224590 25891461 24298757 22521313 20623251 18718180 16921998 15285612 13835700
8335A3835700j254362j071169r06525p95724p48740p16346o72159o12100n61199
$$ 13835700 12581338 11510169 10603644 9807920 9059180 8342834 7670675 7058575 6497376
8326F497376n18246m50131l80921l57622l41147k87107k30182k20277k24726j70065
$$ 6497376 5979130 5528999 5148078 4790456 4449309 4162202 3932020 3711743 3487017 3316952
8316C316952p4890l5291p2455j10605j13817j12438j00603p2601n0426n7169r6521
$$ 3316952 3242062 3206771 3134316 3023711 2909894 2797456 2696853 2624252 2573826 2516657 2420136
8305B420136j20653r5625l4324O272J585L512k820m7947p2254m5780Q42K1646
$$ 2420136 2299483 2203858 2169534 2175806 2177391 2180903 2178083 2130136 2057882 2012102 2012944 2034590
8293B034590p124p5490j21200j20217r1865m5699J8552Q0130J07127R4430L8795
$$ 2034590 2027466 1951976 1830776 1710559 1618694 1572995 1591547 1671677 1778804 1873234 1912029
8282A912029l8701m4461L9645J16201J10074K3618q6707j59281j54344p5999R472
$$ 1912029 1873328 1828867 1868512 1984713 2094787 2118405 2031698 1872417 1718073 1642074 1651546
8271A651546L6850K706m4113o2946l2733K9019Q3708J08382O0730k6619p6724
$$ 1651546 1688396 1691102 1646989 1584043 1551310 1580329 1664037 1772419 1833149 1806530 1729806
8260A729806p2867m8669j5125K2157N6526P6803N9451J021n3899p7974o8615j4584
$$ 1729806 1656939 1608270 1593145 1615302 1671828 1748631 1808082 1809103 1755204 1677230 1608615 1594031
8248A594031L7114N7196N7099O373q8595j60773j62850j17286n9176N792Q8766
$$ 1594031 1631145 1688341 1745440 1751813 1663218 1502445 1339595 1222309 1163133 1168925 1257691
8237A257691J48816J56435J37914J00305N0328J451m3037p1017m4675J9252O1048
$$ 1257691 1406507 1562942 1700856 1801161 1851489 1852940 1809903 1738886 1694211 1713463 1774511
8226A774511N1890m343m9196m7870k5034k4455m6604l5186K7883R0536J27861
$$ 1774511 1826401 1822058 1772862 1724992 1699958 1675503 1628899 1593713 1621596 1712132 1839993
8215A839993J30147Q0928K0129k6833m0338l4801j2837L7249J00486J21041R2191
$$ 1839993 1970140 2051068 2071197 2044364 2004026 1969225 1956388 1993637 2094123 2215164 2307355
8204B307355O3635O2373Q8376J03774Q4499M5190J48l4547m1341l3731k3711j9277
$$ 2307355 2370990 2433363 2521739 2625513 2710012 2755202 2755350 2720803 2679462 2645731 2622020 2602743
8192B602743J85K5397K6538k111m6454o1228p654O0703Q0232O1434J4892m0481
$$ 2602743 2602928 2628325 2654863 2652752 2606298 2545070 2537416 2598119 2678351 2739785 2754677 2714196
8180B714196o7070k3254O4185J02973Q8999O1843K1472j0931p112J3001K651j1639
$$ 2714196 2647126 2623872 2688057 2791030 2880029 2941872 2963344 2952413 2945301 2958302 2960953 2949314
8168B949314K6430J02865J47629J38652J11029P9096N9949O7371J00011J32123
$$ 2949314 2975744 3078609 3226238 3364890 3475919 3555015 3614964 3682335 3782346 3914469
8158C914469J26118J05088J12751J43563J71070J99315K49770L17241L84955M36902
$$ 3914469 4040587 4145675 4258426 4401989 4573059 4772374 5022144 5339385 5724340 6161242
8148F161242M56781M29526L82315L48717L38304L96305N11123O39981P69089R06764
$$ 6161242 6618023 7047549 7429864 7778581 8116885 8513190 9024313 9664294 10433383 11340147
8138A1340147J095960J336930J580082J794920J970663K107089K139045J889074
$$ 11340147 12436107 13773037 15353119 17148039 19118702 21225791 23364836 25253910
8130B5253910J182004P4201j080983j886627k209549k136533j836587j512518
$$ 25253910 26435914 26510115 25429132 23542505 21332956 19196423 17359836 15847318
8122A5847318j231260r58739p08880n14740l65053k40130j41277m4974Q8612K35918
$$ 15847318 14616058 13657319 12948439 12433699 12068646 11828516 11687239 11642265 11730877 11966795
8112A1966795L57487M48387N36735O50853P89683R40772J072038J159911J213667
$$ 11966795 12324282 12772669 13309404 13960257 14749940 15690712 16762750 17922661 19136328
8103A9136328J292198J421088J563096J676573J718237J645670J453504J161567
$$ 19136328 20428526 21849614 23412710 25089283 26807520 28453190 29906694 31068261
8095C1068261P93568L98915j0340m15336q03617j177221j494593j692882j763030
$$ 31068261 31861829 32260744 32250404 31835068 31031451 29854230 28359637 26666755 24903725
8086B4903725j741155j663454j571349j491333j413544j295524j143178r94354
$$ 24903725 23162570 21499116 19927767 18436434 17022890 15727366 14584188 13589834
8078A3589834q65211p41666o31164n55894n14641m96936m72327m18999l40885
$$ 13589834 12724623 11982957 11351793 10795899 10281258 9784322 9311995 8892996 8552111
8069H552111k67125k08247j70278j65763j65361j52467j63019j56409r7210n0689
$$ 8552111 8284986 8076739 7906461 7740698 7575337 7422870 7259851 7103442 7006232 6955543
8059F955543k7676k0885m9302q6008r2569p1641n0799j6847K3780K6443J552k2549
$$ 6955543 6927867 6906982 6857680 6771672 6679103 6607462 6556663 6539816 6563596 6590039 6591591 6569042
8047F569042k4267m855o512k2374l5068n1019p7847j07225r6649m2487q491j8491
$$ 6569042 6544775 6539920 6533408 6511034 6475966 6424947 6347100 6239875 6143226 6100739 6092248 6073757
8035F073757n9928j00933j30748j42650r6133j4764M1729P1136R8145J42691J72803
$$ 6073757 6013829 5912896 5782148 5639498 5543365 5528601 5570330 5641466 5739611 5882302 6055105
8024F055105J56808J07885P6036R8958J39166J71195J73584J23700Q5529R6802
$$ 6055105 6211913 6319798 6395834 6494792 6633958 6805153 6978737 7102437 7187966 7284768
8014G284768R1635O0293M8714P1993J29253J97354K56557L05242K97105K24229
$$ 7284768 7376403 7436696 7485410 7557403 7686656 7884010 8140567 8445809 8742914 8967143
8004H967143J83988K11010K88670L92380M46648M44793M87636O21830P59995Q48783
$$ 8967143 9151131 9362141 9650811 10043191 10489839 10934632 11422268 12044098 12804093 13652876
7994A3652876R18770J034640J228925J474380J723636J971320K273610K645049
$$ 13652876 14571646 15606286 16835211 18309591 20033227 22004547 24278157 26923206
7986B6923206L042497L448206L881132M360454M807343N081138N107577M818928
$$ 26923206 29965703 33413909 37295041 41655495 46462838 51543976 56651553 61470481
7978F1470481M087350K825590J171410o04609k256520l569362m427726m850820
$$ 61470481 65557831 68383421 69554831 68950222 66693702 63124340 58696614 53845794
7970E3845794m872933m563948m079199l535821k995036k493588k070388j715299
$$ 53845794 48972861 44408913 40329714 36793893 33798857 31305269 29234881 27519582
7962B7519582j403732j120427q74314o69478m85114l32050k19016j21257k5587
$$ 27519582 26115850 24995423 24121109 23451631 22966517 22634467 22415451 22294194 22268607
7953B2268607N3716J14605J73015K33061L13353M35075N93457P67290R33063J086572
$$ 22268607 22322323 22436928 22609943 22843004 23156357 23591432 24184889 24952179 25885242 26971814
7943B6971814J242552J448249J711530J994941K282455K601958K988211L444516
$$ 26971814 28214366 29662615 31374145 33369086 35651541 38253499 41241710 44686226
7935D4686226M001144M671884N437580O309594P278920Q332857R526397J0872997
$$ 44686226 48687370 53359254 58796834 65106428 72385348 80718205 90244602 101117599
7927A01117599J2270558J3625744J4814273J5606022J5643970J4520485J1968586
$$ 101117599 113388157 127013901 141828174 157434196 173078166 187598651 199567237
7920A99567237P988630K893592k707067q056612j2415064j5250447j6458444j6312391
$$ 199567237 207555867 210449459 207742392 199685780 187270716 172020269 155561825 139249434
7912A39249434j5241734j3668579j1916390j0166052q517613p058863n824582
$$ 139249434 124007700 110339121 98422731 88256679 79739066 72680203 66855621
7905F6855621m783483l898629l170042k576777k086674j704413j410457j121674
$$ 66855621 62072138 58173509 55003467 52426690 50340016 48635603 47225146 46103472
7897D6103472q40773o48011n58945m90883l42463j02326J83192M88857Q06033
$$ 46103472 45262699 44614688 44055743 43564860 43222397 43120071 43303263 43792120 44598153
7888D4598153J120594J452746J801814K154031K518677K933535L471852M179222
$$ 44598153 45718747 47171493 48973307 51127338 53646015 56579550 60051402 64230624
7880F4230624N001018N862663O827655P967201R298244J0869802J2716644J4837613
$$ 64230624 69231642 75094305 81921960 89889161 99187405 110057207 122773851 137611464
7872A37611464J7217358J9891821K2803176K5754396K8485026L0522003L1125736
$$ 137611464 154828822 174720643 197523819 223278215 251763241 282285244 313410980
7865C13410980K9469799K4902924J7300208P262190l963055j4760744k3600274
$$ 313410980 342880779 367783703 385083911 392346101 388383046 373622302 350022028
7858C50022028k9459059l2110416l2038164l0049289k6974954k3501813k0073892
$$ 350022028 320562969 288452553 256414389 226365100 199390146 175888333 155814441
7851A55814441j6916599j4133756j1759233r762187q080896o666016n480624m524793
$$ 155814441 138897842 124764086 113004853 103242666 95161770 88495754 83015130 78490337
7843G8490337l770696l151047k644405k253647j970532j741382j474530j160828
$$ 78490337 74719641 71568594 68924189 66670542 64700010 62958628 61484098 60323270
7835F0323270q50132n43428k20895J62614O27408J096663J542340K021748K582659
$$ 60323270 59473138 58929710 58708815 58871429 59498837 60595500 62137840 64159588 66742247
7826F6742247L232375L928064M666171N525484O542145P701543R052194J0636746
$$ 66742247 69974622 73902686 78568857 84094341 90636486 98338029 107390223 118026969
7818A18026969J2459985J4537418J6914999J9657512K2795379K6241652K9813478
$$ 118026969 130486954 145024372 161939371 181596883 204392262 230633914 260447392
7811B60447392L3179799L5718013L6529856L4631074K9301468K0395436Q566164
$$ 260447392 293627191 329345204 365875060 400506134 429807602 450203038 458769202
7804D58769202m724158j7580969k8191967l5288991l8507825l8392116l5939973
$$ 458769202 454045044 436464075 408272108 372983117 334475292 296083176 260143203
7797B60143203l2193384k8015480k3925844k0197439j6947209j4178666j1819295
$$ 260143203 227949819 199934339 176008495 155811056 138863847 124685181 112865886
7790A12865886r806876q120798o737668n627205m740485m040750l497204l027755
$$ 112865886 103059010 94938212 88200544 82573339 77832854 73792104 70294900 67267145
7782F7267145k608204k245993j901227j549233j191998q27233m68346j13939K56404
$$ 67267145 64658941 62412948 60511721 58962488 57770490 56943257 56474911 56360972 56617376
7773E6617376O45447J059835J526924K019637K521479L046122L645233M394344
$$ 56617376 57262823 58322658 59849582 61869219 64390698 67436820 71082053 75476397
7765G5476397N292559O318460P492211Q877993J0485322J2290126J4270997J6501292
$$ 75476397 80768956 87087416 94579627 103457620 113942942 126233068 140504065 157005357
7757A57005357J9099016K2027040K5061156K7848378K9901984L0527588K8957108
$$ 157005357 176104373 198131413 223192569 251040947 280942931 311470519 340427627
7750C40427627K4536364J7096532P198632l996619j4884331k3888378k9997169
$$ 340427627 364963991 382060523 389259155 385262536 370378205 346489827 316492658
7743C16492658l2912653l2972744l0970392k7812832k4262204k0783733j7576205
$$ 316492658 283580005 250607261 219636869 191824037 167561833 146778100 129201895
7736A29201895j4757591j2386660j0435771q832938p478992o311626n320772m489340
$$ 129201895 114444304 102057644 91621873 82788935 75309943 68998317 63677545 59188205
7728E9188205l816143l294386k862053k475166k165672j918418j656688j369141
$$ 59188205 55372062 52077676 49215623 46740457 44574785 42656367 40999679 39630538
7720C9630538j105802q71159o35261m09410j90070N4918L14814N93876R45920
$$ 39630538 38524736 37653577 37018316 36608906 36418836 36473754 36788568 37382444 38328364
7711C8328364J350642J730492K097417K502406K993199L584399M263997N034257
$$ 38328364 39679006 41409498 43506915 46009321 49002520 52586919 56850916 61885173
7703F1885173N886655O875269Q056170R399011J0845181J2319827J3662420J4625053
$$ 61885173 67771828 74647097 82703267 92102278 102947459 115267286 128929706 143554759
7695A43554759J4914173J4160207J2007032Q329546L405186k126096p508972j2007022
$$ 143554759 158468932 172629139 184636171 192965717 196370903 194244807 186735835 174728813
7687A74728813j5098535j6633742j6709278j5678638j4075537j2288319j0540394
$$ 174728813 159630278 142996536 126287258 110608620 96533083 84244764 73704370
7680G3704370q931653p503905o314959n346622m547319l881418l299059k786630
$$ 73704370 64772717 57268812 50953853 45607231 41059912 37178494 33879435 31092805
7672C1092805k369101k048476j805606j612508j447303j275017j060963q42664
$$ 31092805 28723704 26675228 24869622 23257114 21809811 20534794 19473831 18631167
7664A8631167o86080o01075n39300m52359l23987j73053l9723O6523J67533K47005
$$ 18631167 17945087 17344012 16804712 16352353 16028366 15855313 15815590 15882113 16049646 16296651
7654A6296651L22084M20577N39968P07773R21997J123551J298330J495218J765285
$$ 16296651 16618735 17039312 17579280 18287053 19209050 20332601 21630931 23126149 24891434
7645B4891434K092852K465644K918650L446388L962830M369268M625758M656249
$$ 24891434 26984286 29449930 32368580 35814968 39777798 44147066 48772824 53429073
7637E3429073M364852L688158K596191J123311o09835k340701l790415m821435
$$ 53429073 57793925 61482083 64078274 65201585 64591750 62251049 58460634 53639199
7629E3639199n368576n459421n205609m738586m167385l577205l016431k521340
$$ 53639199 48270623 42811202 37605593 32867007 28699622 25122417 22105986 19584646
7621A9584646k117284j789153j502735j278446j151697j053775r25077p88202
$$ 19584646 17467362 15678209 14175474 12897028 11745331 10691556 9766479 8978277
7613H978277o67108n77554n28669m92898m58208m29054m08301m04292m13678l83396
$$ 8978277 8311169 7733615 7204946 6712048 6253840 5824786 5416485 5012193 4598515 4215119
7603D215119k97486j96559j10578o3858p9124j46215j87063j55096q8644j0508
$$ 4215119 3917633 3721074 3610496 3546638 3467514 3321299 3134236 2979140 2890496 2879988
7593B879988N2766M2016j5751m3056o1358j02545j12157q5377p2053n8078l5672
$$ 2879988 2932754 2974770 2959019 2915963 2854605 2752060 2639903 2554526 2482473 2424395 2388723
7582B388723k3895l2463m9664k9473Q754K7215J9748j1621m3671p2084p6289o3124
$$ 2388723 2364828 2332365 2282701 2253228 2261982 2289197 2308945 2297324 2253653 2181569 2105280 2042156
7570B042156o7600p8120p4199o6344m7578k3810k9993o6630q9487q5367q1224
$$ 2042156 1974556 1896436 1822237 1755893 1708315 1684505 1654512 1587882 1498395 1413028 1331804
7559A331804r7683j32051j57583j49802j07998l9800L2618J01411J62513J99038
$$ 1331804 1234121 1102070 944487 794685 686687 646887 679505 780916 943429 1142467
7549A142467J85048J31258N7184k8173m4367J6188N0050L0822J6843J4544j7151
$$ 1142467 1327515 1458773 1515957 1487784 1443417 1459605 1509655 1540477 1557320 1571864 1554713
7538A554713j01933j59759j13118k6829N3378J16497J33398J12526P4588L0128
$$ 1554713 1452780 1293021 1179903 1153074 1206452 1322949 1456347 1568873 1643461 1673589
7528A673589m0801j26451j87607j80714j22127p4234l4777o744l613j7680l9106
$$ 1673589 1632788 1506337 1318730 1138016 1015889 941655 906878 900134 896521 878841 839735
7517H39735l8686k478P0234J23040J10477O4922J0278m9934j07846j21261p1330
$$ 839735 801049 798571 868805 991845 1102322 1167244 1177522 1127588 1019742 898481 827151
7506H27151P734M6420L2794N719j2314j6001k761K7513M9131O6055P6390O9309
$$ 827151 834885 881305 914099 919818 907504 891503 888742 916255 965386 1031441 1107831 1177140
7494A177140N0006K9644L5594N6137N4964J2234l0268j0713N0171O9325K9176
$$ 1177140 1227146 1256790 1292384 1348521 1403485 1415719 1385451 1374738 1424909 1494234 1523410
7483A523410k3852l6269p908L3601N1379N1157O6803P7963N9981K8967J0556j4035
$$ 1523410 1499558 1463289 1455381 1488982 1540361 1591518 1658321 1736284 1796265 1825232 1835788 1821753
7471A821753k7949J376O3417J16644J18990Q4099O2388N2996K0257j7928l9820
$$ 1821753 1793804 1795180 1858597 1975241 2094231 2178330 2240718 2293714 2313971 2296043 2256223
7460B256223l6370q685J7531J9979K7792O1272J17839J60446J40075R4302Q4570
$$ 2256223 2219853 2211168 2228699 2248678 2276470 2337742 2455581 2616027 2756102 2850404 2934974
7449B934974J32658J87322K09294K15315K57071L41263L90028L84483L68175L50141
$$ 2934974 3067632 3254954 3464248 3679563 3936634 4277897 4667925 5052408 5420583 5770724
7439E770724L40830L72634M42648N08523N70824O47163P26800Q05013Q53872Q69562
$$ 5770724 6111554 6484188 6926836 7435359 8006183 8653346 9380146 10185159 11039031 11908593
7429A1908593Q76333Q13544O20149L48214P4232k15307n41150q30789r93190j030640
$$ 11908593 12784926 13598470 14218619 14566833 14641065 14425758 13884608 13053819 12060629 11029989
7419A1029989j000800r35199q53918p68575o62155n44218m46676l81207l41367
$$ 11029989 10029189 9093990 8240072 7471497 6809342 6265124 5818448 5437241 5095874
7410E095874k94269k24115j54481j63869k40378k63930j97000j10494o3574m3915
$$ 5095874 4801605 4577490 4423009 4259140 4018762 3754832 3557832 3447338 3383764 3339849
7400C339849n5223q3767j02409r4658m6417K4989O5310N5148N6105Q8281J13816
$$ 3339849 3284626 3200859 3098450 3003792 2957375 2982364 3047674 3102822 3158927 3247208 3361024
7389C361024R6787N2653J2838j7278m2837n3475m5709l3137J919P2603J48292
$$ 3361024 3457811 3510464 3523302 3506024 3463187 3409712 3364003 3330866 3332785 3405388 3553680
7378C553680J79182J62943J33402J14099J38090J88805K21447K49136K97064L56347
$$ 3553680 3732862 3895805 4029207 4143306 4281396 4470201 4691648 4940784 5237848 5594195
7368E594195M05975M68659N56469O43170P62591R04762R74056R76647J001951
$$ 5594195 6000170 6468829 7025298 7668468 8431059 9335821 10309877 11286524 12288475
7359A2288475J074673J129127J044861P69989L92485K4212l16627o71214r60193
$$ 12288475 13363148 14492275 15537136 16307125 16699610 16723822 16407195 15735981 14775788
7350A4775788j097205j084614r86350r00871q46960q15915p84902p30718o71761
$$ 14775788 13678583 12593969 11607619 10706748 9859788 9043873 8258971 7528253 6856492
7341F856492o21467n78347n32283m81462m20301l69960l43214l27327l00561k82445
$$ 6856492 6235025 5656678 5124395 4642933 4222632 3852672 3509458 3182131 2881570 2599125
7331B599125k67879k16595j33277p5274o4974j12590j66883j52628j03808p7936
$$ 2599125 2331246 2114651 1981374 1906100 1841126 1728536 1561653 1409025 1305217 1227281
7321A227281o0386k0962p512n9929r7228q0841m3941k398J3087Q645M165K396
$$ 1227281 1166895 1145933 1138421 1078492 981264 900423 856482 854084 867171 875816 879981 882377
7309H82377J5244K7365L3370M7285M7228K3979K2380N5959O7120L6917j7747n0014
$$ 882377 897621 924986 958356 1005641 1052869 1076848 1099228 1155187 1222307 1259224 1241477 1191463
7297A191463n7108q7237j26422j04721m0599j2258n868l077l1333j24714k02157
$$ 1191463 1134355 1047118 920696 815975 775376 763118 757250 754173 722840 598126 395969
7286C95969j71044p8093m697K4088M2524R4874J37821J09145N0384J9062O696
$$ 395969 224925 146832 142135 166223 208747 303621 441442 550587 600971 620033 626729
7275F26729k2075n3883n2204j0348N3717R1767Q6595N2334n620m2686m7817l3312
$$ 626729 604654 550771 498567 488219 541936 633703 720298 772632 767012 724326 676509 643197
7263F43197J483K525l7785p4910o3041p914J8235J015k8464l3679n95K1083J3311
$$ 643197 644680 647205 609420 534510 471469 463555 481790 482805 454341 420662 420067 441150 454461
7250D54461L092J6240P0888J16233P4920l0966j14247j29636q2900k4814M765
$$ 454461 457553 473793 544681 660914 735834 704868 590621 460985 378085 353271 358036
7239C58036J8074N0631P3296M6582L7637N2722K6526o811j7653k4101m4013p4744
$$ 358036 376110 426741 500037 546619 584256 636978 663504 656693 639040 614939 570926 496182
7227D96182q9465o4425p165L8978M2525J0196n4525j31911j61493j23077o2808
$$ 496182 406717 342292 335127 374105 416630 426826 372301 240390 78897 -44180 -106988
7216a06988k9535j7519k41J670M716J2236j6521m4060k3275K7670P2207O1658
$$ -106988 -136523 -154042 -154283 -152613 -147897 -135661 -152182 -196242 -219517 -191847 -119640 -57982
7204e7982O168l1482P267Q0905P1212J2203o370q797Q775L8298M8638N1627K2576
$$ -57982 -51814 -83296 -76029 4876 76088 88291 81921 73124 81899 120197 168835 220462 243038
7191B43038m6222j03495j27989r0594j1086M4389P0151P2353M6759J106n5990
$$ 243038 196816 93321 -34668 -125262 -136348 -91959 -21808 50545 97304 98410 42420
7180D2420r6755p3166j6698J8923J7115l254K6371J06755J42264J01671L4687
$$ 42420 -54335 -127501 -144199 -125276 -108161 -111415 -85044 21711 163975 265646 300333
7169C00333q62j934l0695p3755p3589n3613l5735l3587n9241o5887l0812K7034
$$ 300333 299471 297537 266842 193087 119498 65885 30150 -3437 -62678 -128565 -159377 -132343
7157a32343Q6054J21430J24646J05169P4928L0162l4859o8079m3409J386L0539
$$ -132343 -46289 75141 199787 304956 379884 410046 375187 307108 263699 265085 295624
7146B95624L1349J1297k5778p8422j26947j48718j19698n9982J1080P1109N8379
$$ 295624 326973 338270 312492 234070 107123 -41595 -161293 -221275 -210195 -139086 -80707
7135h0707j0071p5840j01698q0345l6815K2411O4102O7229N1369L1253R409q279
$$ -80707 -90778 -166618 -268316 -348661 -385476 -363065 -298963 -231734 -180365 -149112 -139703 -147982
7123a47982j5170j5034k4205m9768n2629j2995K2986J9853J2218K5252O5920J12846
$$ -147982 -163152 -178186 -202391 -252159 -304788 -317783 -294797 -274944 -262726 -237474 -171554 -58708
7111e8708J25613Q7438K5270o969O260M1826P4194Q1184M7472Q841m1862j13450
$$ -58708 66905 154343 179613 172644 178904 220730 294924 376108 423580 432421 390559 277109
7099B77109j50911j15419l4000K1025M4806O5509M3306n570k1292n393J6307L4292
$$ 277109 126198 10779 -23221 -2196 42610 108119 151425 145855 124563 119170 135477 169769
7087A69769N3239O0404M2295K1898J8545J7719J4639p404m7000p5250p5156m5249
$$ 169769 223008 283412 325707 347605 366150 383869 398508 391104 344104 268854 193698 148449
7075A48449J2074O3191O2546K1162k8969n5899m1348R12K7576K7698K6958K5963
$$ 148449 160523 223714 286260 307422 278453 222554 181206 182118 209694 237392 264350 290313
7063B90313j3811q8842j60274j80769j45814o6542M9243J41201J73800J30690
$$ 290313 276502 187660 27386 -153383 -299197 -365739 -316496 -175295 -1495 129195
7053A29195N6587K5219K8400K0852J4412K0366J9535M2271P0871L6917l7530p0954
$$ 129195 185782 211001 239401 260253 274665 295031 314566 356837 427708 464625 427095 356141
7041C56141l5759L6316R2701Q1869K2489k6621n2911p5806p4524p0418o7297k1297
$$ 356141 320382 356698 449399 531268 553757 527136 474225 398419 323895 253477 186180 164883
7029A64883L3940N1364M1212J3036k2179k8329j3799M286J4971J1302L0929Q7463
$$ 164883 198823 250187 291399 304435 282256 253927 240128 244414 259385 270687 301616 389079
7017C89079J12785N9474p173n0050o0620m1775l0017k5481j2069J3990J6173k3905
$$ 389079 501864 561338 554165 504115 443495 401720 371703 346222 334153 348143 364316 340411
7005C40411o1805n2473k5660k6564m8491o3719l4146J7510L3594J4585L183J6350
$$ 340411 278606 226133 200473 173909 125418 61699 27553 45063 78657 93242 96425 112775
6993A12775L0264K6406J9769K9505L0584O132j3273J3039P4453J00984P9721M1975
$$ 112775 143039 169445 189214 218719 249303 255435 242162 255201 329654 430638 510359 552334
6981E52334k6567j06349j20177o5076r849N974j3393l8535k5980J5230K3722j6163
$$ 552334 525767 419418 299241 234165 224316 230290 216897 178362 152382 167612 191334 175171
6969A75171n9888r1718j02455p9605m3007j9011j1721J8631O7857Q4831P8618
$$ 175171 115283 23565 -78890 -158495 -201502 -220513 -232234 -213603 -145746 -60915 17703
6958A7703Q2566P2112J4140n3845p6564m0518K1667N1618L2486Q840R09N870L2088
$$ 17703 100269 172381 186521 132676 56112 15594 37261 88879 121365 130205 131114 136984 169072
6945A69072O6623P4475N4753K5968k2365q6318j18052j06716p7731j5936M6435
$$ 169072 235695 310170 364923 390891 368526 282208 164156 57440 -20291 -36227 10208
6934A0208P1056N3236P945j9468k6714k1300j3345k3602K616O9628P5756K4586
$$ 10208 81264 134500 142445 122977 96263 74963 61618 38016 40632 110260 186016 210602
6922B10602l4L4074Q2844Q3288N9607L1355j11l6970n7815m2864M054L7453j117
$$ 210602 210568 244642 327486 410774 470381 501736 501625 464655 406840 363976 368030 405483 404366
6909D04366n9109p4577n4908l3820j4469M536L1370L8329J5705l2113p6229n6386
$$ 404366 345257 270680 215772 181952 167483 172019 203389 241718 257423 225310 149081 92695
6897I2695K3478Q9979Q4057L2670n866N57L8099N8718M6483O355n4328j01815
$$ 92695 116173 206152 290209 322879 317013 317570 355669 414387 460870 467225 412897 311082
6885C11082j00233n1065J0011N0305O0341O7872J11168J73565J90976J68238J32921
$$ 311082 210849 159784 169795 220100 280441 348313 459481 633046 824022 992260 1125181
6874A125181O7392K2665L0716K6014j0948k5040N572N1282O1145K1436j3898j1290
$$ 1125181 1192573 1215238 1245954 1271968 1261020 1235980 1241552 1292834 1353979 1375415 1361517 1350227
6862A350227l976k7195n7166n0934J4544Q1612R3225O4958K9709J1720L7807Q9856
$$ 1350227 1346251 1319056 1261890 1210956 1225500 1307112 1400337 1465295 1495004 1506724 1544531 1634387
6850A634387J23550J14910O5493j7929r9173j14251r2579q9409j07319r9706l6784
$$ 1634387 1757937 1872847 1938340 1920411 1821238 1706987 1614408 1524999 1417680 1317974 1281190
6839A281190M4728R6469J14811J42180J90416K02962J66684J35412J31615J65429
$$ 1281190 1325918 1422387 1537198 1679378 1869794 2072756 2239440 2374852 2506467 2671896
6829B671896K36076L21969L95623M37029M35004M13404M62219O11590Q06529J021608
$$ 2671896 2907972 3229941 3625564 4062593 4497597 4911001 5373220 5984810 6791339 7812947
6819G812947J268858J523801J793503K088841K420095K865808L509200M341881
$$ 7812947 9081805 10605606 12399109 14487950 16908045 19773853 23283053 27624934
6811B7624934N326008O425256P446329P655237N615085O42873m869727p831241
$$ 27624934 32950942 39376198 46822527 54477764 60092849 60735722 55865995 48034754
6803D8034754q106552p140956n918276m765727l777019k963857k326647j846766
$$ 48034754 39928202 32787246 26868970 22103243 18326224 15362367 13035720 11188954
6795A1188954j478148j200326r99444q40614o91760n47662m22657l42181l58581
$$ 11188954 9710806 8510480 7511036 6670422 5978662 5431000 5008343 4666162 4307581
6786D307581m09859l86782l25193k82182k65814k52786k05549j23469l1232L4387
$$ 4307581 3897722 3510940 3185747 2903565 2637751 2384965 2179416 2055947 2024715 2059102
6776B059102M9550P329l8044m3664k9352j409r071m0846k6818J9197M1803R884
$$ 2059102 2108652 2115981 2077937 2034273 2004921 2003512 1994441 1953595 1926777 1945974 1987777 1997661
6764A997661m1507o5442n5249l9383n4295r2327j33181j55224j45001j03314o6168
$$ 1997661 1956154 1890712 1835463 1796080 1741785 1649458 1516277 1361053 1216052 1112738 1046570
6753A046570m0041M395O0941N5635j3048r6848j67501j80348j51544j19637p0720
$$ 1046570 1006529 1010924 1071865 1127500 1114452 1017604 850103 669755 518211 398574 327854
6742C27854j274L8442J8291j113J5972K9657K8454J8538q662j8830K0313L9758
$$ 327854 326580 365022 383313 382200 398172 427829 456283 474821 466159 447329 467642 507400
6730E07400R9o4692r2262o8423m4287m1213l8924j4247N696K986O997P880J1077
$$ 507400 507499 442807 350545 282122 237835 196622 157698 143451 149147 152133 159130 167010 178087
6717A78087M4198P0528M6348r83j8472j6236p636J0432P809j2445k1296l1100
$$ 178087 222285 292813 339161 338178 319706 303470 295834 306266 314075 301630 280334 249234
6705B49234m4591q659O5101J06961P1865j282n5493p2259n5702m1950n5040p8864
$$ 249234 204643 195984 261085 368046 439911 438629 383136 310877 255175 213225 158185 79321
6693G9321q7971r6407j13691j12806p0334j7998K7469O6582P1952M6057K5304
$$ 79321 -8650 -105057 -218748 -331554 -401888 -419886 -392417 -325835 -253883 -207826 -182522
6682a82522J7752K5223N5961R0475P0430K6463M3023R0002Q2838K9679j6859l9214
$$ -182522 -164770 -139547 -83586 6889 77319 103782 146805 236807 319645 349324 332465 293251
6670B93251l1104q763r645j991J9811J7069k997j455N713q138j1320j9n833j0658
$$ 293251 262147 253384 243739 241748 261559 278628 275631 274176 279889 271751 260431 260412 254579 243921
6656B43921J3938K0706m204k8171k5114p954n246j1954k6429o1983r6764o5524
$$ 243921 257859 278565 274361 246190 221076 213122 207876 195922 169493 107510 10746 -54778
6644e4778j7338j7618m151J8459j879n5109j04493r1705j547J01811J38230Q7302
$$ -54778 -72116 -89734 -93885 -75426 -77305 -132414 -236907 -328612 -330159 -228348 -90118 -2816
6632b816R741j9705M424L2529K5580k0675m7333p576O3988P4782M7725M6803M4388
$$ -2816 6925 -12780 -8356 24173 49753 29078 -18255 -25831 38157 112939 160664 207467 251855
6619B51855Q906j3329J5966N3927N5361L0279j314m7560q8414p6180m2781l1542
$$ 251855 260761 247432 263398 317325 372686 402965 401651 354091 265677 189497 146716 115174
6607A15174k6675k0185q353k751j4698k3806l2974k6327O927K6161K9298K3869
$$ 115174 88499 68314 59961 57210 42512 18706 -14268 -40595 -33668 -7507 21791 45660
6595D5660j1903n3210p0708q0735n2446L0848R9630J15479J26844J42093J33526
$$ 45660 33757 -19453 -90161 -170896 -223342 -192494 -92864 22615 149459 291552 425078
6584D25078Q5793Q863m4753m4491k6091k3744j5445p50M742l224j3086p105J9149
$$ 425078 510871 519734 474981 430490 404399 380655 365210 364460 369202 365978 352892 345787 364936
6571C64936O5540P9672L8846o788j9146J7305O1546M9691M374k0458k4834m7770
$$ 364936 430476 510148 548994 542206 523060 540365 601911 651602 655976 635518 610684 562914
6559E62914o7898l8019K1198P4796Q2389Q332r2885j39092r4066j0580K4869K2703
$$ 562914 495016 456997 478195 552991 635380 643712 550827 411735 317669 307089 331958 354661
6547C54661k418j3940K1810P3565J08888J18289R0432N0785L0668J1306J3971
$$ 354661 352243 338303 360113 433678 542566 660855 751287 802072 832740 844046 858017
6536H58017M4501N3432O0854Q4743P9156L7109q477l9806p9793j26364j34624
$$ 858017 902518 955950 1016804 1101547 1180703 1217812 1209335 1169529 1089736 963372 828748
6525H28748q3527l7135k678P2196J45803J78962J93105J66935J04816O1191N6526
$$ 828748 745221 708086 705408 777604 923407 1102369 1295474 1462409 1567225 1628416 1684942
6514A684942P0110Q1889J07421J15390R6573R3742J26656J65346J76983J76885
$$ 1684942 1755052 1836941 1944362 2059752 2156325 2250067 2376723 2542069 2719052 2895937
6504B895937K00686K18426K20095K61463L54407M48341N25734O15867P04298P79326
$$ 2895937 3096623 3315049 3535144 3796607 4151014 4599355 5125089 5740956 6445254 7224580
6494G224580Q57646R40153J066036J237493J403793J580583J799206K085440K440124
$$ 7224580 8082226 9022379 10088415 11325908 12729701 14310284 16109490 18194930 20635054
6485B0635054K821599L216771L624600L953176M070731L954813L535153K640476
$$ 20635054 23456653 26673424 30298024 34251200 38321931 42276744 45811897 48452373
6477D8452373J131929q74384k826245m141851m667479m584034m183551l705011
$$ 48452373 49584302 48709918 45883673 41741822 37074343 32490309 28306758 24601747
6469B4601747l245606k815694k401411k027291j722465j461877j196691r22499
$$ 24601747 21356141 18540447 16139036 14111745 12389280 10927403 9730712 8808213
6461H808213p24720o50229o09608n44098m58194l76208l38126l17448k77947k45898
$$ 8808213 8083493 7433264 6823656 6279558 5821364 5445156 5107030 4789582 4511635 4265737
6451D265737k15852j64701j20034j17370j36025j38312j17661r6523q0014p0776
$$ 4265737 4049885 3885184 3765150 3647780 3511755 3373443 3255782 3159259 3079245 3008469
6441C008469o1570m4277m4084m0710k0336j0885J882J2581n387k0387K645N5938
$$ 3008469 2946899 2902622 2858538 2817828 2797492 2786607 2788489 2801070 2795683 2775296 2777941 2833879
6429B833879J03996J18078J01089J03223J67689K41355K64616K78681L48498M44295
$$ 2833879 2937875 3055953 3157042 3260265 3427954 3669309 3933925 4212606 4561104 5005399
6419E005399N03802N07695N03206N57993O85418Q62869J050468J226341J408549
$$ 5005399 5509201 6016896 6520102 7078095 7763513 8626382 9676850 10903191 12311740
6410A2311740J595465J760806J864618J858261J656580J152920L54827n70282
$$ 12311740 13907205 15668011 17532629 19390890 21047470 22200390 22555217 21984935
6402B1984935j375054j866069k022488j964126j783295j574954j419527j276107
$$ 21984935 20609881 18743812 16721324 14757198 12973903 11398949 9979422 8703315
6394H703315j075923q63519p19833o37080n81112n25597m28765l26173k70380
$$ 8703315 7627392 6763873 6044040 5406960 4825848 4300251 3871486 3545313 3274933
6385C274933k31246k19098k66424l17259l04869k37210j60435q4276o252N2512
$$ 3274933 3043687 2824589 2558165 2240906 1936037 1698827 1538392 1454116 1447864 1500376
6375A500376N4844k6951j06432r2132j9231L0831L3774K583o8977j24575j08810
$$ 1500376 1555220 1528269 1421837 1329705 1310474 1341305 1375079 1377662 1308685 1184110 1075300
6364A075300o9643l3061L6884Q6480N1692j7123l8711k5885m2825o1332n4926
$$ 1075300 1005657 972596 1009480 1095960 1147652 1130529 1091818 1065933 1023108 961776 906850
6353I06850m2300k3762k447k275l4477q5422j10030m5754L7841M1979M61l6638
$$ 906850 864550 840788 838341 836066 801589 716167 606137 560383 598224 640203 640664 604026
6341F04026n1036k9507R358L1010J7674k6883o9169p6315n5856k5509Q776L1402
$$ 604026 552990 523483 532841 563851 581525 554642 485473 409158 353302 327793 336569 367971
6329C67971J3811m8716j01178j09023r5483p8906m9835q135L8770O7676P5914
$$ 367971 381782 333066 231888 122865 27382 -51524 -101359 -109494 -70724 -3048 72866
6318G2866O7494L6556L039j4444k5181j6307K4491O2062M1378j2157l9404m5495
$$ 72866 140360 176916 179955 165511 140330 124023 148514 210576 251954 239797 200393 154898
6306A54898k6241J1854L4819K5165q344k9224l181M1550M5704J3508r603N761
$$ 154898 128657 140511 175330 200495 192151 162927 159746 201296 247000 260508 250905 256666
6294B56666M4555M2131k011k3834N706N7222P3232M1056m175k8097k0862q382
$$ 256666 301221 343352 341341 317507 323213 380435 453667 494723 490548 462451 441589 433207
6282D33207k0293m4407k9386O708k7711r8567j16071r6779q0959p5681n8126j5127
$$ 433207 412914 368507 339121 345829 318118 219551 103480 6701 -74258 -149939 -208065 -223192
6270b23192M1649Q9802P4209L1804K4027M4803N7787M3078n666o1059m9456n565
$$ -223192 -181543 -91741 -17532 14272 38299 83102 140889 183967 178301 117242 67786 62221
6258F2221N531l438O218K8131M9388N3499K8312j147r630N632J8679J7180J101
$$ 62221 67752 64314 70532 98663 148051 201550 229862 228715 219085 224717 243396 260576 261677
6245B61677k0296m6590q2987p6252q817O0109R8582Q3566J0163p0072j12607j10145
$$ 261677 241381 194791 111804 35552 26735 86844 185426 268992 279155 209083 96476 -13669
6233a3669m7174L1072O2301N7348J4618k7896j2550L4821Q5273J29246J62184
$$ -13669 -60843 -29771 32530 89878 104496 76600 64050 98871 184144 313390 475574
6222D75574J51194O3006p0199j70801j84079j12360k0148K2503L4973N5720N8916
$$ 475574 626768 689774 619575 448774 264695 152335 132187 154690 189663 245383 304299
6211C04299L1580K5405M4650O1641P9807P3244J5280n3883o6412j8300l452n5476
$$ 304299 335879 361284 405934 467575 547382 620626 635906 582023 515611 497311 493859 438383
6199D38383j11244j42779j29579o7511J0635P5044J11467J20295J09016P1195
$$ 438383 327139 184360 54781 -12730 -2095 72949 184416 304711 413727 484922
6189D84922J3306l9100o6385p3763p9350r0331q4158n8327l2981J617M7324O2754
$$ 484922 498228 459128 392743 318980 239630 149299 65141 6814 -26167 -24550 22774 85528
6177H5528O6040P4609O7592M4775k847m6824n3791m4355m5498m1216k1284J8006
$$ 85528 151568 226177 293769 338544 335697 288873 235082 190727 145229 104013 82729 100735
6165A00735N2694P6206R1333R5640J01009R8758O9007K9539K681j1733q121K7873
$$ 100735 153429 229635 320968 416608 517617 616375 685382 714921 717602 705869 697748 725621
6153G25621O6465O7179M7537M9565O9712P4644P4617R5098R9443M4098k9669p7143
$$ 725621 792086 859265 906802 956367 1026079 1100723 1175340 1270438 1369881 1413979 1384310 1307167
6141A307167j04498j09135q3038n9005n0739m9143k8517L1781P6996O8240O9121
$$ 1307167 1202669 1093534 1010496 951491 900752 851609 823092 854873 931869 1000109 1069230
6130A069230R5527J07307J05069Q5011L2595p490L6270J33067J89355J87141J54453
$$ 1069230 1164757 1272064 1377133 1462144 1494739 1487249 1523519 1656586 1845941 2033082 2187535
6119B187535J13389J20484J88855K72664L28782L41324L35970L57606M13446M71616
$$ 2187535 2300924 2421408 2610263 2882927 3211709 3553033 3889003 4246609 4660055 5131671
6109E131671N21367N91367O91473P84043Q24153Q55152R22897R96132R96707Q74643
$$ 5131671 5653038 6244405 6935878 7719921 8544074 9399226 10322123 11318255 12314962 13189605
6099A3189605O49964L37553l3203m03940p24263r37319j050919j105424j082567
$$ 13189605 13839569 14177122 14143919 13739979 13015716 12078397 11027478 9922054 8839487
6090H839487r76844q26665o88698n92563n46415n05301m10743l01101k33630k05520
$$ 8839487 7862643 7035978 6347280 5754717 5208302 4703001 4292258 3991157 3757527 3552007
6080C552007k07687k34373k63859k59111k07476j51175j46784j57011j24502p3844
$$ 3552007 3344320 3109947 2846088 2586977 2379501 2228326 2081542 1924531 1800029 1726185
6070A726185n3328o1255n6163n5187q3408j02416q8816p3795o5806m9951m6386
$$ 1726185 1672857 1611602 1555439 1500252 1416844 1314428 1225612 1151817 1086011 1036060 989674
6059I89674p1697r3780q4964m3984k715L0471O2555N9404N7397P0385K8095m8912
$$ 989674 917977 824197 739233 695249 692534 723005 785560 844964 902361 972746 1000841 951929
6047I51929r3713r0191n8742k5780j9270n6333j11811j06887k1797O6157Q6989
$$ 951929 858216 768025 709283 683503 664233 607900 496089 389202 367405 433562 520551
6036E20551K8937m0406q1668r9777o4270P483M8407N3190J5764l6068m2324k4659
$$ 520551 549488 509082 427414 327637 263367 270850 319257 372447 388211 352143 309819 285160
6024B85160J0441Q0303J30604J03508L2128K521M2325J07631J18179O6274J8502
$$ 285160 295601 375904 506508 610016 642144 644665 686990 794621 912800 979074 997576
6013I97576k6236o8705o8607l5094kK4158N6713J03321J17008N3272m9365p8580
$$ 997576 971340 902635 834028 798934 798932 823090 879803 983124 1100132 1153404 1104039 1025459
6001A025459l2854j2290o9305j63070j99920j71055j30347j00331n8633j7726
$$ 1025459 992605 980315 911010 747940 548020 376965 246618 146287 87654 69928
5991F9928j749J0786P265k6892m5919j1707K1784K6614L9411O5739Q8127O2238
$$ 69928 68179 78965 86230 59338 13419 1712 23496 50110 89521 155260 243387 305625
5979C05625K876l2209k2288J6337L9741K5264q040j9286j7229K896k116l7184
$$ 305625 308501 276292 254004 270341 310082 335346 327306 308020 290791 293687 291571 254387
5967B54387m6304l0706k4925l4867l1894l4472p4605p3711Q245R9807J36037J19643
$$ 254387 208083 177377 152452 117585 85691 51219 -23386 -97097 -88852 10955 146992 266635
5955B66635R3849M6071j3362k5810N56J4846R550L0796P1899Q2653N0058K8446
$$ 266635 360484 406555 393193 367383 367939 382785 392335 423131 495030 577683 627741 656187
5943F56187K9479K3743j8937n4371o1186n1880r746K2088J696l0034n0829n8715
$$ 656187 685666 709409 690472 636101 574915 523035 513289 535377 537073 507039 456210 397495
5931C97495k6519L861m248n3315j14697j02836n633P3163Q5425N1772J4236L845
$$ 397495 370976 374837 370589 317274 202577 99741 94108 167271 252696 304468 318704 322549
5919C22549K5055N0344O6158O6317O9925N9557K5293J5412L1949M1493K9111j7601
$$ 322549 347604 397948 464106 530423 600348 659905 685198 700610 732559 774052 803163 785562
5907G85562o7173o3680q138L6044K9082j7170n9407n8310l4650j1973J0257j0254
$$ 785562 718389 654709 646571 682615 711697 694527 635120 576810 542160 530187 540444 530190
5895E30190o0237o7462m8271l9472l8171l0021L893N3725P6882O4121N6043O6652
$$ 530190 469953 402491 354220 314748 276577 246556 250449 304174 381056 445177 501220 567872
5883E67872N8759R075n0840o2416j3959K6520N516q3584j65929j89697j37758
$$ 567872 626631 635706 584866 522450 508491 535011 540527 456943 291014 101317 -36441
5872c6441l9597K0134K3134L9300P8711J12264J30427J17406P0631m201o0066
$$ -36441 -76038 -55904 -32770 6530 85241 197505 327932 445338 515969 511768 451702
5861D51702n6642k0633r573l1963m2321k9476J0530O2231N5198Q530j0434J2866
$$ 451702 395060 374427 364854 332891 290570 261094 271624 333855 389053 397583 387149 400015
5849D00015J4629l9184q3934o8415l1694j4793L809K2346L7162N1092M3241J4254
$$ 400015 414644 375460 291526 223111 191417 176624 180433 202779 239941 291033 334274 348528
5837C48528J338J6865L1333L2603J997l7351n6019o4537p6534p1903l7500n219
$$ 348528 349866 366731 398064 430667 432664 395313 339294 274757 198223 126320 88820 83601
5825H3601J0920J3908J0483r614k9831l2228k6793m697R280m2253j16663j30770
$$ 83601 94521 108429 118912 109298 79467 47239 20446 15749 25029 -17224 -133887 -264657
5813b64657q3275m9196n7721n9431l4301k287L3842O8982J02567J33710J26996
$$ -264657 -347932 -397128 -454849 -514280 -548581 -550868 -517026 -448044 -345477 -211767 -84771
5802h4771R8054P7151M0566q570m1733m9574k2255K4829L7866k016k7477J2882
$$ -84771 13283 90434 131000 122430 80697 31123 8868 33697 71563 69547 42070 54952
5790E4952O2575M6464k3452p9863j07524j26194j18274q6099n7035j3860N7585
$$ 54952 117527 163991 140539 60676 -46848 -173042 -291316 -377415 -434450 -448310 -390725
5779c90725J18770J23903J01294J13931J19496Q9656N9656J8705n8794j30370
$$ -390725 -271955 -148052 -46758 67173 186669 276325 335981 354686 295892 165522
5769A65522j20811n3632J6334N3232N0732O0440O1767J3754m9058p9061n6426
$$ 165522 44711 -8921 7413 60645 111377 171817 233584 247338 198280 119219 62793
5758F2793l0057k3102k7021k6635K4067R7677J18505Q7513M6184m507l3939M229
$$ 62793 32736 9634 -17387 -44022 -19955 77722 196227 283740 329924 325417 291478 295707
5746B95707O2499J09182J26007Q1438J9117j4631k2023r897J7375L2381L0196
$$ 295707 358206 467388 593395 674833 693950 679319 657296 647399 664774 697155 727351
5735G27351K5385O861k5065m1059o0026j02180j23822j25786j41796j32241p4900
$$ 727351 752736 759597 734532 693473 633447 531267 407445 281659 139863 7622 -67278
5724f7278n1720o7392k9087N0543R7599J09772Q7267L7030R132P924J5741M3745
$$ -67278 -118998 -186390 -215477 -164934 -67335 42437 129704 166734 175866 183790 199531 243276
5712B43276Q7127J05252J03769P7161J8036k8734m8267n0551o2438q4175q0722
$$ 243276 330403 435655 539424 616585 634621 605887 557620 507069 444631 360456 279734
5701B79734m6416J2837O0458N1756O380k3206j5847p909k1667l8602m1498l0191
$$ 279734 233318 246155 306613 358369 364749 341543 325696 317787 296120 257518 216020 185829
5689A85829l4818o4771q5354q1390p6789q4395p6095j0376P5997J03261P4703
$$ 185829 151011 86240 886 -80504 -157293 -241688 -317783 -328159 -252162 -148901 -74198
5678g4198K7333k3762l2184K4529P3222O7559M1764J9738j3457m3444l9101k5018
$$ -74198 -46865 -70627 -102811 -78282 -5060 62499 104263 124001 110544 67100 27999 2981
5666B981l0649l4334k2133n585L0377N8446J7019n2202n9047J0978P5428R1416
$$ 2981 -27668 -62002 -84135 -89720 -59343 -897 16122 -36080 -95127 -84149 -8721 82695
5654H2695J10449J36391J22939P0223J4190l0802m2117m1556m9088l0421O394
$$ 82695 193144 329535 452474 522697 536887 506085 463968 422412 373324 342903 349297
5643C49297L6906M4098K0460J7664N1396M8831l354n2594q8495j15529j33356
$$ 349297 386203 430301 450761 468425 519821 568652 565298 512704 424209 308680 175324
5632A75324j34043q8035j4343L6200N7415O0896K3940m0545p3352p0056o4175
$$ 175324 41281 -46754 -61097 -24897 32518 93414 117354 76809 3457 -66599 -130774
5621a30774n1396l4230j3090M209r450m0036m7697j4252K1794K6108K5775L9632
$$ -130774 -182170 -216400 -229490 -225281 -234731 -274767 -322464 -336716 -314922 -288814 -263039 -223407
5609b23407O5426P6889L9096j6021k3736L9504R7245O4505k1111p1680l9802L1237
$$ -223407 -157981 -81092 -41996 -58017 -81753 -42249 54996 119501 98390 26710 -13092 18145
5597A8145M7308J2425k9202o6112j06522j35974j13543n3466j839J6670N290j9972
$$ 18145 65453 77878 48676 -17436 -123958 -259932 -373475 -426941 -428780 -412110 -406820 -426792
5585d26792j4557M4734J03856J16943R2122Q6159J20920J04610K7559k1911l4035
$$ -426792 -441349 -396615 -292759 -175816 -83694 2465 123385 227995 255554 233643 199608
5574A99608k8935j3942m814j4493k3803k6760k0719n614l455J1855O4129R7612
$$ 199608 170673 156731 151917 137424 113621 86861 66142 60528 57073 68928 133057 230669
5562B30669M0008q3373j40749j04209o3193n3672o0599p1862r1833j01095p4868
$$ 230669 270677 187304 46555 -57654 -120847 -174519 -235118 -306980 -398813 -499908 -574776
5551e74776m5003l6846l0590k5667q068L0873P5106R6863J02626Q8834N8586L1953
$$ -574776 -619779 -656625 -687215 -712882 -720950 -690077 -614971 -518108 -415482 -326648 -268062 -236109
5539b36109l650l0468j3387L3492O2478Q6366J00385O6972l825n3905n3316m1061
$$ -236109 -239759 -270227 -283614 -250122 -187644 -101278 -893 66079 62254 8349 -44967 -86028
5527h6028l2107q633K0783L4630M5751M7486M7386P1621Q9390M9557L50M768J9553
$$ -86028 -118135 -126768 -105985 -71355 -25604 21882 69268 140889 230279 279836 280186 284954 304507
5514C04507J3106l4361j01340j01634l2107M5268R3442P5937J5650m0170q1511
$$ 304507 317613 283252 181912 80278 48171 93439 186881 262818 278468 238298 156787
5503A56787r5483p7133n5862n0317p8004r6485p0824k8410J9381P0568J03250
$$ 156787 61304 -15829 -71691 -122008 -200012 -296497 -367321 -395731 -376350 -305782 -202532
5492b02532J02879Q0952M7442J6535K2950M9650P1131O8182M4724L8847N1256
$$ -202532 -99653 -18701 28741 45276 68226 117876 189007 257189 301913 340760 392016
5481C92016K9382q351j5363l0478r2332j53543j56989r0761k794M3317N1208L6881
$$ 392016 421398 413047 397684 367206 274874 121331 -35658 -126419 -129213 -85896 -34688 2193
5469B193J6724J4698K5597O479k0803j9895J945K0500L2965N1021N3237J6651
$$ 2193 18917 33615 59212 65691 44888 24993 26938 47438 80403 131424 184661 201312
5457B01312k3339l8436l6787m3046m5066k7970j8075l3636k5615O620P019J5470
$$ 201312 177973 139537 102750 59704 14638 -13332 -31407 -65043 -90658 -84038 -77019 -61549
5445f1549M6488L5286o864k6516l3868m5599l6738k5222n9323j21651j32248o6929
$$ -61549 -15061 20225 13361 -13155 -47023 -92622 -129360 -154582 -213905 -335556 -467804 -534733
5433e34733L1173R3374Q7175O1478L2378j6323m0166l7827q277N8014J23617J62225
$$ -534733 -503560 -410186 -323011 -261533 -229155 -245478 -285644 -323471 -331748 -273734 -150117 12108
5421A2108J63192J23438N2916m157m7358n9139k0966k119j5892m7347p1635n7278
$$ 12108 175300 298738 351654 347497 300139 241000 220034 217915 202023 154676 83041 25763
5409B5763m9598n3971k8074N134j2765n0392l8744l889Q267R56q523k2687j3761
$$ 25763 -23835 -77806 -105880 -100746 -113511 -163903 -202647 -206536 -198269 -197313 -205836 -228523 -242284
5396b42284L7714P9229J00815J04933P9817L5324j5786l4660M969N2200O3096
$$ -242284 -204570 -125341 -24526 80407 160224 195548 179762 145102 150071 202271 265367
5385B65367M7967K1442j7509p1518r9430q7649n9884k8783j0176P399J1110K424
$$ 265367 313334 334776 317267 245749 146319 58670 -1214 -29997 -40173 -32774 -21664 -19240
5373a9240K7189P5810O0541N57q13M0078M9300L9465L1918J2035j3484m6060r7873
$$ -19240 7949 83759 144300 144857 144044 184122 233422 272887 304805 316840 303356 257296 159423
5360A59423j36206j35976j15812r5469q9711q9007o9928j5013O1943J00885R2839
$$ 159423 23217 -112759 -228571 -324040 -413751 -502758 -572686 -587699 -525756 -424871 -332032
5349c32032P7160Q2044R0412P3363M5642L7201K7700Q472k2700p0831r0559n9131
$$ -332032 -254872 -172828 -82416 -9053 36589 73790 101490 109962 87262 16431 -74128 -133259
5337a33259k8284k0865j655M2137Q0430Q4010N9024L4059J3792k107k445N016
$$ -133259 -161543 -182408 -184063 -141926 -61496 22514 81538 115597 129389 127282 124837 129853
5325A29853q767m6930o8567o2258l7782k3026k7830j4986K8052N1616K3042j4931
$$ 129853 121086 74156 5589 -56669 -94451 -117477 -145307 -160293 -132241 -80625 -57583 -72514
5313g2514j2397J3248L6068L0622J6129M518k8474m0817n91M9596M1101k753K920
$$ -72514 -84911 -71663 -35595 -4973 11156 15674 -12800 -53617 -54208 -4612 36489 33736 36656
5300C6656J2382k4867l0849Q700J8499p97M0062J37941J75546J22468N4669N72
$$ 36656 49038 24171 -6678 2022 20521 19724 59786 197727 373273 495741 550410 550982
5288E50982l9137m3788l1320m9636j05048j30431q0549M651N2296J2491n4467
$$ 550982 511845 468057 436737 387101 282053 151622 71073 75724 128020 140511 86044
5277H6044n5292J8737J00725J15393O7997L301m5992m0371j1842j9971n3168n8863
$$ 86044 30752 49489 150214 265607 333604 336905 290913 250542 238700 218729 165561 106698
5265A06698m8521k9993j0242j7641m4617p3494o9646n3187n3983n2057Q753R8080
$$ 106698 58177 28184 17942 301 -44316 -117810 -187456 -240643 -294626 -346683 -337930 -239850
5253b39850J27544O5809j3457l5586l0418m5235n8128k3138K9000N4253O4027
$$ -239850 -112306 -46497 -59954 -95540 -125958 -171193 -229321 -252459 -223459 -169206 -105179
5242a05179P0798L6726l6348o2045k8104L0411O9764N5976L8192K7045J8309L9399
$$ -105179 -34381 2345 -34003 -96048 -124152 -93741 -23977 31999 70191 97236 115545 154944
5230A54944P3951Q0705M1564k2433n3664l0153L1K6239N1129O3858N9800M3492
$$ 154944 228895 309600 351164 328731 275067 244914 244945 271184 322313 386171 445971 489463
5218D89463N7731J22185J55868J25283R0671N7506j8248j27759k07498j85112
$$ 489463 547194 669379 825247 950530 1041201 1098707 1080459 952700 745202 560090
5208E60090q9031M816N8554O8015M1675P691j8936m6222p0424o2234l7162j3532
$$ 560090 471059 475875 534429 602444 644119 651810 632874 586652 516228 453994 416832 403300
5196D03300N935k3689q2765r8201r5031r9079p9916k1665L6260M9651L7829J3080
$$ 403300 409235 385546 302781 204580 109549 10470 -69446 -91111 -54851 -5200 32629 45709
5184D5709p882r15K2146N8132P3229N8982O1262O5145N4687M5947L1877J9453
$$ 45709 37827 36912 59058 117190 190419 249401 310663 375808 430495 476442 508319 527772
5172E27772K6237L5535K0066j1861j5034p667k6732o4554q1970p1976n6070k7613
$$ 527772 554009 589544 609610 597749 582715 575048 548316 483762 401792 329816 273746 246133
5160B46133J9968N6727M0083K1963L3307K8709L902M728L4333M1646K3911J963
$$ 246133 266101 322828 362911 384874 418181 446890 450792 455520 489853 531499 555410 557373
5148E57373J877L4142O2132M5464j7838n2715l0757r538k9155m0141J7281R7875
$$ 557373 559250 593392 655524 700988 683150 630435 599678 590140 560985 520844 538125 636000
5136F36000J27714J10479J05147J15173J12779R4459L4717n4785r5258o0974j2647
$$ 636000 763714 874193 979340 1094513 1207292 1301751 1336468 1281683 1186425 1125451 1112804
5125A112804j5167m3332m0805l559M8741J08563J52509J45331J34806J60077J75638
$$ 1112804 1097637 1054305 1013500 1009941 1058682 1167245 1319754 1465085 1599891 1759968 1935606
5114A935606J69620J59900J54435J51369J90170K64611L07632K87173K53778K58945
$$ 1935606 2105226 2265126 2419561 2570930 2761100 3025711 3333343 3620516 3874294 4133239
5104D133239L12136M27490N53559O36578O96448P21780O98876O83841O91947O91074
$$ 4133239 4445375 4872865 5426424 6063002 6759450 7481230 8180106 8863947 9555894 10246968
5094A0246968O38686N32976L96172J77693j32830m24876o14657p08140p41465
$$ 10246968 10885654 11418630 11814802 11992495 11859665 11434789 10820132 10111992 9370527
5085I370527p65933p82008p64799o94740n81241m57583l80625l62461l31387k86101
$$ 9370527 8604594 7822586 7057787 6363047 5781806 5324223 4943598 4581137 4249750 3963649
5075C963649k73559l12284l58492l54523l03153k57168k31524k05129j71725j47285
$$ 3963649 3690090 3377806 3019314 2664791 2361638 2104470 1872946 1667817 1496092 1348807
5065A348807j39282j19366q1652m7033q969L9825R8919J26607P7526j7992r3040
$$ 1348807 1209525 1090159 1008507 961474 952505 992330 1091249 1217856 1295382 1277390 1184350
5054A184350r4001m3553l492K4422L6413N164m8269p1991p1578p3998o3916m1485
$$ 1184350 1090349 1046796 1043304 1067726 1104139 1109303 1061034 989043 917465 843467 779551 738066
5042G38066l7785m2896j9046p088j6266j4816q575j8356m6415o7525l9792J5112
$$ 738066 700281 657385 638339 631251 614985 600169 591594 573238 526823 459298 419506 434618
5030D34618M6053K2699j3806j6049m277j6490m9504n9769l4187j0404J0738L1687
$$ 434618 480671 503370 489564 473515 469238 452748 403244 343475 309288 298884 309622 341309
5018C41309K7211p012m2351p5079r8070q5823o5643q5015j06855p6858R73O1425
$$ 341309 368520 361508 319157 244078 146008 60185 -5458 -90473 -197328 -274186 -273213 -211788
5006b11788N4384K0328K1935M3168N6078O0569P5562Q5347M8642O809k4J3689
$$ -211788 -157404 -137076 -115141 -71973 -15895 44674 120236 205583 254225 261034 261010 274699
4994B74699L8697K4059m1713n9607o807M0554O1890O7128K8062k6575o1876r5101
$$ 274699 313396 337455 295742 236135 229328 269882 331772 398900 426962 400387 338511 243410
4982B43410j15891j09969r5610q6975q1767l7370K9585L7858J0341Q578L6355
$$ 243410 127519 17550 -78060 -165035 -246802 -284172 -254587 -216729 -206388 -197810 -161455
4971a61455N4235K4735l5794r0512j02705o9232k715O2208R3996Q7544N7795J8579
$$ -161455 -107220 -82485 -118279 -208791 -311496 -380728 -383443 -321235 -227239 -139695 -81900 -63321
4959f3321m149L142J4287J3725j8083o6923q8829o8746m0120m3440n7827m0195
$$ -63321 -67470 -64328 -50041 -36316 -54399 -121322 -210151 -278897 -319017 -362457 -420284 -460479
4947d60479J9528O7317M3885n545q70L2049M8204O4590Q6836P8445M6805K7583
$$ -460479 -440951 -373634 -329749 -335294 -336164 -304115 -255911 -191321 -104485 -26040 20765 48348
4935D8348J3868q91N610M1549Q0783P8735K8694l0726n2467l1349j3843l4436
$$ 48348 62216 61325 66935 108484 189267 268002 296696 265970 213503 182154 168311 133875
4923A33875n5168o801N6073O5778J7346o2222j32354j36519p6087j5584K1649
$$ 133875 78707 71906 127979 193757 211103 148881 16527 -119992 -196079 -211663 -190014
4912a90014K9482J5932K8821O1508P3616Q4077R0500O9442K7935j9167p0152j11952
$$ -190014 -160532 -144600 -115779 -54271 19345 103422 193922 263364 291299 272132 201980 90028
4900I0028j34969j20992p6651n4921l3667P640R693j6284k6840k1385q285j0248
$$ 90028 -44941 -165933 -242584 -297505 -331172 -323532 -313839 -330123 -356963 -378348 -386633 -396881
4888c96881k0394k7540k2065j0060J656K5565M6564N4708O0859P0137P9654Q0054
$$ -396881 -417275 -444815 -466880 -476940 -475284 -449719 -403155 -348447 -287588 -217451 -137797 -57743
4876e7743M8428o758m9828m6280o036M3183Q2396J17365J27607Q8060K8556r702
$$ -57743 -9315 -16073 -65901 -112181 -118217 -75034 7362 124727 252334 340394 368950 359248
4864C59248l7002o8844o8659m3822m5477m1307p375K018l0626q1242r4416n1423
$$ 359248 322246 253402 184743 140921 95444 54137 46762 48780 18154 -63088 -157504 -208927
4852b08927K1635Q9125J23736Q8893k3307j11275j05150n4507j0688J3184J0682
$$ -208927 -187292 -98167 25569 114462 91155 -20120 -125270 -179777 -190465 -177281 -166599
4841a66599M718R755N959l6397p9923q1497n1212J0366Q8171J47277J53645J18486
$$ -166599 -161881 -152126 -146167 -182564 -262487 -343984 -395196 -384830 -296659 -149382 4263 122749
4829A22749P3922M7878J2136n0031p3638k4022K3881L0328J8043j3215j8376p121
$$ 122749 196671 244549 256685 206654 133016 108994 132875 163203 181246 168031 149655 142534
4817A42534j1942k2354l7801o2448r9802j17072j06128p2974k546M5939L9432
$$ 142534 130592 108238 70437 7989 -91813 -208885 -315013 -387987 -390533 -344594 -305162
4806c05162J7457j4118k7493P365M0189M0129K4649J3401K1905K0332k107O588
$$ -305162 -287705 -301823 -329316 -321951 -281762 -241633 -216984 -203583 -181678 -161346 -163453 -156865
4794a56865L9274L7773m695n4906o6214n5993o6904q7981r5489p4484m4137k3554
$$ -156865 -117591 -79818 -84513 -139419 -205633 -261626 -328530 -416511 -512000 -586484 -630621 -654175
4782f54175O977N5282R9092J16481R2624N3549L4658M5499M1419o348o4207q2711
$$ -654175 -647198 -591916 -492824 -376343 -283719 -230170 -195512 -150013 -108594 -114942 -179149 -261860
4770b61860r4588r9447n5073K0248Q3710Q4488M9141L8609L8007J6598j7601j802
$$ -261860 -356448 -455895 -510968 -490720 -407010 -322522 -273381 -234772 -196765 -180167 -197768 -199570
4758a99570M3643L0555j5682m3934k1753M2192J00879J06726M2996k5641m5519
$$ -199570 -155927 -125372 -141054 -184988 -206741 -164549 -63670 43056 86052 60411 14892
4747A4892l0449J3508O4559O4043J5717k2409l2059j5528l43n309l368L730J7660
$$ 14892 -15557 -2049 62510 126553 142270 119861 87802 72274 71931 66622 63254 66984 84644
4734H4644M3180L7109N215J2386L2320j1248q9475j18506q4948k4213J1190N539
$$ 84644 127824 164933 170148 182534 214854 203606 114131 -4375 -89323 -113536 -102346 -96807
4722i6807J2904L7550K8475k7419q6608j09067j00470p6473l6521K6801O7686
$$ -96807 -83903 -46353 -17878 -45297 -131905 -240972 -341442 -417915 -454436 -427635 -359949
4711c59949P5952Q5748Q0293N9522J3973l3903o0179q6238j13828j26838j03675
$$ -359949 -283997 -198249 -117956 -58434 -44461 -78364 -138543 -224781 -338609 -465447 -569122
4700e69122p3242l1538K9443P9043P3825J6312l2139j6540O4145J32244J55338
$$ -569122 -642364 -673902 -644459 -565416 -491591 -475279 -507418 -523958 -459813 -327569 -172231
4689a72231J48034J00968Q780n8799l7372K4055L6711m107m3851k6875L0707N3263
$$ -172231 -24197 76771 85551 26752 -10620 13435 50146 46039 2188 -24687 6020 59283
4677E9283K9278j6331n8121o3271l2291m210J0366j293k4312j2178L446l612N524
$$ 59283 88561 72230 14109 -49162 -81453 -85663 -75297 -76590 -100902 -113080 -109634 -113246 -107722
4664a07722N0758O3484m410q1859q7929l4363J1429L4262N1304M5560K9868L6517
$$ -107722 -56964 6520 2110 -79749 -167678 -202041 -190612 -156350 -105046 -59486 -29618 6899
4652F899M2261M2628K6310J6981K0963k364m1727m8943j1262L2214N9090N7023
$$ 6899 49160 91788 118098 135079 156042 153678 111951 63008 51746 83960 143050 200073
4640B00073M4614O3183P3629K9531k9203p5358j30320j58287j04640j5235M3013
$$ 200073 244687 307870 381499 411030 381827 306469 176149 17862 -86778 -102013 -59000
$$ [...]
##END NTUPLES=NMR SPECTRUM
##END=
