##TITLE=1H_TG-KAP
 CDCl3, 8 sc, 
 28.1.2020
##JCAMPDX= 6.0         $$ Bruker NMR JCAMP-DX V2.0
##DATA TYPE= NMR FID
##DATA CLASS= NTUPLES
##ORIGIN= UXNMR, Bruker Analytische Messtechnik GmbH
##OWNER= root
$$ XWIN-NMR		Version 3.5
$$ Tue Jan 28 14:32:56 2020 Russian Standard Time (UT+4h)  she@DPX200
##.OBSERVE FREQUENCY= 200.1315
##.OBSERVE NUCLEUS= ^1H
##.DELAY= (6, 6)
##.ACQUISITION MODE= SIMULTANEOUS
##.ACQUISITION SCHEME= undefined
##.AVERAGES= 8
##.DIGITISER RES= 18
##SPECTROMETER/DATA SYSTEM= spect
##.PULSE SEQUENCE= zg30
##.SOLVENT NAME= CDCl3
##.SHIFT REFERENCE= (INTERNAL, CDCl3, 0, 15.7039)
##AUDIT TRAIL= $$ (NUMBER, WHEN, WHO, WHERE, WHAT)
$$ ##TITLE= Audit trail, XWIN-NMR		Version 3.5
$$ ##JCAMPDX= 5.01
$$ ##ORIGIN= Bruker BioSpin GmbH
$$ ##OWNER= she
$$ F:/spectra/data/she/nmr/H-F/1/audita.txt
$$ ##AUDIT TRAIL=  $$ (NUMBER, WHEN, WHO, WHERE, WHAT)
(   1,<2020-01-28 14:32:03.46 +0400>,<she>,<DPX200>,
      <created by zg, POWCHK disabled, PULCHK disabled
       configuration hash MD5:
       00 E9 B6 7A A2 85 ED C7 34 08 36 98 17 FE 4E 26
       data hash MD5: 16K
       5C BB F3 59 6A E1 85 01 D8 80 AD CE 47 C1 01 5D>)
$$ ##END=
$$ 
$$ hash MD5
$$ 98 58 08 4D D4 BB 5C 9A 0C 18 F1 8E 8F 8A EC DF
##$RELAX= 
##$RELAX= 
##$RELAX= 
##$RELAX= 
##$RELAX= 
##$RELAX= 
$$ Bruker specific parameters
$$ --------------------------
##$DU= <F:/spectra>
##$EXPNO= 1
##$NAME= <H-F>
##$PROCNO= 1
##$TYPE= <nmr>
##$USER= <she>
##$AMP= (0..31)
100 100 100 100 100 100 100 100 100 100 100 100 100 100 100 100 100 100 
100 100 100 100 100 100 100 100 100 100 100 100 100 100 
##$AQSEQ= 0
##$AQ_mod= 1
##$AUNM= <au_zg>
##$AUTOPOS= <>
##$BF1= 200.13
##$BF2= 200.13
##$BF3= 200.13
##$BF4= 200.13
##$BF5= 200.13
##$BF6= 200.13
##$BF7= 200.13
##$BF8= 200.13
##$BYTORDA= 1
##$CFDGTYP= 0
##$CFRGTYP= 5
##$CHEMSTR= <none>
##$CNST= (0..31)
1 1 145 1 1 1 1 1 1 1 1 1 1 1 1 1 1 1 1 1 1 1 1 1 1 1 1 1 1 1 1 1 
##$CPDPRG= <>
##$CPDPRG1= <>
##$CPDPRG2= <>
##$CPDPRG3= <>
##$CPDPRG4= <mlev>
##$CPDPRG5= <mlev>
##$CPDPRG6= <mlev>
##$CPDPRG7= <mlev>
##$CPDPRG8= <mlev>
##$CPDPRGB= <>
##$CPDPRGT= <>
##$D= (0..31)
0 1.2 0 0 0 0 0 0 0 0.06 0 0.03 0 0 0 0 0.0002 0 0 0 0 0 0 0 0 0 0 0 0 
0 0 0 
##$DATE= 1580207522
##$DBL= (0..7)
120 120 120 120 120 120 120 120 
##$DBP= (0..7)
150 150 150 150 150 150 150 150 
##$DBP07= 0
##$DBPNAM0= <>
##$DBPNAM1= <>
##$DBPNAM2= <>
##$DBPNAM3= <>
##$DBPNAM4= <>
##$DBPNAM5= <>
##$DBPNAM6= <>
##$DBPNAM7= <>
##$DBPOAL= (0..7)
0.5 0.5 0.5 0.5 0.5 0.5 0.5 0.5 
##$DBPOFFS= (0..7)
0 0 0 0 0 0 0 0 
##$DE= 6
##$DECBNUC= <off>
##$DECIM= 24
##$DECNUC= <off>
##$DECSTAT= 4
##$DIGMOD= 1
##$DIGTYP= 9
##$DL= (0..7)
0 120 120 120 120 120 120 120 
##$DP= (0..7)
150 150 150 150 150 150 150 150 
##$DP07= 0
##$DPNAME0= <>
##$DPNAME1= <>
##$DPNAME2= <>
##$DPNAME3= <>
##$DPNAME4= <>
##$DPNAME5= <>
##$DPNAME6= <>
##$DPNAME7= <>
##$DPOAL= (0..7)
0.5 0.5 0.5 0.5 0.5 0.5 0.5 0.5 
##$DPOFFS= (0..7)
0 0 0 0 0 0 0 0 
##$DQDMODE= 0
##$DR= 18
##$DS= 0
##$DSLIST= <SSSSSSSSSSSSSSS>
$$ [...]
##$SUBNAM2= <"">
##$SUBNAM3= <"">
##$SUBNAM4= <"">
##$SUBNAM5= <"">
##$SUBNAM6= <"">
##$SUBNAM7= <"">
##$SUBNAM8= <"">
##$SUBNAM9= <"">
##$SW= 24.9337058887773
##$SWIBOX= (0..15)
0 0 2 0 0 0 0 0 0 0 0 0 0 0 0 0 
##$SW_h= 4990.01996007984
##$TD= 16384
##$TD0= 1
##$TE= 0
##$TE2= 300
##$TE3= 300
##$TEG= 300
##$TL= (0..7)
0 120 120 120 120 120 120 120 
##$TP= (0..7)
150 150 150 150 150 150 150 150 
##$TP07= 0
##$TPNAME0= <>
##$TPNAME1= <>
##$TPNAME2= <>
##$TPNAME3= <>
##$TPNAME4= <>
##$TPNAME5= <>
##$TPNAME6= <>
##$TPNAME7= <>
##$TPOAL= (0..7)
0.5 0.5 0.5 0.5 0.5 0.5 0.5 0.5 
##$TPOFFS= (0..7)
0 0 0 0 0 0 0 0 
##$TUNHIN= 0
##$TUNHOUT= 0
##$TUNXOUT= 0
##$USERA1= <user>
##$USERA2= <user>
##$USERA3= <user>
##$USERA4= <user>
##$USERA5= <user>
##$V9= 5
##$VALIST= <valist>
##$VCLIST= <CCCCCCCCCCCCCCC>
##$VD= 0
##$VDLIST= <DDDDDDDDDDDDDDD>
##$VPLIST= <PPPPPPPPPPPPPPP>
##$VTLIST= <TTTTTTTTTTTTTTT>
##$WBST= 1024
##$WBSW= 4
##$XGAIN= (0..3)
0 0 0 0 
##$XL= 0
##$YL= 0
##$YMAX_a= 279755
##$YMIN_a= -185148
##$ZGOPTNS= <>
##$ZL1= 120
##$ZL2= 120
##$ZL3= 120
##$ZL4= 120
##$ABSF1= 10
##$ABSF2= 0
##$ABSG= 5
##$ABSL= 3
##$ALPHA= 0
##$AQORDER= 0
##$ASSFAC= 0
##$ASSFACI= 0
##$ASSFACX= 0
##$ASSWID= 0
##$AUNMP= <proc_1d>
##$AZFE= 0.1
##$AZFW= 0.1
##$BCFW= 1
##$BC_mod= 2
##$BYTORDP= 1
##$COROFFS= 0
##$CY= 11.3945322036743
##$DATMOD= 1
##$DC= 2
##$DFILT= <>
##$DTYPP= 0
##$F1P= 16.9975609425685
##$F2P= -3.02152046262296
##$FCOR= 0.5
##$FTSIZE= 0
##$FT_mod= 4
##$GAMMA= 1
##$GB= 0.15
##$INTBC= 1
##$INTSCL= 1
##$ISEN= 128
##$LB= 0.24
##$LEV0= 0
##$LPBIN= 0
##$MAXI= 10000
##$MC2= 0
##$MEAN= 0
##$ME_mod= 0
##$MI= 1.114404
##$NCOEF= 0
##$NC_proc= 0
##$NLEV= 6
##$NOISF1= 3.799351
##$NOISF2= 2.8
##$NSP= 1
##$NTH_PI= 0
##$NZP= 0
##$OFFSET= 15.70392
##$PC= 1
##$PHC0= -9791.932
##$PHC1= 22.80081
##$PH_mod= 1
##$PKNL= yes
##$PPARMOD= 0
##$PSCAL= 0
##$PSIGN= 0
##$REVERSE= no
##$SF= 200.130013532006
##$SI= 16384
##$SIGF1= 3
##$SIGF2= 2
##$SINO= 400
##$SIOLD= 16384
##$SREGLST= <1H.CDCl3>
##$SSB= 0
##$STSI= 0
##$STSR= 0
##$SW_p= 3612.71676300578
##$SYMM= 0
##$S_DEV= 0
##$TDeff= 0
##$TDoff= 0
##$TI= <>
##$TILT= no
##$TM1= 0
##$TM2= 0
##$TOPLEV= 0
##$USERP1= <user>
##$USERP2= <user>
##$USERP3= <user>
##$USERP4= <user>
##$USERP5= <user>
##$WDW= 1
##$XDIM= 8192
##$YMAX_p= 0
##$YMIN_p= 0
$$ End of Bruker specific parameters
$$ ---------------------------------
##NTUPLES= NMR FID
##VAR_NAME=  TIME,          FID/REAL,        FID/IMAG
##SYMBOL=    X,             R,               I
##VAR_TYPE=  INDEPENDENT,   DEPENDENT,       DEPENDENT
##VAR_FORM=  AFFN,          ASDF,            ASDF
##VAR_DIM=   8192,          8192,            8192
##UNITS=     SECONDS,       ARBITRARY UNITS, ARBITRARY UNITS
##FACTOR=    0.0002004,     1,               1
##FIRST=     0,             0,               0
##LAST=      1.6414764,     0,               0
##MIN=       0,             -185148,         0
##MAX=       1.6414764,     279755,          0
$$ Real data points
##PAGE= N=1
##DATA TABLE= (X++(R..R)), XYDATA
0@%%%%%%%Pj5J6j6J6k3L1l8M6n3O1p2Q7j02J19j38J61j88K14k42K79l19L60m06
31b15M57n13N74o43P18p97Q88r88J094j215J345j487J648j825K022k244K496k782
49a467L111l498L956m509N193o064P221q841J1293j5485K4573q1394R6233J44345
63A74667j59595j84029j6191J84452J24505n7888j51248j8962J20846J00902n4876
74F2583j10081q184J18637Q4179n8625j28294j7993J14193J03099l8718j21749
85i53o0002O3872R5467J1522p5737o0398J2910M3673P961k6299j6741J1350R684
98A6309j8720k7193P268L6071J4752k7704l2479K608K8794J7506q404j2907O539
111B440R733j2879k0652J2470M4502K1212l7955o2268j2095O4517O7923j6242
$$ y = [0, 0, 0, 0, 0, 0, 0, 0, 7, -8, 8, -8, 8, -15, 16, -22, 24, -29, 32, -40, 47, -55, 64, -74, 87, -101, 113, -129, 150, -169, 191, -215, 242, -271, 303, -340, 378, -419, 469, -519, 575, -640, 705, -782, 866, -959, 1063, -1181, 1315, -1467, 1644, -1854, 2102, -2407, 2786, -3278, 3943, -4898, 6395, -9090, 15483, -65911, 30322, 174667, 15072, -168957, -185148, -696, 123809, 65921, -85327, -104289, 16557, 117459, 62583, -47498, -55682, 62955, 147134, 88509, -39785, -57778, 56415, 159514, 120796, -953, -60955, 2917, 98384, 109906, 34169, -26229, -13319, 30354, 38315, 12016, -4725, 6625, 16309, -2411, -29604, -22336, 13735, 28487, 783, -31696, -29088, -294, 17212, 8808, -4099, 2440, 12173, -706, -21358, -8888, 35614, 56826, 18871, -43397, -55492, 9025, 76948, 60706]
123F0706q6657n2382M2388P7680J6985o0345n9747J2531N9366K0330m3426m1861
135e4432J8732N2394J1785n0038m8901K2738P4217L2602n1324p2866n488O8103
147b478O4345q712o7547m5179K6159O0297K6036k7430m0527r175K7701K7455m880
160B6065k3592p433J6307J6970m936k3727j3582K0786L7274O716l9431m3727M732
173b7578N5567M8215j8853p2407m2436L9392P4450K1080n5545o5866L08O1987
185A8314M1262l1810n9979q112M9298L4168l1016n5841l078N9808M3275l8122
197A8167p5436j4480O8450O9286j5006q0722m7511M4193P8617J6685n5693m9437
209d2887J6106N0852J8470l0524k9367J5759L5232l52l7110j9331K7336L8924
$$ y = [60706, -25951, -78333, -35945, 41735, 58720, -1625, -61372, -48841, 10525, 30855, -12571, -54432, -35700, 16694, 28479, -21559, -70460, -47722, 26495, 59097, 7773, -65093, -70581, -2478, 61867, 53155, -14392, -59571, -33412, 26885, 52921, 25491, -15036, -24211, 3490, 30945, 26065, 2473, -4960, 11347, 28317, 23381, -346, -13928, 6858, 44132, 50848, 11417, -32310, -27578, 27989, 76204, 57351, -15056, -57492, -18100, 56350, 77430, 21885, -43981, -43673, 18314, 59576, 27766, -32213, -40325, 8973, 43141, 12125, -43716, -46794, 13014, 56289, 18167, -57269, -71749, -3299, 65987, 50981, -29741, -77252, -33059, 45558, 62243, 6550, -42887, -26781, 24071, 42541, 12017, -17350, -1591, 33641, 33289, -3821, -23152, 4184, 43108]
221D3108j193m2928l2785J7162M2552J1930k8230k8053P99J6568M263p979k70
234e056J2849J15k6999k2495J9375M4875J2325m0653m6526O807N5382L5048k9965
247A5082n4065m763M8649L3695k5834m5963J846N1400K9727m0407n9543O310P3780
260B9914M5861m4424q3256j7299P3964P4903j9386q7607m3723N2001P5261L017
272E9226o6306m5714L3820O2394L585n9346l7171L7139O1318R94o3454m7851L1890
285b9476P3268K1182n8073o3670O930O2751M0257k6400n4866j5547L4747L2981
297B4084q627k8562q322J7500J3334j0261j8345Q25K1559J1912j4832k3156k781
310b5672J7283J6735L88j4115j3812j469O675Q236Q094K032j2563j7952l740J6967
$$ y = [43108, 41915, -1013, -33798, -16636, 25916, 37846, 9616, -18437, -17638, -1070, 3193, -4786, -5056, 7793, 7908, -19091, -41586, -22211, 22664, 34989, -5664, -52190, -45383, 9999, 45047, 15082, -38983, -43746, 4903, 38598, 12764, -33199, -31353, 20047, 49774, 9367, -50176, -43866, 29914, 75775, 31351, -51905, -69204, 4760, 79663, 60277, -27330, -71053, -19052, 56209, 59226, -7080, -52794, -18974, 43420, 47005, -12341, -49512, -12373, 48945, 49939, -13515, -61366, -29476, 43792, 64974, 6901, -56769, -49839, 12912, 53169, 26769, -28097, -43644, -8897, 24084, 15457, -13105, -21427, -3927, 9407, -854, -19199, -18374, 3185, 15097, 265, -22891, -25672, -8389, 8346, 8734, -5381, -19193, -20662, -13987, -5751, 2343, 4375, -8188, -26140, -29880, -12913]
324a2913K0927K105k1175k2093L641K4538J4306j0356j8467l874J3666J0068o307
337e934j1466N099J7359M025j8353j7595Q251K8522J7566j6287l1969r363K5273
350d872L0504K712k3892k2241K076K2700J6251m966j5604o929M508P745L938k126
364I804l721L95L096r99n027l960L191J0015P300p935j9854r585J5523K6082O511
379C0836k4733l2065j357L4093K9002j2209l9516j8435K2973L3720J856l2380
391h215k1898J7275L0513j002l2415j8017K2793L6502o62m2744l1685K4515N2389
404B7349J3765m2969m6291O882N0626L1569k5383m6545p246L6857K8853j4524
416A2943l2951n338K7980K1438j7161l2527M53L4291K2399j9869l7267p626L2419
$$ y = [-12913, 8014, 10119, -11056, -33149, -29508, -4970, 9336, -1020, -19487, -23361, -9695, 373, -5934, -17400, -12301, 5058, 9083, -9270, -26865, -18614, 9908, 27474, 11187, -20782, -30145, -4872, 25632, 28344, 4452, -17789, -15713, 6987, 23238, 18272, 2668, -4261, 247, 7992, 11930, 9804, 6083, 6478, 9574, 8575, 3548, -412, 2779, 12794, 20094, 12159, -7695, -17280, -1757, 24325, 30836, 6103, -25962, -27319, 6774, 35776, 23567, -15949, -34384, -11411, 22309, 24165, -8215, -30113, -12838, 17675, 16673, -15742, -33759, -10966, 25536, 24874, -17870, -49555, -25040, 27349, 41114, -1855, -48146, -41264, 9362, 40931, 15548, -30997, -38243, -1386, 27467, 12943, -20008, -25346, 2634, 24072, 6911, -25616, -25163, 9128, 31527, 11658, -25609, -33235, -816]
429h16L0746q255l4262j5794J9138K3152p66j7724p393J0608R042q737j3358P008
443g411K0299M583k0940k0025Q996K8173J2601j9691k5330K893K5379J2275j5656
456F146j7045P356K1232K861k2564j6481J7802L3319K956l6142k8577J7001M3091
469C0955J6926l3004m0546K842M1629K4794k1872l7079l726L0823K2255j7621
481A6376l2794j692L3099K0714k2510l7317l431L6212L0143j5615m3203j6874
493c6892K8934L6738q66l3268k3252J1953K8789P758j9479j7482P050J7865K791
506A0639j4649j0376Q704J7439K183j7024j4420O403J8531Q936q626j6233o069
519a4562Q547J2690L841n919q103m808J321O611O612J03o529o967k47O389O517
$$ y = [-816, 29930, 21675, -12587, -28381, -9243, 13909, 13143, -4581, -11974, -1366, 7676, -1061, -14419, -7411, 12888, 17471, -3469, -23494, -14498, 13675, 26276, 6585, -18745, -15852, 9527, 21802, 6146, -10899, -3543, 17689, 20550, -2014, -18495, -693, 32626, 35582, -560, -29137, -12136, 30955, 47881, 14877, -25669, -22827, 18802, 43596, 21724, -15355, -19081, 11742, 33997, 16376, -16418, -18110, 14989, 35703, 13193, -24124, -27555, 8657, 38800, 23185, -20018, -36892, -7958, 28780, 27914, -5354, -28606, -16653, 12136, 19894, 415, -17067, -10017, 7848, 10639, -4010, -14386, -5682, 11757, 13940, -3084, -17504, -11101, 7430, 16366, 7740, -8493, -14562, -6015, 6675, 10516, 4597, -3506, -8314, -6993, -382, 6230, 6333, -196, -7163, -7410, -1021, 5496]
534E496j124o375j521L810J368l214j759L847P854Q86r223r993M038J6143Q973
549A9206q199j5911n283J1673J5259J494j1974r587L034Q079L798k774l026k08
563E581N88l051l088K725N963m3o015o421j013M136L546j115l770j472j718m604
579i771j486O802Q462k665j4656j0821O918J9045Q263j4603k0692K04J9666J4859
593I525q425j8686m197J6799J4545q593j9041m12K1434J5007j2741k5638l568
606b3991K6901K4927r720l2952j3902K3503L1255L31k9733k0446J4194K8739M802
619B3908k4092j7847J1824K3660J940k3158j6361J3734K6960K525k6767k1423
631b5097J1900K9020J0296k1513k4951K933K4651J2682j3532j7828Q39J5599O702
$$ y = [5496, 4372, -2003, -3524, 286, 1654, -1560, -3319, 528, 8382, 9268, 45, -9948, -5910, 10233, 19206, 11007, -4904, -10187, 1486, 16745, 18239, 6265, -3322, -288, 7791, 11589, 8815, 5789, 5581, 6169, 3118, 30, 2755, 8718, 8675, 2660, -3761, -4774, -638, 2908, 1793, -1977, -3449, -5167, -9771, -11257, -4455, 4007, 1342, -13314, -24135, -17217, 1828, 10091, -4512, -25204, -25000, -5334, 9525, 1100, -17586, -21783, -4984, 9561, 968, -18073, -18485, 2949, 17956, 5215, -20423, -23991, 2910, 27837, 18117, -14835, -28737, -5234, 26021, 26352, -3381, -23827, -9633, 19106, 23908, -184, -18031, -6207, 17453, 19393, -3765, -20126, -6392, 20568, 23093, -3674, -25097, -13197, 15823, 26119, 4606, -20345, -17412, 7239, 19921, 6389, -11439, -10600, 4999, 11701]
644A1701j0372j1646N595J5704J601j5827j1986R355J8150L895j5964j5488M611
657a0671J7643N636j2302j1611M581J1139r4j1710o086J0152J2987m848j9371
670a4555q042J5552J9411k027k2052j4738J1341K2307M296j8188j5281P730J8049
683C803L817j4794j1517Q810J8040J493j8060j2549J1448K1864M620j8426j8254
696a9705N151K3112J1862j3261j8873j730J5392J2129n067j3732l320R734Q458
709A0150n648j0176l91R271O406n533j1367k995Q871J0212j489j0038p543K132
723h138Q316N534k174o993l850J894M901L205m4l213l548J131L341J969l12j229
739G90M2J654O37k547k016L697O559P94o520p065J278R589P312m626j1284l515
$$ y = [11701, 1329, -10317, -4722, 10982, 12583, -3244, -15230, -5875, 12275, 16170, 206, -15282, -10671, 6972, 12608, 306, -11305, -6724, 4415, 4321, -7389, -13475, -3323, 9664, 4816, -14555, -22597, -7045, 12366, 10339, -11713, -26451, -15110, 7197, 11493, -6695, -21976, -14246, 3803, 7620, -7174, -18691, -9881, 8159, 9652, -8408, -20957, -9509, 12355, 16975, -1451, -19705, -14554, 8558, 20420, 7159, -11714, -13444, 1948, 14077, 9010, -4722, -8042, 1692, 10150, 4502, -5674, -6065, 3206, 9612, 4079, -7288, -10283, -1412, 8800, 7311, -2727, -10270, -8138, 178, 5712, 3538, -3455, -7305, -5411, -510, 2695, 2651, -562, -4110, -2979, 362, 2331, 2019, 790, 832, 2486, 3123, 576, -1440, 2257, 8816, 9610, 3090, -3975, -2697, 6892, 14204, 9578, -1706, -5221]
755e221P417R000r5q081o041K595O582N73n765k088M306L052l594o933n62P399
771B544O262m031r833l094P155P129j389p133k951L748M498k209m092K133N677
786D414J20q125n538O072J1185K379j1165j0929L698J4077N924r530j1479J251
800g646J2068N670q735j1023M043J3569L433j3000j2141N924J7507O695j4414
813A950j8481K653K0252J2090j1354j9862k231J6865J4090p186j7476l506J5436
826C240J1884q105j5858k081J6005J3243q213j9538m438J7082J6267m958j9148
839d618q724J2072J6294n05j5707q671Q582J2347r36j2038n446Q084R711k751
853G694j3191m878J0305J1426l169j3215p007Q035J1519L4j0732o319N800P475
$$ y = [-5221, 2196, 11196, 11101, 3020, -3021, -426, 6156, 6729, 964, -1124, 3182, 6234, 2640, -4293, -4855, 2544, 8806, 4775, -5058, -8152, -997, 6132, 4743, -2390, -5341, -1593, 2905, 696, -3396, -1263, 4414, 4534, -3591, -9129, -3057, 8128, 10507, -658, -11587, -7889, 6188, 12112, 2582, -8897, -7646, 4422, 10092, 1357, -9666, -5623, 7946, 11379, -1621, -13762, -7838, 9669, 16364, 1950, -16531, -13878, 6374, 18464, 7110, -12752, -14983, 1882, 15972, 8786, -8690, -12196, 3240, 15124, 7019, -8839, -10920, 5085, 18328, 10115, -9423, -13861, 3221, 19488, 14530, -4618, -13342, -1270, 15024, 14519, -1188, -9859, -1277, 11070, 10134, -1904, -7350, 734, 10445, 7694, -5497, -10375, -70, 11356, 8187, -5028, -12035, -4000, 7519, 7553, -3179, -9498, -3698, 3777]
867C777r76p144k431O270N620m127r108p98J0085P392n348j1173k449R023J0054
882H667k332j0308m910P696Q057k039p793k225O542O176l555q814j289Q728P893
897A0494m144j0936m043Q362R663l87j0230o542M629Q608J385n861m888J300N340
912B750J161m287l136K362M744om816l554J792N190K404l282n047j405L147L877
928A894J202k538l809j768K779L286J048k586k974p01K402K682j145l047k16K347
944a144J332j432l592J05M307L479l095o816j407N792O561j014p407n271L552
959f050Q738J624o338n575K039N807J754m341m024K448O441k90o481m262M947
974c563P415P08p052o720L403Q731K609o379n918J920O562K385m808m464K981
$$ y = [3777, 2801, -4343, -6774, -504, 5116, 989, -8119, -8917, 1168, 8560, 3212, -7961, -10410, -1387, 8667, 6335, -3973, -8883, -1187, 6870, 4831, -2962, -5187, 1355, 7531, 3976, -4838, -6127, 2601, 10494, 6350, -4586, -8629, -267, 9396, 9009, -1221, -7763, -3134, 5474, 6859, 998, -3890, -2590, 2750, 3911, -376, -3512, -1150, 3594, 3588, -1228, -4782, -2990, 2200, 4604, 1322, -3725, -5130, -1983, 1894, 3096, 558, -3251, -5019, -2240, 1046, 2094, -492, -3466, -4167, -1765, 917, -228, -3275, -3491, -1144, 188, -1244, -4836, -4731, -424, 3055, -40, -6856, -8263, -2471, 4090, 3076, -4331, -9602, -6050, 2688, 4312, -2026, -7601, -5562, 245, 1999, -2342, -6366, -3918, 2523, 2233, -4248, -8510, -3563, 3852, 4560, -2492, -9212, -5809, 2922, 5531, -848, -6766, -4846, 1716, 4101, -707, -5171, -2190]
989b190O029j19o634l543N059P745r66p792n859N152R360J475q748o418M383Q467
1005E401J655p788n674M602Q553J45r722m722O766R624m92j1035p341O274J2682
1020H928J977j1253r683M925J1639L437q810r400K974J0844L649r327q150L580
1034d670J0997L186r315j0013L094J2454N352r277j1119J033J1288O970o372j0584
1048f976j076R563O015n178q437kP477M668m866q176n3R010N417n512q774r88
1064g888P768O444l336p644k134N762N139k206n525n93M834K845l019m276O32
1079c197N477K738l917n476O74O224L368k977n211p08M831L343k087l968PL236
1095B357J730k203l071O98M250J466l362m145N09M860K311j934m776j151L045
$$ y = [-2190, 3839, 3720, -2914, -6457, -1398, 6347, 5381, -2411, -8270, -3118, 6242, 7717, -1031, -7449, -3066, 5401, 7056, -732, -6406, -1804, 6749, 6894, -2828, -7550, -784, 8840, 8348, -2687, -10028, -3754, 8928, 10905, -348, -10031, -5106, 6533, 9970, 1160, -8240, -5266, 5578, 9227, -100, -8250, -4670, 6327, 9513, 198, -9815, -6721, 5733, 11085, 1808, -9311, -8278, 3010, 9980, 3608, -6976, -8052, 1511, 7526, 2348, -6089, -6091, 1386, 6054, 1188, -6988, -7041, 1969, 7386, 1874, -6900, -7888, -120, 6324, 2988, -4656, -6790, -1028, 4111, 1905, -3620, -4213, 621, 3466, 447, -3829, -3197, 2280, 5018, 1101, -4375, -3701, 2523, 5891, 2914, -2297, -3005, 1826, 5169, 3082, -886, -879, 2357, 4087, 1884, -1187, -489, 3761, 5227, 1865, -2280, -1771, 3089, 5400, 3466, -1310, -2461, 584]
1110E84L530q53l211j015J448J603n33j209p66R17J228p00j907Q2J183J540N6
1127A977j544j885L27J918J280K66j718j740n73K458K218k89k421j634P99K495
1143A934J189k077j629L06K703N11k314j788J126L342R87l511m042J693N406J887
1159E723l684n497j25N304M165k291o034r60M414L630j832m808j103M461L663
1174E026k462n859l85N478M103k540o818j669N410N695j594o749l070M853N376
1189D795j474n462k209M051M702j780o081j259M858M861k850o757j615N300N860
1204D940k039p044k699N123N487j109o364k441M619N178j763o232k134N805N317
1219D644k681o866j888N985O403j580p811l326N663O542p25p016l534M606O237
$$ y = [584, 4114, 3261, 50, -965, 483, 2086, 1553, 344, -422, 495, 1723, 1023, -884, -802, 381, 1921, 1977, 433, -1452, -1125, 793, 2073, 2339, 621, -1119, -1692, 766, 2984, 2695, 274, -1360, -561, 1934, 3123, 1046, -583, -277, 2426, 2937, 623, -1165, -39, 3303, 4290, 779, -3263, -1570, 3836, 5723, 2039, -3458, -3583, 1721, 5886, 3595, -2439, -3399, 1015, 4645, 2813, -1995, -3098, 1363, 5026, 2564, -3295, -3680, 1798, 5901, 3361, -3457, -5126, 284, 5979, 4385, -2364, -5434, -581, 4795, 3321, -2141, -4350, -299, 4403, 2623, -3458, -4717, 141, 5002, 2152, -4605, -6220, -920, 4940, 2901, -4143, -6842, -1719, 3768, 2659, -3705, -6146, -1527, 3651, 1888, -4344, -6478, -673, 4644, 1963, -4903, -6791, -806, 5597, 4017, -3794, -7120, -1457, 5085, 4360, -2656, -6190, -1584, 4653]
1234D653n23o649l318N187O221j264o977l582M976O707k83p440m631M397P206
1249D680P56o762m679K529O490J333n536m273K423N472O12m741l733K682N585
1264B838Q20n083m660K528N945J315l977m305Q13M633K376k881l564P36L867O78
1280B079k110k675Q86L510Q18k723k769J236L704O83k447k438L63K277J605r99
1296A000k491M54J380N09j104j007P02J397k66j190j285R49J654L32j538j068
1312a572K19J207P31m83j249j3M82j30K86J17K8k31l52k97O36L18j66l17j80K74
1332f92k70l12J94Q10M8l87j145q02J663J622l16k397j146J383K376J00k012j587
1350b870J433K238K53k338j522J821K595k39k767j693K351L678K33l999k815K115
$$ y = [4653, 4130, -2519, -5837, -650, 5571, 4307, -2670, -6252, -1276, 5431, 5148, -2292, -6923, -2526, 4680, 5436, -1326, -6005, -3476, 3014, 4347, -1189, -5462, -3039, 2433, 3045, -1696, -5429, -2747, 2838, 3658, -1425, -6085, -3557, 2388, 3703, -274, -4579, -3766, 867, 3243, 362, -3202, -2466, 1401, 2079, -31, -2706, -1820, 1690, 2508, -215, -2984, -1748, 1956, 2639, 192, -2246, -1883, 394, 1999, 1000, -1491, -1037, 343, 852, -252, -1259, -557, 840, 574, -616, -1901, -952, 702, 1034, -504, -1572, -1353, -146, 585, 102, -1147, -1160, -678, -808, -522, -405, -377, -608, -960, -1257, -621, -303, -469, -786, -966, -692, -962, -1274, -1080, -270, -222, -609, -1754, -2556, -893, 729, 413, -1984, -3130, -1747, 629, 729, -1283, -2870, -1437, 801, 1054, -1284, -2806, -985, 1610, 1371, -1396, -3089, -738, 2940, 3173, -826, -3641, -1526]
1366a526M653R49l778l526J437M481J718l634l218J355M015J361l397l769J337
1381a542N037J470m208l888J300N252K480l737n490O13N409K696l223n040O02
1396b269M743K319l367m227L47N108K649m298m641Q68N424K665l672n199P9N538
1412B067L223l482n017J17N046K566k601m662L4M961K590l172n066P38M995K493
1428D830k778n131k53M888L628k608n296j07L955L539j948m805n93L901L351k871
1444A702m225q2L979L025k087m401j066L679L893j745m542j309L591L168j351
1459B229l707j161K894L208j558l568j156K933K955j095l467j557K966L104p56
1474B264l729j252K191K475j34k393j905J354K729k88k238r43J530J794m97j736
$$ y = [-1526, 3127, 4076, 298, -3228, -1791, 2690, 4408, 774, -2444, -1089, 2926, 4287, 890, -2879, -1542, 3495, 4965, 757, -3131, -1831, 3421, 5901, 2164, -3326, -2713, 2696, 5392, 2169, -2871, -2269, 2474, 4793, 1426, -2801, -2454, 2654, 5303, 1005, -3636, -2768, 2656, 5321, 1649, -3550, -3471, 2067, 5290, 1808, -3209, -3092, 1954, 4520, 1919, -2743, -2709, 2252, 4842, 1670, -3396, -2658, 2337, 4830, 2052, -3079, -3332, 1556, 5184, 2576, -2720, -2827, 1128, 4667, 2719, -2086, -2679, 1222, 4573, 1702, -2523, -2605, 1374, 4399, 2312, -2089, -3155, 524, 4417, 2672, -1870, -3179, 412, 3580, 2229, -1478, -2639, 255, 3463, 1905, -1663, -2819, 114, 3069, 1974, -1493, -3050, -84, 3020, 2264, -1465, -2717, -526, 1949, 1815, -578, -2483, -1129, 1600, 1312, -926, -1869, -339, 1455, 958, -778]
1490g78j201J351K147j80k087p33R32J454N03j029j241K85J361N7p47l11K15J33
1508A31L07m8k64k4M08k44j77L21j04o4L54K31l27n10l18L51J019L29r02j070
1528f01N5J146O28o73j180L3P21J198o99j755J84J482P07j142j279Q5J458J446
1546A814j107k380j33K021J807j425k211n54J764K340j072k628m42K287J668j049
1562G00k729l13K132K232q52l482r92L086K542j096l368j370K472L321n06l720
1578a943j448K409L059q54l218j664K806L063o27m211j612K732L683k87m039k149
1594d300K312L951p1l961k191K506L460j71l400k064K158L693j11l705k367K622
1610a639M215m47l547k569J828M183N35l731k767J561M155N98l407k240J606L539
$$ y = [-778, -1979, -628, 1519, 1339, -748, -1481, -549, 905, 1408, 379, -862, -577, 784, 841, 94, -217, -2, 131, 438, 390, 126, 102, 510, 266, 89, 410, 306, 242, 596, 827, 500, -10, -328, 23, 1042, 1371, 469, -601, -546, 600, 1228, 555, -625, -592, 129, 1327, 628, -1127, -943, 539, 1246, 104, -1175, -1090, 368, 1814, 707, -1673, -1806, 215, 2022, 597, -1614, -2168, -404, 1936, 864, -1764, -2206, 81, 1749, 700, -2029, -2342, -210, 2022, 1170, -2312, -3304, -218, 2324, 1228, -2140, -3510, -1038, 2283, 1777, -1943, -3391, -982, 2077, 1223, -1995, -3659, -853, 2210, 1583, -2628, -4240, -1508, 2175, 1888, -2151, -4300, -1988, 1963, 1892, -2069, -4260, -1754, 1706, 1535, -1865, -3929, -1771, 1922, 1811, -1894, -4261, -1639, 2576, 2129, -1418, -3987, -2159, 2024, 2559, -1172, -3939, -2378, 1777, 2375, -1032, -3272, -1666, 1873]
1626A873L77l337k275J960L160N07k836l200K322L304P71k869k679Q91L483J152
1642B604k527k326O99L229J073k534k518Q51K896Q35k152k151N77K940J015j758
1658G53k714M49K797J130j603k501N84J801J326j462j995o3K088J109j084j886
1674a271L75J746J104j111j932n5J615J131n30j637m98J351J101o48j227N8P89
1691C61L36k05k98m66N30Q35l88j073L9J79N55M26k92j063K91M03P92l05q68m8
1711b59J71M31K99k42q02M8N59M25k76m49m97Q56O71k61j467k5R53Q03p4j312
1731d48q61R71J525q0j361r25O89J258N20j358j290J124J159N24j490j124N85
1748e82K186k0j557j581M80K639P16j965j828M27K590N41j562j724K69K266R72
$$ y = [1873, 2250, -1087, -3362, -1402, 1758, 2265, -571, -3771, -1449, 1855, 2626, -243, -2922, -2031, 1452, 2604, 77, -2249, -1550, 1679, 2752, 218, -2300, -1449, 1447, 2282, 130, -2021, -1444, 1496, 2511, 753, -1961, -1512, 1285, 2415, 812, -1689, -1105, 696, 2022, 560, -1435, -1498, 590, 1699, 615, -1271, -896, 850, 1954, 843, -1089, -1144, 471, 1602, 1072, -565, -1063, 288, 1389, 741, -486, -428, 361, 697, 492, 194, -272, 258, 1093, 705, -368, -329, -150, 405, 831, 539, -524, -233, 170, 962, 657, -211, -259, -88, 343, 642, 400, -402, -354, 205, 630, 354, -95, -592, 264, 935, 674, -793, -818, 135, 938, 864, -448, -1309, -338, 1187, 1107, -254, -1179, -490, 768, 1288, -70, -1360, -236, 923, 1447, -43, -1167, -582, 1604, 1584, 27, -1554, -1074, 1565, 2281, 316, -1512, -1085, 1505, 2046, 484, -1240, -971, 1295, 2267]
1765B267j886j741N70K397J094k067k122J43L082J475k055k712M86K523J619j807
1781A266k540j9K613J463j585k372p8K796J298j549k804j92K971K023j891k901
1797a501k69K862K164j881l087j11K658K049j485l137k40K678K042j359l118l60
1813b095K767J805j340k724j027K926J997o46l120j183K547K615j106k986o45
1828b215J973K168n49k498j034J695K305o20k727o95J874K374o36k505r89J498
1844e81K198l05k184j132R95J776N14k123j254J201J991L9j657j413J044J436
1860E45L07j564j187L88J964L92j234j300L72J315L92q56j314P10Q75N30j153
1877h18l26K56J031O00r73q13k43J233M56p50m32k29J044L38m53n32j69O44J97
$$ y = [2267, 381, -1360, -790, 1607, 2701, 634, -1488, -1345, 1737, 3212, 1157, -1555, -1069, 1454, 3073, 1266, -1274, -1293, 1320, 2783, 1198, -1174, -1252, 1544, 2842, 1293, -1511, -1703, 1268, 3291, 1400, -1501, -1770, 1092, 3256, 1375, -1712, -1823, 835, 2884, 1399, -1738, -1978, 700, 2742, 1383, -1735, -2095, 672, 2477, 1137, -1587, -2614, 312, 2309, 1663, -1457, -2640, -93, 2522, 1416, -1570, -2215, -242, 1926, 1377, -1121, -2155, -460, 1845, 1225, -1502, -2197, -323, 2051, 1415, -1090, -2079, -581, 1617, 1312, -872, -2004, -1009, 767, 1281, -842, -2096, -895, 1096, 1135, -522, -1935, -891, 545, 852, -712, -1899, -1511, 453, 845, -389, -1689, -1317, -2, 390, -466, -1780, -1070, -195, 335, -818, -1144, -888, 143, 743, -230, -1043, -1286, -53, 403, -347, -779, -1008, 36, 374, -79, -611, -780, -136, 61]
1896F1J34p09j27K45L81J68n82m23M47M76j4o9o01L91j2O08M4r19j58K98O66J2
1918C17j77j109M86Q17O1l80r43M77K83R12n60j125J26J265O23o27j429l40J627
1937C04Q86o70j725l62J648R10m81j509m29J191J269o60j580m69J399J360k22
1954H60k315n22J469J758l06j995j026J128K372n40j568j080Q72J814L27j891
1970f43j862J700K157j06j957j329J234J934N49k394j075J165J979N4j842j187
1986a623L37K276N10j616j956J160K048K97j748j423O24K547L21k049j380O05
2002a070K239L52j478j961O03K370O02j714j646N07K156O31j364j748N71J881
2018I31J175j834j534K06K085R92j162k070K03K127P98j108j742J36J657J382
$$ y = [61, 195, -514, -641, -396, -15, 153, -429, -852, -405, 71, 57, -12, -613, -222, -234, 374, 418, -501, -659, -361, 305, 317, 140, -969, -483, 334, 395, 15, -928, -451, -168, 744, 184, -941, -815, 450, 1073, 446, -983, -1323, 304, 1190, 520, -1205, -1567, 81, 991, 510, -999, -1428, -237, 1032, 372, -1208, -1677, -278, 1082, 860, -1455, -1977, -508, 1250, 944, -1051, -2077, -949, 1423, 883, -685, -1765, -893, 921, 1248, -643, -2505, -805, 1352, 1246, -711, -2040, -806, 1128, 1677, -717, -1792, -627, 1352, 1406, -436, -1623, -1286, 990, 1500, -116, -2072, -912, 1136, 1433, -315, -1738, -1114, 1433, 1754, -295, -1675, -1070, 1169, 1521, 43, -1918, -1315, 1055, 1657, -57, -1703, -1196, 960, 1591, 227, -1521, -950, 931, 2106, 272, -1262, -1056, 1029, 2021, 859, -1211, -1008, 1119, 1917, 809, -933, -797, 860, 2242]
2034B242j580j320k01J702Q55r73j372k50J691R62k95j872k86J358J195o31j409
2051a84l82P02J382n23r76o98R98J167k79j501n2M63J006J20j020o99L75J430
2069A329k42o30r85N35R33L31q29q58J93O40M64k30o16L7M40k53J16n83m3N50
2089B99J90l71j46l55J89N20ok56p04K33P08k8j77n62r1N21M80m08m30L53M7M92
2111D98l94m39J03J49Q46o28n79M1K55O26j57k66o81K67R78N0r09q40Q62P85J12
2132F79q69o12M41J179l1r78r27N69J135M2o75j007L17J289M96q32j432K07J612
2151F03N78o78j777O00J040O76q18j145J83J333Q05p49j842J38J664R42j152j285
2169h84j19J007J325o19j517j90J086J426o56j673l08J029J505o23j559p12J341
$$ y = [2242, 662, -658, -859, 843, 1698, 725, -647, -897, 794, 1756, 1461, -411, -697, 661, 1856, 1225, -184, -566, 136, 1518, 995, 19, -679, 319, 1486, 1207, -294, -346, 117, 1123, 1243, 223, -476, -101, 1329, 1087, 457, -528, 7, 940, 1271, 442, -416, -223, 417, 881, 651, 35, 72, 512, 259, 375, -208, -251, 299, 489, 118, -28, -383, -194, 326, 320, 64, -640, -407, 301, 273, 96, -466, -557, -36, 444, 36, -394, -41, 6, 498, 104, -335, -232, -83, 763, 135, -444, -403, -148, 478, 321, 55, -626, -359, 619, 669, -240, -1080, -218, 567, 679, -190, -802, -361, 818, 787, -191, -1118, -549, 586, 628, -47, -1054, -737, 552, 1048, 216, -1216, -1009, 603, 1181, 503, -1274, -674, 366, 1042, 224, -921, -738, 595, 1400, 651, -1191, -1053, 611, 1553, 401, -884, -1003, 4, 1329, 710, -807, -997, 89, 1515, 859, -814, -1122, -93, 1412, 789, -770, -1482, -141]
2186a41J550o36j703n21J108J412k33j336p97Q40J437l57j321n33R97J167k03
2203G30j454n13N88J520m1j515r13Q25J394J14j038j396P84J528j11j053p86O97
2221f40J175K74j254j075N02J561K85j412r37O96J470L4j098r09K74J232Q09j331
2239c44q03M35P56N31q30j020L66J170M14r12r23J72J008P26o51j248j53R94O03
2258B91m59p03j20R38M79m27l60m04K86O24qq59J05K52N87L5o10k07l0N74N16
2279E00n73m04L06J33N45l49k87MJ47K23Rk42l65L26N67q4o93J26M2N23l3n03
2301h2l79M71M55N9m53j28j82M68M21m82k71P6K02N59m64m41J64L83K43m9o50
2322h0l09O65O58o19k79m06N65N48q4p46m23O99O83m87n57q3N73O77l69j153m98
$$ y = [-141, 1409, 773, -930, -1451, -343, 1069, 836, -500, -1297, -457, 980, 623, -698, -1231, -234, 933, 730, -724, -1237, -649, 871, 830, -685, -1598, -773, 621, 735, -303, -1699, -915, 613, 502, -551, -1337, -640, 535, 809, -445, -1520, -1018, 543, 828, -584, -1521, -825, 645, 679, -419, -1328, -1054, 178, 987, -344, -1147, -712, 44, 575, -255, -1275, -909, 261, 675, -237, -1160, -988, 20, 746, 95, -1153, -1306, -312, 291, -168, -871, -991, -53, 426, -1, -361, -765, -479, 145, 137, -722, -617, -365, 222, 257, -353, -560, -590, -16, 500, -73, -477, -171, -38, 507, 158, -129, -125, 22, 245, 254, 12, -353, -27, 540, 456, -237, -111, -69, 454, 421, -82, -461, 10, 465, 524, 71, -57, -239, 229, 650, 168, -103, -27, 175, 734, 270, -171, -7, 376, 619, 570, -80, -389, 276, 934, 315, 36, -370, 195, 743, 659, -87, -510, 189, 872, 385, -172, -255, 318, 995, 626, -527, -1025]
2343a025J199P50n05n22p59N72R12J42p65r28Q74Q22l4q94p46N14R85m9o13q93
2363i63O58R82K0p54r59P08J007O13j135j222N10J291M99q86q83r7Q90R63r31
2382C11p41QJ043L76p23j108L19J198N60j071j078J70J004J132q73j150j47N82
2400a88Q33k15j021L46M99P16m71r55m2O50J078o40r16n1O51P56l79j121J05N20
2420A55P83j16o87p89J052R49n66r53K2N91L05K36j152m66O87O85o2o11m21N22
2440A64M15L02p78o05N89K90L33o44o87J91J012K39p43q17P36O42O7m64m14n10
2460f82J037K72m46l80k80L79O42o78j41L4K34N66k68l09l45j04Q74j39n14l45
2480e93R6Q35j26m26j87m79P10L64l64o57M33K50J29j64n10j6N83N00n90k90l67
$$ y = [-1025, 174, 924, 419, -103, -862, -290, 622, 764, -1, -929, -55, 767, 733, -161, -907, -393, 592, 543, -70, -963, -305, 677, 697, -57, -1016, -308, 699, 1312, 177, -1045, -535, 756, 1255, 369, -514, -611, 279, 1242, 311, -430, -422, 621, 997, 274, -834, -515, 683, 1243, 172, -906, -736, 268, 1400, 527, -623, -770, -188, 645, 430, -591, -245, 254, 970, 499, -456, -498, 152, 1230, 590, -326, -377, 274, 1030, 651, -470, -365, 155, 938, 822, 135, -654, 398, 1347, 781, -172, -150, 441, 746, 982, -170, -636, 51, 736, 674, 63, -358, 164, 579, 881, 103, -502, 87, 377, 710, 66, -621, -430, 582, 821, 78, -739, -3, 639, 706, 242, -172, -682, 355, 627, 181, -199, -479, -100, 542, -136, -277, -243, -9, 557, 289, -20, -365, -469, 405, 266, -248, -593, -497, 338, 212, -214, -401, -880, -170, 194, -170, -827, -394, -144, -15, -179, -689, -705, -122, 378, -212, -502, -869]
2501h69P13M59l69m20k31K06O74o7n28n26M75M84K2l71L1j27P19n7p67j68L87
2522c30M82L60m88m71jM76K08k97o58O8O62K18op65k01O30P65n63q11J2N24M91
2544C05p8r10j23R09P15n88j288O54K59N85p5j142j7O42Q29k96p62j34P89N89
2564H63l51j092l73J119J64j13o52n45P71O28J76q35m59O59N41N1q57m60L58N97
2584A90K58o08n31L06R80l4o45o64L53Q61k2m34r53N90O83K45o43o24l7J166R9
2605E36m39n80k13J060K44k90q38K18N58K89O4j395j2R65N4j01m65k40P05L25
2625D45m98m18l58P28L70l14m2n42M16N27m6p21O9L58K15n7k54n35N94J66J89
2646B92n63j43L7O23R9o19P6l87R12J82m20n26K93M12P5l38j68j28O30J70l14
$$ y = [-869, -156, 303, -66, -486, -717, -511, 163, 96, -432, -958, -483, 1, 23, -348, -317, -444, 275, 218, -549, -717, -330, 152, 512, 24, -447, -448, 28, 236, -61, -719, -651, 11, 229, 223, -542, -743, -113, 652, 89, -722, -710, -186, 305, 227, -683, -806, 103, 818, 230, -1058, -404, -145, 440, 365, -777, -794, -152, 677, 381, -381, -515, 274, 863, 512, -580, -953, 166, 330, 217, -435, -980, -209, 419, 595, -240, -699, -40, 501, 552, -305, -765, -407, 190, 448, -160, -691, -385, 595, 561, -84, -748, -395, 466, 444, 10, -943, -353, 330, 575, -68, -692, -729, 437, 536, 97, -483, -696, 364, 608, 318, -520, -302, 256, 545, 609, -786, -798, 167, 221, 120, -345, -585, 120, 445, -53, -471, -829, -101, 269, -45, -87, -629, -213, 314, 268, -453, -384, -26, 189, 132, -122, -657, -63, 103, 292, -271, -414, -377, 246, 345, -274, -198, -585, 327, 509, 89, -437, -144, 268, 343, 5, -163, -291, 339, 509, 195]
2667A95m20K54J56J79Rp11P3M34P8J16l99l72O36L21m8j86n48M83L02K59p33m27
2689c49N02o7N69l72n13L02K20J26k21k85N5L58K37J70o57k18M11P81o95o57J36
2710a67M49M50k73m21rM8O60j89m18n34Q12J45Q7p57r7L75L25N0n03j93j49P26
2732D17J87n35m75k6Q64j49k64j74k95J008j44m62k44K60J90M53n53l13n5Q31
2752E21J5n25o53L23N85M9Pp68k06Q86K04m14m11m8N56l5j96j80k81O69M87n66
2774A9m58q3M16P68l54m04m06N40L17O8o79j86K61O34j16m66m07M92L37j10m83
2795c00l09K41P82n2n53k10Q0Q53R9q49j25M3M11L40n67l36L16M18j33N4o94J57
2817c34M77K76m16o32J45R62j70m12k90K20N3O94j96q10j16O01N07n47m50J86
$$ y = [195, -225, 29, 185, 364, 373, -338, -265, 169, 247, 363, -36, -408, 228, 549, 501, 315, -233, 250, 552, 811, 78, -349, 153, 86, 655, 283, -230, 72, 292, 418, 197, -88, -33, 325, 562, 732, 75, -143, 268, 1049, 354, -303, -167, 282, 732, 459, 38, 29, 77, 737, 548, 130, -404, 408, 553, 640, -117, -214, 161, 486, 536, 33, -160, -309, 417, 604, 69, -406, -432, 432, 283, 19, -155, -450, 558, 414, -48, -292, -32, 158, 611, 58, -255, -310, 521, 536, 11, -642, -319, 266, 315, 322, -446, -652, 234, 438, 24, -387, -435, 121, 86, -110, -290, -571, 98, 585, 19, -439, -522, -106, 662, 308, -96, -502, 38, 355, 423, -256, -442, -181, 453, 337, -129, -536, -44, 293, 183, -300, -609, -368, 414, 362, -191, -401, -321, 532, 631, -218, -343, -300, 111, 451, -116, -452, -136, 282, 149, 203, -491, -334, 143, 419, 3, -629, -484, 478, 308, -104, -394, -174, -121, 573, 377, -433, -549, 52, 559, 12, -438, -252]
2837b52K88k7K55m28n9N1L18j5j76k14K22K33P1m02j98J59K52k16J09j95q1M11
2859A06n5q4l57J37L59j09m54K6K15K98K29m98m14L68J18J54j75j82l67J96O44
2880A55r2l07j88L33K45k03l14J51j00M12k21k27l24L91M61j60k70k52K69J30
2900a11K06n14K33j88L22n9j32l20L29L29J43m60m25Q7O14L97m55l17k1N15Q9
2921B62m23j38j52N09K50k39l84o0L05M80j17o41J30J2N98n6l84k47J52L61K29
2942D47m58l5L72n2J42l27k36O1N26j2p18K68Q4L37j3k51m90N07L22M7o36k71
2964c86L99K12P64q01m87N37N7M2r3m77J09O01K0k17o18L69L07J17Q1j077N64
2985B3k09P72j79q88N54L4O73m66j02o94O03N93p61p9LL41K33l07K1m51K21O17
$$ y = [-252, 36, 9, 264, -164, -223, -172, 146, 131, -45, -259, -37, 196, 267, -135, -333, -174, 78, -138, -29, -224, -305, 106, 51, -33, -390, -253, 106, -3, -457, -431, -216, 82, 311, -187, -601, -233, -115, 39, -136, -318, -685, -489, 155, 63, -244, -432, -99, 146, -57, -371, -220, -320, 92, -129, -356, -680, -289, 172, 12, -258, -510, -241, -111, 95, -419, -186, -374, -52, -111, -243, -563, -234, 95, 238, -222, -647, -560, 54, 451, -4, -321, -342, 173, 262, -161, -299, -451, 58, 308, 69, -315, -375, -70, 410, 293, -348, -218, -206, 392, 336, -48, -295, -143, 218, 447, -11, -46, 326, 274, 416, 89, -147, -86, 440, 428, -290, -22, 62, 399, 386, 135, -355, 152, 474, 521, -115, -386, 13, 225, 989, 188, -299, 238, 295, 337, 244, -233, -124, 477, 497, 280, -338, 31, 338, 455, 536, -541, 23, -186, 586, 407, -481, 73, 107, 780, 314, 212, -482, 121, 714, -47, -126, -123, 218, 451, 144, 165, -286, -65, 552]
3007E52k57n15K1M8N90k04k64o49N03L97K89l56m41J12M40K69m63m84J52L56J43
3028B39P6o74m0O51J48j83n78J89J50L26j78j75n56N22L11l95J47j09N5M81j05
3049C02l84j25L92L14j39l80k62J43L46J54m08j21J16J58K17l24k36J39L48K85
3069E35n43j55K84J24J19j38n82m1N48J84j75m07Q2M19J34j65n70K87L26mj58
3090A04p0j51J79J20q9l74j1N30K2j95m21M36k75L52M16q54l21K32O24q3n15j2
3112c56pP36j58j90j32l18Q66j76l13l77J57K37N24q00r5L56O5J75k83n16N23
3133h2L53j53J66o84mK55K03J13l48l62L8O21l80j32j27J36N24j62l11j27J87
3154b76K71o5k45l4j00M63l69j59K2N5K13L67n22j22K48J29N4j80m10M33L94k28
$$ y = [552, 295, -220, -199, -151, 439, 235, -29, -678, -175, 222, 511, 155, -286, -174, 266, 535, 72, -412, -260, 96, 239, 315, -359, -399, 252, 400, 217, -361, -172, -22, 304, 126, -49, -605, -83, 228, -167, -20, -129, -74, 407, 302, -82, -207, 185, 499, 360, -20, -282, -139, 207, 361, -47, -168, -52, 106, 323, -1, -237, -98, 250, 535, -8, -163, 121, 245, 364, 226, -356, -397, 151, 335, 160, -247, -165, 254, 388, 223, -347, -60, 266, 262, 104, 34, -117, 62, 182, 93, -281, -292, 238, 260, 65, -356, 80, -195, 157, 573, -281, -602, -370, 254, 171, -344, -356, -363, 373, 215, 25, -107, -425, 441, 265, -48, -425, -268, -31, 493, -307, -402, -46, 19, 194, -89, -605, -82, 271, 118, 284, -400, -404, -149, 54, 167, -181, -543, -505, 116, -264, -396, -523, -387, 137, -25, -336, -463, -276, -5, -70, -315, -349, -449, 14, -355, -514, -492, -437, -224, 143, -379, -501, -253, -124, -70, -250, -660, -227, 167, -61]
3176f1Km22L00R3l6Rn65M16J04L83o18L17k83L53K49j71o75J98O28j10J65l64
3198h8p4K20J76j11j26j82P2J25K8k39j77M80n4J51k15l05J90M56k88j61l86M71
3220c7L88j3m17j94O9O29On26k00k9M48J55p12K68O7K35K30j75k96l10M57J29
3242A72J4k62P6N2J44k06l00J31j22N80k32m17m8N75o7j49m9l46P30Mk47Kk85
3265b50L59k05J78k9l09L54J31j80k6j27j13Q82m90k50j19LL88q1l25k00M00O3
3287E4m6K2k91mL27P3k79j8K12J06L03k72l31N2K39N90n20l40l84Q74r8J3n60
3310b78K23k7N04l65k24K4J42M69j28n47n9K41J72J63m50J53K73j01J2rk56p0
3332a38L31J69k23k80K28K74j89j77r8M9J8N03k28l67Q3R0K57m47qo3J04O51j36
$$ y = [-61, -59, -481, -181, -88, -124, -115, -680, -264, -160, 223, -395, -78, -361, -8, 241, 70, -605, -407, 221, 111, 276, -88, -162, 58, 234, 123, -3, -185, -113, 12, 40, -199, -376, 104, 50, 201, -14, -319, -129, 327, 39, -122, -508, -37, 351, 338, -79, -273, -204, 425, 431, -95, -295, -324, 124, 279, -433, -165, -98, 137, 367, 192, -104, -414, 43, 172, 186, -76, 0, 52, 196, -10, -310, -179, -301, 279, 47, -370, -418, 157, 90, -59, -108, -454, 276, 280, 33, 35, -250, 109, -96, 82, 53, -256, 98, 229, 49, 23, -104, -217, 665, 175, -75, -194, -191, 197, 116, -209, -409, -9, 54, 8, 30, -261, -265, 62, 135, -144, -162, 50, 156, 459, 187, -144, -92, 147, 737, 217, -123, -507, 367, 269, 282, -278, -55, -82, 422, 57, -167, -143, -1, 468, 340, -207, -266, -25, 147, 310, -140, 13, 286, 185, 197, 188, -68, -138, 193, 362, 139, -141, 87, 361, 172, -5, -103, -54, -36, 467, 239, -128, -45, 45, 302, -145, -153, -216, -112, 539, 403]
3355D03k44K2j1L28m27m31M30M8J96n1l98O8L18Q0R8m56o6J23M25l26j36k7k8
3378f2L73r7j07j39J53j86O3K66m58L13j02Q5j44j09o2L66j15k22j52O5N69o1
3400B37k5k91j34O15n15M6p7k37N26J1k77j02n3K96J74N0m86q9L29j73J51l91
3422d15J89J1J89P0l40O0M57j92j33j63r3K50J05N3j64j80L29mK16jr93M07L64
3445B2J44k96m61N21J19J06J05o39P8J69N03m23j70k20L80K95o9k16j85K84lj8
3467B6j81o4M57N6m0l22j89K84R3J03n48p7N73M5k16p7j54RO98m32n7k97J73O75
3491E38l54k55o3K1K20M0l56k90M17L23j75l28N0K0J74J81Q3m59k92M79K20j23
3513G1m28K18k1J6K45k34o3J56N6j84p5k95J90O18k53k9k5j75J75j09j37j9K53
$$ y = [403, 159, 181, 170, 498, 71, -360, 70, 118, 314, 263, -135, -67, 251, 331, 429, -27, -93, 30, 455, 129, -7, -34, -62, 311, 214, 107, -32, 121, -65, -2, 264, -194, 119, 17, 102, -42, -151, -213, 153, 38, -184, -336, -271, 298, 237, 212, -79, -213, 402, -113, -67, -144, -381, 145, 156, -121, -223, -276, 20, 194, 244, -242, -331, -2, -175, -24, -415, -226, -215, -26, 44, -296, -236, 221, 29, -104, -267, -360, -110, -5, 48, -116, -296, 33, 29, 245, 244, -749, -342, 22, 166, -130, -591, -70, 49, 155, 260, -379, -301, -132, 371, -52, -222, -442, -62, 233, 164, -52, -237, 47, 44, 26, -155, -219, 238, 294, 254, -68, -257, 27, 120, 223, -325, -402, 171, 216, 0, -77, -231, -222, 476, 44, -13, -310, -137, 538, 184, -71, -134, -113, 107, 147, -209, -499, -82, 241, 66, -262, -212, -192, -18, 163, 246, -213, -505, -26, 194, 71, -357, -139, -160, -144, 101, -133, -196, -40, 16, -168, -243, -538, -348, 270, 17, -12, -37, -212, -37, -146, -283, -302, -49]
3536d9l3K78l47kl7L76l49K7mK32o5nj77k51K32K31n4k9l54J78K36K46j57o08
3560d85K80M0M14m99NK36L22k52k05l7O3K49Q2m66K5q2J29L20k67j12j33L2M21
3583H0M3m15K53O4K87J28n30n04N46N36l75k94J36K7L74j41m42L74r9J42J76k91
3605G5l04L22N15k35K8l96P7K01j66O2m55M76JJ18m0k34rj07L78l01l8k12M32
3628A88j11J81N9n57N00J15j69m44q5O46m7j50j68L6n0M13j25q3m42M22k70O46
3650E05n36r5K04J05J59n89J82L03j40q4j42R9n8K54L8m63K44J67j93M4j26o7
3672a89J28J78J82n41K64m59O07R7j84j91r0K33K22l83k24K32L9K85J51l01l35
3693b79L60Q6Q3j45j98K86L8r7l54r9K05K11j73j66K69o4J82j63J11l29M28J51
$$ y = [-49, -82, 196, -151, -153, -190, 186, -163, -136, -140, 92, 27, 22, -155, -406, -174, 57, 3, -26, -380, -202, 34, 280, 123, -485, -205, -165, 249, -250, -245, -9, 313, 61, -144, -181, -118, 131, 213, -253, -228, -310, -181, 139, -128, -240, -373, -341, 80, 123, -292, -39, 25, 312, 440, -90, -594, -48, 488, 113, -181, -45, -18, 356, 215, -227, 147, 48, 190, 366, 75, -229, 93, 608, 373, 401, 5, 82, 283, 117, 179, -276, 200, 201, 319, 279, 45, 36, -71, 307, 6, -32, -244, 188, 77, 258, 317, -240, 260, 375, 206, -238, -323, 323, 276, 126, -42, -6, -56, 357, 232, 149, -293, 129, -141, 505, -31, -126, 78, 183, 342, -247, -65, 238, 98, 14, -128, -29, -87, 167, 205, -258, -14, 153, -40, 4, -122, -189, -61, 117, 299, -242, 22, -437, 170, 267, 83, -108, -198, 35, 257, -126, -350, -118, -79, 206, 357, 56, -279, 81, 167, 250, 105, -93, 193, 231, 134, -220, -319, -114, 97, -76, -242, 27, -37, 145, -18, 93, -236, 192, 343]
3715C43j35j61o0J1J24k52K02J22q9m6J80k18l77L14N7M19l9l79K02j59Q0J23
3737B62l60M9j25N99q5l69k28R0K01N0rj0j68M13l93J05n6j22K08J63m70j4K17
3760e2K5K44l05j2J64P8j01j65J20m7J93J03k33j12mj3J92k46K71m99K04K37p5
3783c3j03j21K61k8j70J92k73K79PJ54j22m76N04Q1j20k59l55M40J94r7l47K07
3805a85M00J38n31k65L63J43J12k31k89o3M14j35o8k17J29K60K29m52j11Q1k1
3826b99K91J12n0n02nO30kr3l02l5N29l22R0j16j94K38Q6l4j62j53N15l6j17l33
3850b64J94Rl7L92l72K13k01n2K98k19o1J70K95j28j17m72K03J26J45J19j93P9
3872A27J36j3j80j93L5N2J95l76o4m3P25n31K27j27J00k6L52m12j78R3O2N5N7
$$ y = [343, 208, 47, -13, -2, 122, -130, 72, 194, 105, 59, 239, 21, -356, -42, 15, 434, 395, 16, 218, 59, 139, 262, -98, -49, -174, 425, 340, -29, -257, -167, 34, 84, 75, 65, -103, 310, -83, 22, -34, -156, 52, 215, -255, -269, -52, -27, 217, -88, -100, 64, 142, 41, -124, -4, -51, 142, 245, 12, -100, -104, -117, 75, -171, 100, -399, -195, 42, -33, -136, -257, 4, -24, -194, -2, -275, 4, 11, 165, 43, -433, 71, 152, 32, -227, -582, -142, 52, -45, -392, -185, 215, 353, -178, -443, -80, 63, 175, -56, -345, -408, 6, -129, -197, -414, -285, -25, 204, -248, -359, -278, -299, -8, 104, 54, -448, -453, 177, 175, 82, -220, -255, 274, -48, 42, -74, -268, -30, 56, 22, -140, -293, 222, 186, 69, -264, -70, -61, -98, 294, -78, 135, -66, -118, 180, -39, -100, 70, 365, 237, 120, -352, -149, -23, 122, 241, 48, 127, 263, 250, 70, -123, -88, -36, 159, -217, -281, -324, 401, -130, 97, -30, 70, 44, 396, -16, -194, -101, -39, 16, 73]
3895G3n7j84L61P8K4n83K81P6O4K02m27r9L47J79j26m00m7J17K04J2L5j02J54
3918A82J46l94j88Q0J28N7m9J12q7O7P3j08J65k94N6J37k20J39n8n6K80j33J33
3941A68k05k44P5M54l23k3R5j51N24m89j4j13J81J81J59l54k99J33L65Q9j34j69
3963i4L87l69K37m28k35N01J87M0p6j05Q8J21j18j07j82L07J68q6o6k85J1Q1J49
3986A26j99N6k68L68j16K5J32k54L26M6n1K1k26M4K04j16M8k03Oj29M07m41J30
4009f4j5L81o5m44L81j41J65J42m01J19k06M00j6k60L0Qo4M5j28r3J90j26K38
4032G6j10q0J43O7K39l03k30n6M47k08j22j96M61pL59q24K6K61J8N09m89l26j2
4055c57M56j40j81l2k13L74J87ql03n7J67J53P3l17j7K61k91J05j03m5J80L6J39
$$ y = [73, 16, -168, 193, 271, 295, -288, -7, 69, 133, 335, -92, -191, 156, 335, 209, -191, -238, -121, 83, 95, 130, 28, 182, 328, -66, -254, -174, -46, 11, -38, 74, -13, 54, 127, 19, 184, -110, -54, 83, -137, 2, -56, -112, 168, 35, 168, -37, -281, -206, 248, -75, -98, -3, -154, 370, -119, -133, -246, -65, 116, 275, -79, -378, -245, 120, 209, 75, -94, 293, -76, 161, -267, -502, -1, 186, 226, 150, 45, 133, 254, 136, 29, -153, 154, 322, 236, 170, -115, -104, -23, 126, -73, -17, -285, 83, -33, -8, 124, -130, 196, 242, 191, 212, -14, 30, 234, 118, 166, -37, -31, -160, 247, -194, -64, -79, 302, 237, -207, 174, 33, 198, 340, -61, 58, -148, 252, 236, -24, 6, 14, -50, -5, -133, -226, -36, -162, 76, -34, -114, 29, 96, 335, 32, -198, -254, 193, -15, -137, -333, 128, 121, 480, -344, -318, -57, -39, 470, -19, -345, -357, 99, -41, -222, -254, -467, -93, 94, 86, -217, -274, -107, 46, 119, -198, -215, 46, -245, -140, -243, -288, -108, -72, 67]
4078F7m57L24R4L6J28m08J56k2J20%j65j2L3N0K70m32J43J7K09k78k23J48QM04
4102B10k12j41Q9L3R2k22p5J73j54JM78l01j15J2O3J79%j59P2n1J14L3j28o9n2
4127a30N58k48l68q2P1M28K06p25K89J06l05K52j32K9K32o6K96l05m64M66k27
4148a19p2L02m7Q3L60n31j40K56J5O6j36l5j79J08N6o0j26J01j52L55j1J17k39
4171b8k26N12k1k58q3N0O2l0ojm39L41K8J34k38L65j57k6K47n57J11O2J77j21
4195a02q0K02n7j5K31%m09L5K91Q7r8k37J65J26k21L03m06K40j17J62l7l92K48
4218h1M14j05l76J4j59lL14j9p3J79j80L32j15j85P9O0K03l58J00q9p8L10K45
4241D29o09Q8J66K00l7m33J31L91m30Q4m8q7L44Pj08j66R3j24L96M7l00n8J06
$$ y = [67, -390, -66, 28, 64, 192, -216, -60, -82, 38, 38, -127, -139, -106, -56, 214, -218, -75, -58, 151, -127, -350, -202, -194, 210, -2, -143, -54, -21, 71, -151, -226, -53, -207, -206, 272, -29, -144, -132, -69, 110, 110, -49, 23, -28, 86, 119, -9, -78, -130, 428, 180, -188, -270, -199, 229, 435, -290, -1, 105, -200, 52, -80, -51, 181, 115, 411, 106, -358, 108, -119, -191, 111, 64, 147, 507, -24, -164, 92, 107, 173, 37, 2, -177, -69, -13, -73, -199, -98, -250, 105, 94, 211, -28, -254, 258, 237, -21, -104, -54, 8, -22, -28, -29, -468, -127, -99, 35, -203, 162, 5, -21, 226, -331, -220, -158, 19, -102, -182, 20, -37, -52, 179, 179, -230, -195, 96, 183, 85, -152, 13, 139, -82, 221, -185, 55, -62, 100, 63, -329, -81, 333, 228, -148, -134, -293, -296, 18, -1, -74, 105, -75, 257, 142, -43, 36, 96, 299, -59, 41, -48, -126, 184, 429, -180, -92, 74, 274, 237, -196, -65, 326, -104, -20, -68, -155, 189, 196, 88, -78, 15, -109, 287, 334, 34, -24, 82]
4264H2K01O9k88rk24K20J72N6k40J40J03l50K50k80L89L3M2l40Q4Q4k38K02L0
4287A88l15M5J01L99k17k50l0K7K74n0k85J04K26j5j1jn77L24J35k4j87K46MP3
4311A84j38K89m12o6J86ko8j70K79m3K2J4k22L5J01%k5k19P5L29l1o0j33j11M36
4336B50n2k12k23K23p5K04j05J31m2j67r1P4R7j11J0M80m79l4K2J7lL80p6n6k72
4361a10Q7L0k7o8K18Kj0P2l04N3n2J39j37M50m68J30M62k43k79K9J2K10o9r0j89
4386a52J84j50L77Rn01J47J13k6mM7j82M55l45O6k23j02L04J28k35K03k68K29
4408G4J60J4j31l62L24J15k81P5o0R3j66q6L64j75J01q7J02m22LK35j6J36j33
4431a23J51j69J90j7m24K15K03p6Q0m40J5L1J92K73l49l5J2N02k50M5l04J97m2
$$ y = [82, 283, 352, 64, 55, -169, 51, 223, 279, 39, 179, 282, -68, 182, -98, 291, 324, 366, 26, 110, 194, -44, 158, 188, -127, -82, 19, 418, 201, -49, -79, -52, 222, 172, -113, -9, 217, 202, 191, 190, -387, -63, 72, 48, -139, 107, 111, 184, 46, 335, -77, -143, 43, 41, -27, -197, 82, 39, 61, 75, -147, -112, -11, -11, -36, -255, -180, 149, 118, 58, -75, -186, 250, 198, -14, -237, -14, -89, 115, 10, 141, 99, -68, -159, -85, 12, -99, -89, 391, -88, -122, -100, -83, -86, 294, 218, 162, -110, -23, 7, -20, -88, 130, 132, 122, 194, -110, -57, -109, 30, -107, 343, -125, 5, 467, 224, -55, -26, -14, 196, 127, 37, -152, 32, -118, 259, 268, -233, -86, 27, 1, -3, 44, -138, 317, -28, 38, -185, -287, 17, 145, -90, 113, -155, 74, 234, 248, 117, -245, 79, 194, -87, -12, -72, 21, -145, -231, 133, -42, 59, -28, 74, -348, -345, -110, -126, 10, -123, 28, -141, 49, 32, -392, -177, 26, -50, 30, -410, -395, -364, -172, 101, -248, -283, -271, 231, -19, 26, -278, -81, -123]
4454a23r1j6J90p2P2j01j11j0o2K60N3j78k4J20K2K38l94O9N2J50j97M7M61p18
4478c63L38M5N3m07Q1M06o2m5j18n4j13L49j71k6o3J17P5q5O6k34L72k2p8k26
4502a65Q7K02k8n7lm85O99l10k59J16J24J47N7k03L62j89k8j42K31j78j63K06
4524B1K64j03l90J09o1L15k42J53J6j36K73j07j25J92j68p8j2J58l78J43L83J34
4546C61l81l2r9L83l63J86J9N8j35K64K1m73J24k48L50J39p7k79rL81k9l17K98
4569A42p7J01j53J93m65K77L2j07j5N7R6j02M5r1QP1L2m4l3kj22J98L7k40N8q6
4595a90L3L50l55K07J25r4K13p8j93N4QQ4J41l50j07O8p0Q5m3Q9q5J87J66j36
4619A09j49NM8J04k34j03L06j11J68Mk0K53j68N1j08n6l3j67L41j11k5k31J63
$$ y = [-123, -214, -230, -40, -112, -40, -141, -252, -262, -324, -64, -11, -189, -213, -93, -71, 167, -227, -158, -106, 44, -153, -106, 355, -363, -25, 20, 73, -334, -253, 153, 91, 46, -72, -126, -239, 110, -61, -87, -150, -33, 42, -43, 23, -211, 161, 139, 61, -165, -78, 124, 96, 39, 36, -449, 250, -60, -319, -203, -79, 68, 125, -78, 284, 95, 67, -75, 156, -22, -185, 21, 285, 182, -208, -99, -160, 155, -87, 66, 82, -54, 219, 112, -13, 179, 11, -67, -79, 79, -299, -156, 227, 361, -20, -52, -151, 232, -131, 55, 74, 132, -3, 261, 282, -191, -67, -315, 35, 174, 97, -182, -191, 190, 161, -156, 142, 65, 166, 13, 206, -259, 18, 50, -57, -72, -15, 81, -21, 24, -67, -59, 12, 44, 0, -33, -35, -157, 41, 78, -162, -104, -190, -157, 193, -162, 45, 170, 76, 289, 211, 18, 72, 80, 164, 305, -45, -152, -84, -154, -69, -112, -23, -108, 79, 245, 109, -40, -35, 13, 117, -117, -220, 86, -25, 143, 147, 127, 380, 212, 263, 155, 99, 66, -101, 240, 129, 104, -127, 36]
4642C6k97N28k08O7K46j53Nr1j44l7j91M99l46Q2J36l62K88l54K69K27r8m3q0
4665b1R4lp0L28j32l49J17K6P3k98M8L41n0Q8j88k52J64R3r4J3N6l12K44P9n9
4690f4K4j77L80j0N7k85n6J85k82K79l46J58J55%j39j15J60j5Q5Q8k1q0r8N07
4714C90k60r2J07m12J93j03j2P4O1j16J05k58K37p7L48j18k40k09M39j78K12j74
4736h3J61j30K54l21n4lp3J03L35m52L89J27k79rp7K23k28L6Q7o2n8k3K03Q4r
4761A41k16l1R9J04J00k31r6j0L29Pj41m11M61J06j93j54J33j97L78j00j84J71
4783F5OO5p9j61j13L81j07K9R0l14M4pL25k43j33j5O8Q8N9J64k28m8Pk9L53j68
4809I9k98K81M7m93K37l13L72J65j95l38L88J88j35k64K29J91M4n0l8n5j76N5
$$ y = [36, -261, 267, 59, 126, 372, 219, 224, 133, -11, -48, -239, 260, -86, -4, 132, -230, 58, -296, -27, 200, 102, 59, -21, 73, 70, 0, 328, 196, -153, -36, -10, 63, -235, -187, 154, 104, 192, 4, -248, -84, 9, -85, -72, -16, -328, -84, -5, -64, -40, -217, 163, 153, 210, -75, -131, 54, -228, 51, -295, -137, 18, 18, -121, -236, -76, -91, -6, 82, 61, -19, -117, 390, 130, 38, 145, -267, -74, -177, -189, -115, -54, -170, -65, -323, -86, -163, 185, 67, -173, -382, 57, -121, 91, -83, 78, -52, 202, -119, -173, -176, -249, -146, 189, -263, 126, 253, -26, -35, -112, 111, -117, -81, 6, -56, -114, -137, 66, 150, 141, -75, -106, -7, 97, 197, -34, -130, -140, 189, 196, 55, -356, 105, 211, 18, -136, -3, -200, 178, 78, -106, 65, 71, 136, 57, -104, -217, 164, 57, 86, 176, -138, -94, -101, 224, -19, -152, -167, -99, -11, 48, 212, -16, -64, -57, -86, 267, 99, -199, 82, 129, -364, -127, -440, -68, 97, -98, -436, -48, 140, 5, -259, -30, 161, 205, 155, 117, 62, -114, -59]
4831e9P3J32q1p4J65P6k94j12K83j02M9K09l30J57Oj9j8k99O4j46L52j58j33J64
4855i5j49J23L56o46M42l3p6J55J97Mm36L09J24k61p5P3K76n07K53k67M35l67
4877a65mO2K37L25n78pL13l67l4L30j26J89j47K25k10N7J23j76p1L04n05K06J88
4900A69K2j62J04Q6j64o4p4R1J0J72j62j81K83j7k23p4L25j78p9K24J8K7j07m5
4924Ak37L15N0J42j00k30L80k51j20J64j20K03r2M7j04J32l64K38j3R4k4n1j06
4947d6K12l18J92l60J57J49O0J12j02k9oJ25l43N9J09L12Rn1k30J74m76K66R9
4970G4m26K05J34k0K87n11J39K70p5K43m95J60j19K14l3j09L76l30m12M64l4o5
4992f3j4p6M36l62j8K79l97K43j1K24l35N1P9l9n06K97L46K3k89j4O8L83l55J12
$$ y = [-59, 14, 146, 65, -9, 156, 232, -62, -174, 109, 7, 56, 265, -65, 92, 98, 79, 61, -238, -174, -320, 32, -126, -259, -95, -244, -121, 235, -411, 31, -2, -78, 77, 274, 278, -158, 151, 275, 14, -61, 12, 288, -219, 34, -233, 202, -165, -169, -107, 130, 455, -123, -130, 183, -184, -218, 112, -14, 175, 28, 253, 43, 100, 223, 47, -24, 280, -225, -19, 169, 191, 29, 133, 219, 55, -9, -83, 8, 18, 190, 28, -153, 130, 113, -110, -184, 141, -37, -116, 108, 126, 153, 46, 1, -236, 79, 129, 271, 171, -59, 321, 70, -50, 114, -6, 197, 105, 152, 48, 180, -184, 54, 41, 135, 111, 60, -46, 166, -152, 40, -320, -163, -14, 46, 158, 56, 27, 21, 146, -197, -138, -29, 283, 292, 241, 11, 185, -291, -25, 74, -352, -147, -13, -33, 254, -257, -118, 152, 77, 320, -175, -15, -134, 80, 47, -62, 314, -16, -428, 36, 2, -63, -77, -153, 283, -79, -97, 182, -215, 28, 17, 241, -94, -43, 36, -3, -509, -212, 134, 157, -132, -146, -78, 305, -50, 62]
5016F2J2j19J59j32K06k71K82k41K57j2j14j35J25q7K19m64M36n04L66J98j80
5037F3K4K02l43J65k38L36j63J93m09j6j03L18j03j80L09k81K03OJ30k52r9K94
5059E6q3Oj19J07n2K07k12K21N8k00M9n6O0l00K68Q0l6J77k28j21j25L92pk8q7
5084B7k04K37k27L21j85r2K76l69J03R3J35k97N04l45m2Pk33M5K09K92m65K40
5106C0M0j03n7J73P3O7k31Q2J8k82J98j24j71Q7L1L26m76M16k80J10N8o9L35k87
5130c6L3O6j79l5j02J01K42o4lj75j07N4K21O4J1k56k28Q49n47k53M54J13m12
5153a89m0N6J68K20k14o2j97N77j15j86k49K10j54N70m04K27j95k15L30j56K08
5174A90k03N5M6K86k76j51K8J35k56k54M55k14L26k6J55O6n63M26j46k15M14k32
$$ y = [62, 74, -45, 114, -18, 188, -83, 199, -42, 215, 203, 89, -46, 79, -8, 211, -253, 183, -321, 45, 243, 63, 87, 289, -54, 111, -127, 209, 46, 239, -170, -186, -289, 29, -74, -254, 55, -226, -23, -17, 113, -139, -238, 56, -27, -21, -140, -33, -85, 122, -90, 131, 189, -11, 38, -18, 42, -258, 10, 90, 54, 231, 3, -118, -243, 149, 142, 114, 27, -177, 60, -167, 154, -31, -123, 153, -216, -113, -20, 115, -182, 322, -23, -65, -58, -291, -246, -37, 255, -210, 30, 70, -33, -90, 83, 156, 223, -8, 74, 92, -190, 8, -116, -287, -200, -169, 157, -319, 97, -183, -73, -15, -84, 251, -36, -3, 63, -116, -151, -253, -152, 90, 26, 23, -152, -259, -205, 16, 80, 91, -165, -393, 456, -91, -344, 110, 223, -189, -229, -173, -5, 215, 1, -61, -258, 319, 204, 18, -231, -21, -175, 395, -9, 218, 23, -192, 138, -18, 190, -13, 42, 88, 374, 98, -53, -25, 110, -146, -400, 55, -159, 167, 141, 296, 362, -201, 225, 79, -136, 278, 46]
5196D6k1p6J4j65K87j36kJ00nj02o9L3J76o3j84J22J21K50l94K49j46K56k57o7
5220c3l7M6j99N64j98J99m23N9L6J50l82J52J01k82L43M0j63j25J50m4p9K95L8
5243B08j57L9k61K60j99Q5K24k84l7l8J44K1j28L10q4j8j4%n2q2K78r8r1k08J83
5268AJ81j92K27k99Q8J05o1J2k47J92J29J03k59K39l19L96q2k22K0J01k14J04
5290Ck09M53l43K20j09p9nJ52p9J19R7l30r7K34j33L96m30K42L2k69j39K8K43
5313cK3J49m10J01L69K0l49L7j60R8qJ62k6j59J3LJ94j02j8J57r0L0j71K44k30
5338a26J32J08j37m0J4M5r1J7J39j43K92k14P5K47m07J27n11L48J22J20k67k7
5360a77N13m05o8K42n7J02k84m5M54p3j19k00Q7o3j55L13J20J5k62J3o6P1J19
$$ y = [46, 25, -51, -37, -202, 85, -51, -53, 47, 42, -60, -129, -96, 80, 17, -167, -45, 76, 326, -68, 181, 35, 291, 34, -33, -70, -24, -223, 341, 143, 342, -81, -22, 14, 164, -218, -66, 35, -247, 96, 136, -27, -152, -2, -46, -125, 170, 208, 51, 90, -171, 89, -110, -25, 199, -85, -122, -160, -16, 5, -123, 187, 103, 85, 71, 71, 19, -63, 215, 117, 26, -182, 1, 182, -10, 217, -82, 6, 111, 50, 62, -185, 7, 136, 239, -20, 219, -100, 296, 214, -8, 12, 113, -101, 3, -206, 247, -96, 124, 15, -64, -69, 83, 4, 123, 220, -110, -207, 27, -106, 290, -140, 102, 134, -135, -274, -246, -3, 20, 169, -241, -140, 229, 249, -100, -63, -223, -125, -133, 29, 3, -156, -143, -140, 54, -48, -66, 91, 1, 31, -140, 104, -126, 6, 114, -23, -63, -49, -4, -95, -78, 61, -82, 210, -4, 71, 318, -89, 38, -473, -125, -3, 117, -150, -177, 336, -69, -137, 105, 48, 150, -134, -179, 275, 202, 83, -117, -30, -93, -248, 65, 185, 200, -62, -49, -115, -44, 75]
5383G5j88M7L1J41k01J8l85P12k14k19QJ37O6k98L78k8k31J83K9m1j20O2P0J06
5407A38r8o6J26j54J34M3l00k6J91Q7o8k17M54M3k30K44j47l63J99J06k62j98
5429c64N45j92j15K13Q7n28K34L92j67k66K12j84J94j59J14j77k98O15j65Q6j46
5450f9j37J62k7K62p9r7l97L82j93j37K67P4K97l16j16J20J78l58L39j3j04K7
5472F5k87J62j92K41K21p9o6j9jk0J03k74j01K13O7o1j90J99L1j44Q1R0j32l9
5496a32L49r4j05p2L6nj41J43l8k45M21m60N93m33K42M5n7K22J55m29J65m50J61
5519a29L11j94K37r6p0l35L68j00J1j5J8j73J59k63L38l81N52k99Q5O7K55l63
5541a7M3k4j46K48p4oL11l31J43j73m8j72K59N4k23qj99M91k37J12m9J25O7j58
$$ y = [75, -113, -66, -35, 106, -95, -77, -462, 250, 36, -183, -175, -38, 28, -270, 108, 80, -151, 32, 61, 20, -100, -38, 32, 138, 40, -26, 100, -54, 80, 123, -177, -203, -12, 75, 7, -210, 244, 287, 57, 301, 154, -209, -10, 96, -166, -364, 181, -11, -126, 87, 174, -354, -120, 272, 105, -161, 51, -133, 61, -98, 16, -161, -459, 156, -9, 77, -69, -206, -44, -71, 191, 112, 15, -382, 0, -193, -330, -63, 11, 308, -8, -124, -4, 174, -184, 155, 142, 38, 65, -222, -60, -252, -11, 210, 131, 65, 46, 45, 25, 128, -146, -247, -34, 33, -28, -218, -19, 12, -132, -51, 39, -93, -132, 217, 123, 18, -54, -18, -23, -164, -21, -59, -304, 117, -343, 250, -183, 59, 104, 47, 269, 424, -5, 160, -290, -129, 182, -12, 225, 129, 59, -276, 92, -8, 3, -12, 6, -167, -8, -271, 67, -314, 238, -61, 24, 91, 346, -17, 26, 2, -144, 104, 30, 24, 335, 4, 147, -26, -74, -246, 13, 67, -156, -164, -363, 128, -109, 3, -46, 79, 146, -12]
5565a2o3N44n14Q2k70K09J18m08M54j02p4J89l89L39m0j43J80j18J90j1k59j2
5587a10J36J72Q5k45K3P7j99m6J47J00k67J25%m5J31k96K26J61k83R1N8j01K11
5610A51j71K90k72m9r1K74j44M6P0m06K93K12j37j53k75K70L4k93L43o1j03j70
5632c42J28M1J68N4j84J30J65j58J06l12L9n4O3K47J1k53K70o7k16K22j23qj08
5655a81K0J91J95k70J31k22r4rj2L33RJ43k93J86m55J01M12j87k99M38n41L41
5677f3R9k65J75J70N0m47N75l20L3M2k33K40K33n8l64Pr2L38q3j3qj35R4P2N4
5702A01R5N1m24K18jr8Q3k68K63k09K47l42L11P1J32l20K72K82n84J58O4l26M13
5725A89l25j13L54R2j87p7q5p5M8q5J51J42K6J8j04Pl57L09k9o5K91k54K24N9
$$ y = [-12, -75, 469, -45, 37, -233, -24, 94, -314, 140, 38, -36, 153, -236, 103, 63, -80, 100, -18, 172, 161, -98, -110, 26, 198, 283, 38, 61, 138, -61, -107, 40, 140, -127, -2, -2, -47, 84, -212, 14, 175, -108, -17, 41, -60, 151, -20, 270, -2, -51, -142, 132, -12, 34, 104, -302, -9, 203, 66, -87, -362, -92, -58, -351, -8, -69, -172, -342, -214, -173, -5, 49, -135, -5, 160, 2, 108, -204, -165, -219, -156, 91, 102, -151, 119, 52, -164, 58, -65, -73, -181, -161, 30, 225, -45, 86, -136, -230, -239, -251, 82, 91, 234, -59, 127, -328, -227, 185, -2, -301, 137, -404, -63, 36, -229, -54, 116, 166, -281, 294, -26, 7, 49, -184, 56, 289, 231, -133, -126, -218, 120, 37, 24, 16, -119, -25, 47, 101, 196, 247, -177, 41, 40, -58, 25, -243, 20, -189, 58, -284, 27, 98, 230, -90, 182, 464, -120, 38, 102, -224, 189, -136, -249, 105, 197, 10, -67, -152, -227, -179, -264, -113, 29, 55, 73, -31, -24, -381, -72, -101, -166, 125, -129, 95, 154]
5749A54n9k84J9P1J71k9j3k84O7lR8L03l72L38k77q5K0K65j2j20M03l76r9K60
5773A56M7l30q1J92m7J21Q2j54j83L42k42J87j22l6M26n38L0M0K9j10L55l86K17
5796eL13m7l14J73l3j44O5m6J00P0k58j87M16k42K77J5m77L31N0N1m79O70l48
5819d9N0M8M6q0j07N43k66J25n80J6P03k94k17L74p9j10j76J58j55K2K28L5K9
5842B64k04j31M14l30j57L40k83J30j26R0j73K03j80M14j44k11J60L2j25R9K4
5863A06j95J62l95L40j29j2j0R4j02K47q7M8j39O8o6N5J38Q0j54k56K92k1J21
5886A85l11J38j52Q4K14r5l19O4L50j99j52J47J50J2o6Q7j67j80J29L16l33J09
5908A1r1Q1J28j12J8R6j13J69l37q2J13m8K20j03Q5L0j22l18P03m00k37L24J81
$$ y = [154, 95, -189, -170, -99, 72, 43, 30, -254, -187, -190, -92, 211, -161, 177, -100, -185, -165, 100, 88, -32, 371, -5, -104, 156, 203, -127, -208, -16, -63, 58, 140, -14, -197, 145, -97, 90, -32, -68, 358, -180, -150, -110, -81, -191, 164, -222, -5, 308, 261, -53, 120, 87, -57, 8, -38, 62, 132, -126, -313, 103, -139, 138, 153, -324, 7, 57, 108, -371, 299, -49, 1, 49, 95, 15, -92, 451, 185, 310, -270, -254, 449, 155, -62, 312, 233, 123, -53, 105, -50, -28, 200, 235, 264, 60, -71, 343, 13, -144, 196, -87, 43, -83, 7, -166, 37, -143, 271, 127, -84, 76, 108, -17, 82, 106, -89, 73, -322, 18, -111, -123, -133, -39, -141, 106, 19, 67, -72, -4, -70, -15, 123, 203, 49, -207, 85, 64, 185, -126, 12, -140, -56, 158, 63, -256, -192, 158, -41, -193, -46, 104, 116, 50, 137, -30, -210, -81, 235, -98, 11, -80, 1, 129, 17, 35, 131, 18, 187, -150, -232, -119, -167, 53, -50, 35, 65, -57, -375, 328, -72, -309, 15, 196]
5931A96o7J98l09J69l11j0L36l68K45O8l01r0R7K92k86K63j00Jk34M12l67P7L91
5954C02k73j97K00j29M28j69j48L4k83L94j57K56k52J02j6m6J67o9o6j82L6J29
5976F1n8k90L70k17M1P5k29L9L35l5j91Q4j46J67J75j95j5j76M07m08J69J42J19
5999B24m57L30j13N0J1n0N8l75L91k3R6l09J02K76m2k96K41j51O7j4J44j85k15
6022b40J97j39K35j6k7j76J14j28K33j98M69n5k05o9o3j8K24j9Jk32M0J09j98
6045a61j5J07K7K81j76l05K01P5J0P2l57K13J49k02J14q9j69K5J50R0j97K00o9
6068b6Q3m32O30k33pL1m16L02J48l37L3L52j39R3j28J23l3k06L56l55J16M6J96
6091A97k16k63K62RK97k45k85j8K89K10k56j08L39k63N4Mj41l0L3K93j64j2Q7
$$ y = [196, 129, 327, 18, 187, -124, -134, 202, -166, 79, 147, -154, -244, -147, 145, -141, 122, 22, 23, -211, 201, -166, -89, 302, 29, -168, 32, -97, 331, 162, 14, 48, -235, 159, 2, 258, 6, 108, 92, 46, 213, 144, 78, -104, -68, 61, 3, -287, 83, -134, -93, -18, -247, -208, 127, 92, -99, -15, -161, 6, 181, -14, -29, -205, 202, -206, -37, 105, 224, -233, 97, -16, 34, 45, -5, 53, -322, 69, 46, 142, -167, -65, 211, 169, -127, 114, -37, 30, 16, 160, -25, -240, -43, -182, 53, 37, 10, -166, -52, -180, 53, -145, 324, 269, 64, -5, -68, -86, 138, 119, 120, -112, -72, 37, -161, -176, -69, -42, 239, 63, -242, -41, 34, 44, 116, -241, -28, 121, -81, 33, -56, -225, -200, -50, 40, -157, 43, -26, 57, -375, 255, 22, 15, 46, -370, -68, 80, -257, -224, 128, -11, 82, -46, 77, 44, -162, 194, -161, -45, 1, 197, -19, -282, -20, -11, 286, 41, -244, -262, 27, 237, -19, -127, 212, -51, 3, 7, -134, -164, -131, 162, -2, -14, 73]
6114G3L42j91k95j02L65o9l09K09l22M27j24j34K88rn5j64l8J72Q7J7k8j50k01
6137b11K5K57n3P6j17q5J53j0J10j77l8O4J08j1PK0O3j32N5k24J70j19J34j34
6161f9J25M3k1M6j45Q6N4l8m4m7N9j15J46K0J84m99L83l42J23J70j77K77k74K66
6185B11j85J03k4j69j17J80J55j5l42J13K48j5p9j73M2K20l38O50o39N7J9J9j91
6208b70K78J82k34m3L89K5n89M84m73M03k44K33j96L0j14P6j54K09L0L7K2P0q2
6231F9J55Mk20J17pK7j79m2L9K32j49L3k4M11n34j1L10j23k71J21q3j76K62k01
6255b40L52j0k54m4K95j21Q6K11k23k68K06j65R6k8n9J28l4L05m53J34j43K67
6277C8M9j33j18Oj52K75j3M7j61O6K45m3J47m34P8l4L74k42l4J29r1Q7k74O9M2
$$ y = [73, 415, 224, -71, -173, 192, 123, -186, 23, -299, 128, 4, -130, 158, 149, 94, -70, -108, 64, 151, 168, 140, -10, -211, -186, 71, 18, 94, -23, -108, 45, 35, 145, -32, -70, -6, 102, 91, 98, 118, 181, 49, 104, -120, 50, -69, 65, -69, 56, 99, 78, 124, -21, 65, 119, 81, 37, -10, 49, -66, 80, 100, 284, -215, 168, -174, -51, 119, -58, 219, -55, 211, 26, 129, 105, -64, -181, -1, 154, 139, -203, -90, 158, 143, 64, -109, -67, 153, -185, 465, -174, -117, -98, -79, -270, 8, 190, -44, -87, 302, 327, -262, 222, -251, 152, -92, 141, -55, -25, -139, -63, -217, -8, 22, 59, 81, 151, 69, 224, 228, 8, 125, 118, 145, -34, -76, -37, 195, 46, 79, 55, 466, -68, -79, 231, 108, -163, -42, -125, -301, -39, -240, 112, 102, -152, -196, 99, -22, 64, 275, 52, -216, -10, -175, -79, -107, -166, -38, -72, 233, -220, -86, -229, 38, 87, -46, -164, -158, -310, -35, -48, -1, -162, -96, 149, 106, 253, -181, -103, -137, 237, -5, -39, 90, -1, 86, -188, -119, -77]
6302g7J91k15K21N7q5j33N9r0J45k47k8Q7j14j85O50j62O1k5k95L37l26Q3j36
6325b27K29l5onK58k94K21j4K9k30J24P8L5l86J6P12n44L46l50l2j32k8J89J50
6349A04j23p6P0p8k2l7K57p8J99l18j7k8K98k43j04L15j74J78k11L8l2o5J41P0
6373F4m23L04k7J89pLo7n4n3N2j50K32J51m77n1K84O9m14K77q1J97l5P3K67m35
6398a12K40Q6k14K24p3j74N7O9k76N0n6L76n38N50j21j78j63K32n1j34L34l51
6420b23N18m43J16K66k27j90L04l0j55n1R0l40J78K05j01j18J55L16k71Q1j04
6441b4L33l57l2J73k91L22J23l4k80R4L3L8j63M94m41N2J47k58P0J96j88k31n4
6464b78K2J87J49R3L8j45l9p3j9Q8o7K66k25K56n31J23K28k05J20J13K20j86k1
$$ y = [-77, 114, -101, 120, 177, 92, -41, 18, -72, 73, -174, -202, -115, -229, -414, 236, 74, 135, 110, -185, 152, -174, -91, -227, 2, -33, -39, -44, 214, -80, 141, 127, 156, -74, 50, 128, 163, -223, -207, 505, -39, 307, -43, -75, -207, -235, -46, 104, -19, -95, -25, -103, -125, -162, 95, 17, 216, -102, -119, -147, 151, -92, -196, 119, -55, 123, -88, -50, -82, -147, -6, 64, -359, -55, -82, 107, 100, 103, 36, -18, -71, -19, -169, 63, 214, -263, -314, -30, 39, -375, -98, -179, 18, -17, 56, 323, -112, 128, 214, 0, 224, 151, -23, 34, 103, -173, -123, -179, 197, -341, 209, 88, -90, -253, -21, -72, -206, 128, -223, 295, -148, -32, 234, 7, -183, 121, 91, -64, -115, -25, -365, -187, 18, -83, -201, -46, 270, -1, 80, -24, 309, -48, -80, 93, -198, 124, 247, 213, -67, 27, 60, 98, -65, 429, -12, 40, 187, -71, -1, 195, 7, -224, -278, -256, -69, 80, 173, 211, 66, 27, -46, -65, 23, -44, 222, -3, 253, -278, -155, 73, -132, -12, 101, 321, 135, 114]
6487A14k40K32J89k65n9J83n51N43j05j6J92q2j90n3J57n2j18k56O58k21p5R8
6509H3l27J94O5j09JK78o3j24k18L28l7J26k77J83k7k72P6K64j84J09M8j63K8
6532a8J62j72J37j55k76N16qk14J00q4j91J0J3K43j97P8J93k27J59K7l21M9J27
6555d9J3j31L23o8j20nJ23l34K14j9k04M77q1k32K10j3k0q4%pL8j26K60j99L67
6580C33k91m0r6j3J07J19l14K03J35j38J17J18m16n9L17k23J05m6L2J15J8k79
6602a96J26n3M7R8j36K39Q4l64R2K7j60P1J28j68R4Q2N5O3J33n05K15%j63K48
6626E7J15K1m27K65m66M49j61L64r4l31L65l05L00j03j16O5k03J65K5m38N78j58
6648c3J69Kj19Lj91M04K1m87K02j10J16j03J83r5QL26j45k62k95N75k2P2k06m
$$ y = [114, -126, 106, 295, 30, -29, 154, -397, 146, 41, 25, 217, 135, -55, -108, 49, -3, -121, -377, 281, 60, -15, 83, -244, -50, 15, -94, -93, 185, 122, -2, -220, 108, 71, 197, -80, 103, 76, -196, -120, 144, -40, 69, 117, -46, -18, 144, -28, 109, -46, -322, 194, 186, -28, 72, -12, -203, -193, -180, 63, -134, -56, 137, -90, 69, 96, -225, -176, -49, -36, -167, 156, 88, -32, -37, 86, -248, -34, -53, -257, 220, 139, -93, 117, 104, 84, 0, 0, -7, 31, -95, 165, -34, 333, 42, 2, -94, -107, 0, 119, -195, 8, 143, 5, 122, 240, -176, -235, 82, -141, -36, -82, -50, 65, 83, -196, -70, -123, -76, 22, -114, 125, 209, -155, -63, -36, -196, -125, 3, -165, -71, 11, 66, 129, 262, -243, -28, -28, -191, 57, 172, 193, -234, 31, -435, 14, -147, 217, 123, -208, 157, -148, 152, 49, -67, -2, -205, -40, -15, -453, 125, -33, 136, 138, 19, 22, -169, 235, 256, -231, -29, -139, -23, -126, 57, -38, -30, 296, 151, -111, -406, 169, 147, 219, 13, 9]
6672IJ25p0L5J1K33k40M4l36M40o71K64K02J9k40prL4J43j69o7Q8J07M26l00j4
6697E7k62J76j02RM7N6Q9r7k09K85KQ5k42J77k90J00L8QJ97j77K80l91n5R1J76
6722D8k38L09l46M35l39L34k45J7J06l25L03j84n3K50K07n02K86j8l25M02r3j35
6744a06qJ01R6Qk01M83m79Ok08J61J11J07J87l51J03J22k93J58J8j87J94r1K96
6767B27m29K53j29R8q6j81L99K7j31Lp9k74M98k00J33k28q6K15K08l25j30K80
6789F3q0K8M1K61k60k7j00k40L49L19k78k72L38k29R3R4l64J91o8L06k37P9m0
6812c3J40P6k53J14ol16J95R1Kk2p5L33k57k97N73l91M12l12l1j5q5J37J72k31
6836g9J05N8l76L85j9QJ4k57q0J04p3M96j14K01k43k80m0qL17JL1k49J63K2J64
$$ y = [9, 134, 64, 99, 110, 343, 103, 147, -189, 251, -420, -156, 46, 65, -175, -182, -191, -157, -14, -183, -250, -162, -55, 371, 71, 57, -205, -29, -131, -122, -75, -19, 70, -27, -236, 49, 51, 136, -106, 71, -219, -119, -81, -73, 124, -53, 227, -164, -219, -128, 48, -190, 119, -227, 208, -131, 203, -42, -25, 81, -244, 59, -125, -178, 72, 279, -223, 63, 45, -280, 122, 29, -106, -114, -13, 83, 91, -110, 373, -106, -100, -308, -147, -36, 71, 258, -93, 10, 132, -161, -3, 15, -172, 22, -69, 227, -202, 51, -78, 20, -66, -247, 152, 179, 48, 51, -28, -302, 196, -4, 129, -99, -185, 30, 238, -87, -217, 63, -17, 11, 52, 313, 53, 26, -74, -314, 35, 354, 76, -196, 142, -87, 6, 100, -264, -73, -141, 165, -72, 7, -33, 107, 183, -70, 44, 38, -278, -83, 8, 10, -12, -87, 246, -11, -308, 265, -126, 286, -26, -57, -72, -157, -20, 152, -79, 26, 84, -292, 93, 74, 82, 96, -161, -241, -137, -210, 286, 172, 373, 130, -150, -190, -198, 119, 120, 151, -98, 65, 87, 251]
6861B51l74K90k71R9J4K53o4m15K99j98Nl2J57J54k88J23J47j28K03j72k54L29
6883A28j76nj11r3K58RP0L5j10QP7L4m93M44L7k47J55oL5k9l01K36O2k86J36J49
6909A6K11k83L46o5o5J59j87Q0k94L09l30j25N9K65k1l4O0l53L07R7k31j91L69
6932I9k87R6L05l37J5J54o5j56M13j38l9oj31j72K67N5l15K21j46O8QK36k76R4
6956c7M7k21J48l4J00J93j77r3jj17mR8j19K48K24k68j58J71J62J73l11O3l92
6979c05N04k05Mn8j5m7J60j26k07M44k48K63k73K19J59j53j79K21j37o4j76L62
7001A43Nkj41K30k05n7J04p6JJ2K59n15K34J11K5k01N6M13m04J20l35K18l19L91
7025F7l0k56J3L07K1J10l80K16Mn5r8P3l7j55r5L05O1Q0K05l14K65k58r5M7m9
$$ y = [251, -123, 167, -104, -5, 9, 262, 198, -217, 82, -116, -111, -143, 14, 168, -120, 3, 150, 22, 225, 53, -201, 128, -48, -53, -164, -257, 1, 10, 80, 115, 5, 13, 90, 124, -369, 75, 112, -135, 20, 14, 49, 20, -281, -45, 17, -269, -133, 16, 227, -56, 290, 225, 160, 319, 132, 212, -82, 227, -103, -228, -169, 96, 75, 41, 101, -252, 55, 152, -79, -270, 99, -188, -92, 213, -124, -109, 45, -20, -176, 237, 99, 60, 54, -77, -249, 18, 73, -242, -21, -167, -99, -91, 145, -131, -37, 10, -211, -63, -97, 3, 196, 19, -74, -75, -192, -196, -98, -217, 31, 255, -13, -171, 0, 162, 335, 24, 87, -305, 199, -6, -2, -60, -75, -122, 38, -88, -295, 149, -99, 164, -109, 110, 269, 116, -63, 158, 21, -43, -219, 143, 148, 146, 5, 235, 30, -27, 77, 1, 2, 14, 273, -242, -8, 103, 128, -73, -17, 396, -8, 112, -223, -5, -324, 67, 37, -219, -206, 101, 122, 232, -148, 68, 72, 17, -81, -8, -45, -200, -295, 10, 71, 151, 356, 42, 307, 49, -46, 1, -48]
7050d8P1J16j1q1j6J94j83K21l59Q3L7J85j11k25J87j33J27k65K84j40J39j32
7072f0J50k81J52n3J23J92l15J57m2Q7q6p1k73K05l5J22p1J28K29j99K43j07J05
7095C00j62J8k70L17k13p0M33l11J7k13J05K72l24K52k23O4k76o0L05K57j92K8
7117E4J03j70J03P9l81J39J85m74N60l40k15L21o1K21j27l04M31j56J12k02p6
7138a98L18j37O2Pn8K08k69L97n47L00m8L2J05k05J75k41K32l16K76Jj83J19k07
7161a77J06J97qJ50k46nm6K38k1j86P3p0J06o9J91k89J25l26K55L64k68j88J05
7184A1k03l0J88M1j00R0J90j40o7k66K82m4l7J17l3J45n1O3k31L05k23j87L40
7207A60j29r5r7L06l36j40O7J84N3J52J23k77J61k41K07j35K36m48Q6J48k17J47
$$ y = [-48, 23, 139, 128, 47, 31, 225, 42, 263, -96, -13, 24, 209, 98, -127, 60, -73, 54, -211, 73, -67, 72, -60, 90, -191, -39, -92, 31, 223, -92, 65, 23, 110, 24, -47, -320, -115, -150, -28, -99, 29, 258, 59, 302, 195, 300, 138, 156, -114, 203, -10, -80, 353, 42, 59, -154, -49, 223, -101, 151, -72, -8, -284, -344, -39, 218, 26, 54, 157, -13, 90, 169, -212, -73, 112, -362, 198, -142, -357, -36, -97, 124, -3, -307, 124, -32, 80, -122, -198, 120, -17, 45, 52, -6, 202, -67, 330, -217, 83, 35, 67, 172, -33, 142, -99, 133, -183, 93, 94, -89, 30, -177, -71, 126, 118, 268, 22, 17, -29, 209, 188, 2, 75, 5, 111, 42, 233, -56, 69, -257, -2, 362, 94, -94, 11, -192, -222, -34, 7, -93, -3, 187, 47, -20, -286, -4, -48, -85, 32, -1, 144, 93, 156, -75, 230, 7, -180, 160, 31, -64, -161, 145, -191, -331, -264, -80, -27, 125, 248, -29, 132, -109, 98, -37, 199, -249, -163, -15, -232, -85]
7229h5J02l10K5L21J25k46J17q9J7L9J95k21p2K97l52K57J78m39L65l59L5J5l8
7252a23l0K3O4m3J65j29L4Q3j65j02L79l67K02K93k31l17L84k16m1j49J55j7L16
7275A68k22j85L00l21K5J93R7k5J20k73L8P4p3M9K6j73J87J69m23K57J5kJ65J0
7299A96k04j16J45n3J11m42L51q5m7J68l1J9N7K5K4J5k57K96j57l55M93j86L39
7322C06l80K85k50J45k08M4K3j24K53j34L2l07J68J36m1L22j31k55r3N22m93K57
7344G7J40m96K12p2P8k14L96l42L23k24J38p2J22m87N40j8k97K36j85J30r3J62
7366E4j41J34j69J36m1J76k7l24n0K18L82l56K1J0l8j02R1M92p97K14K5K10j40
7389b2K49j27L7k4n1J02k58L12r2l45M21J6j81m1J14k15J79k27J54k96N99j30
$$ y = [-85, 17, -293, -268, 53, 178, -68, 49, -40, -23, 16, 211, -10, -82, 215, -137, 120, 298, -141, 224, -135, -100, -85, -123, -153, -130, -66, -109, 56, -73, -39, 44, -121, -223, 156, -211, -9, 284, 53, -264, 120, -96, -137, -286, -131, -148, 168, -54, -239, 61, -260, -235, -42, 55, 30, 150, -123, -85, -11, -84, -35, -9, -182, 5, 174, -249, 8, 23, 21, 186, 196, -8, -124, 21, -32, 79, -363, -12, -97, -144, 24, -7, 12, 69, 94, 118, 133, -124, 172, 15, -340, 153, -33, 306, -74, 211, -39, 106, -102, -58, -35, -159, 94, -40, -8, -315, -147, -11, -52, 270, 139, -116, -209, 313, -180, 77, 217, -279, -67, -139, -61, -275, 121, -221, 102, -122, 16, -56, 66, -421, 119, 101, -196, 40, -145, -15, -108, 54, -87, 47, -122, 14, -27, 149, 122, -202, -252, -34, 348, -8, 13, 23, -15, -117, -26, 466, -331, -117, -92, 118, -22, 227, 100, 137, 113, 62, 164, -94, 218, 126, -219, 202, 218, 37, -4, 110, -105, 74, -153, 1, -295, 304, 174]
7411A74l85K60l67K35o0R1l1P0K37l62qR8m3L23k10M0L7Ql07J56L34l37J62l15
7435b00J35J02n1J2J53k60K20j55p2M45m49K0K10j52L8L7k30K29j69N32k82k06
7457i3j24L38P0j96j65L02j63M8m6o9j23L15M0r1K6j43O5k9J42l69M89m06M40
7480B58l98J28M3Q8j57Q5Kj65J62j66Q6J0k3M2n5M6qj84K06r6K04Q8j21J01q0
7505I6r4N7J19k49Q4J82Qk32Q4np1j09J29m31L78k5k19L92k99J50J04K44k45J
7529D9no6M3k01M2K46q0k08%J20J42j12J64j12R1k13J77M7l00K03j10K70j48k3
7553A6oj87O1J2j13N0N3Q2l0j15R1K96j94j28O25n81N2k84r9N01p4j04J61j60
7577g5L72l16J26l80P8K86m49M41k99j7n2J56j14K34j2M8r8J09j4l1k1j59l5L64
$$ y = [174, -211, 49, -318, -83, -143, -52, -83, -13, 224, -138, -146, -48, -91, 232, 22, 62, 99, 107, -200, -44, 290, -47, 115, -200, -65, 37, -14, -2, 151, -109, 111, -44, -116, 329, -120, -100, 110, -42, -4, 33, -197, 32, -137, 395, 113, -93, -217, 121, 191, -5, -170, 132, -31, 17, -29, -98, -221, 94, 134, 43, 69, -74, -9, -38, 104, -265, 224, -182, 258, -140, -12, 31, 119, -38, 47, 49, -116, 46, -120, -34, -24, -47, -5, -60, -14, -22, -206, 0, -96, 108, 196, 75, 176, 96, 2, 59, 178, -71, 13, 195, 203, -29, 55, 50, -21, -130, -1, -432, -54, -79, -298, 94, -205, -55, 49, 293, 48, 49, 44, -22, 21, -180, -138, 108, 28, -180, -180, -60, 82, -30, 134, 22, 113, -100, 77, 124, -176, 27, -83, 187, 39, 16, 10, -177, -116, -104, -217, -167, -114, -32, -62, -177, -86, 210, 16, -112, 513, -68, -16, -300, -399, 102, 28, -76, 85, -75, 297, -19, 107, -273, -195, 91, -358, 83, -216, -233, -285, -129, -243, -9, -21, 27, -71, 38, 24, -7, -28, -187, -222, 142]
7601A42r1R8k41j02M43l56O5j69Q2R0Q2j02r6L4J38Q7k12L87m29K88j69j72K54
7624E1K6J59l64L54q5j28k86M43n19R7J96oJ39R7l34L44m7p9K00k05j95J07J96
7647A61j49j66J72k68N3K87J66Pm48J10J09k2r8Oo3P9J54j3j90K91k18M9k21J66
7671d6J57O8j54Kk5j44J88q5j26J18K3J62P2j9q2p5r5J06j2O4j40K6L13k46J0
7696F0j61Q0L65l70M08m37J79j86k8j8R9Q5k02J10r8J56J51n29J75J05k1K53j17
7719E9J9K9j91Q4Q7k78l9K48N1L7p8P3rR5l92L04rp6k12J36J05Q9R5M9k71j86
7745a81K30o9K26k8q2J3j77L20j65o2J73j38j29J74M7J29l65j4j21J32J13k7k2
7768b3O7J70M7j8k81L5J53J31k62j83K19n4rJ41k00r1J99k4j67K04J51j52o9J07
$$ y = [142, 51, 149, -92, -194, 249, -107, -42, -211, -129, -39, 43, -59, -155, -121, 17, 104, -108, 279, -150, 138, -31, -203, 51, 77, 236, -128, 226, 141, 13, -273, 170, -349, -252, -56, -62, 77, 174, -160, 184, 137, 58, 258, 53, -142, -35, 161, 12, -154, 18, -250, -197, 90, 256, 263, -185, -75, 34, 12, -86, -80, -143, -64, 90, 77, -113, 178, -40, 9, -212, -46, 111, 179, 25, 27, 2, -142, 46, -39, -165, -47, -24, 138, 210, 191, 109, 34, -61, 45, 33, 97, -43, -17, 296, 50, 60, -101, -21, 344, -26, 382, -55, 124, -62, -90, -108, -9, 76, -126, -16, -114, 42, 193, -336, -161, -56, -77, 176, 59, 78, 107, -84, 0, 87, -191, -230, 18, 69, 106, 28, 101, 92, 187, -205, 99, 90, 14, -198, -62, 43, 132, 227, 276, 5, -181, 49, -20, 206, 178, 96, 109, -68, 252, 87, 25, 198, 60, -69, 105, 152, 281, -84, -98, -219, -87, 26, -1, -23, 44, 214, 261, 243, -38, -3, 150, 281, 19, -164, 55, 1, -8, 133, -67, -158, 41, 17, -150, 54, 205, 53, -16, 91]
7792I1o5j15M9qm2K54j07o3J39l57L76k22K59j40k34j17J22J52k2q3p2L65j38
7815B2J92m7lo0J00K6j35l0p3j16K85j01q0j61N1M2K41p4j30k4J70j98K3N5K24
7840A99m76K24l8m7J3J50L3K4k52N0n0J07k13J07L25l7j25j65L04p6k37J99K15
7863B34k32J49j99J60j0j7j31J17j56J81j59Q6r4K0L8M6J05l05K72Q2j81j84J69
7886io4j61J70K55l20k22J80J98J82j81p3J45j34J13j89j02L21k81q4M06j36l23
7908c09M54j69Q3K7M9nj69Oj13m9J88K54r0j62pM4Q2k41J1J02j08K20K1j20K2
7933B1k82L38m3j26P4m6r2J74K45l03k10L02j50o7P4J09M4j84k0K8J40p9K13j14
7957D6j5k8m27N32j77j63L27j10O2l84K66M25o31M43j53ml80L32j30k2M0J91j92
$$ y = [91, 26, -89, -40, -48, -90, 164, 57, -6, 133, -224, 152, -70, 189, 49, -185, -302, -180, -28, -50, -133, -205, 160, 22, 214, 167, 164, 104, 204, 230, 95, 65, -8, -124, 161, 60, -20, -181, -130, -88, 153, 79, -51, -75, 95, -103, -80, -25, 199, -277, -53, -91, -138, -125, 25, 58, 82, -170, -120, -170, -63, -276, -169, 156, 119, -6, -171, 133, 57, -180, 19, 234, 2, 151, -48, 112, 102, 85, -46, 71, -85, 96, -63, 23, -71, -51, -13, 33, 138, -167, 105, 187, 6, -178, -9, -73, -234, -64, 191, -129, -351, -171, 27, 209, 28, -45, 100, -34, 79, -110, -212, 109, -172, -256, 150, 14, -309, 145, -24, 59, 86, 135, 130, -39, -33, -146, -195, -7, 247, 157, -5, -12, 32, 114, -127, -116, -14, -122, 98, 119, -1, 21, -261, 77, 34, -92, -18, -64, -156, 18, 263, -40, -250, 52, -98, -165, -91, 18, 62, -122, -142, -114, 26, -53, 160, 46, 31, 3, -424, 108, -69, -232, 95, -15, 47, -337, -71, 354, -277, 166, 13, 9, -371, -39, -169, -191, -151, 40, -152]
7980a52K57P1k26M3j2n1J5K3L90j45j55R3J0k29K23J6k89Q8Rl6L4L32n09L70l86
8005b16o7N61l29K09j36j08j7N23n31N6J33j74N45l80kq9Q3o0Nl09N22k79k6k2
8029a08J69Q6o5j40J98l9j20k52N74l82K64j98o0K35M7n75N80J01n30K27NJ78
8051A95k73J4K05k66K16l4j90q9K24k9o4j09L26k58J51m3l9LP6r4Q9Q1m15J46
8075a77L90k54j33P7k1k71N98k16K0O3j09r5K57l33L63n0j86J66p6q4J84n2R6
8098A57j33k84M57j7q3J47n8n07J67K71j48J74j2N8k90K17ko3q0r0L83l21K42
8121A85k95j11M72k48n9m4L0L36k90j7j58j6J95K5j6k11L29j70J84k25r2L07j07
8144DK07p1k71J17Nj20L0J13R4l35L26k68L27p7p2L2KL2j79K86j62r0K90n4j10
$$ y = [-152, 105, 176, -50, -7, -19, -70, -55, -32, 358, 213, 58, 151, 161, -68, 155, 171, -118, -30, -21, -57, -23, 309, -200, 170, -216, -283, 278, -51, 158, 22, -86, -103, 420, -111, -55, 78, -96, 449, 69, 67, -22, 61, 1, 6, -303, 219, -60, -86, -108, 61, 147, 82, -58, 140, 101, -19, -271, 303, -79, 185, -13, -73, 162, 209, -366, 214, 315, -215, 12, 17, 195, -78, -64, 141, -125, 91, 57, -133, -222, 2, -27, -91, -200, 126, -132, 19, -24, -63, -60, 16, -78, 11, 92, -323, -177, 213, -41, -174, -97, -118, -389, 209, -7, 13, 76, -33, -128, 129, -204, 159, 109, -77, 89, 13, -71, 113, 61, 157, 24, -260, 197, 180, 97, 244, 186, -321, -154, 117, -31, 143, 131, 189, -101, 116, 114, 51, -29, -119, 264, -57, 185, -110, -221, 251, 3, -56, -100, -70, 266, -24, -41, -199, -215, -20, 5, -11, -222, 107, -63, 121, -104, -196, 111, 4, 211, 140, -131, -14, -9, -129, -99, 14, 108, -227, 99, -169, 158, 81, 9, 41, 43, 75, -104, 182, 20, -70, 220, 166, 56]
8169E6k27L24p1j77M30m27r6N2k9P1R8J07j61l04M10o7n2J78j78k07N07k65
$$ y = [56, -171, 153, 82, -95, 335, -92, -188, -136, -165, -94, 4, 111, -50, -354, 56, -11, -63, 115, -63, -270, 237, -28]
8191b8
$$ Imaginary data points
##PAGE= N=2
##DATA TABLE= (X++(I..I)), XYDATA
0@%%%%%%Qj6J6j6K4l2L2m0M8n6P2q8J04j20J39j62J88k18K51k86L26l73M22m77
30b54N40o06O77p59Q49r44J051j170J300j443J598j767J955k166K401k660K954
47A556l289L671m114M635n257O014o961Q189r850J2233j5974K2737l8824J45263
61A20029J59726k42824j52292N0522K09213O6236j18725j58591J8954J31790O5568
72A49606r8221j08798J7609J19510M2575r3951j14713K4184J27677O6033q4876
83D6635j21846j5403J00702Q5312k4499r3733m4184M1849N5897k0l5510j6766
95b1566J4799Q950j6985j9442J3387L0971J849l6003k6711J5981L2910J0259j8376
108i977j6640N748J1217p595j1019J8701L5722K869m4547m2582J8666P1539M3383
$$ y = [0, 0, 0, 0, 0, 0, 0, 8, -8, 8, -8, 16, -16, 16, -24, 24, -32, 40, -48, 56, -64, 75, -87, 101, -117, 134, -152, 174, -199, 223, -254, 286, -320, 357, -402, 447, -497, 554, -616, 684, -759, 839, -928, 1027, -1139, 1262, -1398, 1556, -1733, 1938, -2176, 2459, -2798, 3216, -3745, 4444, -5406, 6827, -9147, 13590, -25234, 120029, 279755, 36931, -115361, -64839, 144374, 210610, 91885, -66706, -47752, 84038, 149606, 51385, -57413, -39804, 79706, 122281, 28330, -86383, -62199, 65478, 131511, 46635, -75211, -90614, 10088, 95400, 70901, -22832, -67016, -25167, 30730, 30710, -4800, -21566, -6767, 2183, -14802, -34244, -20857, 10114, 11963, -24040, -50751, -34770, -1860, 8399, -9977, -26617, -20869, -9652, -17247, -28266, -9565, 26157, 29026, -15521, -58103, -39437, 32102, 75485]
121G5485m4516q4356j9042P0528P1687j2439p5142m4021L6167O2355N160n3417
133a1551l3600L0660M7602n172n3853l0520M0844O6009M891o7724n5392K7445
145d0361P8912M1672l9988p1575j9763N2602O1527L654m6221l7267P748L7448
157B8388K1681j6063k7877l410J9073J0291j3552k3357m799K2002K3694j2603
169B3468m4474k8097K4406N2896K0761m4483o7801j2972O1455O4570r958p1042
181c1271m7734K9938O9944K4626m7882n3371J2658N8419K3185m0138m5204J6281
193c0549O1483K3744n2916o1788J4745P8558M4437m6407q2096j8280O7244O9190
205F7365j3524p2868l7884L5337N3902K771m1802k6228K2514L2458r220l6747
$$ y = [75485, 30969, -53387, -72429, -1901, 69786, 57347, -17795, -61816, -25649, 36706, 41866, -11551, -45151, -14491, 33111, 27939, -25914, -56434, -15590, 50419, 55310, -12414, -67806, -40361, 38551, 80223, 40235, -31340, -51103, 1499, 63026, 66680, 20459, -16808, -9060, 28388, 50069, 34006, 6129, 2719, 21792, 32083, 18531, -4826, -9625, 12377, 36071, 23468, -21006, -49103, -24697, 28199, 48960, 4477, -63324, -76296, -14841, 49729, 39771, -31271, -79005, -49067, 20877, 45503, -2379, -55750, -43092, 15327, 38512, -1626, -46830, -30549, 30934, 54678, 1762, -60026, -45281, 33277, 77714, 31307, -50789, -69069, -1825, 67365, 53841, -19027, -56911, -21574, 32328, 35099, -6703, -32931, -10417, 22041, 12821, -23926]
217b3926r067L4360L0120j6558m4673j7190L2766M1060j846l8309k3678J3376
229b3565K3671M213j0735k932Q211k324k0403r498K7460L5452n226m6901l0572
242e3149K7411N6252J5867m4519m7661J3182N5305K1414l7273m0463J4528N0658
254C1552J3889m8323m5332K7187P0082J8878o4921o9186J5283Q4916M9104n1567
266C1562q8787j5192P4088O4061k5515p6422k7472N1265N6387j5733o3775k1141
278e6674N0226N0812j9828o5855k5304N1909O5079o011p1247m6296L4815O9206
290C0832J9963m7729n1757L676M7114K7996k0979l2884j377K2707J1100j3566
302d904j5413N686K0415N061j9647j8409O694K2444J1628q947j7970q720P448
$$ y = [-23926, -32993, 1367, 31487, 14929, -29744, -46934, -14168, 26892, 25046, -13263, -36941, -23565, 106, 4319, -6416, -9348, -1137, -3461, -23864, -33362, -5902, 29550, 24324, -22577, -53149, -25738, 30514, 46381, 1862, -45799, -32617, 22688, 44102, 6829, -33634, -19106, 31552, 45441, -2882, -48214, -21027, 49055, 67933, 3012, -66174, -50891, 34025, 83129, 31562, -57225, -72417, 1671, 65732, 40217, -36205, -63677, -12412, 43975, 28242, -35533, -56674, -6448, 44364, 24536, -41319, -66623, -14714, 50365, 44354, -26893, -73189, -38374, 30832, 50795, 3066, -48691, -45015, 2099, 30095, 9116, -23768, -25145, -2438, 8662, -4904, -20317, -14631, 5784, 10845, -8802, -27211, -20517, 1927, 13555, 4608, -13362, -22082, -14634]
315a4634J2816P564J675m530j2308r982O228K1024J4330q354k3176j3298J4749
328g896K7124P056j8451j7937L373J6918Q310q935j0129N885J4773j250j9046
341b05j0050J5232K5554L894k4914k6756L718L2044K2385j2425l1090j4682J3441
354c854K4962Q754j4913j8686k719R658Q164L6n516m876n4K458j499m723j260
369d068M194O735N53j1087j5194k6K0534J8448o566k8997k0985J3719L6341J6605
383C0206k5841l7266l694L3933K8782j0909l4594j3242K6023K7934r101l2361
395b0130q012K9790K8334j3425m2227j4708L7351M5252n899n1894l2440K7501
407b0507N2934J4402m0586m2479Q891M4631K0298k5880l2920M162L1636J3999
$$ y = [-14634, -1818, 5746, 7421, 2891, -9417, -19399, -13171, 7853, 22183, 13829, -9347, -22645, -7896, 19228, 26284, 7833, -10104, -6731, 10187, 18497, 9562, -567, 5318, 20091, 18841, -205, -10255, 4977, 30531, 34425, 9511, -17245, -13527, 18517, 40902, 28477, -2613, -17295, -3854, 21108, 29862, 14949, -3737, -6456, 3202, 11366, 11402, 5886, 1010, 956, 3414, 1915, -2808, -4068, 126, 6861, 7414, -3673, -18867, -18893, 1641, 20089, 13523, -15474, -36459, -22740, 13601, 30206, 4365, -32901, -36595, -2662, 26120, 15211, -19383, -32625, -6602, 21332, 12231, -20130, -28142, 1648, 29982, 16557, -25670, -40378, -3027, 42225, 36326, -15568, -48008, -20507, 32427, 46829, 6243, -36236, -27345, 17286, 37584, 11704, -21216, -17054, 14582, 28581]
419B8581k3481k7178R353L5133J1154k9827l2179P633L7583K0934k1301l5634
431a9229n116K8113K2013r239k1456l968J3347Q438q996j0061Q856J7001j988
444A7715k2759j1748J6998K6225J683k5569k0310J1648K7080N466k1158j5295
456a0024J1262J8978l022k2377r317K1426K5278r552l7728j6742K8670L8436j053
469C4235m1662l1793J8261M3910J2174l4048l3763Q271L5290J3815k5397k8857
481b9564Q305L3786J0434k9219l0538J0737L9522J7439k7842l9796q87L9433K9739
494C1549j5294l7670j2902K3886K8579j072k4770j4086J3572J8831j752j6668
506g797o124J2393J4541l885j8428q654J2922J8190J879j5638j3897R17J3810
$$ y = [28581, 5100, -22078, -12725, 22408, 33562, 3735, -28444, -20811, 16772, 37706, 16405, -19229, -24345, 3768, 25781, 16542, -4914, -8882, 4465, 12903, 3907, -6154, 2702, 19703, 17715, -5044, -16792, 206, 26431, 28114, 2545, -17765, -6117, 20963, 26429, 5271, -10024, 1238, 20216, 17194, -5183, -14500, 6926, 32204, 22652, -15076, -31818, -3148, 35288, 34235, -7427, -39220, -20959, 22951, 35125, 1077, -32686, -24415, 10875, 24690, -707, -29564, -21259, 12527, 22961, -6258, -36796, -26059, 13463, 30902, 3060, -36736, -37623, 1810, 31549, 16255, -21415, -34317, -10431, 18148, 17076, -7694, -21780, -8208, 10623, 8871, -7797, -13921, -1528, 13013, 9128, -9300, -17954, -5032, 13158, 15037, -601, -14498, -13581, 229]
519B29J1146k140j0282p725N00N547P193L312l869p969l753L447P688M651l851
534D124o779q46N290J960l036j145M143M356j994r364n843Q305J4303J795j3713
549A556j3851J330J5213J0872n755j5525p117P312R236L12n628m251k85O86j471
564g366j621K517M115j762p345m193L087O030K512k742l957j148R11q73J786O690
580c359N137n409j1799l283J2560J6700R65j7433j4711Q371K2479Q959j4245j7569
594a2637K116J9093J0485j2129j6967M898K1342P274j8453k1125N642K8075J5236
607C2850k0402l1651k421L0745K4129j2621l3237j1742K2583K6412m724k8300
619h379j2364J8276K0986n630k4104r654J9624K2418o712k8610j2599K0666K7060
$$ y = [229, 11375, 9235, -1047, -8772, -8272, -2725, 4468, 7780, 3911, -4058, -7811, -4364, 3324, 7975, 4124, -2655, -3501, 1789, 3749, 713, -432, 3711, 8067, 6073, -3291, -9134, -829, 13474, 15269, 1556, -12295, -10965, 4248, 15120, 9365, -6160, -13277, -5965, 3271, 3583, -2045, -6296, -6581, -5895, -7366, -8987, -6470, -2355, -4117, -11462, -15655, -12568, -6538, -4026, -6768, -10725, -11873, -10962, -11835, -10049, -3359, 1778, -3631, -15430, -18713, -6153, 10547, 11512, -5921, -20632, -12261, 10218, 19177, 4932, -12637, -10521, 8572, 19057, 6928, -10039, -5141, 16201, 23475, 5022, -16103, -10461, 17614, 32850, 12448, -19203, -21624, 9121, 33250, 20629, -12608, -24350, -1767, 24645, 19921, -8379, -20743, -2467, 18519, 12889, -11215, -20869, -1245, 21173, 14461, -14149, -26748, -6082, 20978]
632B0978q23k7176j9067J2555K6635O186j9807j6563O553J7286L653j2991r496
645a2077Q209J3523k574j6721p049J3757J5766l293j8695j0408J0405J7732J033
658I608j5397r668P917J1770k346j1325k573J1212R882q641j6435r58J9343J4510
672A6899r347k1823o497J8014K0736k788k1417j0402J3774J7803j097j6557p573
685a0275J2580J5301l958j8764p055J6268J8882m613k1761j2369J2818K2409L683
698B3146j9440j7382N528J8478P567j1029j4233K02J2001N907p607r675K172J0220
712E855L225q300r552J149J1059P927n595j1631l432P039R496K063n801o744r23
727d165N173N383J114k125l818k162K604L867R68j570k022M6J434L51k227j492
$$ y = [20978, 20155, -7021, -26088, -13533, 13102, 19288, -519, -17082, -10529, 6757, 10410, -2581, -12077, -3868, 9655, 7081, -9640, -16689, -2932, 12834, 9541, -9154, -19562, -9157, 8575, 9608, -5789, -15457, -7540, 4230, 1884, -9441, -12014, -802, 9080, 439, -15996, -16954, 2389, 16899, 7552, -14271, -20768, -2754, 17982, 15194, -6223, -16625, -2851, 14952, 13855, -2702, -10275, 2305, 17606, 13648, -5116, -12171, 4097, 22979, 18366, -3395, -15764, -2946, 19463, 23146, 3706, -13676, -8148, 10330, 17897, 6868, -7365, -7163, 4838, 10745, 3138, -6537, -4365, 5855, 9080, 780, -8772, -7623, 3436, 11363, 5768, -5863, -9295, -2256, 7240, 9303, 3502, -3242, -4165, 1008, 6391, 7505, 5380, 1562, -600, 2004, 5871, 6839, 5269, 3247, 3293, 4727, 5078, 2851, 1359]
743A359L570M138k347p247m374M303R202K342p992j0779m4R763P477m263r734
758d626l636N167O559r83o577j276M766K221m272m670K046O880L970o448q442
773i321P27R466N699m122p626j025N416L914k449l897K365M756j487p017k269
788f870P713Q382j720j2153p359Q278J3801N59j2441r332N849J2161K404j0525
802a253q713O628J2459n36j3979p568R958J6380Q2j7537j3565R943K0851M991
816A8141j6798j7223M675J9615R231j2556j6821J830J7268P874j2009j4600L228
829h145J6828P499j3144j7065K216J9190J0793j2280j9263k115J6832J3220o964
842G602j6715n276J2255J0898m776j2506k518J0096Q027n860j2699q36J2452Q783
$$ y = [1359, 4929, 9067, 6720, -527, -4901, -598, 8604, 10946, 2954, -7825, -7869, 1894, 9371, 5108, -4626, -8262, -3095, 3464, 2481, -4096, -5372, -606, 1615, -2657, -7327, -5281, 1599, 5569, -879, -9321, -8594, 872, 6571, 2449, -5177, -6202, -786, 3128, 679, -3218, -853, 3903, 2416, -4601, -6870, 843, 9225, 7505, -4648, -12007, -3729, 10072, 10631, -1810, -11142, -5293, 6868, 9272, -1253, -9966, -3338, 9121, 8585, -5394, -12962, -3004, 13376, 13458, -4079, -17644, -7701, 13150, 18141, 1343, -15880, -11205, 8410, 17641, 5085, -11736, -9906, 7362, 15236, 3227, -11373, -8145, 8683, 16182, 3038, -14027, -11811, 7379, 18172, 5892, -13371, -15486, 1346, 14566, 7602, -9113, -14389, -2134, 8764, 3988, -8518, -11036, -940, 7087, 1227, -11472, -12308, 144, 8927]
856H927p334j3233j868J1170J0173l700j1365m167Q457P959l062p381o20P091
870A047M011n119p273K058J0340M250q449j0002K027J1153O825o323j0909j322
884g686R356O712m358q520j25P193M115n096p923J003R675M623p683r769K33R990
900A740P036m593j0727l852P776Q175j079p440m212L427N252M01m996k770L714
915b148M113j533m859k117L733N229K04m923m578J486M822K906j250l753k883
930e551O12M147K451q17l309j729N30L131K108k233k514k57L057J140k047k397
946c678J151M054J507l769n329J120P332M269l821p656k438O439P694j228p619
961a972l899M129O205K52n459l192L889N539j576o577j753O075O304k137q107
$$ y = [8927, 1593, -11640, -13508, -2338, 7835, 4135, -7230, -11397, -2940, 5019, 1957, -5424, -6044, 1047, 5058, -61, -7334, -5276, 5064, 9314, 865, -9137, -7110, 4043, 10868, 4545, -6364, -7686, 1670, 8382, 4024, -4496, -4621, 2572, 6687, 1591, -6332, -5329, 4346, 8969, 1286, -8483, -8250, 1740, 8776, 4183, -6544, -10396, -2620, 5555, 4476, -2964, -7176, -3749, 1503, 1904, -3092, -5862, -2148, 1965, 432, -4427, -6544, -2811, 2418, 2622, -2301, -6879, -5393, -571, 2335, 1085, -2668, -5551, -4939, -792, 1659, 842, -2467, -4196, -3666, -535, 1573, -660, -3174, -3431, -374, 766, -1281, -3678, -2527, 1527, 3034, -735, -6064, -4944, 2388, 6657, 2836, -4820, -7258, -819, 6875, 5647, -1972, -5871, -1742, 4463, 4715, -744, -3936, -47, 5492, 3916, -2661, -4414, 1661, 7965, 5828, -2279]
976b279l877N797Q197k59p763m725M142O824K94n537l723L688N360j707o415j352
992c335O561N438l397q721k146P176Q102k455r828m419P171P873j349r031l223
1007e583O301O880k897q580k611Q331P991m283j1075m003R598J0617k435j3063
1021d812n837Q037J1481k26j1105o982N938J0760L56j0496o275O738J0404p12
1035G269j0766o979O907J2182O08j1595q972N561J2096L082r124r257K141J0668
1049C821L921p294p767K661Q344K727o759o464K606Q924K918p505p260K528R046
1064D447L710n862p357M79P124M358m099n462Q29N106J830l635l937J986N519
1079E036R12n259m093K687O102J817n013m880Q24N152K496l670l739P06L734J125
$$ y = [-2279, -6156, -359, 7838, 7579, -184, -4909, -767, 6057, 6351, 814, -2909, 779, 6139, 4432, -1983, -3335, 3226, 8664, 5267, -3454, -5600, 1576, 9678, 7223, -2605, -7024, 147, 8020, 6671, -2360, -5583, 718, 7598, 4701, -3879, -6490, 1841, 9832, 5549, -5526, -9529, 69, 10686, 8251, -4812, -10649, -2612, 8869, 8643, -2462, -9444, -3506, 7254, 7610, -2886, -9161, -2423, 7981, 7269, -3497, -10476, -3569, 8613, 9221, -2374, -11346, -5785, 6311, 9393, 269, -8988, -6847, 3821, 7742, 448, -7319, -4658, 3686, 6413, -346, -6810, -4204, 4720, 7638, 133, -7127, -4599, 4447, 8157, 2295, -5062, -4583, 2541, 6899, 2800, -2662, -1833, 3273, 5103, 1468, -2469, -483, 5036, 5948, 689, -3404, -717, 5385, 7202, 2189, -2691, -1867, 3285, 5781, 2111, -1628, -922, 2812, 3937]
1095C937l498k311J508L534O35m352l512K649M583R64m076m166R77L906K527k061
1111A244l633j58K072J538l87j915j81J239J043j014j812O27J896R72q35j758
1127a062q31J321J617J221j384j596j144R65K168J071r47k592j077J737K413Q7
1143A967k247j597R90K444k41k698j132J805K619j11m004k248K749M561P14n199
1159a628m160K117N589K505m206n358M81N536K670l327m461M26M562K160l255
1174c49m886Q94O153K258m728n495P80O529L640l609p065q37O405M239k860n919
1190d850o56M923L472k959n440k7O121L266m198o032Q26O117M335m459o234m07
1206f202O389M838l620o004m71N763L980l088o466N82O316L521m318o254L74O779
$$ y = [3937, 439, -1872, -364, 3170, 3805, -547, -4059, -1410, 3173, 4137, 61, -4105, -3128, 778, 3305, 1244, -2389, -2547, -475, 1063, 676, -1239, -1420, -181, 862, -152, -1964, -1337, 559, 1531, 696, -1062, -1893, -572, 1045, 2266, 882, -714, -1858, -893, 1275, 2346, 1399, -1193, -2270, -533, 1880, 1967, -280, -1877, -887, 1557, 1316, -1382, -2514, -709, 1910, 1799, -2205, -4453, -1704, 2857, 3571, -1628, -5788, -3671, 1918, 4423, 217, -5141, -4660, 876, 3546, 219, -4242, -3816, 746, 2906, -349, -5235, -4341, 1812, 4070, -658, -6153, -5373, 1156, 4796, 1187, -5878, -6715, -310, 3929, 1069, -4850, -5506, -583, 2889, -70, -5510, -5537, 584, 3850, -348, -6380, -5554, 563, 4898, 439, -5795, -6202, 187, 5025, 1405, -4599, -5070, 693, 4673, 1585, -4881, -4299, 2017, 5538, 1220, -5034, -4660, 2119]
1222B119M558m386p192p12P390N129l341p438j564N835N425k556p093j379N978
1237G73M911l071p060j128O077N482l066p778j934O087O276j792p576k761M865
1252a695O037p62o184l079M606N132j280n387k229M047N186p67o048k841M228
1267a036N592l59n227k994K499M944N84m015l017J950L653Q4l023j729J734L148
1283B788k87l236j758K045L449l08l476j903J770K475P20k008k259Q74J932J89
1299A007j410n56R52R67m98j490p38J786J391l63k111m35Q14J252O13j219p84
1316h22J32M96N48k78M06j62o39k55L64L05N00k18o62k12N79l3k72M12M84J91
1336H64p09r28K99J553J422j274k393J03K069J944r94k134r98J756K399o27k322
$$ y = [2119, 6677, 2291, -4901, -5613, 1777, 6906, 3565, -3873, -5437, 398, 5823, 3267, -3826, -5205, 773, 5684, 2613, -4447, -5575, 502, 5984, 2918, -4860, -6794, -707, 5569, 3777, -3799, -6560, -1695, 4342, 3580, -2604, -5683, -1077, 4055, 2775, -2612, -4841, -794, 4392, 3625, -2423, -5264, -1036, 4556, 4197, -1030, -4024, -1525, 3419, 4003, -12, -3029, -1079, 2574, 2658, -365, -2094, -360, 2788, 2501, -735, -2493, -448, 3001, 2693, -783, -2686, -916, 1559, 2279, 271, -1988, -1114, 818, 1007, -403, -959, -7, 960, 462, -1028, -1766, 20, 1411, 1048, -1063, -1498, -684, 568, 1181, -38, -822, -690, -194, 354, 76, 482, 320, -319, -574, -210, 95, 595, 377, -285, -497, 82, 49, -223, 189, 673, 864, 155, -773, -474, 1079, 2501, 1227, -1166, -1063, 1006, 2950, 1956, -178, -1176, 580, 2979, 2352, 30]
1353C0q18K578J957j182l095l67K523L272j007m435j379K954L802n16m108k820
1369b611K676M029K00m257k373K514L938o21l705k628K620M249J29m808l388L133
1385i03M920J76m363l961J858N623J111m697l746K404M461O28l936l504J953N232
1401C256O84m908l499K527N202R03m548m202J619N853J793m707m096J707N018
1416B602J452l611m267J328M965J405m260l704J766N133J485m363m294J398N390
1431B425K273m302m752J292M763K165l582l913N96M699J693l158m118R58M721
1446A760J618l086m350Q09M299K709l172m386M35M007K410k165l739m58L741K157
1462B589k050l591J63L582J676j960l327K0L163K608k051l540m10K849K448p84
$$ y = [30, -788, 1790, 3747, 2565, -530, -897, 1626, 4898, 3891, -544, -1923, 1031, 4833, 4317, 209, -2611, 65, 4094, 4294, 37, -2336, 178, 4116, 3495, -210, -2838, -218, 4031, 4160, -648, -4036, -903, 4017, 4193, -170, -4131, -2273, 3350, 4461, -236, -3982, -1578, 2883, 3511, -425, -3929, -1976, 3256, 3940, -968, -4467, -1940, 3262, 4165, -383, -4585, -2966, 2887, 4680, -27, -4123, -2416, 2602, 4054, 443, -3824, -2496, 2469, 3874, -386, -4090, -2324, 2809, 4294, -69, -4363, -2965, 2425, 4698, 396, -4356, -3064, 1699, 3864, 282, -3631, -3035, 1664, 3357, 199, -3919, -2961, 1760, 3378, 292, -4058, -3249, 1050, 3759, 587, -3799, -3364, 643, 3053, 888, -2851, -3309, 432, 2589, 539, -3052, -2889, 693, 2369, 409, -2918, -2898, 265, 2873, 822, -2718, -3128, -279, 2169, 1385]
1478A385k931j000J893K469p41k345n77J550J679q43j751o93J743J816r30k001
1494a277l18J379J235K8j400r47Q40J090K51j201n14O45L33j41k47q7o6O37l43
1513a03n77L72j45M72R0j12l43m65o9P59O28n37p23q52K55J798J26r89q77j6Q80
1534d28O86q15j015N50J287K57j178j266O06J664R42j710k222P39K552Q01j767
1551c17k166J44K366J522j706k252J56K408J557j862k257K54K686J195j646l049
1567b967k4L768J447j871l242j62L173K440j623l108q52L179K297j629l304l58
1583b836L286K199j793l260o88L888K542j982l773q35L301L260j229m063j537
1598c520L543L427j864l238j290L204K891j221l689j264L343L363j210m208j380
$$ y = [1385, -1546, -2546, -653, 1816, 1075, -1270, -1847, -297, 1382, 539, -1212, -1905, -162, 1654, 724, -1277, -1595, -216, 1019, 1047, -353, -1300, -460, 630, 881, -320, -834, -189, 144, 3, -244, -331, -397, 240, -103, -680, -308, -453, 19, 109, -3, -346, -811, -880, -121, 507, -30, -753, -1605, -1350, 448, 574, -415, -1292, -1308, -428, 258, -557, -1572, -1022, 265, 522, -656, -1922, -1316, 348, 1290, -420, -2642, -1903, 649, 1450, -317, -2483, -2339, 27, 1549, -157, -2409, -2253, 155, 1712, -150, -2407, -2153, 533, 1728, 82, -2967, -2991, 777, 2224, 353, -2889, -3051, 122, 2562, 939, -2169, -3021, 158, 2455, 826, -2478, -2836, 450, 2649, 856, -2404, -3092, 796, 3338, 1356, -2417, -3252, 49, 3309, 2080, -1983, -3520, 23, 3450, 1586, -1652, -2942, 262, 3153, 1932, -1757, -3021, 322, 3685, 2475, -1733, -3113]
1613c113L392L347n20m287j648K527L852n29l941j474K073L817q29l354j918K773
1629A68L129l96l508j737K640L028j16l407k447K303L317j53k929k092J819K780
1645B399L92k901j802J977K281L3k763j456J412K598K94k412k311J639K303P52
1661B435k243j898J130J934Q90k113j775J301J922L12j850j237N88J970P08j548
1677E26j923P33J666P75j093j404m11J798Q55q67j156r9J170N44o58n92l32P15
1695B47R47o66j027N7P64L93k87o66l93N19P13R2l63m37j25L10J73O3j22p09J16
1716d01R94k49k70j16l17L58Q96n21j009J08J211K61p87j077k71J370J383m40
1734A123j918k24J157J267m85j270o24J026J369k45j735o62J614J610l71k028
$$ y = [-3113, 279, 3626, 3106, -1181, -2829, -302, 3550, 3021, -920, -2394, -321, 3496, 2667, -687, -2605, 168, 3297, 2901, -607, -2344, 296, 3324, 3208, -199, -2646, -343, 2974, 2821, -108, -2200, -381, 2399, 2791, -110, -1912, 65, 2346, 2379, -384, -1840, -428, 2170, 2464, 52, -2259, -620, 1683, 2435, 192, -1706, -576, 1358, 2248, 135, -1640, -339, 1583, 1895, 45, -1192, -604, 1366, 2074, 526, -1397, -664, 1002, 1777, 684, -720, -1131, 667, 1522, 655, -501, -600, 570, 1114, 456, -136, -468, 247, 1194, 528, -499, -442, 322, 715, 428, -238, -631, -112, 601, 693, 330, -107, -232, 78, 251, 314, 192, -517, -401, 593, 344, 74, -42, -359, -1, 895, 374, -635, -527, 684, 945, 158, -919, -1190, 180, 1563, 1123, -795, -1019, 138, 1405, 920, -350, -974, 52, 1421, 1176, -559, -1221, 393, 2003, 1632, -396]
1750c96r93R55K370j93k135j454J675J844M03k512j510J261K314N67k525j132
1766a461R92K193J48k358j949J692K588K34k570j779R40K793Q35k287k486R23
1782a552K763P60k247k043O68K708P55k169k108O53K940J031k526k811J171K760
1798G53R51j808k671K10L171J308j993k744O19K445J354j759k371jL186J271k108
1815a87k911N41L026J664j901k611q7K664J976j807k844j84K762J428j311k466
1831b248n1K350J722j353k581RJ909J913q63k876l33K007K164r45k638n71J749
1848f36J860o04k118m91J146J875l71j968l03J233J572o05j703q66J717J383k12
1865I09j667p46P87J304L08j341p46O35J332l6j012m14N66P95K81j093o08P02
$$ y = [-396, -1389, -434, 1936, 1743, -392, -1846, -171, 1673, 2076, -436, -1946, -685, 1629, 2196, -329, -1461, -469, 1724, 1872, -486, -2435, -743, 1845, 2079, -491, -2270, -1330, 1463, 2298, 11, -2475, -1552, 1211, 1971, -276, -2319, -1651, 1057, 1812, -357, -2465, -1812, 1128, 2159, -367, -3178, -2007, 753, 1704, -104, -2775, -2565, 606, 1914, -79, -2823, -2204, 241, 1595, -164, -2535, -2536, 650, 1921, -187, -3098, -2557, 469, 2133, 232, -2379, -2466, 198, 2174, 367, -2477, -2661, 101, 1529, 218, -2248, -2299, 51, 1773, 420, -2161, -2152, -243, 1670, 807, -2069, -2402, -395, 1769, 824, -1814, -2385, -636, 1224, 620, -1498, -1989, -843, 1032, 661, -1307, -1610, -377, 1195, 590, -1113, -1979, -262, 1121, 909, -758, -1504, -717, 587, 895, -446, -1192, -557, 775, 739, -273, -687, -121, 674, 955, -138, -746, -44]
1883d4R15N0q91p82O87N70J22l49l39j81L65N45l60n20J67K26K88n9k63q5J45
1904B07L49j97k66k31l54P85L47r1p44P5L27M90j95o90JpQ97j89n22l26J8R28
1926F12J92j127n34O19R83q5q84j066O11J104O97q52j653M92J407R88j160j449
1944a105j82J662Q30p40j695k12K016R40r77j832j74K054J269r21k025l12J829
1961D25J308p32j958m40J668J568o91j585q19J821J380o46j950o62J673J664k87
1978A737k574o93J539J913m34j925j204J170K460mk375q41R67J885J95k425n57
1995a166J290J676j75j410j849J535J684K84j710j464J028J941O42k047j665J208
2011a98J892J39k101j062J205J762L45k069j348J333K086P8j902j522Q33K147
$$ y = [-44, 871, 921, 30, -752, -65, 505, 627, 278, -61, -242, 123, 668, 308, -212, -45, 181, 469, 410, 147, 62, 207, 556, 359, 93, -138, -492, 293, 640, 549, -195, -120, 207, 697, 502, -188, -187, -194, 703, 514, -8, -334, -316, 612, 804, -323, -857, -238, 745, 660, -224, -1290, -679, 425, 1122, 270, -1383, -891, 516, 1504, 344, -1105, -1287, 375, 1205, 465, -1230, -1442, 574, 1514, 537, -1295, -1469, 585, 1854, 933, -1092, -1404, 425, 1733, 1001, -957, -1397, 271, 1839, 1148, -437, -1256, 565, 1945, 1299, -651, -1313, 360, 2024, 1737, -837, -1530, 9, 1922, 1488, -437, -1641, -471, 1989, 1985, -390, -1231, -264, 1621, 1816, -609, -1166, 124, 1800, 1625, 215, -1634, -99, 1585, 1869, 159, -1305, -277, 1664, 2306, 259, -1406, -198, 1694, 1833, -268, -1330, -125, 1637, 1982, -87, -1435, -102, 1984, 2062, 160, -1362, -529, 1618]
2027A618N02k004j446O61J915N84j150j727N30J655O30j458j520L16J982N74j308
2044C54j519M31J401O98p92j782L30J609M39o67j264k46J173O49l57r71n58J232
2062A60Q60q53q76j92R67P67m57q76n83N08Q87j08o43o90N52M89L85p93m47L96
2082e47N60J19o07k85p6N71M99o66n89L61L88K72l16m9j93K19K76o6m57L3L56
2103a97M30k78m10j65%M98k0j00l13J51M74L48n64o58M6N39O98k69n68o49R30
2124g7O91m71l84p50Q75N74m31p82j07N81P75l3r35q30J069R08K54j211r53P97
2144d40J245J6j098j012O96J269K30j129j001N36J455L78j550p73N43J558Q1j085
2162h1j123Q7J833R23j805j364P63J658L38r86j675J30J610Q54r44j501lJ565
$$ y = [1618, 2120, 116, -1330, -669, 1246, 1830, 680, -1047, -517, 1138, 1768, 310, -1210, -894, 1088, 1662, 354, -1165, -734, 667, 1365, 573, -1209, -879, 730, 1169, 502, -762, -1008, 165, 814, 457, -514, -1072, 160, 1020, 167, -709, -901, 66, 833, 376, -500, -1083, -575, 312, 204, -439, -1129, -577, -88, 297, -496, -943, -547, 13, 132, -475, -760, -836, -265, 234, -432, -1021, -660, -272, 0, -316, -365, -558, -339, -63, -129, -586, -553, -197, 233, -45, -455, -620, -620, -122, -142, -242, -555, -404, 70, 418, -146, -804, -758, -219, 479, 210, -358, -1007, -77, 614, 143, -241, -991, -116, 458, 27, -755, -862, -281, 494, 461, -474, -1304, -235, 673, 927, -284, -1237, -440, 805, 821, -277, -1289, -593, 676, 906, -223, -1224, -688, 767, 1145, -405, -1178, -635, 923, 1004, -81, -1204, -1117, 716, 1639, -166, -1530, -767, 891, 1229, 243, -1432, -1302, 308, 1162, 218, -1283, -1286, 279]
2180B79O33q19j011l40J339R86q32j501j41J331J233n06j786k39J363Q82l01j846
2198a276j10J071J369r28j296l81J352J146l78j709p4J038J076l29j503o67J414
2215a85P97j53j184l15J032N43k06j176n46J203J326n49j167p11J192Q22Qj084
2233c53r58R10J412q4j094r50O41J248l05n33n28L44J201r3j143o29L87J301j7
2252G57o51p10J4J386J42m67q25K7R44J98l60o25j35P93N79n27p08J82L32O98
2272A044k69n74l21N02N58j75k79o02R6N75L57n06j72j55J59M82l17l39p0M07
2292D01J84k71l63J85J94P05o68o7k71K90L98J69m14l02k28P30J54p90k87L25
2312G4L09L91q36k63N42L10k0l13m13N2O85N9m67n05LN03N68m08p65k52R95L39
$$ y = [279, 912, 93, -918, -1258, 81, 1067, 235, -1266, -1407, -76, 1157, 651, -1135, -1374, -11, 871, 570, -1276, -1386, -315, 1054, 126, -1170, -1551, -199, 947, 569, -1140, -1214, -176, 900, 571, -932, -1599, -185, 612, 459, -725, -1040, -8, 535, 329, -847, -1393, -190, 1136, 587, -580, -1291, -99, 723, 731, -353, -1311, -401, 1011, 927, -167, -1117, -476, 772, 467, -66, -594, -250, 951, 858, -285, -914, -527, 774, 757, 106, -604, -590, 796, 938, 471, -354, -327, 617, 815, 455, -170, -305, 488, 1067, 540, -168, 14, 346, 1044, 775, 201, -120, 382, 940, 765, 486, -116, -20, 555, 912, 406, 234, 79, 238, 720, 403, 64, -6, 401, 585, 314, -49, 136, 330, 1035, 367, 300, 29, 319, 717, 886, 472, 170, -58, 672, 826, 36, -251, 74, 383, 774, -62, -325, 217, 527, 507, 194, -219, -167, 518, 577, 110, -395, -392, 111, 679, 271, -494, -746, 249, 588]
2334E88m08q34Q9J085L4n42r61J13J005N29m80p71j96P03J008n00j089k26R26
2353G3J037n30r32n25R41Q25l24j138k36O63J073m28r97n8L14J055L8j212n91
2372i52R12Q31J62j103m18K97J078m6p66q98L51J169N2r38o86N46R35L40o35j256
2392a025O57Q52J94k18j142K14R49L04n23q85K4J425j1r43l66J08R61L52p87j024
2412h84P2P91R33o59p41q0M67Q45m91q77J06M83O54o94m16r3M37P38m09o62m65
2433i45J133J68l37o48j99O14N66j68q57k70R70K15o0m43o14N70Q94o31n50l2
2453f24L80O38k19o75l31L30P09K44q11l09q1N01J41J4n50p9M65M10k23p70L23
2474e17M69J19j51q80l27Q06M59J81p90n5J38P78l8n31j69J17K54K94j71k71j15
$$ y = [588, 180, -654, -565, 520, 554, 12, -949, -836, 169, 698, 218, -553, -749, -46, 962, 462, -627, -853, 73, 1110, 580, -352, -877, 64, 889, 565, -573, -809, -146, 927, 499, -498, -556, -242, 813, 851, -361, -952, -40, 791, 953, -150, -568, -271, 807, 761, -5, -903, -552, 617, 669, -269, -955, -409, 526, 866, 231, -1025, -368, 484, 678, 460, -682, -468, 481, 785, 262, -623, -599, 826, 815, -128, -494, -386, 575, 927, 140, -884, -812, -21, 912, 253, -488, -568, -101, 744, 253, -624, -518, -35, 619, -75, -491, -584, -147, 591, 182, -480, -945, 188, 356, 19, -629, -828, -214, 352, 184, -673, -943, 27, 242, 182, -261, -875, -305, 589, -42, -592, -624, -244, 394, 175, -500, -831, -501, 208, 452, -359, -668, -749, -248, -107, -93, -643, -722, -257, 153, -70, -840, -517, -48, 71, -80, -960, -1287, -481, -22, 159, -631, -686, -548, 230, 192, -339, -508, -391, -137, 157, -14, -285, -400]
2495d00M47J82l56l11J60M96L7j43n03l52Q01M96l29o34O6M53M51l55k24l80K18
2516a80N09l31L6n59L88P58l44o95j47K07R40k69j63o58L07Q76l45j55l89J73
2536d1N47J85p26j90K53M67K2l41l32j16Q30J60m92l80j38R63K23n32q62RP13
$$ y = [-400, 47, 229, -127, -438, -278, 218, 255, 112, -391, -743, 58, 554, 225, -409, -343, 110, 561, 206, -18, -398, -180, 329, -2, 34, -525, -137, 621, 277, -418, -565, -358, 582, 313, 150, -508, -201, 675, 330, 175, -214, -41, 506, 691, -35, -225, 28, 495, 517, 176, -156, -272, 558, 718, 226, -154, -292, 671, 894, 362, -500, -491, 222]
$$ [...]
8191d30
##END NTUPLES=NMR FID
##END=
