##TITLE=1H_TG-Ad
 CDCl3
 8 sc, 
 25.1.2023
##JCAMPDX= 6.0         $$ Bruker NMR JCAMP-DX V2.0
##DATA TYPE= NMR SPECTRUM
##DATA CLASS= NTUPLES
##ORIGIN= UXNMR, Bruker Analytische Messtechnik GmbH
##OWNER= root
$$ XWIN-NMR		Version 3.5
$$ Wed Jan 25 14:18:19 2023 Russian Standard Time (UT+4h)  she@DPX200
##.OBSERVE FREQUENCY= 200.13135
##.OBSERVE NUCLEUS= ^1H
##.ACQUISITION MODE= SIMULTANEOUS
##.ACQUISITION SCHEME= undefined
##.AVERAGES= 8
##.DIGITISER RES= 18
##SPECTROMETER/DATA SYSTEM= spect
##.PULSE SEQUENCE= zg30
##.SOLVENT NAME= CDCl3
##.SHIFT REFERENCE= (INTERNAL, CDCl3, 0, 15.7943)
##AUDIT TRAIL= $$ (NUMBER, WHEN, WHO, WHERE, WHAT)
$$ ##TITLE= Audit trail, XWIN-NMR		Version 3.5
$$ ##JCAMPDX= 5.01
$$ ##ORIGIN= Bruker BioSpin GmbH
$$ ##OWNER= she
$$ F:/spectra/data/she/nmr/H-F/1/pdata/1/auditp.txt
$$ ##AUDIT TRAIL=  $$ (NUMBER, WHEN, WHO, WHERE, WHAT)
(   1,<2023-01-25 14:16:52.95 +0400>,<she>,<DPX200>,
      <created by zg, POWCHK disabled, PULCHK disabled
       configuration hash MD5:
       00 E9 B6 7A A2 85 ED C7 34 08 36 98 17 FE 4E 26
       data hash MD5: 16K
       7C E9 B8 3E FB C1 76 BC 41 94 ED E9 99 A3 F5 C1>)
(   2,<2023-01-25 14:16:57.04 +0400>,<she>,<DPX200>,
      <Start of raw data processing
       efp BC_mod = 2 LB = 0.24 FT_mod = 6 PKNL = 1 PHC0 = -19114.09 PHC1 = 14.60079 SI = 16K 
       data hash MD5: 16K
       19 65 DC 4A EA 82 B4 A8 00 B5 A2 FE 0D 8D 6A 8B>)
(   3,<2023-01-25 14:17:17.17 +0400>,<she>,<DPX200>,
      <pk PHC0 = 0.5506827 PHC1 = -1.6 
       data hash MD5: 16K
       5E AC 48 40 17 F8 48 14 06 7F A8 D5 D0 8C 8E 0A>)
(   4,<2023-01-25 14:17:20.48 +0400>,<she>,<DPX200>,
      <abs ABSG = 5 
       data hash MD5: 16K
       03 A8 E7 2E 8E 0A 09 CE 45 E4 F2 8D 9D 74 F6 A7>)
$$ ##END=
$$ 
$$ hash MD5
$$ 22 D9 41 96 E2 F2 6E CF 70 EC 69 7B 45 E4 BB 9C
##$RELAX= 
##$RELAX= 
##$RELAX= 
##$RELAX= 
##$RELAX= 
##$RELAX= 
$$ Bruker specific parameters
$$ --------------------------
##$DU= <F:/spectra>
##$EXPNO= 1
##$NAME= <H-F>
##$PROCNO= 1
##$TYPE= <nmr>
##$USER= <she>
##$AMP= (0..31)
100 100 100 100 100 100 100 100 100 100 100 100 100 100 100 100 100 100 
100 100 100 100 100 100 100 100 100 100 100 100 100 100 
##$AQSEQ= 0
##$AQ_mod= 1
##$AUNM= <au_zg>
##$AUTOPOS= <>
##$BF1= 200.13
##$BF2= 200.13
##$BF3= 200.13
##$BF4= 200.13
##$BF5= 200.13
##$BF6= 200.13
##$BF7= 200.13
##$BF8= 200.13
##$BYTORDA= 1
##$CFDGTYP= 0
##$CFRGTYP= 5
##$CHEMSTR= <none>
##$CNST= (0..31)
1 1 145 1 1 1 1 1 1 1 1 1 1 1 1 1 1 1 1 1 1 1 1 1 1 1 1 1 1 1 1 1 
##$CPDPRG= <>
##$CPDPRG1= <>
##$CPDPRG2= <>
##$CPDPRG3= <>
##$CPDPRG4= <mlev>
##$CPDPRG5= <mlev>
##$CPDPRG6= <mlev>
##$CPDPRG7= <mlev>
##$CPDPRG8= <mlev>
##$CPDPRGB= <>
##$CPDPRGT= <>
##$D= (0..31)
0 1.2 0 0 0 0 0 0 0 0.06 0 0.03 0 0 0 0 0.0002 0 0 0 0 0 0 0 0 0 0 0 0 
0 0 0 
##$DATE= 1674641812
##$DBL= (0..7)
120 120 120 120 120 120 120 120 
##$DBP= (0..7)
150 150 150 150 150 150 150 150 
##$DBP07= 0
##$DBPNAM0= <>
##$DBPNAM1= <>
##$DBPNAM2= <>
##$DBPNAM3= <>
##$DBPNAM4= <>
##$DBPNAM5= <>
$$ [...]
##$SUBNAM3= <"">
##$SUBNAM4= <"">
##$SUBNAM5= <"">
##$SUBNAM6= <"">
##$SUBNAM7= <"">
##$SUBNAM8= <"">
##$SUBNAM9= <"">
##$SW= 18.05172834244
##$SWIBOX= (0..15)
0 0 2 0 0 0 0 0 0 0 0 0 0 0 0 0 
##$SW_h= 3612.71676300578
##$TD= 16384
##$TD0= 1
##$TE= 0
##$TE2= 300
##$TE3= 300
##$TEG= 300
##$TL= (0..7)
0 120 120 120 120 120 120 120 
##$TP= (0..7)
150 150 150 150 150 150 150 150 
##$TP07= 0
##$TPNAME0= <>
##$TPNAME1= <>
##$TPNAME2= <>
##$TPNAME3= <>
##$TPNAME4= <>
##$TPNAME5= <>
##$TPNAME6= <>
##$TPNAME7= <>
##$TPOAL= (0..7)
0.5 0.5 0.5 0.5 0.5 0.5 0.5 0.5 
##$TPOFFS= (0..7)
0 0 0 0 0 0 0 0 
##$TUNHIN= 0
##$TUNHOUT= 0
##$TUNXOUT= 0
##$USERA1= <user>
##$USERA2= <user>
##$USERA3= <user>
##$USERA4= <user>
##$USERA5= <user>
##$V9= 5
##$VALIST= <valist>
##$VCLIST= <CCCCCCCCCCCCCCC>
##$VD= 0
##$VDLIST= <DDDDDDDDDDDDDDD>
##$VPLIST= <PPPPPPPPPPPPPPP>
##$VTLIST= <TTTTTTTTTTTTTTT>
##$WBST= 1024
##$WBSW= 4
##$XGAIN= (0..3)
0 0 0 0 
##$XL= 0
##$YL= 0
##$YMAX_a= 903803
##$YMIN_a= -889417
##$ZGOPTNS= <>
##$ZL1= 120
##$ZL2= 120
##$ZL3= 120
##$ZL4= 120
##$ABSF1= 15.6907
##$ABSF2= -2.36115
##$ABSG= 5
##$ABSL= 3
##$ALPHA= 0
##$AQORDER= 0
##$ASSFAC= 0
##$ASSFACI= 0
##$ASSFACX= 0
##$ASSWID= 0
##$AUNMP= <proc_1d>
##$AZFE= 0.1
##$AZFW= 0.1
##$BCFW= 0
##$BC_mod= 2
##$BYTORDP= 0
##$COROFFS= 0
##$CY= -3
##$DATMOD= 1
##$DC= 0
##$DFILT= <>
##$DTYPP= 0
##$F1P= 0
##$F2P= 0
##$FCOR= 1
##$FTSIZE= 16384
##$FT_mod= 6
##$GAMMA= 0
##$GB= 0
##$INTBC= 1
##$INTSCL= 3.70164e-10
##$ISEN= 128
##$LB= 0.24
##$LEV0= 0
##$LPBIN= 0
##$MAXI= 10000
##$MC2= 0
##$MEAN= 0
##$ME_mod= 0
##$MI= 1.114404
##$NCOEF= 0
##$NC_proc= -4
##$NLEV= 6
##$NOISF1= 3.799351
##$NOISF2= 2.8
##$NSP= 0
##$NTH_PI= 0
##$NZP= 0
##$OFFSET= 15.79427
##$PC= 1
##$PHC0= -19113.54
##$PHC1= 13.00079
##$PH_mod= 1
##$PKNL= yes
##$PPARMOD= 0
##$PSCAL= 0
##$PSIGN= 0
##$REVERSE= no
##$SF= 200.129995452571
##$SI= 16384
##$SIGF1= 3
##$SIGF2= 2
##$SINO= 5.538805
##$SIOLD= 16384
##$SREGLST= <1H.CDCl3>
##$SSB= 0
##$STSI= 16384
##$STSR= 0
##$SW_p= 3612.71676300578
##$SYMM= 0
##$S_DEV= 0
##$TDeff= 16384
##$TDoff= 0
##$TI= <>
##$TILT= no
##$TM1= 0
##$TM2= 0
##$TOPLEV= 0
##$USERP1= <user>
##$USERP2= <user>
##$USERP3= <user>
##$USERP4= <user>
##$USERP5= <user>
##$WDW= 1
##$XDIM= 16384
##$YMAX_p= 318958044
##$YMIN_p= -199260
$$ End of Bruker specific parameters
$$ ---------------------------------
##NTUPLES= NMR SPECTRUM
##VAR_NAME=  FREQUENCY,     SPECTRUM/REAL,   SPECTRUM/IMAG
##SYMBOL=    X,             R,               I
##VAR_TYPE=  INDEPENDENT,   DEPENDENT,       DEPENDENT
##VAR_FORM=  AFFN,          ASDF,            ASDF
##VAR_DIM=   16384,         16384,           16384
##UNITS=     HZ,            ARBITRARY UNITS, ARBITRARY UNITS
##FACTOR=    0.220516191357247, 1,           1
##FIRST=     3160.90709557323, 0,            0
##LAST=      -451.809667432554, 0,           0
##MIN=       -451.809667432554, -199260,     0
##MAX=       3160.90709557323, 318958044,    0
$$ Real data points
##PAGE= N=1
##DATA TABLE= (X++(R..R)), XYDATA
$$ [...]
9639 -1824 1826 -15868 18576 11148 -7910 -55221 -52753 -14124 21621 20759 -5879 20557 10257
9626 10257 -6524 35176 55165 46138 34776 29078 2521 -15941 19663 33810 16459 40164
9614 40164 30431 34695 39509 51065 32838 -772 -5276 19513 31936 25766 7719 13824 22907
9601 22907 50015 75230 3392 19796 18678 -5210 -12610 32767 34687 30039 31487 41099 42370
9588 42370 31182 9533 4378 6210 -17173 -22694 -26171 -904 -4661 21426 21555 19527 -2007
9575 -2007 -1063 48193 30315 5921 -2219 820 7906 12337 4797 14010 20465 29374 12017 -19097
9561 -19097 -17446 -732 -14137 -22815 5292 -2841 -6840 10848 33550 26134 24655 14329 16378
9548 16378 6600 21725 5970 -15741 -29688 -8324 21700 4121 20005 13735 26748 25319
9536 25319 18558 4869 6685 12523 18489 24501 -1901 -4046 -2156 7536 -18234 -8477 2798 6188
9522 6188 11240 -748 -1892 -29555 -24451 -6820 838 7972 25966 -1182 -9135 18810 -12807
9509 -12807 299 -26143 -10942 -1542 14394 16330 49876 22351 -6234 -2617 -20858 -25438 -2604
9496 -2604 3133 2695 13601 5480 39922 44372 12181 -18960 -32263 -37295 -23673 -17476 3575
9483 3575 -6085 6946 41295 8661 -26176 -21177 -1404 13089 8185 33412 22027 28330 12850
9470 12850 -3177 3441 46297 63731 17660 -1407 37184 54491 43038 24657 6366 -9509
9458 -9509 -3029 34654 23412 28412 13122 -18067 23604 11556 -32627 705 1378 435 -2420
9445 -2420 -42786 -46648 -14834 8556 850 29834 7750 -1985 3374 -13948 -21379 -4745 -5192
9432 -5192 4272 4858 -26226 -8674 -1176 -18164 -26532 -14283 17668 2245 24947 22562 18509
9419 18509 12340 -337 12183 20881 18565 1730 20474 -5793 20300 45303 18056 36542
9407 36542 34214 -5700 -2429 8430 33378 24835 -1355 -42789 -38865 -48267 -24253 -15979 -677
9394 -677 20120 4382 1632 -12222 -29875 -16744 13220 -3792 -15500 -16705 1284 39580 42407
9381 42407 -7956 -40727 -16819 -15556 -1739 3110 447 11182 35180 27115 -15595 17575 17179
9368 17179 22023 22094 36089 40341 13062 -4049 26119 15597 -36848 -35549 -42241 -37785 4466
9355 4466 30394 45234 26262 11391 16796 12131 -36913 -40905 -274 8189 17592 38444 44025
9342 44025 34569 47324 45386 36192 24953 17794 44995 26957 24047 13802 23727 20872 11309
9329 11309 34258 40149 18866 -28070 -10998 234 -12080 -2997 10666 27931 24797 9797
9317 9797 -7157 -13683 18191 10042 -345 -18452 -9845 21027 -23910 13293 21935 -21666 -27295
9304 -27295 -20511 14531 -7226 -16447 6625 -2147 -31084 -29288 -44136 8439 12562 10185 33473
9291 33473 8650 -14832 -10530 -11646 6591 -2770 -1728 -18561 -13871 -90 7205 -49779 -52112
9278 -52112 7172 -9338 12384 7599 -8429 -19182 -931 30247 19144 -9462 -9828 14175
9266 14175 13587 -233 -9433 -19193 8530 -9558 -10166 -406 29357 15371 26643 8458 11958
9253 11958 -3707 -2599 30079 48673 47848 11249 -20608 -45768 -6094 -10980 -6880 31229 23062
9240 23062 16957 -18581 -15499 -5124 -27499 -11103 12442 1693 8083 27188 -10952 14966
9228 14966 27107 28345 46277 11096 -15256 -3800 -3090 24592 25819 18619 -7744 -10422 -15213
9215 -15213 9569 -6038 2722 3363 16885 32398 15763 -15865 -8405 23208 53732 38213 2357
9202 2357 7116 16490 21604 22868 9439 -12121 -15368 1776 27702 22830 54282 43816 33862
9189 33862 32701 36048 48071 60602 32489 41147 61981 62258 56055 98725 93909 69902 86526
9176 86526 104900 150044 168330 156690 127246 96051 68989 33773 34692 52133 30889 30800 38345
9163 38345 34196 32467 31142 7943 7499 11143 19555 19849 9047 31668 22098 14881 -7900 5328
9149 5328 -22940 -51791 -18145 -18347 3850 -4293 -555 -21137 2592 4373 3827 -7313 11693
9136 11693 50042 -21149 -25696 -16128 694 -8445 39 26569 25513 14214 1446 6251 2431
9123 2431 -4746 -9784 -25384 18122 -34085 -613 8684 -1359 -16431 2416 -799 -15982 12660
9110 12660 18279 44516 7333 -2450 -2551 3631 -40621 -26883 21716 -8506 -14284 -36753 -18650
9097 -18650 -16680 -5540 1186 -4679 11365 9074 1975 5021 -23472 -28475 -14416 21202 48508
9084 48508 27596 40577 20054 21443 3633 22381 48250 45452 28411 38826 27428 52635
9072 52635 48603 33795 24627 20975 11825 -987 8717 31750 30350 -7130 -12022 20513 28452
9059 28452 20756 17491 16460 29865 14882 -4817 13656 25135 14547 -767 9417 6883 -10341
9046 -10341 -12059 -1329 31907 20167 9994 19116 20529 24397 -10369 -8017 7574 27938 40171
9033 40171 60489 35804 15387 -10573 -2938 21800 22599 47840 36219 38362 35025 29591 45459
9020 45459 42985 31217 -6854 125 -1378 1437 26648 49400 37392 11272 7163 21238 4872
9007 4872 -7907 -6024 16609 15305 30640 45077 64153 56411 20962 22527 18237 30245 58812
8994 58812 62607 19992 31315 24697 4353 -949 -11754 5421 5927 -9195 24077 2856 625
8981 625 60956 57855 39511 31933 31925 26386 44885 50244 41575 15322 5909 38358 53090 32572
8967 32572 -34181 -6703 20701 13927 4624 22277 25066 33563 46011 33524 40688 26340 -13982
8954 -13982 21546 24145 28228 23042 13899 -3867 28150 40355 51331 43091 26446 7078 10237
8941 10237 25026 38500 24887 17253 -7905 -3859 19543 28750 3058 33833 43450 20542 45506
8928 45506 29338 8951 22233 45785 57897 17116 18099 47564 72737 78817 55757 41024
8916 41024 21466 36453 51064 32506 26352 6521 15306 38813 45044 71531 50671 35857
8904 35857 35839 40025 61002 66135 49284 70081 68715 66693 62333 66800 41543 85875 62569 52944
8890 52944 38853 60567 58854 79612 72812 50037 73991 64128 40908 56686 60851 92655 95065
8877 95065 68463 45510 52606 56821 80337 82951 60078 102327 106334 103844 76998 57918 41831
8864 41831 31662 45681 66283 59862 62101 37052 61508 94679 79866 79965 114276 104084 76662
8851 76662 77915 71757 108667 117628 91958 98916 110555 90440 96487 95838 107130 116545 94241
8838 94241 100487 104469 101371 106349 99872 108509 122232 112194 118459 102266 142188 142546 133205 171982
8824 171982 149713 154250 142224 158038 162033 148708 154345 175411 183141 170276 159452 180356
8812 180356 181143 131751 153216 191206 226383 225241 194866 182616 195493 219007 219676 221226 246474
8799 246474 270438 254611 226256 217086 187354 200295 245799 257529 238067 251587 232517 278937
8787 278937 298749 288047 316733 340932 349521 335378 364050 363412 378942 421321 440272 447453
8775 447453 470463 458907 485047 522257 540730 546848 564736 568972 551802 619813 638709 646896
8763 646896 676148 660195 660656 691046 702283 718164 718881 721601 743393 749048 756708 781880 812582
8750 812582 838770 858516 896171 929559 918233 936044 1016599 1040469 1066262 1134562 1191463 1194192
8738 1194192 1232073 1283392 1364210 1401505 1439433 1524190 1584860 1649687 1742204 1848454 1916496
8727 1916496 1998380 2046713 2156919 2261998 2342397 2412066 2525807 2631842 2786078 2955976
8717 2955976 3168233 3431756 3770900 4148555 4628625 5143977 5786938 6528624 7399325 8523599
8707 8523599 9893697 11768600 14369688 17646117 21785514 25656714 28126656 27176383
8699 27176383 22409992 17706872 14195255 11532023 9602913 8136728 6984577 6101624
8691 6101624 5302895 4711551 4253828 3838022 3513900 3224633 2980201 2744655 2521700 2321626
8681 2321626 2163422 2021429 1919720 1822430 1701348 1602769 1490836 1426934 1362524 1320858
8671 1320858 1297267 1244697 1196984 1122953 1062719 1026464 975018 948588 891410 820565 803155
8660 803155 762123 771098 761048 710512 659516 647630 647722 632297 596584 567078 547216 501103
8648 501103 501733 496654 508301 519969 486033 468356 436512 452840 465586 413985 386122 366885
8636 366885 354381 374950 323587 331523 324517 324918 320539 306635 309579 282784 292176 289541 268307
8623 268307 244380 252420 290683 287353 260520 200986 206968 229295 208243 231268 262037 236101
8611 236101 187042 203544 207968 204143 162036 148661 157062 136239 129775 131615 155682 137509 133020
8598 133020 142977 156259 172486 139322 124838 104820 112305 123568 109521 67901 57789 71818
8586 71818 61268 64497 60952 112087 116703 131202 137207 95431 76444 96859 83797 113178 131335
8573 131335 121338 125395 91252 90956 71926 65865 59824 67371 96321 61096 71162 61151 28234
8560 28234 4979 29286 29746 44579 31598 39571 38152 22456 16850 38078 58366 52245 50916
8547 50916 59245 69701 43684 46474 45883 32353 22578 54954 27008 -195 13911 34798 39621
8534 39621 57960 33858 14256 45423 37487 1702 -12344 10868 38708 16419 46026 24505
8522 24505 21923 26766 30728 17505 -5532 5856 20767 12025 11655 31737 6116 -6113 -5599
8509 -5599 -1269 9781 23522 16594 7513 -4442 222 15863 -3848 11263 17642 33169 55856
8496 55856 22829 21161 12385 -8614 -5753 22637 36710 28362 11354 -3517 -3334 -13025 -23640
8483 -23640 -43971 -13075 -13047 13263 8520 29462 24942 31633 35032 17690 2797 5040 14609 4237
8469 4237 1610 -10801 -34358 -23865 17714 22363 21560 36386 494 -7687 6072 1180 49941
8456 49941 31039 20330 12343 -2145 12278 12864 5778 -8498 -27556 -7786 -5265 -6545 -23750
8443 -23750 -38084 -5761 10676 7516 -2044 27990 1283 -12351 11404 20100 7728 -14186
8431 -14186 8410 24151 23469 -12034 -11050 -1904 14026 4838 -8222 -43941 -16830 -13971 -2042
8418 -2042 -17083 -35069 -34559 -896 12757 6802 13372 41584 23975 4266 12768 -1169 10547
8405 10547 -13823 -51759 810 -32015 -24523 6626 -15111 -11978 -904 -55984 -50442 -18297
8393 -18297 -53093 -32356 -6690 -5818 -12226 -5365 -27299 -14774 -37151 -40485 -25293 -7365 -50128
8380 -50128 -39831 -6522 -7667 -11349 17505 -7003 -11461 7523 9075 -12734 -8653 -27057 -23312
8367 -23312 -22867 19429 25578 8650 -12253 -36899 20556 22224 -28110 -58899 -24569 -28938 16128
8354 16128 13770 -39048 -13742 -15605 -11875 -5130 -34769 -11784 4320 -35833 -48581 -19108 -7650
8341 -7650 -9981 -3615 3485 -21163 -3792 11159 4501 -28569 -43682 -27428 -27081 -87 15314
8328 15314 8450 -11451 -38282 -14709 -23798 -20009 -21455 3279 -20010 -34677 3624 513 -24229
8315 -24229 -49815 -54992 -44255 -14339 -3372 -83 -10301 -14424 -17211 -20559 -3431 -3891 20792
8302 20792 17271 -22715 -21143 -27343 -26756 -4405 -2498 -62405 -64241 -18597 9078 -9566 -23487
8289 -23487 -34590 -35729 -22682 -3074 -42872 -45306 -28887 -6583 -14193 -50630 -25006 -19486 -34230
8276 -34230 -38528 -64024 -39799 -2340 -29820 -18561 -16964 -16903 -3055 22064 13842 -18928 -26900
8263 -26900 -18784 -36557 -45467 -17816 -3340 -31597 -12517 466 -22172 7461 25282 5728
8251 5728 -2030 -6592 -20962 -13472 -11484 -3735 22729 44885 -16373 -17114 -48533 -42349 -12056 22299
8237 22299 28606 15825 41436 11837 16881 21763 12041 29579 51910 49345 52572 68653 94106
8224 94106 126824 132520 93019 65394 58444 35744 32053 17187 19073 23249 16641 8486 -12669
8211 -12669 -21728 -4209 19486 30277 28286 21793 28362 27167 31513 10328 -878 12579 39845
8198 39845 51308 26684 7411 27371 -1005 -37433 -199260 -129115 -46907 -52985 -331 -17833
8186 -17833 -24959 -38770 -32473 -18730 -20588 -25448 5184 -34407 -57027 -41396 -53536 -47044 -26277
8173 -26277 -15185 -34451 -41387 -31085 -24436 -20198 -41540 -14864 -12042 -11153 3724 14715 -12319
8160 -12319 -14989 -29754 -43971 -20511 -10267 -6778 -16372 -17527 -28762 -49942 -43377 -25954 -3152
8147 -3152 -18614 -10107 4949 16742 -21562 -4839 -11763 -20890 8302 -38581 -26245 -32751 -24931
8134 -24931 -35522 -46625 -57642 -37108 -19124 29149 27106 16729 -25876 -43796 -18023 -12487
8122 -12487 -2480 19562 20881 -6420 -25329 -15778 -16348 -33682 -8662 6336 -16942 -32911 -16524
8109 -16524 -15223 -5655 4954 -22380 -21542 -20420 -49359 -21280 7415 6576 -22464 -31377 10325
8096 10325 5273 -44333 -9798 -445 24002 15500 5188 -27300 -56588 -37030 -42042 -14674 -39520
8083 -39520 -13994 -13177 -58769 -1096 6567 -5150 1601 -2748 -3117 -8142 -10148 -16580 -24417 -29655
8069 -29655 -29465 9603 -6174 -44321 -19071 -16812 -27809 -44316 -18693 -1510 7040 -21207 -28142
8056 -28142 -5913 -17377 -10004 -4847 -3926 -9894 -47467 -60619 -25328 -15771 -10941 -24832 -19514
8043 -19514 -12348 -29301 -48673 -22875 -22520 -20901 26624 -3362 -15077 -23605 -35977 -616 -32236
8030 -32236 -55348 -18074 -8917 -14052 -17287 -12023 -42657 -24618 -21131 -50259 -8929 -30042 -13406
8017 -13406 -11820 -29610 -31174 -23872 9122 14944 -3131 -19334 -7374 4018 25311 23247 9398
8004 9398 -22602 -17085 -22378 -25631 -6952 -10491 -25278 -19535 -7775 -15138 47054 18485 -19464
7991 -19464 -16040 -13690 -9906 15471 14999 -9905 20658 26011 5951 20646 -748 -18326 -17829
7978 -17829 -41079 -47027 -40041 -10577 -28464 -34088 -42863 -18149 -22471 -13142 15679 -1577 -24418
7965 -24418 -31307 -23188 -30562 -17918 -30994 -50808 -23131 -7677 -13365 -12436 -15547 -16765 -8583 -31353
7951 -31353 -52192 -19861 -26276 -26049 -18866 -10712 -3011 13986 -4991 -8548 2316 507 -28867
7938 -28867 -17604 16151 -13757 -15167 853 -3362 -4339 -21052 -46246 -57264 -78707 -32788 -29367
7925 -29367 -64582 -71603 -25894 -20662 -21781 4975 15791 7174 16587 7867 -12514 -32868 -34521
7912 -34521 -5436 5910 16362 21642 -4882 -28675 -17080 -14492 16360 24807 31983 34672 5036
7899 5036 -24089 -19379 -1008 -15364 -10064 -2599 -2410 -225 27569 31107 23905 -15318 -1494 -26059
7885 -26059 -18119 -6610 -32613 -9140 -15502 -28163 -50591 -27854 -19579 -23813 -6841 -11471 -1918
7872 -1918 9703 -5485 -47393 -77553 -29815 -35208 -5218 8127 -18501 -33388 -22408 4971
7860 4971 7799 -3964 -30455 -55832 -53557 -39214 -50671 -31206 -15317 -28078 -36035 -7447 -23000
7847 -23000 -3396 10298 9390 -18800 -21968 -13715 -27355 -12417 -8209 -14900 -37089 -13627 -2523
7834 -2523 -12793 -11325 -31527 -12260 1260 124 14330 -1257 -10021 -22238 -10890 -8974 18573
7821 18573 8583 -3708 24445 8935 -21124 -4155 -9068 -6620 8578 17747 -4764 -14157 -9460
7808 -9460 -26275 -16771 -4890 -49216 -73423 -33302 -27490 -21248 -30447 -12541 -22923 -31894 -20788
7795 -20788 -40858 -4781 20328 -15548 -7526 -26578 -19888 -644 -26279 18413 -4530 -1661
7783 -1661 -30427 -24380 -27645 -46672 -33624 -41818 -6685 -22410 -14781 18879 3208 6491 -17704
7770 -17704 -35936 -47255 -34286 -63598 -44545 8854 -5789 -41058 -29721 -48272 -47772 -40713
7758 -40713 -18032 3414 -1520 2982 -8671 -2998 -15872 -13516 -1773 238 -30009 -55623 -28354
7745 -28354 -43761 -27696 -6164 5486 2376 -353 15150 13346 -18870 -9984 11688 -38616 -7393
7732 -7393 -10144 -4271 -35664 -46877 -42207 11974 12519 1270 -18567 -50831 -41824 -14129 -29225
7719 -29225 -28075 -32811 -25076 -25960 -41287 -19633 -7296 -18497 -3316 -18888 -40261 -27029 6226
7706 6226 13811 6848 -20863 1244 -2318 -10883 6029 3169 -24985 -38961 -25265 3284 -2917
7693 -2917 27795 8456 -757 -24267 -43781 -7541 -15006 4298 -18368 -20024 5571 4682 -1128
7680 -1128 -8962 -16934 -6577 -568 -6890 -3032 6238 -5320 -3729 -31335 -26796 -21074 -11049 -28921
7666 -28921 -35319 -49801 -18053 -30034 -32560 -5229 29539 10730 -25322 -45112 -2374 25895
7654 25895 21527 -20556 126 -15066 -27226 -6131 -35888 -26815 -17076 10124 21032 1558
7642 1558 -1147 -7019 -35942 -31420 -36974 -17508 22472 25662 1312 -12025 -10931 -14834 -2036
7629 -2036 -11322 -516 2818 3134 -34461 -52873 2510 7577 -20991 -1009 -1706 19495 50010
7616 50010 2732 -17057 15781 10369 -21502 -38603 -45212 -27118 -32721 -27564 -68381 -48436 -34042
7603 -34042 -4075 -32882 -26866 -8201 2405 2175 -8823 -5885 3347 17515 -12376 -24822 -26140
7590 -26140 -2766 -18726 -48957 -67483 -31189 -8418 -38435 -8161 -4942 -24953 -16348 -26675
7578 -26675 -3714 19337 -19184 -15463 -14981 -15147 -51701 -35710 -10327 16563 -8660 -30841 -7290
7565 -7290 -36604 -21745 173 19830 -1477 -31407 -41558 -24217 -30579 -9313 -298 22648
7553 22648 -13765 -30042 -6596 -7195 17697 8259 3316 -27263 -22924 25720 18619 13899 2062
7540 2062 -5999 5173 -5362 -14278 -12571 -40732 -9028 -9278 -14426 -20395 -1994 -17825 -8946 -10314
7526 -10314 4973 2926 -1762 17793 24140 3199 -16161 8893 -7256 -9183 -2052 -5809 215
7513 215 -14901 -7419 26317 -17385 -28893 -12391 -46771 -25340 -15329 -21652 -14959 9948 7858
7500 7858 -1670 9832 -18932 -10183 -3923 33327 31482 6486 -45111 -42176 -27235 -9983 16371
7487 16371 25527 -2364 -7714 -10766 -16240 -2811 3659 13306 17630 8926 7991 -14061 -19930 -10724
7473 -10724 -23963 -32645 -49683 -50037 -26016 -15543 -22467 -5003 -3918 -35995 -26203 -25772 -34596 -45797
7459 -45797 -30136 -27405 -9277 -27203 -46142 -16500 -8804 -158 -4111 -891 -19007 -33519 -22415
7446 -22415 -25942 -17343 -12203 -31600 -46346 13893 25493 7903 -24286 -33090 -17241 -24922 -7163
7433 -7163 4600 2214 -18198 -21570 -37495 -14298 -7171 -10033 10275 -6218 -37459 -14807 4759
7420 4759 -20441 962 3948 -27685 -41768 -41156 -49081 -43775 -38382 -28332 1934 21044 -6823
7407 -6823 3089 7841 -5138 -7937 -26431 -18162 8329 3767 3317 4006 -30724 6269 26797 22684
7393 22684 21986 988 -19127 -1508 -2646 4872 -7555 -55111 -28008 -30723 -4230 -12452 -24238
7380 -24238 -40718 -34956 -8030 -17589 14028 -6370 -20742 -32137 -25208 -36254 -30098 -54995 -9205
7367 -9205 -14066 -31300 -28748 -36554 -18045 44455 10849 -8326 -9110 17506 32546 28323 24378
7354 24378 -15261 -4786 -31671 -54181 -32890 -39613 -30269 12925 11009 -30295 -39807 -52671 -55850
7341 -55850 -59940 -26863 -7233 6654 32649 16509 -25457 782 4473 -8924 -17238 -25970 -20329
7328 -20329 -35706 -27175 -28476 -10185 -12090 -29101 -38578 19598 1318 33902 14403 -2140 -7121
7315 -7121 1648 12886 3852 -9666 -6911 5549 -41657 -24878 -10733 -6319 -9536 -12272 17953
7302 17953 31446 1041 -11376 -10940 6804 33928 -1278 -1850 -17713 -6858 -42768 -1944 40720
7289 40720 3405 -37847 -31762 24525 21101 -14707 -8138 26774 -7161 -15377 -39848 -40281 -45814
7276 -45814 -27783 -9010 -4568 -30530 -45732 -10257 -28349 -21654 -15333 -47699 -33728 -21190
7264 -21190 -18691 -26350 5935 17368 754 1986 12097 30599 -15537 -13341 -23864 -10556 -28136
7251 -28136 -20731 -10657 -6886 -15515 -544 -5098 -1303 14238 21977 37839 36229 -6458 -28301
7238 -28301 -16365 3016 9753 -1438 -16624 -14385 -13163 -20756 9126 7491 -15860 -21562 -15268
7225 -15268 1965 25947 -8277 -16110 -7600 -9709 -30963 -11885 -6043 -9049 -18373 -34017 5783
7212 5783 880 -5488 -6427 31666 45633 9310 -23831 13623 -3364 -30885 -9815 -750 6753
7199 6753 -17724 -27846 -2913 2114 -11169 -13763 -20754 -41006 -51750 -2473 10528 12543 -23501
7186 -23501 -7192 2313 33001 6031 1888 -17833 -55284 -41512 -11132 -3825 -6886 -18932 13416
7173 13416 -3586 -25534 -12005 10062 6794 7448 -17656 -5724 -546 2201 -7018 -30381 -12965
7160 -12965 521 9109 -12015 1804 4041 -30435 -43982 -28689 -15788 -7226 -8670 -10320 20860
7147 20860 37611 8376 -3258 -666 9130 3234 -15348 -4603 -13102 -38279 -12356 -14629 -32798
7134 -32798 -11503 -4486 -27587 -4411 22073 16237 19288 23471 -5211 -2470 17411 7545 29330
7121 29330 27706 24692 21462 19188 15119 -6012 14809 4755 22066 -2307 39342 31352 5453
7108 5453 -9185 -10227 9752 19307 -2047 16271 27031 34286 -31725 -32762 -15337 -3108 -13669
7095 -13669 -28209 12752 11516 -25476 -38353 -22122 -22565 924 -341 10119 5971 13788 -14693
7082 -14693 -24829 -11466 -5085 10598 3422 10785 2050 -33032 -10103 -12151 -17145 2468 28933
7069 28933 1885 4331 4689 13657 21340 13678 -8100 -22666 -35764 -22920 -30823 -14117 26767
7056 26767 24653 -16448 -25984 -12918 14137 794 -18815 -23667 9696 11353 -32742 -24946 -30338
7043 -30338 -26211 -37878 -63066 -50222 -15144 -20244 -12280 23436 4520 -8269 21646 -20674
7031 -20674 18208 3824 866 -971 11259 -7990 -18741 13501 18691 6403 15190 22289 10954
7018 10954 -3858 39627 56751 42951 48468 14585 31981 43823 2789 -44960 -22964 -32615
7006 -32615 -24514 -15678 -30997 -24463 29022 24434 11341 5452 -36006 -28559 13860 22370 10022
6993 10022 -3116 8092 26014 -748 -9675 11358 27707 2533 -8554 -9719 -22672 -20369
6981 -20369 -9083 1994 16792 -4650 -24076 8591 17471 11316 -18675 -40034 -9576 3914
6969 3914 -22772 -56837 -69382 -18528 -11867 -20329 -36669 -36995 -29350 -40892 -3616 -16912 -1419
6956 -1419 9249 -3492 -11211 1283 -19365 -23813 16545 19532 10851 -1604 -16964 -42717 -40364
6943 -40364 -31805 -25562 -4985 -1078 -44983 -35620 -32721 -47418 -41320 -27759 -29193 -345 -558 -6990
6929 -6990 22161 43851 46514 42768 11116 10038 -12412 -10066 -32149 -36271 -18005 -1514 -1258
6916 -1258 -6821 -46264 -68008 -44543 -35597 -26319 -33870 -9445 -47070 -60335 -59347 -47946 -16716
6903 -16716 1105 -33481 -54424 -21893 -29359 -28933 -22815 20889 25513 2626 17118 -156 7919
6890 7919 4335 7460 5473 242 6458 3426 -10457 -21797 -20810 -20185 -48536 -27811 -9132 51414
6876 51414 54080 7284 -931 -18320 -45915 -37850 -8549 -17907 -10726 30109 -3491 2312 7555
6863 7555 24509 4062 -5247 -42263 -48709 -27411 -17889 -8231 -5430 6844 10974 -15080 -27305
6850 -27305 -9910 21107 28768 15221 -3291 -10287 2709 12153 11382 17336 19638 -33526 -18968
6837 -18968 -38724 -38867 -46626 -58858 -22417 -7450 25675 15064 -5581 4667 9144 -66 -19058
6824 -19058 -32907 -24064 -3342 -40371 -10517 4746 32238 14960 6047 -1943 12681 -11813
6812 -11813 -23927 5503 -1485 -17166 -31438 -30314 -34560 -47895 -12825 2465 -1648 -8558 15384
6799 15384 -1003 16530 12908 -23903 -6106 -12713 -9058 2663 -33614 -24133 -39688 -43031 10575
6786 10575 -5305 5045 -16468 -11416 12313 5665 281 -26452 4333 15781 -2650 10544
6774 10544 6338 -12341 -6664 1931 -113 -16159 -20087 -4484 -10187 -24521 -16288 -10556 -3791 -3117
6760 -3117 -24112 -4337 -7188 -2814 -6863 -3862 -11368 19574 10967 -4699 993 4681 -12820 -806
6746 -806 -15510 -10454 533 -3689 -2998 16411 4630 654 21305 29442 7469 -3998 -20001
6733 -20001 -40808 -20025 -15710 -4467 -20456 -25965 -12252 -32 2416 4152 -8311 -50286 -41541
6720 -41541 -38054 -34066 -11508 -19514 -34516 3839 -6862 -13528 -34683 -29928 -26866 -20150 -10639
6707 -10639 -614 -19408 -27209 -16267 -8226 40601 20254 15193 -30969 -16253 -12386 -10368 -7431
6694 -7431 16157 -29509 -19487 -17839 -51819 -46315 -36801 -8907 -1150 -15714 -15824 -13665 5649
6681 5649 6892 -17228 -14691 -10704 2839 -41 39635 28303 -474 6020 10446 -13063 -25415
6668 -25415 -31139 -31683 -18195 -12068 -1328 -2613 6842 165 -25400 -18631 4146 -6811 -13089 -35468
6654 -35468 -39947 -10970 -23831 -31253 -5451 1394 -8545 -26970 -34759 -23986 -23103 -25074 -24849 -19184
6640 -19184 -3965 20581 32006 12016 1434 -15192 -28720 -36755 -57705 -31297 22830 22140
6628 22140 -1738 2809 -1812 -31929 -35469 -14581 -10871 -19029 -6334 -37430 -55711 -36608 -6515
6615 -6515 6976 19880 10697 -817 -17227 401 -11888 -33745 -33233 -11615 -16687 -14200 7733
6602 7733 -1393 8210 5434 11346 -25627 -61315 -50157 -7492 6070 -20061 -33715 -49091 -51353
6589 -51353 -34760 8511 5377 -32029 -13991 -25512 -42751 -43140 -33165 -23081 -30528 -27672 11398
6576 11398 -15117 -21377 12524 15245 -12640 9426 -5338 -23350 -1205 -436 -41892 -53295 -26255
6563 -26255 -22141 -14949 -13762 -8589 9943 -3090 -525 -2696 -30863 -48234 -3985 1329 9859
6550 9859 20836 -165 -8583 -13776 -32943 -36320 -30422 -30809 -29779 8568 26824 15656 17074 -42144
6536 -42144 -41866 -14566 -9641 -18561 -19276 -21426 -21477 -26643 -43925 -32053 -48923 -23862 -7663 2234
6522 2234 5619 9282 -4810 14510 17594 -12595 925 14716 8087 -8068 -2813 -20715 -2189
6509 -2189 -14001 5072 -1894 -29425 -45796 -13630 4018 -12274 -36006 -26054 -29925 -37412 -2536
6496 -2536 25784 13145 -15277 -27134 -31305 -25223 -25121 -28341 -13790 -6710 -13305 5042 -5873
6483 -5873 -1855 -1615 -43738 -16279 8245 -5263 -21903 -30694 -15923 -14476 -12472 -23882 -27886
6470 -27886 -30405 -40643 -29637 10510 16839 -944 14023 -15460 -3271 13110 -24606 -10354
6458 -10354 -14897 4115 6065 -32220 -1545 -869 -34685 -53187 -62926 -45676 -28584 -51432 -18365
6445 -18365 7956 -2234 4205 -10651 2973 -20507 -19350 15206 4484 50112 21542 -41569
6433 -41569 -26637 4501 11555 14112 -2105 -3723 8466 -6874 -22031 -31895 -27803 -4635 -6712
6420 -6712 -10855 -21189 -17516 -12175 8901 1577 709 4435 -10739 -15373 -14919 3545 -16095 1252
6406 1252 -9441 -23552 12227 27086 14014 -19128 -28082 -15398 -6464 20104 -9634 -27927
6394 -27927 -29436 -23950 -45341 -23504 -10848 -18530 -30976 -27829 5375 18208 -732 -7068 -12093
6381 -12093 3124 -22615 -30915 23517 23538 42 -44890 -40092 -50729 -13241 9867 -6045 -19318
6368 -19318 -38391 -18313 -27603 -20869 -3257 10815 -31565 -36939 -27589 -20863 -2581 -43832 -29734
6355 -29734 -34936 -13627 -9697 -16617 15183 8119 -4338 -11655 -14795 -52074 -25185 -18558 -5038
6342 -5038 -1051 -9861 -6065 -12768 -28783 -19618 -26323 -24502 -5824 19159 25714 -2509 5115 1762
6328 1762 2320 4315 -16742 1550 -6053 -6398 8867 19761 20184 17093 -11560 -52092 -46194 -40284
6314 -40284 -20409 -13290 -13551 -28914 -27199 -40439 5763 -4406 28990 27693 8605 5172 -823
6301 -823 15735 5494 5273 12604 18362 -11080 329 16635 -5325 -36533 -31060 -30641 -22586 1915
6287 1915 -27767 -10789 1781 -13650 -8881 7293 -29607 -45632 -1882 22495 17888 -10752
6275 -10752 -24413 -28350 -39152 -47889 -51875 15261 35364 -980 12505 -9640 -23848 -11440
6263 -11440 12742 7697 7597 -6066 -15730 7129 -1160 3099 25660 24655 17467 -22619 -8454
6250 -8454 -27174 -31216 -26159 -55458 -5257 -16255 -15903 -5080 -11377 -25455 -7108 -7268 -16120 11351
6236 11351 30925 23879 -225 -10238 -11489 -25864 6340 343 -6183 -1251 979 -24917 -21911
6223 -21911 -3844 -14804 4281 9268 10010 8824 11871 13834 50365 1472 7239 -7420 -536
6210 -536 -22975 -10648 -21009 -30054 -24565 -14593 -22528 -18375 7774 -22038 15477 2104 -8152
6197 -8152 -6096 -9874 -13574 -34981 -35738 -31483 -8124 13287 -21885 -40645 -10879 8068 5607
6184 5607 34176 26463 15183 -2201 23304 28254 -4688 25200 8464 7943 -7396 -39089 -30752
6171 -30752 -233 -19795 -22516 4887 -7582 -16940 -17257 -5930 14266 -1426 -44349 -10601 -3714
6158 -3714 22960 -22819 -34759 2373 -2575 -2847 -27891 -24167 1556 -7541 22513 36431 -9773
6145 -9773 -21446 1659 -9926 -36890 -48678 -28382 -40440 -65238 -41585 -8143 22738 23627
6133 23627 1308 -29729 -51567 -19679 -12955 -29730 -35282 -7101 17403 -1853 8389 -10824
6121 -10824 -29049 -14933 3200 -23619 -23377 -19992 -46296 -43031 -12730 -21924 2904 -2869 -16396
6108 -16396 -21773 -435 -9818 19095 29036 31484 18342 -2126 1620 -32015 -34758 -18340 -25749
6095 -25749 -28313 -11119 18443 19629 5097 -4977 -30394 -26686 -9021 9058 3053 -14029 -23767
6082 -23767 -22654 -34116 -40908 -22121 -14265 -51739 -60451 -44245 -26330 -34590 -40396 -41527 -33801
6069 -33801 -17739 2229 -25718 -3720 2588 9399 13877 16485 24266 -11085 -855 23622 9967
6056 9967 -1635 -3913 -5978 -20507 14361 -14642 -11745 2121 10501 -1132 -32623 8090 -18579
6043 -18579 -49 5055 -6632 5849 -16626 -23943 -17873 600 -3142 -17603 -10790 1959 -9121
6030 -9121 -1535 3890 -17826 -14551 -14835 -12733 -38005 -75911 -20523 8537 -17560 -7697 -15274 -7484
6016 -7484 -4623 -14392 -26374 15257 8702 -2337 2566 29853 5315 -13678 6959 213 776
6003 776 -11679 -4527 -19581 -28058 -9260 -674 1163 14094 10838 8831 4705 -12139 -11441 -24576
5989 -24576 -9498 -12950 -15349 -22974 -33320 14453 55946 7886 -32245 15240 28420 -3057
5977 -3057 -513 14252 20552 -13548 -36296 -16170 2369 -43007 -57286 -28027 4455 25413
5965 25413 8868 16448 9148 -16441 -21951 -1854 -26451 -21840 7896 1788 9747 27268 35700
5952 35700 13795 -12685 21083 -9678 -10862 23989 13977 8560 21591 8150 -862 1369 -13991
5939 -13991 -18050 -17521 -10198 -16859 2024 23294 -7654 3119 -7359 -24866 -8329 -2484 -5074
5926 -5074 -211 -2489 -2061 -749 12939 9342 6703 3494 -6579 8403 -27526 -4497 -1851 -35985
5912 -35985 -20390 4143 -7921 -17788 -4386 -23153 1500 37106 9925 -4775 40980 20484
5900 20484 -17707 -26299 -7237 -8963 5737 4898 5081 -23366 -5286 899 -26143 -8158 37106
5887 37106 58234 -7875 -26474 -1184 20144 -12391 -18133 -18182 -13052 -18153 -19875 -25122 13694
5874 13694 18309 20359 20391 -1136 -11311 -24002 -41461 -27773 -40680 -19398 -14234 170 12520
5861 12520 -20 -14469 9954 32625 29301 24352 32483 -2046 -12511 -21343 -8571 -560 -29037
5848 -29037 -9001 -28043 -11646 26854 27727 11150 8678 21162 9294 1500 13892 19189 5866
5835 5866 9090 38313 13611 -1753 6444 18863 -34476 -36944 -42071 -346 6153 -1506 -3346
5822 -3346 -23769 -28346 -28810 12608 5219 -1121 -37609 -35227 2072 1155 33971 9871 -1903 27267
5808 27267 41398 -8816 -9312 925 20099 23183 36662 28593 29592 22008 2675 13841 30162
5795 30162 16640 23940 13825 1908 16863 28365 1160 -9453 3983 -20925 3255 17316
5783 17316 22295 16192 -9197 -14305 4784 14043 26561 20945 16478 8911 -13475 -979 35577
5770 35577 46 -3174 15043 31362 27301 11537 -9581 22333 675 -15709 -8070 -20739
5758 -20739 -19391 -14004 -34394 -33087 -35815 5782 28822 14504 12740 25498 10003 22606 20731
5745 20731 9699 8364 18230 36382 39127 39746 34983 39642 42255 19527 11066 37345 44455 30463
5731 30463 9496 6655 -5641 -7324 21005 54933 61903 66749 33991 9820 8265 -7085 -5771
5718 -5771 27132 405 11316 -7260 6930 24967 -3195 11267 25624 22116 29496 26032 -7003
5705 -7003 666 5306 11570 18371 18555 -7225 -1187 -4734 -27798 -2874 24661 15578 24341 19609
5691 19609 20687 18312 11686 11775 10761 12126 4141 16260 6436 -283 400 -3699 -20347 -34522 -3186
5676 -3186 17809 32770 41764 17419 29692 17551 27977 -16067 4359 -2638 -13424 -22775 20603
5663 20603 22350 5519 24934 19060 66119 26524 -10537 19984 21989 28362 44283 9183 28320
5650 28320 -645 3774 29994 18709 23986 44942 55065 25920 -25622 -50028 -23242 -23761 26668
5637 26668 11310 3219 8428 -22630 -13623 20421 26028 13614 14843 -3122 15760 32315 16699
5624 16699 4737 -5524 -16604 -32296 -7780 3931 3233 45826 38122 51583 3489 3709 7135
5611 7135 2405 15040 21899 27770 4013 24058 31715 9025 -25442 -31361 -27332 4504 9037
5598 9037 16852 26416 10700 6145 24466 10923 15223 19727 23707 45552 36793 18144 6472
5585 6472 34083 1863 -10221 4450 21418 -4765 -11090 1026 30639 31794 22146 -5314 8080
5572 8080 8096 11143 36543 44847 11889 16586 19290 24438 39840 17543 19500 16111 -5391 -15662
5558 -15662 14199 15646 15397 -10323 -233 6556 -1090 -3424 11714 -14343 -17834 -5761 -10250
5545 -10250 3938 12877 11579 -2679 44124 51228 11593 13415 17753 30675 30192 -1961 -6862
5532 -6862 10989 51600 2961 25041 37181 10896 11861 5974 9025 18186 34895 41733 36244
5519 36244 61165 37651 20913 30889 6429 -24564 -5129 3626 22616 53886 29820 55217
5507 55217 22091 27349 33073 31436 12164 32782 15665 12359 20670 2194 7193 24735 19871
5494 19871 28753 15821 8799 -3923 8444 5223 32346 37206 13553 -2664 30213 53025 50816
5481 50816 41237 10478 17748 31157 49731 39878 31616 10588 34038 37748 27531 61532 37535
5468 37535 34118 -3526 4773 37715 21854 29917 36669 36226 42098 32022 38361 29778 9574 33207
5454 33207 61738 53556 36201 31641 31295 26380 40238 5553 42417 51398 36171 47204 36715
5441 36715 41553 42848 77444 76592 65196 63203 58822 54454 91578 76658 80399 61978 79789
5428 79789 89956 74781 44259 89632 94531 109350 125150 100605 151545 177119 203607 168466
5416 168466 162541 139210 90937 119516 108511 115023 111739 112437 99051 69186 58895 59389 95313
5403 95313 111609 97402 128460 105056 123420 131027 121801 145837 129043 155146 188316 219095
5391 219095 266869 280775 317112 389742 441044 450616 424798 357734 323992 249039 230881 215076
5379 215076 185594 161216 170076 156632 146748 135287 130666 117793 97653 132430 135888 143251 148081
5366 148081 130782 163991 172760 159448 163376 230556 237675 267828 336413 353744 403333 434626
5354 434626 471470 445335 366036 302473 302967 211300 212309 181555 143828 148186 118080 109558 102642
5341 102642 101239 129060 105801 79804 103466 130043 116257 111746 120857 93998 55305 75171
5329 75171 77709 120755 141943 142777 179831 185338 203233 200793 206855 192481 177880 166718 140397
5316 140397 109769 120928 129066 94552 92522 105959 90717 50541 72860 47667 39576 45828
5304 45828 74353 94759 74665 37674 18976 20780 41812 45279 45055 26850 47876 48902 32438
5291 32438 34907 27025 26496 -1739 28657 46877 61042 108456 95976 66045 65760 55734 39586
5278 39586 52107 45130 17383 34062 31946 30258 32057 53254 78554 65036 35249 26687 34974
5265 34974 38948 30773 41470 30393 35840 28407 23890 28980 16291 48226 72703 51298 44086
5252 44086 55468 19111 25224 43409 55263 56949 35694 80496 72289 33092 52704 69391
5240 69391 60467 41456 10536 41900 66169 75075 53882 36043 30528 17991 31833 40342 20915
5227 20915 13324 24872 17613 22880 57344 38213 37377 45924 19595 26988 29053 17458 27231 33568
5213 33568 19162 -3013 47028 43005 41441 36171 31358 72579 54542 49143 71255 72495 26350
5200 26350 41810 41627 57161 54829 65246 64379 62702 63298 76617 54153 -12861 45810 43781 30021
5186 30021 45326 22870 36494 29622 15407 38020 20340 6552 13169 14362 22626 45583 60805
5173 60805 71180 28306 21395 27781 20854 -1052 -618 7151 22866 29533 45299 61452 28871
5160 28871 22317 61783 71163 67366 59549 74680 61675 32469 8262 23955 22463 40160 45524
5147 45524 29634 11093 19471 24976 5869 33749 22641 44917 32774 39821 49355 44971 36460
5134 36460 35764 37746 61906 58828 40951 26786 43965 32361 31913 56412 63517 57748 71145
5121 71145 81537 61345 37354 27529 28252 67263 74444 48392 42261 24450 29536 34856 -2966
5108 -2966 -3006 30009 37350 39168 52092 20392 43842 65149 59804 25424 32518 20018 7354
5095 7354 16682 18983 19528 36085 29578 32567 9922 2733 11208 -2045 20481 9477 15187 13620
5081 13620 48805 61754 45917 23005 40975 55769 54419 45251 32359 35595 33533 44953 14299
5068 14299 4939 28401 31182 23749 54308 54434 62503 63315 37850 57609 43255 63673 52245
5055 52245 21070 16758 47683 27851 16141 25716 19828 26808 26137 40920 68818 21193 31742
5042 31742 31241 4836 -12623 11196 35660 39143 14571 32824 41396 17358 32399 38852 36339
5029 36339 3832 -6286 901 35441 79744 73217 19497 17343 15785 31394 51199 29103 14468
5016 14468 31399 21141 21689 18999 6161 32577 66549 76980 69249 52157 53616 53523 38960
5003 38960 12466 908 21981 61932 55851 44683 39140 26627 16565 17351 13823 8373 56119
4990 56119 72856 48965 61187 49976 34923 36921 12008 29270 8133 18483 23510 37638
4978 37638 26741 15801 31285 22797 35900 46642 41524 14921 24651 14923 50832 41320 71129
4965 71129 37135 37313 70916 42438 46792 14435 28659 54575 48276 41980 52662 49334 37449
4952 37449 22798 25613 41300 24833 45866 45680 31960 52524 31807 31648 12306 30898 22907
4939 22907 8032 12644 30101 14529 34368 36115 33044 3654 -858 30608 78403 64839 3079
4926 3079 25507 57017 55249 60896 75644 35794 -8394 22925 59499 47131 33837 31683 20773
4913 20773 31574 50863 20621 11218 25004 16357 -6347 24920 31941 22078 39096 62305 43720
4900 43720 39615 43336 43081 60086 55738 48030 35141 35887 30546 16957 6356 24469 33194 36632
4886 36632 46868 38195 44007 32929 39524 36169 62518 55643 47713 26840 22359 19895 6982
4873 6982 39512 28525 43690 73096 54945 37635 11021 31822 38849 23678 44348 73826
4861 73826 70330 37866 24776 55018 65504 90706 60756 52989 70546 49171 53401 73872
4849 73872 62948 34606 27164 58433 68469 88661 78285 38889 2848 13634 25593 -9920
4837 -9920 1697 14743 40863 18730 45167 43497 22205 37216 33551 65778 58717 45192 25491
4824 25491 28761 46792 14357 33028 52532 64289 51828 48887 44862 19470 39803 53850
4812 53850 47250 57959 54899 51034 49832 43882 69382 73683 64561 64826 65094 58624 46152 50450
4798 50450 73063 98760 96807 85004 59651 73346 62101 54075 67630 60414 66297 64242 70787
4785 70787 67862 73468 75493 87886 85432 50388 49452 1164 23031 14639 34561 53858 44230
4772 44230 58771 45623 40173 63524 34573 35463 48782 24722 13513 16251 18224 22351 44360
4759 44360 64512 55366 46878 58520 37799 3897 12667 66914 72881 50358 92899 62598 16579
4746 16579 27231 26388 81480 93644 89432 78582 58167 44273 49355 63270 53971 59006 69205
4733 69205 36738 29502 44030 63937 44624 46878 60828 54924 71704 60933 79305 74222 63173
4720 63173 75550 57212 73493 30601 18777 37598 41654 37518 47704 68721 42142 34796
4708 34796 60429 76289 67498 53568 33261 45769 38631 38444 78552 51935 59462 59035 45887
4695 45887 34342 18823 56724 65144 24144 7525 58636 56806 36345 46903 27039 31954
4683 31954 55047 35428 34086 65208 73468 61692 42051 36550 60206 80451 85255 59267 68923
4670 68923 44357 38046 62461 49821 61541 40123 19391 20536 53208 68147 115388 94902
4658 94902 80622 85320 61756 79432 80489 79712 94103 75553 49015 63781 64843 43099 61064
4645 61064 46688 64170 60614 39606 61110 73415 112268 91645 77753 63370 59175 73778
4633 73778 78026 104526 92756 82085 79215 82335 82741 58810 63579 75537 45767 42688 50026
4620 50026 50202 51543 13862 39157 90216 74206 54523 83286 73438 64926 79125 69064 94020
4607 94020 65720 65486 64429 66506 82501 94042 89631 46541 57895 71752 74268 78501 75671
4594 75671 75165 74766 67920 94200 65050 61412 72155 90426 68074 66082 69874 75006 95666 135219
4580 135219 123694 88604 97960 110333 138228 129321 131734 146032 90833 92558 112447 120555 119730
4567 119730 117936 110332 104185 103201 85557 84920 96052 90579 92738 98037 112525 106483 98315 94897
4553 94897 55634 76200 104797 67190 52202 56112 76464 85065 83728 94611 68731 69061 104946
4540 104946 101515 119269 107265 109288 88797 56945 101071 101884 98232 82811 82674 87148 86017
4527 86017 67906 73564 110000 113201 113705 142293 122371 126987 112260 103067 97109 94270 108015
4514 108015 100539 74945 90712 107317 142163 112599 111660 99269 57213 60221 90461 114999
4502 114999 114014 109735 118956 113676 120675 129854 125719 94808 110773 117365 78722 82794 73541 59252
4488 59252 92620 103130 117100 106789 123266 132209 112385 95095 71359 101034 110555 107746
4476 107746 93406 119891 99634 84702 88156 154653 150480 78218 83320 83999 68204 80034 68010
4463 68010 52549 67789 53223 55946 85479 102458 119920 115705 89776 96051 110062 117723 126922
4450 126922 97129 100772 109143 120940 140441 125092 128924 140610 116014 115972 145700 126710 106052
4437 106052 100637 70155 74991 65845 78912 113428 136823 130247 130709 129986 174300 143246 113015
4424 113015 129929 115831 135930 145057 141232 122458 106461 95471 118525 127603 109718 127426
4412 127426 118485 123806 134415 121635 111836 120195 117198 109140 109858 144137 124509 140069 145950
4399 145950 122010 125839 136154 124663 121046 136163 155679 154742 139705 161633 167908 154987 146034
4386 146034 157332 155595 158737 131589 146695 165959 161694 145668 175916 143460 136790 143620 176238
4373 176238 141229 157769 150688 131312 149298 155846 147296 133340 158840 160669 201666 216583
4361 216583 150248 141080 166093 172647 170617 152120 156016 127462 149803 165147 145644 159804
4349 159804 137327 120603 131496 167682 172278 169402 178719 193200 172487 159890 152959 172964
4337 172964 166677 160268 191931 149255 155327 163010 159575 161051 179678 189930 189549 173592 182500
4324 182500 162528 135652 173038 186260 120446 130139 164331 198701 196933 182171 175041 179947
4312 179947 208967 199917 212692 211050 194085 178269 152575 165867 161686 152894 183230 207651
4300 207651 193305 189917 184181 200486 209703 196311 184238 167330 140225 168147 192425 201090
4288 201090 216444 203295 195476 181408 212578 196198 205217 218551 183511 171297 190298 227360
4276 227360 212996 233326 206240 202476 227018 225469 239911 203699 211410 197582 208935 193160
4264 193160 227568 248976 234077 244768 271502 304797 287647 255175 252251 247064 269441 307739
4252 307739 289957 298125 311625 292094 306733 305743 330053 364368 383317 381109 377720 398517 371132
4239 371132 417600 401321 401465 439105 448564 455878 459022 501207 511872 487960 517968 547252 573501
4226 573501 578654 605032 603536 613464 636918 646722 647778 646981 676643 718031 705968 709625 741856
4213 741856 755121 772342 782203 795259 814644 840221 816495 805955 803862 818757 832578 836516
4201 836516 797189 769551 790473 810521 800269 796053 774178 779519 788014 758192 744063 738104
4189 738104 731536 736674 695650 671301 654321 645919 654494 621193 646453 665453 633047 622197
4177 622197 598718 592298 605792 594838 570875 606646 607160 601230 630519 645784 629319 628490 613542
4164 613542 596566 614192 634598 609796 596156 577289 539053 511755 530567 566526 536482 535092
4152 535092 545657 539023 575360 525970 504085 539190 540648 542561 546901 549234 534934 564825 520326
4139 520326 547910 550589 533004 569638 594908 601041 579861 584649 593865 599613 633156 598071 567913
4126 567913 576621 606066 583081 602020 615773 652336 633135 629241 656062 663647 681008 710476
4114 710476 718874 697910 714318 723239 716192 714567 736908 732616 728509 713691 744499 735274 767840
4101 767840 789573 787852 744484 751476 748804 761851 755824 722625 742418 771040 813865 855053
4089 855053 857976 823990 806440 850498 863985 924458 904981 869913 914175 916365 930588 912799
4077 912799 922521 923325 886312 929734 967760 939138 987640 1005043 1008652 1006923 1045269 1060345 1038819
4064 1038819 1065945 1092190 1069829 1075488 1083831 1094547 1101555 1129465 1129763 1145242 1189584 1213434
4052 1213434 1247918 1250880 1269634 1282828 1290388 1310395 1306791 1347062 1404315 1413721 1422178 1414754 1424256
4039 1424256 1454241 1456899 1483163 1530473 1597686 1650737 1694513 1682640 1712188 1773609 1777774 1835307
4027 1835307 1877412 1936985 1961087 2055997 2130370 2152991 2226698 2255888 2295221 2342323 2371396
4016 2371396 2374486 2429049 2492659 2550653 2633173 2663891 2747237 2794712 2855998 2935626 3001159 3103851
4004 3103851 3188076 3251757 3341124 3435782 3532427 3637649 3712169 3775704 3912062 4055806 4180688
3993 4180688 4318231 4429066 4548914 4654184 4801741 4925125 5070676 5227220 5344303 5454997
3983 5454997 5618522 5785033 5919313 6102427 6305288 6499355 6677477 6849665 7041901 7214642
3973 7214642 7434313 7676298 7904968 8168208 8458819 8725359 9012568 9309090 9641887 9987240
3963 9987240 10396496 10842801 11271416 11729695 12237946 12866989 13449877 14053884 14721077 15451776
3953 15451776 16231369 17018362 17886182 18810989 19796969 20902487 22059243 23308228 24662390
3944 24662390 26062963 27560839 29122958 30803294 32550470 34333802 36130606 38002195
3936 38002195 39942371 41865160 43885663 45958495 48074529 50285059 52577399 54878451
3928 54878451 57267163 59649630 62031826 64320740 66560750 68685340 70676869 72522669
3920 72522669 74233617 75888197 77464162 78965879 80401558 81798272 83181533 84469736
3912 84469736 85575851 86523703 87270329 87727361 87814340 87667715 87231510 86556722 85762035
3903 85762035 84858805 83861831 82842843 81765581 80636115 79444815 78091290 76551118
3895 76551118 74854052 72930551 70831330 68591542 66187942 63701050 61197784 58732925
3887 58732925 56328565 54052848 51835471 49706818 47608087 45494045 43399657 41355382
3879 41355382 39317637 37233541 35206164 33220303 31298706 29465500 27730838 26067553
3871 26067553 24552491 23125149 21795881 20574194 19438544 18328732 17348016 16431544
3863 16431544 15553434 14674479 13868662 13133889 12437686 11807679 11213117 10650100 10175294
3854 10175294 9723566 9304540 8926636 8560459 8265999 7950994 7694238 7394994 7176687
3845 7176687 7002822 6805424 6589141 6402999 6220090 6047203 5947437 5827324 5716646 5577535
3835 5577535 5448350 5342141 5227907 5152222 5106888 5075112 5018039 4968220 4896693 4835636 4788843
3824 4788843 4688171 4617594 4599935 4582876 4537283 4477923 4442498 4402297 4360649 4311225 4297154
3813 4297154 4280311 4257635 4210267 4173258 4123597 4070451 4032253 3980068 3953657 3922391 3865269
3802 3865269 3813716 3757407 3713807 3700443 3650900 3608627 3601471 3575485 3558959 3554852 3530477 3497160
3790 3497160 3449110 3443083 3420459 3394459 3378353 3334368 3337813 3351120 3357591 3360552 3374529 3403191
3778 3403191 3500557 3538841 3619312 3661549 3707014 3774466 3767668 3801817 3823176 3833939 3847265 3827865
3766 3827865 3802811 3765649 3711838 3646789 3614891 3607296 3596884 3570540 3539506 3497051 3427553 3383906
3754 3383906 3346762 3300127 3203841 3104227 3014118 2948687 2849370 2791593 2698814 2643404 2604121
3743 2604121 2539980 2548572 2530639 2500804 2464751 2463441 2486153 2454933 2457375 2427918 2425689 2429462
3731 2429462 2437488 2428073 2450429 2467764 2489613 2513168 2507716 2522036 2531696 2511550 2500007 2502029
3719 2502029 2552622 2579493 2591698 2554938 2554459 2540929 2553682 2588394 2598890 2584493 2556216 2554694
3707 2554694 2600603 2584874 2563296 2569890 2602296 2623651 2628268 2673311 2656607 2676041 2691886 2723235
3695 2723235 2724421 2742539 2774407 2811443 2852656 2862998 2868666 2934020 2955195 2960554 2987236 3038546
3683 3038546 3085443 3133487 3163044 3200982 3260109 3311938 3313391 3364577 3416814 3495066 3549444 3582995
3671 3582995 3610969 3642896 3678109 3755087 3788537 3827590 3867283 3895862 3976181 4065674 4094810
3660 4094810 4149324 4216515 4300222 4358539 4421603 4479812 4560775 4595411 4664584 4772055 4820284
3649 4820284 4906229 4990994 5077156 5156726 5280193 5399176 5528561 5635351 5730788 5861639
3639 5861639 5991657 6087461 6186069 6335780 6495887 6624411 6773495 6920743 7090927 7281862
3629 7281862 7467124 7694842 7874823 8076796 8282547 8476519 8734371 9025305 9328099 9577695
3619 9577695 9890406 10253515 10603083 10965265 11374079 11789659 12197747 12639416 13149637 13680100
3609 13680100 14277424 14872299 15519399 16272298 17076863 17876847 18763446 19690619 20652079
3600 20652079 21577349 22486832 23355454 24169106 24964358 25726037 26414265 27075078 27734279
3591 27734279 28397533 29118470 29862729 30662111 31422580 32120442 32755566 33267237 33629090
3582 33629090 33870620 34002875 34002439 33918282 33811556 33741252 33659017 33682631 33767320 33888540 34047576
3571 34047576 34252918 34479996 34730178 35006076 35243958 35558757 35899954 36343252 36910726
3562 36910726 37595242 38427829 39408666 40572998 41941884 43526250 45307430 47326328 49597387
3553 49597387 52118331 54946463 58077661 61521273 65215427 69095478 73168134 77298991
3545 77298991 81522300 85769136 89929511 94060765 98211825 102398539 106725671 111218656
3537 111218656 115912016 120865464 126001092 131274487 136633899 141920768 147031559 151924391
3529 151924391 156554819 160807372 164657847 168192668 171393920 174356331 177023692 179485824
3521 179485824 181756332 183791776 185597443 187154537 188450227 189658425 190897566 192067262
3513 192067262 193063379 193806474 194267570 194525082 194560993 194415527 194137433 193679610 193087174
3504 193087174 192443594 191942822 191824841 192050195 192666396 193816728 195615083 198382531 202422411
3495 202422411 208141577 215814073 225565282 237196827 250321626 264480337 278749011
3488 278749011 292139183 303656003 312319071 317481682 318958044 317205647 313176536 307889702
3480 307889702 302523764 297839429 294275420 291952439 290775121 290318072 289806430 288216925
3472 288216925 284320003 277280859 266929041 253500791 237663881 220392637 202461531
3465 202461531 184649944 167709487 152377101 139017993 127564580 117735718 109286202
3458 109286202 102030285 95725705 90320643 85681415 81633047 78074044 74843469 71857952
3450 71857952 69058314 66408187 63870365 61451126 59112379 56762111 54477559 52314738
3442 52314738 50327177 48458196 46723615 45064506 43455004 41974503 40599314 39240481
3434 39240481 37875912 36470130 34998913 33549578 32160263 30835667 29551309 28322761
3426 28322761 27167091 26042201 24998371 24030929 23134909 22318558 21541550 20806118 20135170
3417 20135170 19523002 18955670 18408895 17890935 17404661 16957922 16560982 16158182 15730556
3408 15730556 15326628 14935636 14576012 14215679 13903307 13587520 13312799 13044803 12719672
3399 12719672 12438147 12140112 11898500 11648371 11381044 11115199 10903696 10669247 10448135
3390 10448135 10230901 9996262 9797911 9615807 9385486 9190152 9021415 8864859 8662508
3381 8662508 8532007 8367061 8188853 7994258 7843222 7670806 7503003 7299985 7181597 7109020
3371 7109020 6978251 6880377 6752630 6693918 6589373 6473835 6361286 6309665 6249302 6143579
3361 6143579 6035861 5941460 5838405 5730012 5667862 5611083 5557160 5499545 5398961 5307540 5246965
3350 5246965 5160956 5084883 5007104 4958063 4896727 4833542 4766145 4702387 4649413 4560205 4459695
3339 4459695 4397058 4344127 4309553 4249139 4145953 4110314 4076532 4027426 3941861 3901467 3852559
3328 3852559 3817051 3824366 3816082 3745694 3694097 3650459 3578772 3511438 3510651 3480398 3429672 3407446
3316 3407446 3392921 3354526 3285042 3290709 3287734 3267652 3226410 3221969 3204847 3169906 3149123 3124889
3304 3124889 3130731 3111630 3092719 3082925 3082763 3038959 2990376 2965306 2965487 2968803 2957894 2927176 2915901
3291 2915901 2848935 2862997 2865542 2840196 2829177 2797820 2781726 2804726 2833430 2814993 2801688 2799810
3279 2799810 2819509 2809856 2821166 2827321 2816113 2844533 2819844 2810347 2844700 2874025 2909902 2944359
3267 2944359 2947014 2964270 2954342 3004056 3075552 3103322 3122848 3161999 3191433 3199532 3212482 3277448
3255 3277448 3339486 3396427 3432068 3466837 3485788 3493912 3552541 3587596 3662083 3742593 3809012 3847673
3243 3847673 3895143 3962808 4033805 4093487 4135960 4194367 4241712 4269546 4334119 4402527 4444880
3232 4444880 4466584 4528032 4561392 4629832 4705235 4784784 4840832 4938614 5031217 5136167 5189704
3221 5189704 5273506 5357296 5433804 5527095 5607352 5672507 5761562 5891121 6005686 6116835 6238098
3210 6238098 6402009 6531855 6704592 6887933 7078182 7264952 7468193 7658537 7886190 8099549
3200 8099549 8285000 8480532 8658144 8877400 9031234 9211912 9409741 9571616 9760876 9970465
3190 9970465 10203950 10399809 10643259 10924361 11177620 11457614 11761128 12024002 12225541 12417814
3180 12417814 12603737 12801815 13057797 13288939 13523392 13844086 14159750 14510923 14899220
3171 14899220 15333013 15808157 16300030 16854251 17409290 18024748 18670802 19355451 20110766
3162 20110766 20912296 21793468 22702672 23644049 24697630 25814817 27012049 28353293 29805818
3153 29805818 31357194 33004689 34737501 36483925 38321050 40314308 42497717 44840032
3145 44840032 47409046 50096254 52955958 55965258 59044862 62187913 65292504 68245084
3137 68245084 71006257 73416327 75408031 76867848 77709787 77839044 77241156 76029016 74179146
3128 74179146 71873569 69195879 66267685 63187734 60031013 56891290 53833814 50909178
3120 50909178 48097063 45421641 42881940 40410711 38110403 35997936 34059828 32221424
3112 32221424 30521347 28939709 27482753 26125025 24866442 23680957 22577606 21555445
3104 21555445 20616574 19743557 18888668 18098978 17366253 16671499 15990907 15369557 14805464
3095 14805464 14222481 13734202 13267855 12786285 12325505 11884429 11494137 11096115 10705990
3086 10705990 10360435 10038428 9743493 9428227 9180501 8890338 8614483 8380464 8136102
3077 8136102 7921947 7688929 7481891 7306914 7087966 6859108 6718495 6579866 6408476 6250880
3067 6250880 6108644 5966517 5813708 5676525 5546397 5431461 5317970 5184156 5080423 4976496
3057 4976496 4872226 4752870 4633792 4522149 4454409 4351414 4288986 4190635 4099757 4052176
3047 4052176 3936826 3864362 3781676 3698838 3574503 3506681 3444864 3378827 3289337 3203639 3147753
3036 3147753 3069406 3007562 2944401 2910939 2868249 2805609 2734184 2672406 2623852 2581799 2566282
3025 2566282 2541473 2501679 2456817 2437139 2376401 2329385 2334633 2267949 2237449 2181539 2167500 2148380
3013 2148380 2111683 2062728 2018780 2000530 1992509 1973962 1948356 1939137 1877377 1823543 1813610 1813948
3001 1813948 1781451 1752010 1712216 1661656 1619785 1607270 1614005 1618460 1596134 1565915 1509791 1470582
2989 1470582 1489417 1444208 1404242 1363250 1362484 1371772 1360110 1338967 1338966 1293899 1318458 1291735 1243649
2976 1243649 1230518 1198875 1181336 1181546 1157495 1154967 1142887 1118722 1096722 1056175 1083095 1058782
2964 1058782 1062906 1038750 1008442 1031712 988855 979651 985235 978722 993515 945938 958021 952225
2952 952225 934905 916564 891849 904577 884868 870582 864852 829050 807812 767708 766144 772181
2940 772181 733369 717281 716291 721968 730816 722447 706896 689158 685987 681675 648939 649334 681803
2927 681803 668767 685531 656923 650392 680633 633095 601214 586400 593256 615791 640464 649951
2915 649951 586216 579140 591093 555044 565503 585577 590980 556475 539464 513558 509309 516464
2903 516464 472568 468227 473526 477238 470128 457981 449997 460308 445212 454176 449752 425140 415730
2890 415730 399402 379358 360689 371241 422210 376044 360054 371069 359476 371478 373507 340953
2878 340953 367257 312706 293589 349938 363582 388368 374205 356022 295002 312190 323896 338892
2866 338892 338390 328071 299653 337302 344390 286200 268769 289692 269736 286041 316327 310607
2854 310607 287156 277933 263646 243130 260996 269995 269076 290229 262021 224370 226091 224067 229138
2841 229138 253972 258963 241544 243676 270051 283808 286381 261102 246563 250288 201346 222565
2829 222565 237471 243764 255253 232953 233271 209415 195282 192507 211985 180391 163593 182863
2817 182863 176956 188632 160273 172607 222818 226314 202358 184528 168839 193716 213550 224334
2805 224334 205997 187437 193968 174700 171652 201559 171556 176480 215750 218948 211183 188524 156078
2792 156078 154141 147343 143000 147198 188906 218543 214809 191106 167015 171803 159861 166755 170429
2779 170429 161277 149454 139449 154307 148627 146059 156469 151461 121663 125829 115569 128722 107137
2766 107137 87415 94715 92135 117825 113929 124286 137403 127282 118574 153487 131132 121305 125621
2753 125621 124821 145796 151101 124697 106079 75249 105392 122207 136130 108048 78797 74635
2741 74635 105914 121364 134543 129005 142445 138502 129096 119955 132246 125768 128461 147307 111176
2728 111176 107242 80666 107073 104488 84539 69815 93409 110406 99942 50924 45453 79374
2716 79374 75202 65543 65925 61490 76242 60314 42755 32542 79224 63089 60590 40218 45780
2703 45780 57828 41646 38475 34250 50091 87699 83241 64828 102141 91907 108599 89216
2691 89216 73701 56040 66099 57184 44894 63125 44405 49988 38387 43824 64999 59568 37211
2678 37211 26562 35790 37255 57963 56278 58026 41556 35956 27111 40917 71707 50062 63128
2665 63128 84308 48289 22791 19475 38409 49894 80735 40561 42783 48713 61906 75556
2653 75556 82414 72186 40020 78303 67434 52611 60816 56698 30159 16684 8800 15323 23024
2640 23024 8532 15345 29171 8559 10088 21422 25628 11246 19276 -6922 -9585 -3423 16483
2627 16483 15418 -2581 2638 -3536 -10313 31122 63320 79693 59058 42734 47932 25293 49812
2614 49812 15595 19699 17262 21320 12934 10480 29939 2408 2000 -11224 -39557 -23292 15143
2601 15143 9820 21083 11155 4497 30372 26760 -5008 12360 15615 28880 51648 18505 30492
2588 30492 22323 5674 1042 7598 28722 17811 27149 19273 3796 11457 6711 26183 22594
2575 22594 29706 19746 18375 34024 18124 285 -8774 12170 36727 38557 64540 63823 19541
2562 19541 529 15676 -9395 21436 24312 3305 21437 11506 9588 15237 -16083 -32378 4651
2549 4651 17464 29785 16160 -12514 305 20717 -146 -838 -32084 -4581 -12319 11000 -1768
2536 -1768 -10516 17117 -8342 -25906 -12443 4608 2416 26060 7333 -9535 11663 -8351
2524 -8351 11070 36458 2857 -35521 -56159 -49858 -37503 -11020 -2045 32077 15131 -540
2512 -540 1605 -12737 -25789 -21322 -46232 -48186 -29561 -19722 18529 -4444 -7101 16554 18795
2499 18795 12562 18654 29986 18130 18996 13518 -6918 -35335 -15801 -28424 -3292 1966 11637
2486 11637 8908 -12557 -7088 -10216 -5499 9856 -5591 -17673 -18105 -19349 -11922 -4833 4063 -2610
2472 -2610 16433 -1889 -30982 -19751 -22701 -10823 3270 -9176 -3481 -27506 -18891 3469 33734
2459 33734 -570 2480 22024 35340 26494 6702 11908 575 -2809 -6576 -31162 -49180 -42730
2446 -42730 -9294 -18021 -5022 -589 -7753 6638 8872 -2962 -3833 -38861 -63502 -52984 -26876
2433 -26876 -4157 -18137 -6395 -32536 -22596 -11662 -23244 8665 -19815 -44888 -16406 -11355
2421 -11355 -11644 -31125 -17484 -26884 21794 -14026 -34834 -9969 -16304 -30544 -25433 -10244 14820
2408 14820 3125 2526 -34806 -53951 -20877 -7781 -32827 -42824 -21159 -62229 -53236 -11777 -20270
2395 -20270 -16756 -15948 -24522 -26325 -42219 18305 -18654 -32576 -21829 -19866 -37907 -38851 -49649
2382 -49649 -75060 -42130 -36368 -32875 -40174 -26591 -1973 -19717 -22047 -15285 -24529 -12721 2877
2369 2877 11205 6006 -8627 -4340 -21152 -22151 -42652 -66735 -29083 -6938 -22594 -35157 -27050
2356 -27050 -36233 -33866 212 18484 -15351 -12393 6790 8576 20345 21345 18814 31600 24802
2343 24802 10909 3003 4703 -6999 15104 -5010 -11699 -20539 -26047 -19784 -37109 4635 312
2330 312 12617 -3394 -10710 -37771 -30996 -8086 -5599 -11323 4417 32912 49329 62945 67329
2317 67329 97537 64297 40898 42431 39565 26754 31210 33443 -3991 -4595 -7651 10217 3974
2304 3974 752 -17344 20032 66416 42505 27922 10825 -10465 -31095 -21450 -17766 -23144 -665
2291 -665 38554 27493 -369 13873 28214 2004 -11026 -2656 17989 -10296 -35502 -22314
2279 -22314 -7726 -10765 -5205 10867 11034 -21289 -26744 -21267 -47361 -36787 -16703 -25026 -15463
2266 -15463 -2080 -4731 3859 -14351 3115 -14640 -5497 9910 35390 5757 9936 26680 4016
2253 4016 -2396 -24108 -21059 -9148 25781 5522 1080 13495 41207 19613 -15495 -17509 -36293
2240 -36293 -42019 -37347 1240 6927 -1111 -10489 -20280 16372 24446 12718 -13482 -8213 -13646 8805
2226 8805 4926 7178 1308 5174 9321 -26439 -18180 30713 17921 7390 2969 -21706 -41378
2213 -41378 -29350 -16113 -23277 -32207 18713 42064 289 6325 13449 2037 6026 6145 11088
2200 11088 13878 577 -9999 -10286 -22309 -22586 1839 924 7180 4285 11662 -3622 7537 41076
2186 41076 47239 24991 -651 -13043 10785 43252 36041 31982 35922 68483 57024 34877 -6129
2173 -6129 -12175 16266 -717 17435 43607 35069 4952 -30895 11654 47996 37824 42121 42728
2160 42728 36654 31343 27877 45626 60359 26428 35674 23847 60178 72620 96101 81281 91285
2147 91285 94037 106109 102663 75606 105600 116468 103280 91801 78402 61011 104243 89219
2135 89219 77055 91926 97693 139444 148344 151827 142256 125747 158126 172325 165912 180228 168955
2122 168955 165296 173971 206509 208136 220268 239563 234224 252322 270105 273774 233643 256222 282669
2109 282669 271449 295578 274082 279097 304683 285806 295187 317745 343305 346623 376737 406472
2097 406472 408675 412190 438476 476019 478574 471727 530327 503783 495523 556368 587551 634672 601239
2084 601239 617162 663414 683811 692662 746935 819101 859602 920741 963560 1007276 1047026 1066950
2072 1066950 1155729 1232111 1300396 1372189 1465057 1594467 1738469 1907616 2051381 2179057
2062 2179057 2323998 2520345 2824545 3159564 3541185 4005562 4606633 5426644 6500802
2053 6500802 7886484 9648169 11779939 13642005 14459655 13087204 10554242 8507927
2045 8507927 6945373 5809360 4927220 4195882 3633650 3222994 2875704 2614893 2426522
2036 2426522 2289158 2159974 2052367 1904980 1691937 1516176 1401064 1259439 1153814 1096710
2026 1096710 1042692 993841 928406 885607 854692 835807 791257 752160 703349 631202 589669
2015 589669 600378 600647 588802 548905 502097 463981 441297 404965 391069 373091 365201 379514
2003 379514 380177 382103 367802 342814 338517 328263 312141 302025 289214 273360 290637 261900
1991 261900 254931 242179 234516 244993 238510 236792 204728 207124 164090 164057 186820 188515 174858
1978 174858 185436 167185 174836 177794 177262 157949 156264 137510 184205 205501 167839 170256 172242
1965 172242 158016 125795 129940 133222 130728 125876 132145 102188 105561 100105 85702 75432 80937
1952 80937 79433 87276 77934 73231 53632 86162 66691 73658 100362 79076 38381 39127 69701
1939 69701 57224 76631 65800 64782 45277 59568 78703 69554 73885 80028 97276 54180 16828
1926 16828 62245 31604 61117 71824 76886 78539 37265 22196 44732 49920 77745 57016
1914 57016 32567 34031 32185 24702 38590 15474 981 51261 38985 28492 65999 50833
1902 50833 33342 52518 74577 34980 16758 34311 15816 25669 -16076 -8234 30372 30736 24652
1889 24652 -4844 17481 45331 32011 10952 -19662 -3011 17074 10931 4886 13100 -13106
1877 -13106 -30065 6644 12966 -22716 -1755 15642 -20213 -27299 -28199 -27625 21601 7429 4534
1864 4534 4633 2913 -13238 -28667 9267 14397 22876 21153 27419 1591 -23128 -37254 -35142 -19152
1850 -19152 -2953 21471 31128 -4376 -13816 22717 46262 55672 31038 2488 221 -5508 -2376
1837 -2376 -9978 3546 -1409 -775 -18089 -44198 4930 -4012 5727 -13057 30 -9227 -6606 -53945
1823 -53945 -47572 -7631 -36610 -44297 -13456 -6956 -10407 9715 -6822 -46283 -38212 -43257 -37724
1810 -37724 -3192 -16463 -37553 -42979 -42318 -9685 -16454 -6169 14336 21740 15495 -9303 28255
1797 28255 17570 7229 1199 27213 3156 -4304 13059 8047 -8930 -7138 22463 30003 41321
1784 41321 41086 16002 23159 37160 28954 31202 52824 52317 25783 16326 -187 16463 26802
1771 26802 10302 10019 26709 23012 38295 -8402 -37885 5688 30355 36926 15083 -7141 11675
1758 11675 20555 12592 -3381 -31808 -1168 2270 -8072 -35998 -18064 -15623 -11512 -25870 -38224
1745 -38224 -28123 -26688 -10352 -13301 -23101 -8332 -24112 -10055 27765 20145 36630 12990 -13024
1732 -13024 -10838 -1063 -14347 -2717 -27813 -26061 -17152 -9874 7235 -7929 -22264 -12089 -12347
1719 -12347 -24614 12628 18773 -7595 -8035 -15020 -23092 1160 2693 -4105 -13116 -26402 -20481 -24342
1705 -24342 -43789 -69023 -56515 -15473 2283 -21626 -19216 7037 10719 -257 -2120 -5650 -23569
1692 -23569 12690 -16439 -42538 -8914 4793 -6231 2133 -12031 -16520 -8968 -6027 -19966 -29123
1679 -29123 -57594 -28826 -29604 -40379 -41944 -25992 -8725 -34770 -29517 -3246 -10182 -10121 -23496
1666 -23496 -19373 -39735 -55107 -39132 -19531 -31368 -39755 -7686 23900 607 -28855 -23755
1654 -23755 -1633 10226 -583 -17045 -36016 -9039 29481 14483 -15524 -21559 8755 23243
1642 23243 -4303 -4094 -48944 -25726 -12625 -6559 -11738 -57 -10090 -24434 6216 25042 -16957
1629 -16957 -16724 -8036 1845 -5368 -5935 -2807 -18513 -38817 -47714 -34941 -2569 -9114 -3093 11428
1615 11428 -8466 747 -10146 -5991 -34463 -26428 -12648 -29379 -13120 -35456 -32131 -24708 -36506
1602 -36506 -24678 -11047 -45616 -40559 -34738 -16916 -16811 3204 -14742 -25862 -29184 -32438 -47773
1589 -47773 -50568 -30403 -23611 -35492 3681 -5710 -14650 -25931 -55158 -19199 -20712 -38921 -39058
1576 -39058 -42046 -21166 -17258 -7920 -8962 -31602 -41475 -27615 -24144 10220 30463 15818 4899
1563 4899 9185 13270 -15083 -5404 -24638 -16706 -18308 -10270 -1567 -2794 -13535 -13735 -11070 -6358
1549 -6358 -39160 -37566 -63160 -44304 -49562 -44560 -29702 3755 -11630 29244 -6188 -9253 -10283
1536 -10283 -25711 -41981 -11421 -3647 -34933 -21820 -12047 2522 -5372 -25585 -31043 -49004 -9691
1523 -9691 7497 -11406 -2182 -38060 -37332 -41185 -64211 -41422 16057 5073 -32261 -28620 -16599
1510 -16599 -39386 -23354 -28651 -32573 -23561 3900 11395 -1510 -14660 -15199 6986 -7280 -38499
1497 -38499 -11851 -43039 -16706 -10665 -22320 -9620 -43980 -35039 -169 -13248 -29423 -40005
1485 -40005 -43007 -33872 -34169 -29825 -32074 -16009 -9400 -25373 -34660 -42925 -14047 -17441 -30683 -62928
1471 -62928 -44570 -34232 -13221 -19521 -24602 532 -44565 -50349 -17165 -18958 -23270 -21446 -11401
1458 -11401 -17033 -23358 -8358 20417 -3814 -35170 -17513 -24246 -17550 -18404 -27291 -41910 -1157
1445 -1157 -22944 -22443 4615 -6278 -32064 -7944 27742 -3201 -19887 -17951 -28667 -13001 -21130
1432 -21130 -4022 12978 -24557 -36701 -10976 -13687 -7302 -23169 -22887 -3982 -17582 -32620 -30199
1419 -30199 19188 -3733 -20229 -8654 -28744 -32849 -34151 -12120 -18718 -27567 -14701 -28011 -31015
1406 -31015 -24173 -3439 -9489 4695 -1190 -20850 -3391 6139 10420 -25051 -65927 -63221 -59543
1393 -59543 -30514 -31064 -44357 -54054 -11018 -975 -27977 -20990 -10510 -9084 -27371 -38496 -52503
1380 -52503 -68604 -28250 -16642 -34962 -34844 -6457 -4014 -22160 -26872 -8259 -36260 -41617 -4962
1367 -4962 8532 -17149 -4026 -10627 -16105 -11360 -28282 -28825 -30873 -26297 -49986 -43829 -39400 -12619
1353 -12619 -17969 -34867 -26076 -45628 -16522 -24561 -41122 -31944 -34128 22087 -2219 -17510 -43194
1340 -43194 -18317 -6191 -24283 -34973 -33310 -30579 -22061 6124 8871 24335 1148 -15187 -12128
1327 -12128 -30824 -10220 -8678 -13701 7938 -13081 -34546 -13070 -25031 -34289 -41411 -24601 -8306
1314 -8306 -46883 -39732 -14600 -21381 -9953 -18499 -34973 -40567 -59360 -54637 722 -22251 -31564
1301 -31564 -17153 -32878 -49350 -57477 -13459 -23451 2057 18453 -11510 -8677 6090 -5853
1289 -5853 -18066 -4078 -11655 -13370 4406 3981 -23246 9873 16275 11281 -1529 -4674 -855 -8310
1275 -8310 -26039 -38268 -47138 -33216 -54449 -44574 13305 9231 5981 -32339 -29962 -24524 -5534
1262 -5534 -20120 11346 3172 -38908 -55923 -9828 11886 -2280 -29706 -31985 -15452 21305
1250 21305 6217 15564 19210 -11026 -3024 -19415 -11355 -6303 8848 -16924 -22072 -19189 -26951
1237 -26951 -53289 -33024 -10059 -15363 -41243 -23836 -21294 -5141 -10271 -918 -20623 -65986 -40820
1224 -40820 -23232 -29505 -34799 -3131 6531 11285 -463 12078 -20908 -37735 -37024 -30166 -7304
1211 -7304 -12883 1414 16721 -3466 -24919 -30895 -25271 -26120 -21156 22322 -11381 -34694 -14824
1198 -14824 -119 -610 -23537 -13924 -21085 -27228 -11025 28708 -1048 12074 -16413 -19081 -6864
1185 -6864 -31064 -24738 -19364 -33843 -40811 -659 -37400 5498 16838 -1653 -7193 22487 -4779
1172 -4779 5547 9298 -11494 870 -11588 6723 13543 17372 6309 -8859 -18747 -39969 -7348
1159 -7348 -19286 -51352 -34824 -26589 -28833 -22073 2912 -3704 -2165 -23920 -25430 -52167 4866
1146 4866 -1037 -7461 -10255 18657 11382 -14598 -39589 -63984 -35749 -30138 -32239 -18682 9563
1133 9563 -17903 1894 5573 3796 24184 -8638 -29802 20582 12693 -6489 -41860 -14777 -3342
1120 -3342 5350 35626 35713 38149 36032 18650 -28646 -20038 -13852 -19097 -11372 -7648 -27598 -15854
1106 -15854 -24289 -25598 -12531 -16796 -7132 -31373 -38233 -19525 5134 7455 -8908 -18018 2367
1093 2367 18540 22112 23250 13553 -11073 -19849 -45163 -40739 -35051 -12647 1091 -4996 19740
1080 19740 -2337 732 27073 191 -19563 -18326 -35997 -15319 -22704 -26559 -15863 -33124 -19049
1067 -19049 -29091 -7111 -2263 -20884 15501 13984 -12546 -23116 -25849 -16650 -10282 506 -17628
1054 -17628 -13596 7122 -9207 -25547 -16999 10180 43279 18670 -11675 -5718 10080 13797 22066
1041 22066 16136 20332 12893 13111 37780 18378 -21167 -8188 3857 -3252 6635 -11056 -781
1028 -781 8856 6319 8984 -3912 -10756 11443 22550 52860 23814 -2902 25735 19555 -15945
1015 -15945 -5865 8004 38313 18099 40222 36497 19481 -3849 -29024 -45489 -47327 -21384
1003 -21384 -5397 16784 -11249 -19273 -11426 -5753 -5165 9041 8571 212 6474 12712 6214 -4512
989 -4512 6723 41179 13916 -2343 -13370 2335 -25909 -13363 3756 -4120 11723 6050 -4353
976 -4353 -10278 11633 5292 -10923 9096 13175 22377 14334 -2911 17534 15488 -6875 -8552 9037
962 9037 26474 -5049 -15161 17026 2617 31335 -8257 -1450 31239 16727 8393 17041 23512
949 23512 7297 11155 -27465 10672 2074 -12452 1352 5667 2209 -13474 6732 -14534 18937
936 18937 13784 11661 19552 24583 -15352 -22923 12067 26025 27091 28044 30884 43612 27342 -11333
922 -11333 -27069 -278 -22131 -34708 -3660 -20582 -12289 15061 4923 -6545 -9724 -20689
910 -20689 -45261 -47602 -36905 -16567 9564 1060 18391 -8476 -10893 -23836 12522 -5667 -14723
897 -14723 16694 26995 33921 33327 31070 -5021 -15947 -326 17398 13792 28087 30422 5965
884 5965 -2585 -410 15197 26134 25016 -17575 -37601 -26947 -27411 -24477 -10480 1791 6621 26964
870 26964 -3669 -39213 -12185 -17242 -10269 -10690 3354 -11357 -8683 16543 22046 27187 34307 49867
856 49867 48646 22918 -10561 3127 -3245 -4881 18978 20777 29444 37876 399 16716 39400
843 39400 31010 45948 23680 -14768 21538 28875 12402 -16420 -47443 -37945 -8498 41146 73472
830 73472 20290 27531 9952 -25202 5320 9428 39042 29915 23033 17566 15135 27327 2698
817 2698 -24938 -3229 17985 20688 27455 -7037 13730 -15864 -24275 -13017 -29815 -5986 4434
804 4434 21133 20193 789 512 6542 1410 6513 358 19447 29051 7864 -17388 -22222 9728
790 9728 1573 -25338 -14646 -2517 38448 7746 -21304 -13724 8299 28555 44147 18464 25479
777 25479 41060 47656 11062 4158 1818 -16600 -10454 26057 37476 24066 17706 8332 15833
764 15833 10769 -4347 1150 4880 10176 782 -15428 -3085 -33009 7939 24187 36443 28297
751 28297 45169 21330 -1073 -16120 8842 15378 21807 -19333 778 15182 1808 4315 -13663
738 -13663 35213 -12897 -21720 1832 39333 50455 22170 8994 381 -5769 -14471 -1603 -4230
725 -4230 -3763 -6533 -11040 -24394 -14784 18467 29766 -1292 -788 -5773 -40732 -41984 -23444 -27836
711 -27836 -11871 3263 -831 13514 -3169 -15396 -21233 -18486 -14227 13471 11835 -12316 7043
698 7043 -5885 12384 13673 1141 7330 -6113 -137 2840 19306 15300 -1198 -16964 -20794
685 -20794 -12895 -1304 8232 27134 -1632 -15162 -11441 -4541 12929 -19122 -3992 9185 -13097
672 -13097 9719 20150 -490 -26089 -57637 -40396 -41931 -83582 -46315 -23248 7590 33537
660 33537 34797 12035 23718 22692 24724 17705 37324 61298 65472 61388 33110 32562 28228 27662
646 27662 46611 1761 11468 11777 -18932 -13911 -8853 10576 54978 60776 28648 18174 18823 32980
632 32980 24103 11177 -35003 -35969 5290 12749 -2786 7684 23221 24718 36010 25300 18690
619 18690 23180 19664 28560 28358 55693 59125 30682 18596 13251 13720 10925 11757 20231 17500 12832
604 12832 1748 -18229 13909 30663 41896 84549 55178 11054 25878 45171 24601 35526
592 35526 36539 36718 13498 34244 24770 28276 16392 -8128 11064 1665 -5123 1749 11698 -7979
578 -7979 -5184 8352 1583 10580 15743 35266 35158 5799 11298 39162 41287 13207 29144 36038
564 36038 4106 -9774 -20430 21380 52666 45197 33521 16811 -8815 -28362 -8196 34915
552 34915 12219 1269 -1943 3634 18930 22344 24318 -6096 -20127 2527 40361 38772 8208
539 8208 -8517 7672 28782 31519 43018 33573 28635 46710 49807 51428 66910 84950 60436
526 60436 57390 39950 26477 5362 31774 40394 -2735 1280 37523 22383 17834 25898 14709
513 14709 25941 41175 43605 50441 11900 -646 33825 33490 17610 20149 11956 34869 38515
500 38515 25843 17063 846 1423 9913 36052 35402 20433 13537 57073 63038 43419 26547 26297
486 26297 19532 10757 14718 13213 2607 972 -17597 -2807 5721 235 17535 34985 52377
473 52377 48059 67446 59994 55544 36062 23001 32385 35556 52836 36854 25442 36304 42816
460 42816 48968 37189 18399 -1415 11988 23431 13939 -2040 4366 677 17188 2197 19948
447 19948 41387 24119 8839 16116 35867 26760 13669 24391 32289 32397 22610 -19486 12113
434 12113 20904 47445 29035 1665 14107 -16538 -55 -9965 16152 21087 15719 8324 7029
421 7029 41214 55227 68016 61260 55632 28421 13233 8464 30011 6041 -4380 22050 43042
408 43042 19309 27819 31279 23484 25587 7919 2745 4386 -11712 -13024 -9172 -11130 4724 1899
394 1899 19183 17960 28532 35397 27020 26847 37833 39375 61295 44505 -24175 -18434 2 -13490
380 -13490 7527 7929 -5694 4803 3675 -22094 -38178 14746 30064 51725 41497 45319 -13532
367 -13532 -19919 -7333 14048 42594 28229 -17565 -21289 -57972 -34246 21334 49959 53211 11804
354 11804 15001 5485 22501 -8926 13289 25988 -1955 -19722 -3891 -3073 24288 22602 36216
341 36216 16500 21635 -3455 -11384 -11280 -784 -17259 -5645 18829 25805 12040 7013 37263
328 37263 38854 14077 20212 38413 47054 18653 30654 37908 17687 22566 12131 38281 48897
315 48897 32280 16149 24988 9064 3365 12780 16385 6436 15487 32832 45359 20776 7156
302 7156 23982 16974 35031 35995 54320 64095 27509 22927 8412 16106 -12044 -12544 23391 36037
288 36037 41187 43230 25194 -3486 -1162 1999 247 25688 -343 729 -4405 -6646 22495 39577
274 39577 32665 11934 -19610 6071 28474 23861 18626 -8533 -2565 48242 43265 30089 29063
261 29063 -15727 -2466 16198 25693 58144 29318 31414 -2777 7039 37926 54614 74159 60113
248 60113 28352 31140 32746 13285 7153 15083 15940 1804 6016 17715 3728 -18059 2951
235 2951 -19408 13894 950 47 -2369 -16528 -17010 -7426 -5804 -26059 -17855 33542 59502 54322
221 54322 67583 37330 2590 39031 32555 8860 30207 50104 31379 25937 14013 4513 -602
208 -602 -323 11193 -3737 1551 22671 2211 5758 25437 15824 4520 15269 2360 15932
195 15932 47251 72330 16652 8410 32033 5841 11497 -1795 -5536 39566 57058 33992 9319
182 9319 6744 19959 22258 29580 45877 41377 24198 14313 9333 9581 -11738 36608 38566 17233
168 17233 17944 20116 20775 14117 40277 43583 40478 38848 28053 35312 38953 37556 31621 43879 8892
153 8892 8444 25650 30217 4328 7549 23224 5533 -1071 22343 31670 12818 32889 16462
140 16462 10392 -3388 6574 24475 13487 8351 8427 35104 27313 26851 36661 15629 17723 47525
126 47525 36667 38608 66217 50802 22302 16641 11315 15984 22233 35932 32573 28300 35627 27743
112 27743 -9570 24886 21535 3165 -818 6211 25082 16505 35107 29838 33863 60228 43879
99 43879 35563 42328 47699 45347 23655 36062 47308 48045 21700 11965 7470 9247 -294 -11232
85 -11232 -10412 16163 41028 34431 7934 15225 6898 -3718 -1615 14280 19637 28115 44425 41393
71 41393 52581 47126 37892 36433 10727 -453 15472 28132 13506 18647 16244 21824 26964 17893
57 17893 27408 20310 37134 16025 16937 39534 44856 30809 29190 39918 36787 25528 35399 28186
43 28186 22900 48566 23109 8324 12100 39118 35146 19302 45442 39931 24879 31376 14032
30 14032 12881 3282 15085 21348 22582 28020 33060 30663 8609 34238 18273 7751 9995 22801
16 22801 32507 35570 21079 28221 25581 21938 33605 39483 29612 24126 24511 32531 47297 33025
2 33025 33763 27506
0 27506
$$ Imaginary data points
##PAGE= N=2
##DATA TABLE= (X++(I..I)), XYDATA
16383 -1013273 -1007114 -1018513 -995387 -995231 -993172 -963976 -933849 -952811 -919558 -900817 -913903 -901028
16371 -901028 -888370 -854812 -852506 -849173 -828367 -833663 -826020 -793706 -778278 -766095 -759569 -753716 -728247
16358 -728247 -706056 -683087 -684680 -692782 -706803 -674735 -651682 -655181 -634052 -630331 -609599 -602394
16346 -602394 -583064 -576806 -558750 -557198 -561495 -525469 -526207 -501002 -478040 -485671 -478744 -485771 -455382
16333 -455382 -438516 -434642 -404805 -405713 -407433 -401920 -376789 -367995 -324693 -309688 -329504 -312110 -319804
16320 -319804 -296871 -307712 -290575 -249860 -262649 -242914 -210611 -196678 -187126 -191503 -172600 -175318
16308 -175318 -156420 -154553 -130486 -134314 -124065 -103039 -81817 -87059 -72155 -67362 -68918 -46824
16296 -46824 -37100 -44845 -72029 -58406 -5865 -12336 -5400 23849 31604 46766 55406 76803 93795
16283 93795 94941 87539 102185 115406 124638 122237 149480 133935 129134 140454 144584 170055 190220
16270 190220 165018 174794 186452 208806 206328 203583 236427 244421 255064 280377 305338 284579
16258 284579 277209 303943 291776 300391 315979 317414 301821 319262 315025 329316 341935 318577
16246 318577 320047 350547 370839 362480 368557 386264 402632 416542 421322 442030 444129 405469
16234 405469 439922 467107 464781 456771 496916 501071 496213 537248 539087 497315 512651 529988
16222 529988 527906 546513 538648 551763 540500 551728 545720 539205 560043 579851 578012 578460 580449
16209 580449 593817 617439 586822 614481 628586 623076 652640 626541 617071 629647 629309 629739 631755
16196 631755 657687 646206 631207 651255 634495 645468 653648 674012 701381 681813 655717 670570
16184 670570 696243 685251 647811 654198 702685 721684 721724 727005 719135 726659 726065 703354 729710
16171 729710 738224 743792 741820 741559 746529 733666 736391 752807 751122 731951 736379 758030 777023
16158 777023 777713 760031 764995 748183 753937 752018 768239 795280 788852 811815 819899 816712 820118
16145 820118 790181 783687 782347 789714 813078 817909 807113 806050 817275 810848 846321 851579 855492
16132 855492 853587 834497 799227 825463 827887 807276 804821 864585 884686 848396 843507 836174
16120 836174 830037 841511 843990 832193 840310 841896 832430 848394 856044 873744 871237 834227 839778
16107 839778 846752 855726 846382 847034 854559 820986 844843 851186 809367 852421 846083 848864 882225
16094 882225 889943 884742 894899 872200 847739 872417 908117 889626 896592 879575 869548 878625
16082 878625 882626 875531 896258 895190 902098 879496 884726 869221 895503 899389 871676 863593 892018
16069 892018 876701 881941 921768 873417 875475 895574 876884 892656 933089 926252 887143 880908
16057 880908 892110 889731 884023 877853 878935 861125 910928 904324 916134 928051 903179 888265
16045 888265 897789 880563 878156 892884 883364 893413 920502 899693 914644 932519 926911 897259
16033 897259 922938 939161 945603 943694 920748 899634 859916 884356 902322 884364 880079 890169
16021 890169 889373 884677 881422 864640 898026 881846 877713 872553 875402 875203 894557 919661 893482
16008 893482 891159 866544 862985 869082 869429 893546 896586 873232 866232 902321 947123 912786 896010
15995 896010 863179 861453 874224 863882 893150 884489 909380 898933 891866 891678 888173 901314 884613
15982 884613 860559 870763 898207 901355 906227 928541 934191 904038 930131 918421 884265 885506
15970 885506 879924 894623 895376 889943 916900 889903 913357 932945 925492 918346 904095 879368 857733
15957 857733 867786 880681 901666 900637 922512 921084 927593 897773 887872 904901 889137 898470
15945 898470 893361 882860 910127 884881 885211 900030 912833 910545 900369 919635 896989 897140 900119
15932 900119 905109 894165 867630 883026 904664 900373 927435 915998 891793 912959 922762 898927
15920 898927 880308 902050 914142 917228 920970 922930 922870 891824 919000 911123 904790 910454 920535
15907 920535 946839 919458 878359 888395 904652 922373 937724 925426 914711 881235 916943
15896 916943 942276 928224 911970 913626 920430 910703 919480 936257 925922 910400 898338 871322
15884 871322 876777 907761 925360 906116 920244 933477 917607 913973 913596 917115 917515 884488 872219
15871 872219 892445 909872 880144 896386 913485 928259 911477 890586 891475 901292 911329 877675
15859 877675 888940 896692 878826 882347 893909 904345 898631 906902 888486 869675 876836 903351
15847 903351 896594 917295 950149 951483 922902 896929 884456 885178 889749 917171 919850 903208 913173
15834 913173 911644 964801 941499 919072 912208 894014 886212 920131 930477 906283 915532 933179
15822 933179 895662 913910 927156 934952 921724 896253 897036 882971 884187 901099 904843 906308 908003
15809 908003 921946 905301 891140 882037 897453 900573 873348 861626 874660 899388 924040 926966
15797 926966 908252 913526 883994 877108 870699 881626 900010 929063 929659 934490 921626 915198 908462
15784 908462 876514 925727 934681 917144 871402 868791 932578 942632 940035 920477 916710 900893
15772 900893 879500 905931 893784 879564 876048 901770 908294 886358 872248 900257 931766 953619
15760 953619 943424 890823 876272 840682 894163 937717 895280 902337 873431 884555 888151 899051
15748 899051 894448 898918 922785 907091 909815 901804 936208 921652 912605 909260 852274 874726 922117
15735 922117 949535 940636 936238 923906 897289 898825 901602 909892 899383 926627 919364 899346 900230
15722 900230 909329 901725 898506 926209 909779 885653 886800 914632 928205 917370 901070 923442
15710 923442 906512 874945 899859 919152 908271 884755 878732 874745 895326 881690 929202 924830
15698 924830 915963 889854 855310 895718 893994 894666 886780 898342 889462 911947 932821 922172 917837
15685 917837 905643 886648 930247 957734 950033 922219 878078 932595 972840 956545 922442 923729
15673 923729 910513 921565 916648 925829 905747 897188 941092 918988 885782 919443 940318 930839
15661 930839 934249 935157 933379 940423 909817 910787 916855 918972 901951 906635 910959 913579 935424 944021
15647 944021 931849 906963 904432 927163 899250 885621 910623 886285 897246 930265 919558 886398
15635 886398 908439 920680 917087 895243 885472 888487 918497 893386 893508 915750 882483 879134 911271
15622 911271 931944 937900 904426 897041 878396 905673 922610 915184 949747 937891 890854 921156
15610 921156 956502 930148 962497 987940 955416 932156 943769 926957 934896 930204 910009 906635
15598 906635 888449 898172 893142 928357 938546 911444 923702 916406 889271 873392 895898 929815
15586 929815 952950 937030 927467 943874 937720 953284 961942 931272 925662 948920 929838 926822
15574 926822 923293 910736 915391 918102 918693 906771 946149 949831 911621 890198 918098 907914 927452
15561 927452 895133 894802 903138 928124 937796 889543 940663 914468 927105 911027 913629 918943 916349
15548 916349 922819 950309 941260 963768 973761 933832 912050 930182 923000 874248 891442 905784
15536 905784 891799 891165 889840 924022 936919 939989 955768 950974 941443 929640 922284 906021 919870
15523 919870 944307 948062 912736 895509 907638 955239 945522 937394 949736 956993 932895 918963
15511 918963 912741 905754 938381 933826 931424 944604 934709 934357 964416 959508 969903 962974 943388
15498 943388 985988 987105 964521 971000 946000 920032 924903 958394 945432 945352 930118 903877 931350
15485 931350 964133 991162 958029 956756 947733 950514 934156 938788 936640 936054 945446 932405 926270
15472 926270 960898 959959 963049 947561 924137 937617 957236 968276 942923 944461 939852 959993
15460 959993 965803 910132 917305 949536 954422 967740 927059 928938 952889 979453 977418 982606 964884
15447 964884 964677 940004 891964 882757 878813 886280 892136 901342 910830 922896 923434 951859 960633 939905
15433 939905 929570 940233 918281 948343 951385 944744 962359 979285 953494 927814 927732 925112 970545
15420 970545 996035 975255 943682 932291 927198 944287 970371 967013 960596 941899 929952 909923
15408 909923 909168 899790 902979 925726 949307 962171 962447 992192 982100 974472 941838 914850 934130
15395 934130 927070 926855 941847 962110 937546 968991 961651 937853 948963 975172 977803 979921 979024
15382 979024 939715 934146 963476 947374 943153 955267 923589 926731 899082 945850 969161 955998
15370 955998 960929 934864 916369 932762 940210 955820 936465 917910 967476 981855 1001513 999617
15358 999617 949851 940022 939903 961455 977031 981999 972287 960242 942148 960438 968272 938707 921904
15345 921904 920176 936706 968528 965056 974544 939514 943971 941235 920217 925593 957976 955580 962635
15332 962635 962853 949956 929963 940875 967109 993703 983374 966011 941061 954405 962805 924001
15320 924001 949534 950409 935961 931156 941657 957515 951589 939856 956632 940148 939605 949348 950787
15307 950787 966980 981961 983773 981537 964423 979327 961130 932410 946663 929125 960916 939418
15295 939418 935550 979611 936081 928419 930688 932914 957661 951137 946011 952100 946922 940261 945375
15282 945375 955556 961619 964877 949101 927764 913334 948369 944005 955571 927708 890093 905330
15270 905330 945514 985232 959836 959762 982500 976787 972179 958160 968164 961560 948599 937970 957403
15257 957403 962357 950843 944903 973857 1003217 988363 990571 976648 946942 972768 960969 963996
15245 963996 970909 945940 940717 934637 932314 966300 945131 954595 989096 981459 967678 983733 944410
15232 944410 921421 932720 944077 981685 972402 954629 948819 948400 966146 958464 967558 971817 982899
15219 982899 1000568 986819 946935 945482 983514 980661 963592 944257 941976 945102 956402 955977 958104
15206 958104 969299 983640 972719 985054 1012175 1007812 953614 932499 969287 987722 983878 983395
15194 983395 937429 934608 953221 926170 927406 967263 986225 978362 972323 977819 968066 935121 909252
15181 909252 945331 958499 943519 936689 958739 944345 949429 949271 955199 950642 964994 964380 966520
15168 966520 969699 939183 968660 970699 933465 970677 972993 966105 946515 913043 909489 931431
15156 931431 929795 906970 934181 966691 976928 963621 977502 971192 973516 983245 993359 971818
15144 971818 961784 969344 946257 939379 939804 945813 966095 998171 966338 961521 968598 973423 977317
15131 977317 977204 988166 969382 929166 926950 930775 946077 973361 933251 945427 944999 917379 963291
15118 963291 997388 976121 976309 969999 954213 957891 966168 965434 993490 976072 1004117 966248 936131
15105 936131 965166 956791 954493 980658 1020779 1004013 964148 961808 954155 945949 982250 1008457
15093 1008457 963329 942778 935827 935479 983590 1007131 1013348 1009515 1008341 998619 985491 968905 960480
15080 960480 978525 968128 950963 975107 953237 973111 971564 944157 959962 932395 923777 962614
15068 962614 977134 989340 954517 965086 976157 977824 1005597 984857 989904 956070 939519 934362
15056 934362 960835 974420 971798 989637 986347 980001 995455 979335 973616 972452 979451 996481 973888
15043 973888 966979 973838 960169 986874 990676 952460 929974 936957 946148 947416 954903 970321 970377
15030 970377 965142 1004424 1016554 968305 967968 985609 1017443 1020086 996497 1004674 987334 967480
15018 967480 955824 998395 966829 960430 954912 960015 979073 1022683 979017 984362 1003088 989967
15006 989967 981973 993136 976130 949354 991540 985016 1002003 1009537 975758 942129 963092 955787
14994 955787 933171 936854 971007 1017776 966506 962138 997563 987687 991232 966067 933424 949706
14982 949706 990777 987629 980542 971983 997687 991842 985461 939862 928110 960611 936363 940243 926910
14969 926910 914719 946771 956356 978466 987912 985045 971945 984185 990457 969547 943238 973054
14957 973054 957205 993985 1014878 1015388 999698 991826 1000247 984612 979724 954488 937109 984539
14945 984539 1004626 976449 984925 967053 956400 935259 958033 939551 946938 979301 984874 965834
14933 965834 961155 1005601 1009337 1025484 1037957 1024319 1005805 1004263 993328 977502 978136 945820
14921 945820 965704 952695 946092 965144 981306 998252 997568 978454 964251 970321 1003175 1000236
14909 1000236 966191 983414 986608 1008614 1013840 987900 979026 985567 988620 986996 947694 945419 963693
14896 963693 970341 1002200 978158 964851 972633 976982 972206 1000720 999917 992612 1003845 1003898 975932
14883 975932 986889 1004585 998990 991379 969637 946462 971485 1014203 1028623 1033608 1010422 993962
14871 993962 988602 978989 968725 995541 986902 958016 980131 992776 990334 980453 983878 985517 989921
14858 989921 972510 982588 962037 986225 1016337 1011285 991322 992951 1006874 1007468 1004450 984459
14846 984459 991989 995448 1022665 1017712 1019871 1008824 1005662 999883 1004335 983128 964945 970684 988927
14833 988927 1018188 1003413 999930 981123 1016772 1011324 951994 950692 949780 974377 969267 964519 993219
14820 993219 971084 972931 993610 991284 1013459 1025597 1020892 998460 1011602 1006517 1003452 1003387 993796
14807 993796 1005200 1011170 1028953 1030866 1016034 1018502 970722 962939 953255 973619 1003969 993658
14795 993658 973392 989146 997294 1006363 1000854 948185 967161 1023611 1007540 1000905 1025752 1028082
14783 1028082 1052027 1006855 999814 1005405 989043 1017549 1026557 1000951 977993 964650 986754 1005813
14771 1005813 1009204 1002619 983138 1005493 990169 984725 1028340 995694 993531 979427 979846 986675 960482
14758 960482 972719 1015314 1022146 1029840 1019887 997933 1036619 1015727 1010586 974037 994890 1001472
14746 1001472 976886 978294 961084 972558 967312 966596 999359 1002428 1013330 1008027 962995 961986 975055
14733 975055 964132 965595 984570 983275 990154 1043509 1029915 1010661 999405 991818 999405 1000872 1049410
14720 1049410 1035956 1002113 1000217 984753 1016266 1014105 1000053 1006322 984285 960405 959466 979506
14708 979506 979425 1006436 989764 995142 1018957 1022361 990760 988536 996440 1004343 975969 984101 1017256
14695 1017256 998562 1014649 996270 990713 980924 962569 1005933 1003828 999231 993671 1004027 1011751
14683 1011751 1021487 994464 990660 1005665 987115 984881 1002489 1019908 1025177 1006970 965300 966554
14671 966554 984840 996589 967893 972875 990312 980298 983794 1017893 1005837 1033493 1036537 989474
14659 989474 1015755 1017536 1044061 1041144 1025805 1018304 993384 992051 974269 1002099 1023742 982346
14647 982346 967591 990783 991818 1006635 989615 967413 968202 1016677 1032722 1039667 1026433 968434
14635 968434 989022 1016563 1008472 1023325 1041853 1027083 1006424 983912 1006631 1041893 1041572 1039241
14623 1039241 1002360 984143 1011003 1013358 1024657 1007385 996947 1021026 1014353 1004249 1038387 1024481
14611 1024481 993938 999424 1032802 1010590 1026300 1005811 1007052 1007020 1046409 1059378 1008606 977208
14599 977208 1020898 1045088 998745 1006422 1017659 1038057 1000119 1001534 1003378 978880 969621 1003911
14587 1003911 986274 1003176 1055634 1053704 1005471 992021 996691 1028169 1046265 1032822 1008552 1008916
14575 1008916 1010395 1002648 989814 974928 972007 972784 984297 1001737 1020619 984905 997169 1015516
14563 1015516 1042093 1079591 1054356 1063427 1056071 1019416 983909 991388 981188 984517 1032322 1040366
14551 1040366 1032245 1012654 999559 1010643 1018237 1016891 994894 1007662 1020667 1006898 1026525 1029683
14539 1029683 1029931 1023251 1001806 997567 1001799 1034504 1047914 1026531 1008279 992360 1017957 1039091
14527 1039091 1066025 1040213 1012091 1006511 1010071 999227 1004693 1006917 1006693 1005448 997174 1004495 1018929
14514 1018929 1037512 1039207 1021952 998343 1016801 1031965 1037897 1013387 1012974 1014723 1043796 1032078
14502 1032078 1020283 1037390 1036957 994460 988646 979643 989880 1010777 985604 987652 984082 997816
14490 997816 1035592 1053779 1022529 1023928 1022917 1016017 1022816 1045491 1048922 1017371 1003596 993284
14478 993284 1018508 1005456 1008822 1011869 1017773 1013853 1022553 1038052 1017618 1015887 1036467 1016158 1028821
14465 1028821 1048332 1030964 1054530 1055758 1085341 1067680 1056525 1034322 1026407 1031288 1023624 1039482
14453 1039482 1028359 1035532 1030467 1004578 1010069 1031675 1042141 1026489 1044262 1053703 1058963 1063164
14441 1063164 1077305 1063196 1061614 1064989 1053572 1029667 1027467 1026826 1028579 1033445 1018180 1022671 1042029
14428 1042029 998284 1006810 1036437 1014917 1040441 1016434 1015798 1025893 1048660 1038727 1015782 1042913
14416 1042913 1015208 1001683 1011449 1032330 1032279 1026042 1021887 1004058 1026223 1009513 1022893 1042145
14404 1042145 1021506 1031573 1001161 1018921 1055129 1039480 1025873 1022893 1038437 1042932 1042676 1038966
14392 1038966 1006013 1000080 1029577 1041231 1023921 1039581 1050195 1051541 1041042 1027160 994467 1001486
14380 1001486 1043951 1051026 1032628 1038697 1031494 1020926 1019285 1024713 1006957 999907 1011828 1043523
14368 1043523 1065101 1044952 1019715 1037565 1029756 992043 1022803 1028773 1027993 1023004 1043820 1027630
14356 1027630 998803 1014015 1027429 1019345 996163 985607 1025043 1031814 1016466 1034638 1022846 1029349
14344 1029349 1041678 1042187 1030047 1051205 1025819 998147 1018106 1011204 1031242 997370 995313 992680
14332 992680 1031047 1026630 1045307 1047681 1036119 1039894 1042208 1052619 1082875 1047739 1005202 1006227
14320 1006227 1002937 1037301 1060426 1044518 1042513 1066993 1046953 1044670 1020404 1022744 1066665 1044913
14308 1044913 1017287 1039459 1050740 1071177 1043812 1027643 1035935 1034983 1044175 1032801 1019823 1029445
14296 1029445 1058676 1049619 1026933 1001366 1040090 1044990 1023023 1026350 1025329 1013199 1035296 1050602
14284 1050602 1038231 981100 963524 1004603 1040479 1042261 1023134 1034538 1019368 1052070 1047791 1032166
14272 1032166 1046495 1061167 1065468 1056509 1073127 1052257 1046292 1022489 1038111 1066212 1074714 1056534
14260 1056534 1030407 1006443 1020687 1050877 1038835 1046959 1048626 1053820 1042891 1038442 1043818 1026193
14248 1026193 1018225 1005756 1014623 1040090 1033356 1033409 1041460 1049368 1059445 1064279 1021686 1049749 1058821
14235 1058821 1072357 1061988 1083499 1081400 1073433 1049102 1031527 1049081 1057879 1087146 1064215 1033128
14223 1033128 998425 1013731 1008768 992157 1001507 1040607 1045711 1038433 1037110 1014135 1026736 1050219
14211 1050219 1064759 1043760 1031658 1017787 1034680 1043089 1087076 1098963 1096742 1074030 1053864 1016929
14199 1016929 1031115 1059017 1054249 1054552 1037297 1048844 1055346 1056339 1050284 1067166 1077952 1055243 1064095
14186 1064095 1050753 1044858 1048598 1069825 1074317 1065356 1053783 1040445 1030894 1022765 1045928 1055783 1062436
14173 1062436 1059447 1043303 1029058 1028276 1055853 1063239 1071775 1104691 1091610 1070324 1061380 1034141
14161 1034141 1021712 1042468 1064008 1081793 1065069 1071704 1087661 1062523 1056050 1061881 1051835 1064118
14149 1064118 1062928 1062073 1091682 1108890 1051774 1046190 1081505 1081960 1044049 1058470 1065662 1017815 1026924
14136 1026924 1071537 1080545 1063459 1066562 1062160 1051548 1071363 1076810 1062841 1041353 1052068 1072340
14124 1072340 1043948 1060129 1033518 1042982 1078691 1061612 1054625 1035129 1039403 1048060 1040808 1055589
14112 1055589 1036016 1063057 1090519 1052170 1079782 1064632 1057011 1081458 1069578 1029907 1035562 1041483
14100 1041483 1073492 1091576 1077693 1058648 1059943 1048999 1079569 1058493 1034474 1024374 1047183
14089 1047183 1074956 1081307 1065570 1070365 1086089 1049971 1065396 1089526 1065258 1069409 1103585 1097673
14077 1097673 1033364 1039709 1062696 1075359 1041493 1040767 1073576 1085140 1091430 1079119 1091617 1110908
14065 1110908 1080191 1069527 1093135 1083965 1074960 1071861 1089557 1085354 1091922 1084266 1099497 1086144
14053 1086144 1086907 1071278 1067928 1097847 1086326 1062598 1074614 1092734 1109738 1091061 1080717 1047740
14041 1047740 1060541 1108826 1106497 1076150 1081314 1104548 1094869 1071559 1090613 1079113 1064582 1081377
14029 1081377 1079938 1093796 1091571 1092014 1084931 1078308 1091341 1096714 1058909 1022802 1027181 1053168 1052558
14016 1052558 1060857 1065598 1083375 1078493 1093756 1067981 1039795 1070340 1080795 1061213 1045209 1043185
14004 1043185 1058694 1066173 1059145 1068378 1091422 1072476 1043494 1077456 1045225 1038013 1039982 1061692
13992 1061692 1048627 1069320 1054522 1087945 1066931 1089027 1092649 1084716 1080028 1058569 1051596 1063178
13980 1063178 1070244 1041766 1071725 1122174 1106512 1101174 1087563 1086385 1071572 1087998 1086836 1082197
13968 1082197 1079080 1071017 1093516 1067491 1078826 1073062 1086850 1094278 1100217 1093148 1083942 1060170 1070426
13955 1070426 1097827 1109198 1114348 1114882 1079894 1082920 1092072 1083950 1088791 1107896 1108293 1098406 1077421
13942 1077421 1094381 1081071 1099628 1110121 1112760 1094976 1103386 1083353 1075006 1072026 1061975 1047785
13930 1047785 1041264 1070329 1064917 1056589 1052744 1065475 1065233 1082597 1076538 1076576 1062896 1082811 1097251
13917 1097251 1088124 1101741 1112000 1103708 1065972 1048273 1070238 1083796 1050942 1038627 1059266 1062928
13905 1062928 1089633 1082694 1065002 1071515 1069333 1035907 1041559 1066921 1051417 1083581 1077254 1060303
13893 1060303 1082998 1099735 1070779 1075741 1085420 1069271 1092712 1134218 1114729 1087899 1077675 1068745
13881 1068745 1076480 1094985 1103772 1092894 1085568 1112834 1078768 1107757 1099981 1077128 1091370 1093169
13869 1093169 1105651 1091304 1065580 1063258 1102916 1147040 1131814 1091595 1085882 1087088 1064297 1057916
13857 1057916 1088523 1104049 1077639 1079451 1088424 1064207 1075521 1080623 1102331 1081874 1094612 1082372
13845 1082372 1062465 1093971 1097062 1078492 1102840 1093271 1066363 1091569 1103501 1083991 1101056 1100533
13833 1100533 1098832 1118085 1129280 1128005 1105785 1064720 1088243 1111103 1100314 1127018 1129164 1083230
13821 1083230 1054522 1069340 1070654 1096442 1100020 1103846 1084097 1085436 1045830 1075288 1096535 1067742
13809 1067742 1094191 1104673 1078583 1069939 1098438 1123827 1115733 1117987 1115729 1105036 1088401 1075989
$$ [...]
##END NTUPLES=NMR SPECTRUM
##END=
