##TITLE=1H_TG-2315-3
 CDCl3,8 sc, 
 5.02.2021
##JCAMPDX= 6.0         $$ Bruker NMR JCAMP-DX V2.0
##DATA TYPE= NMR SPECTRUM
##DATA CLASS= NTUPLES
##ORIGIN= UXNMR, Bruker Analytische Messtechnik GmbH
##OWNER= root
$$ XWIN-NMR		Version 3.5
$$ Fri Feb  5 13:01:33 2021 Russian Standard Time (UT+4h)  she@DPX200
##.OBSERVE FREQUENCY= 200.1315066352
##.OBSERVE NUCLEUS= ^1H
##.ACQUISITION MODE= SIMULTANEOUS
##.ACQUISITION SCHEME= undefined
##.AVERAGES= 8
##.DIGITISER RES= 18
##SPECTROMETER/DATA SYSTEM= spect
##.PULSE SEQUENCE= zg30
##.SOLVENT NAME= CDCl3
##.SHIFT REFERENCE= (INTERNAL, CDCl3, 0, 15.9336)
##AUDIT TRAIL= $$ (NUMBER, WHEN, WHO, WHERE, WHAT)
$$ ##TITLE= Audit trail, XWIN-NMR		Version 3.5
$$ ##JCAMPDX= 5.01
$$ ##ORIGIN= Bruker BioSpin GmbH
$$ ##OWNER= she
$$ F:/spectra/data/she/nmr/H-F/1/pdata/1/auditp.txt
$$ ##AUDIT TRAIL=  $$ (NUMBER, WHEN, WHO, WHERE, WHAT)
(   1,<2021-02-05 13:00:08.79 +0400>,<she>,<DPX200>,
      <created by zg, POWCHK disabled, PULCHK disabled
       configuration hash MD5:
       00 E9 B6 7A A2 85 ED C7 34 08 36 98 17 FE 4E 26
       data hash MD5: 16K
       0B DD 17 5A 8B DA 53 D5 EF 09 0E 9C C3 40 19 80>)
(   2,<2021-02-05 13:00:16.23 +0400>,<she>,<DPX200>,
      <Start of raw data processing
       efp BC_mod = 2 LB = 0.24 FT_mod = 6 PKNL = 1 PHC0 = -10761.71 PHC1 = 12.80094 SI = 16K 
       data hash MD5: 16K
       70 D8 57 78 BD B7 2C FE 26 B0 CE 90 9E CC 2B 06>)
(   3,<2021-02-05 13:00:38.12 +0400>,<she>,<DPX200>,
      <pk PHC0 = 1.966027 PHC1 = -0.8 
       data hash MD5: 16K
       A4 13 E4 27 47 37 D2 02 DF DA 09 88 E0 67 90 C0>)
(   4,<2021-02-05 13:00:41.57 +0400>,<she>,<DPX200>,
      <abs ABSG = 5 
       data hash MD5: 16K
       E7 CD 26 85 E4 0E 99 41 11 9A F6 47 A6 9E B8 97>)
$$ ##END=
$$ 
$$ hash MD5
$$ 63 43 DA B4 8A 4E DA 60 45 F8 DF E9 02 1C 12 D0
##$RELAX= 
##$RELAX= 
##$RELAX= 
##$RELAX= 
##$RELAX= 
##$RELAX= 
$$ Bruker specific parameters
$$ --------------------------
##$DU= <F:/spectra>
##$EXPNO= 1
##$NAME= <H-F>
##$PROCNO= 1
##$TYPE= <nmr>
##$USER= <she>
##$AMP= (0..31)
100 100 100 100 100 100 100 100 100 100 100 100 100 100 100 100 100 100 
100 100 100 100 100 100 100 100 100 100 100 100 100 100 
##$AQSEQ= 0
##$AQ_mod= 1
##$AUNM= <au_zg>
##$AUTOPOS= <>
##$BF1= 200.13
##$BF2= 200.13
##$BF3= 200.13
##$BF4= 200.13
##$BF5= 200.13
##$BF6= 200.13
##$BF7= 200.13
##$BF8= 200.13
##$BYTORDA= 1
##$CFDGTYP= 0
##$CFRGTYP= 5
##$CHEMSTR= <none>
##$CNST= (0..31)
1 1 145 1 1 1 1 1 1 1 1 1 1 1 1 1 1 1 1 1 1 1 1 1 1 1 1 1 1 1 1 1 
##$CPDPRG= <>
##$CPDPRG1= <>
##$CPDPRG2= <>
##$CPDPRG3= <>
##$CPDPRG4= <mlev>
##$CPDPRG5= <mlev>
##$CPDPRG6= <mlev>
##$CPDPRG7= <mlev>
##$CPDPRG8= <mlev>
##$CPDPRGB= <>
##$CPDPRGT= <>
##$D= (0..31)
0 1.2 0 0 0 0 0 0 0 0.06 0 0.03 0 0 0 0 0.0002 0 0 0 0 0 0 0 0 0 0 0 0 
0 0 0 
##$DATE= 1612515608
##$DBL= (0..7)
120 120 120 120 120 120 120 120 
##$DBP= (0..7)
150 150 150 150 150 150 150 150 
##$DBP07= 0
##$DBPNAM0= <>
##$DBPNAM1= <>
##$DBPNAM2= <>
##$DBPNAM3= <>
##$DBPNAM4= <>
$$ [...]
##$SUBNAM3= <"">
##$SUBNAM4= <"">
##$SUBNAM5= <"">
##$SUBNAM6= <"">
##$SUBNAM7= <"">
##$SUBNAM8= <"">
##$SUBNAM9= <"">
##$SW= 16.9725356469052
##$SWIBOX= (0..15)
0 0 2 0 0 0 0 0 0 0 0 0 0 0 0 0 
##$SW_h= 3396.73913043478
##$TD= 16384
##$TD0= 1
##$TE= 0
##$TE2= 300
##$TE3= 300
##$TEG= 300
##$TL= (0..7)
0 120 120 120 120 120 120 120 
##$TP= (0..7)
150 150 150 150 150 150 150 150 
##$TP07= 0
##$TPNAME0= <>
##$TPNAME1= <>
##$TPNAME2= <>
##$TPNAME3= <>
##$TPNAME4= <>
##$TPNAME5= <>
##$TPNAME6= <>
##$TPNAME7= <>
##$TPOAL= (0..7)
0.5 0.5 0.5 0.5 0.5 0.5 0.5 0.5 
##$TPOFFS= (0..7)
0 0 0 0 0 0 0 0 
##$TUNHIN= 0
##$TUNHOUT= 0
##$TUNXOUT= 0
##$USERA1= <user>
##$USERA2= <user>
##$USERA3= <user>
##$USERA4= <user>
##$USERA5= <user>
##$V9= 5
##$VALIST= <valist>
##$VCLIST= <CCCCCCCCCCCCCCC>
##$VD= 0
##$VDLIST= <DDDDDDDDDDDDDDD>
##$VPLIST= <PPPPPPPPPPPPPPP>
##$VTLIST= <TTTTTTTTTTTTTTT>
##$WBST= 1024
##$WBSW= 4
##$XGAIN= (0..3)
0 0 0 0 
##$XL= 0
##$YL= 0
##$YMAX_a= 650650
##$YMIN_a= -287503
##$ZGOPTNS= <>
##$ZL1= 120
##$ZL2= 120
##$ZL3= 120
##$ZL4= 120
##$ABSF1= 16.01029
##$ABSF2= -0.9623737
##$ABSG= 5
##$ABSL= 3
##$ALPHA= 0
##$AQORDER= 0
##$ASSFAC= 0
##$ASSFACI= 0
##$ASSFACX= 0
##$ASSWID= 0
##$AUNMP= <proc_1d>
##$AZFE= 0.1
##$AZFW= 0.1
##$BCFW= 0
##$BC_mod= 2
##$BYTORDP= 0
##$COROFFS= 0
##$CY= -3
##$DATMOD= 1
##$DC= 0
##$DFILT= <>
##$DTYPP= 0
##$F1P= 0
##$F2P= 0
##$FCOR= 1
##$FTSIZE= 16384
##$FT_mod= 6
##$GAMMA= 0
##$GB= 0
##$INTBC= 1
##$INTSCL= 2.992141e-10
##$ISEN= 128
##$LB= 0.24
##$LEV0= 0
##$LPBIN= 0
##$MAXI= 10000
##$MC2= 0
##$MEAN= 0
##$ME_mod= 0
##$MI= 1.114404
##$NCOEF= 0
##$NC_proc= -7
##$NLEV= 6
##$NOISF1= 3.799351
##$NOISF2= 2.8
##$NSP= 0
##$NTH_PI= 0
##$NZP= 0
##$OFFSET= 15.93363
##$PC= 1
##$PHC0= -10759.74
##$PHC1= 12.00094
##$PH_mod= 1
##$PKNL= yes
##$PPARMOD= 0
##$PSCAL= 0
##$PSIGN= 0
##$REVERSE= no
##$SF= 200.130016208434
##$SI= 16384
##$SIGF1= 3
##$SIGF2= 2
##$SINO= 5.538805
##$SIOLD= 16384
##$SREGLST= <1H.CDCl3>
##$SSB= 0
##$STSI= 16384
##$STSR= 0
##$SW_p= 3396.73913043478
##$SYMM= 0
##$S_DEV= 0
##$TDeff= 16384
##$TDoff= 0
##$TI= <>
##$TILT= no
##$TM1= 0
##$TM2= 0
##$TOPLEV= 0
##$USERP1= <user>
##$USERP2= <user>
##$USERP3= <user>
##$USERP4= <user>
##$USERP5= <user>
##$WDW= 1
##$XDIM= 16384
##$YMAX_p= 435429601
##$YMIN_p= -835061
$$ End of Bruker specific parameters
$$ ---------------------------------
##NTUPLES= NMR SPECTRUM
##VAR_NAME=  FREQUENCY,     SPECTRUM/REAL,   SPECTRUM/IMAG
##SYMBOL=    X,             R,               I
##VAR_TYPE=  INDEPENDENT,   DEPENDENT,       DEPENDENT
##VAR_FORM=  AFFN,          ASDF,            ASDF
##VAR_DIM=   16384,         16384,           16384
##UNITS=     HZ,            ARBITRARY UNITS, ARBITRARY UNITS
##FACTOR=    0.207333158178281, 1,           1
##FIRST=     3188.79762808265, 0,            0
##LAST=      -207.941502352134, 0,           0
##MIN=       -207.941502352134, -835061,     0
##MAX=       3188.79762808265, 435429601,    0
$$ Real data points
##PAGE= N=1
##DATA TABLE= (X++(R..R)), XYDATA
$$ [...]
8177 7437822 7214353 7267561 7176030 7189492 7085608 7068206 7345073 7323741 7418295 7184016 7249335
8166 7249335 7313447 7394259 7326846 7545688 7555404 7770042 7568529 8079902 8080037 8070569 8345815
8155 8345815 8530343 8575642 8602088 8667229 8648444 8603693 8112850 8433461 8840953 9025565
8145 9025565 8992430 9295749 9311070 9560457 9537961 9406630 9493842 9742512 9786397 9857387 10058243
8134 10058243 10195637 10779225 10842977 11169672 11518338 11989810 12309642 12868998 12835887 13258949
8124 13258949 13734640 14226742 14656874 15092056 16028118 16689551 16965752 17087779 17410018
8115 17410018 17360272 17487265 17362502 17456830 17566910 18041611 18113397 18547012 18884528 19150350
8105 19150350 19486289 19887935 20056149 20539155 20968343 21576646 22230314 22716500 23335164
8096 23335164 23759388 24680000 25603309 26728967 27588673 28635417 29916787 31821091 33652049
8087 33652049 35431254 37790964 40540004 43239174 45812198 48252322 50633720 53017383
8079 53017383 55290752 57352146 59526200 61564150 63507816 64751229 64687511 63412839
8071 63412839 60741055 57839443 55168481 53067852 52144884 51904241 51594238 51169196 50770725
8062 50770725 50023522 49615565 48872702 49012687 49787056 50450275 51243403 52969380 54702823
8053 54702823 56769572 58661900 61140277 63993301 67181094 70360253 74482399 79292977
8045 79292977 84973029 91000899 97718454 104121850 110322652 115192964 117971291 117685482
8037 117685482 114635476 109549772 103573457 97696708 93104877 89741898 86975072 83885283
8029 83885283 80124713 75834215 71740857 67866887 64493914 61770414 60032296 58699134
8021 58699134 57780325 56789899 56571148 56719945 56955305 57222965 57875350 58687755 60163664
8012 60163664 62156505 65071719 68207637 71488297 74709354 77548426 80050909 82823536
8004 82823536 86105256 90110857 94242490 97710368 99692425 99736089 97988315 94549963
7996 94549963 90414012 86168229 82676245 80391953 79486787 79861174 81578474 83758804
7988 83758804 86942844 90245755 94496969 99047820 105030385 112054953 121802479 133576749
7980 133576749 150094098 171654507 201545804 242778414 297922651 355097903 392213600
7973 392213600 379579501 343926708 276305394 207182973 165514554 136339510 117580452
7966 117580452 102677523 93097510 84549090 78942266 73603146 69692817 66254818 64088092
7958 64088092 61962819 61087809 60133331 59311995 58254468 57478623 56466407 55866514 55181686
7949 55181686 55161586 54941597 56002185 56991044 58265701 59477027 61598702 63461983 65693293
7940 65693293 67093965 68892394 70281534 71996044 73712884 75367096 75837813 75039496
7932 75039496 72934707 70232514 67135821 64806287 62772737 60696474 58354277 55780095
7924 55780095 53050957 51000706 49589006 48521517 47842620 47358819 46849567 46801444 47081088
7915 47081088 47939685 48303259 49194944 50340167 51966978 53412057 54754700 56107163 57346632
7906 57346632 58455762 60042052 62092445 65460446 69178509 73215568 76541325 78857224
7898 78857224 79155876 77329804 74234225 70370634 66847132 63993956 62020077 60384149
7890 60384149 58897652 57285060 55090990 53245634 51502049 49600302 47893229 46518499
7882 46518499 45385420 44750657 44489597 44195021 44222096 44409218 44985154 46246403 47546685
7873 47546685 49451348 51652108 53496646 55266088 56091312 56210433 55879930 55301142 54842529
7864 54842529 54541714 53856147 52974332 52321399 51536840 51343780 51565862 51876110 52569988
7855 52569988 53377967 54610477 56222362 58267273 60583293 63517383 66249322 68370988
7847 68370988 69476717 69825872 69415545 68096517 65536478 62573484 60053682 57731973
7839 57731973 55933317 54917194 53851779 54009008 54306676 55270994 56647086 58483795 61200601
7830 61200601 64318266 67558368 70659337 73367787 75508060 77119549 77726533 76957378
7822 76957378 75487072 73012721 70190362 67263490 64764947 62654999 61317801 60671618
7814 60671618 60433053 61039124 62276815 63875922 65970489 68784333 72361049 76205048
7806 76205048 80822195 85429787 89489443 92674330 94303246 94647635 93991682 92702860
7798 92702860 90915139 89283687 87893184 86914505 86897533 87613840 89385327 91871843 94961399
7789 94961399 98566101 103155352 108449330 114262922 120291304 126844686 132941694 137765969
7781 137765969 140773523 141745872 140873400 139108390 136067814 132137901 128114221 124104460
7773 124104460 120753408 117891374 115665149 113333719 110836588 108465308 106317720 104806788
7765 104806788 103919864 103703774 104238685 105350179 107505146 110232421 112633077 114538437
7757 114538437 115357405 114396947 112151160 108803119 104979560 101579533 99114606 97662729
7749 97662729 96937079 97514703 98855798 101534121 105098413 109556053 115410062 121648167
7741 121648167 128169185 134777958 141412772 147679210 153065259 157170111 159290299 159180614
7733 159180614 157258531 154362365 151132623 147684257 144796592 142618876 141570044 141374438
7725 141374438 142177437 144201627 146884936 149923948 152943630 155881610 158253623 159747606
7717 159747606 159689311 157499869 153512501 147502854 140919617 134553428 129797321 126463025
7709 126463025 124423266 123306039 122233776 120350622 117397917 113018458 108020412 103143296
7701 103143296 99413123 97033323 95898934 96056424 96879756 97832550 98116068 96979552 94591384
7692 94591384 91165948 86884961 82886408 79419641 76945528 74947370 73227485 71828733
7684 71828733 70733019 69968918 69149255 68989908 68705434 68873804 69392019 70520906 72128127
7675 72128127 74239406 76680916 79299507 81854038 84015430 85024884 85132138 83463180
7667 83463180 80412699 77173837 74406268 72684260 71908692 72795136 73990751 75679592
7659 75679592 76592229 76149095 74095937 70255752 65300299 59705613 54696928 50109814
7651 50109814 46179902 43048510 40593721 38522922 36659584 35093365 34127313 33260305
7643 33260305 32403449 31462972 30977427 30334432 29835730 29509204 28901922 28347902 27770135
7634 27770135 27520702 27325981 26929454 26644596 26495528 26458714 26399416 25999322 26112785 26308356
7624 26308356 26419136 26276643 25888586 26203358 26458087 26674801 26654644 26659346 26970472 27568456
7614 27568456 28164081 28546292 29323641 29894349 30497305 31113067 31690533 31884989 32505885
7605 32505885 33133353 33719252 34615004 36104633 37473866 39282475 40613723 41945391 42575148
7596 42575148 42456937 41800778 41517759 41854591 42153311 42992473 43954442 45560958 47446281
7587 47446281 49382826 51420455 53249133 55243546 57455556 59958629 62733305 64914337
7579 64914337 66256210 66261541 65379533 64668639 64315783 64494037 65104459 66606113 67975847
7570 67975847 69754590 71594641 73498180 75070565 76171086 76770664 77315590 77816840 78966069
7561 78966069 80372588 80679106 80822972 80431600 80043549 79630725 79588705 79624620 79846392 79920675
7551 79920675 79667890 79693416 80179644 80631791 80991175 81342639 82047511 82939269 84141896
7542 84141896 85854625 87617436 89911719 92057800 94335091 96405734 97994230 98415255
7534 98415255 97907100 97070535 95515630 94551022 94289310 95097003 96359499 97997845 99560545
7525 99560545 100387695 100770846 100811799 99970806 98915441 98020398 97724430 97431971 96980839
7516 96980839 96044231 94380076 92201682 89296436 86417764 83437558 81118468 79406255
7508 79406255 78410225 77696495 77492603 77221433 76650849 75897626 74977975 73584942 71921704
7499 71921704 70440491 69199533 67943803 66909631 66669591 66625361 66266849 65381621 64122178
7490 64122178 62296802 60591465 59434118 58970901 58978549 58865005 58529953 58407488 58030075
7481 58030075 57143379 56030866 54692136 53405505 52150799 51377669 51450190 51220459 50784073
7472 50784073 49479862 47591579 45046292 42559730 40351506 39265253 38364663 37542214
7464 37542214 37078671 36829818 36528531 36068908 35501181 34072252 32362056 30771453 29092891
7455 29092891 27861402 26642423 25718954 24597329 23348349 22682799 21829342 20982058 20400526
7446 20400526 20016279 19600669 19032966 18860406 18450131 17826303 17575735 16887884 16361242
7437 16361242 15519887 14844814 14176502 13936825 13513906 12944725 12590199 12262824 11716492
7428 11716492 11381647 11032099 10578627 10511665 10094172 9839565 9813528 9855103 9357040 9180713
7418 9180713 9101253 8851536 8734873 8841063 8793775 8342766 8325066 8044090 7873106 7635549
7408 7635549 7669643 7797937 7755237 7515148 7382674 7019692 6930511 6570771 6591330 6647631
7398 6647631 6580603 6472421 6426022 6460831 6234116 6152802 5990777 6227265 6034055 6024054
7388 6024054 5647483 5518980 5403900 5258214 5078538 4978765 4971203 4767675 4824455 4731185
7378 4731185 4716770 4441982 4401740 4310786 4068757 4023919 4293976 4451994 4226128 4051478
7368 4051478 4024281 4123587 4076670 3940325 3842334 4112054 3696255 3713594 3675976 3674910 3800486
7357 3800486 3937505 4014981 3832137 3671242 3554211 3667607 3815684 3695975 3609934 3523433
7347 3523433 3713274 3729663 3593285 3793157 3636576 3409390 3218924 3327865 3228376 3201500
7337 3201500 2992149 3358039 3080669 2959566 2896255 2909400 2986851 3185019 3151761 3485334
7327 3485334 3378714 3199876 3035825 2851975 2871158 2735983 2773443 2635145 2959627 2889758
7317 2889758 2949764 2927050 2725643 2472170 2691501 2715667 2597955 2651440 2686147 2760490 2619553
7306 2619553 2324692 2207031 2369950 2351464 2557649 2585663 2708200 2773918 2548834 2665720
7296 2665720 2777451 2597045 2693133 2819925 2535300 2449410 2461389 2445621 2341320 2170552
7286 2170552 2043073 2391993 2243351 2462191 2387538 2171244 2258762 2272474 2181010 2186812 2083851
7275 2083851 1982960 2002673 2032162 1959186 1952276 2024740 2158971 2235928 1810343 2006906 2119269
7264 2119269 2120275 1976605 1682724 1679511 1710427 1797760 1777411 1806927 1693992 1646212 1599355
7253 1599355 1477104 1530606 1437052 1634856 1374757 1317631 1543134 1615271 1558245 1376748
7243 1376748 1361145 1385113 1467851 1536525 1662646 1674648 1305665 1089693 1091708 1089419 1202255
7232 1202255 957803 1008268 1107269 802612 825630 762573 680936 766634 878845 696867 669653
7221 669653 832972 788561 836260 407929 335657 538244 781259 702079 600932 488421
7211 488421 516962 571808 566294 687579 432736 415611 486918 608083 489065 399788 496385
7200 496385 462201 674979 513361 601934 726645 735329 647362 449388 482495 571687 660173
7189 660173 566629 378145 357172 332057 785806 662786 450491 470178 119093 388751
7179 388751 288330 467400 503828 697778 608859 448289 515582 496127 646680 608495 651456
7168 651456 656038 633669 754092 832792 672968 412847 240511 515489 607741 681750 1004937
7157 1004937 719134 597478 474098 739903 624715 912494 953695 842307 875109 711173
7147 711173 681261 491479 331514 345967 417875 439475 592814 412403 394011 152374 174727
7136 174727 42930 237929 234068 326429 374703 264656 364637 307855 356403 489181 394971
7125 394971 461695 430136 517007 512307 414674 136986 174721 383309 716446 631572 692172
7114 692172 723743 672645 433108 290997 275017 234214 631970 561708 407137 110953 406267
7103 406267 396255 362301 150700 274285 337147 355190 263578 279758 62180 84381 117268
7092 117268 53410 144235 87486 179630 164437 160200 -122642 -200149 -251237 -117080 137392
7081 137392 178107 125034 145801 112760 151000 35341 -55613 20772 101279 -17749 -266302
7070 -266302 -312695 -184044 -55630 -127148 11076 17075 -47633 -65532 -47572 -34999 -58010
7059 -58010 6275 59579 32549 -80505 -6503 121680 153459 11826 -145491 -202473 205344
7048 205344 26316 -142713 83287 -77794 -55948 -87096 -57479 -75042 -131498 -295630 -267094
7037 -267094 -417999 -210037 -114081 -188280 -422708 -452714 -434458 -242724 -129891 -168775 149154
7026 149154 74059 -142090 -453831 -249749 -390706 -300080 -386013 -270790 64540 19527
7016 19527 -227085 -476102 -312375 -205911 -327768 -259429 102676 -120176 -105284 -300604
7006 -300604 -222704 -66931 57324 -149689 -96598 -82185 -244165 -272513 -277215 -311800 -234088
6995 -234088 -27293 116753 78054 -191259 -96478 -399302 -576512 -528768 -346849 -120916
6985 -120916 -86524 -364533 -418658 -286880 -115249 -97675 71357 -31923 -128664 -325748
6975 -325748 -453653 -432974 -516912 -438869 -227322 -322663 -236689 -405557 -369707 -294149 -383959
6964 -383959 -596862 -410619 -337656 -145519 -100814 -385596 -573619 -377887 -30562 -18585
6954 -18585 -47906 -209416 -75795 -235858 -494539 -397486 -272226 -148818 4541 -207974
6944 -207974 -325086 -272106 -274067 -375587 -310421 -491360 -404410 -227767 -111744 -65928 -54612
6933 -54612 38289 92687 51778 -33680 -164200 -210028 -33236 -680 125528 97689 -161516
6922 -161516 -249013 -276873 11543 -15511 -7509 -73542 -192299 -408815 -499173 -392313 -319150
6911 -319150 -127920 -156575 -161228 -160847 -162114 -442324 -174987 -197577 -258832 -373266 -394789 -835061
6899 -835061 -681521 -500016 -528679 -495190 -429777 -78351 -218496 -167631 -407476 -334472 -566420
6888 -566420 -441745 -541720 -430141 -529158 -275076 -115641 -150877 -259100 -11192 -203895
6878 -203895 -438425 -398007 -315683 -213049 -370862 10324 -205518 -6531 -148426 -107818
6868 -107818 -93497 -134933 -239321 -264725 -151848 -215988 -217300 -397380 -108222 7551 124496
6857 124496 -199806 -209616 -72137 10579 -128747 -268501 -196005 -246246 -95445 -307741 -339085
6846 -339085 -380155 -244549 -352792 -588665 -480653 -226149 -292321 -293632 -417368 -496537 -432989
6835 -432989 -260292 -174508 -25106 141964 28702 -71757 -223160 -91873 -164633 -187743
6825 -187743 -308496 -277404 -228712 -345610 -86525 29196 -26838 -293055 -376741 -179991
6815 -179991 -304372 -164308 -253758 -410884 -225119 -33859 -11797 -119740 -27778 -6501
6805 -6501 -7706 38922 -42282 -279037 -125895 -245182 -330446 -393495 -14294 81518 182701
6794 182701 26307 -225058 -219694 16002 -260992 -450422 -297224 -342125 -258002 -253742 40156
6783 40156 -193661 -120578 -350386 -207675 -149322 -13831 -275227 -401438 -215716 -405539
6773 -405539 -314474 -23613 58110 -138355 -84818 103811 -109564 -189904 6388 -51758 -254057
6762 -254057 -165981 72472 22137 290417 489013 472016 520661 71582 79157 433936 734019
6751 734019 544898 321657 214094 237212 284023 314864 343435 443396 278726 25210 127586
6740 127586 81964 7764 36440 -41990 -373278 -87024 88884 393755 -23178 18953 -81400
6729 -81400 -10021 323826 325186 -117861 -446546 -132328 -15459 342228 474765 5500
6719 5500 113141 416130 358916 218214 -81739 -11434 75813 127163 -23384 76039 402765
6708 402765 557043 363423 245635 327299 364782 483579 436317 341335 -72917 147221
6698 147221 443899 435385 375624 506767 521960 545006 237872 306762 347991 192442 199497
6687 199497 24922 8298 -44582 301225 619216 487661 268941 222536 -5238 78054
6677 78054 135460 35396 -12694 -37489 -21211 83954 61241 241133 93767 321680 143802
6666 143802 141407 225720 389722 211616 -39975 -80762 -244820 -10162 310169 456387
6656 456387 303505 124784 10253 -79039 -37554 181896 -63363 -11098 -52036 224131
6646 224131 203445 189501 15770 -113176 239564 207294 405024 394469 278786 -39893
6636 -39893 22821 228772 202187 116873 172229 104278 -74429 59129 20694 -98979 105148
6625 105148 -106342 -270980 12106 -18252 216187 339426 452690 130341 35685 204649
6615 204649 373216 374658 387324 192085 272247 706827 287606 513008 407959 653066
6605 653066 637547 645638 673034 719251 614652 440807 474395 536377 814394 1133279 1096452
6594 1096452 870945 747305 721953 859719 761030 744490 687991 777945 837368 896147 974652
6583 974652 1209672 985851 570683 810349 811281 620816 708878 664973 664905 106647 148501
6572 148501 447836 923388 728591 424153 382273 544599 668399 331377 202645 425789
6562 425789 551225 648103 649356 510170 525183 549788 634377 538152 557562 586278 826398
6551 826398 860452 692533 624830 665421 820461 704376 776854 963195 843614 720719
6541 720719 837106 755910 715485 566042 431036 686183 937151 773819 817023 884755
6531 884755 906789 877518 642967 784564 770658 720435 628269 666270 412078 689880 709160
6520 709160 768094 977967 1027875 798809 874704 762473 606896 882044 919393 683532
6510 683532 548193 873669 927495 833008 586720 707194 589750 669287 395273 324637
6500 324637 413268 242848 238397 278523 539962 283013 315851 445740 358020 308805 424235
6489 424235 236607 204876 -57174 -163932 66070 245664 182154 165409 380271 164285
6479 164285 181314 -48178 91405 -147780 5790 135028 314310 292432 93562 65093
6469 65093 273733 269544 128285 104698 301967 237226 112253 224395 86091 329310 211027
6458 211027 453939 386652 579020 530850 598374 383335 338344 384251 225874 294332 239285
6447 239285 204549 542064 651834 212218 107491 28019 270664 109114 64603 -163439
6437 -163439 64240 213895 108591 117486 115052 396602 119933 111182 167528 354829 426718
6426 426718 211914 -27676 201526 54839 317584 552571 428925 151413 127240 188630
6416 188630 168510 195036 -1002 148742 217541 537930 311517 303765 24442 -19457 -115677
6405 -115677 161964 -201413 -89074 277230 388041 346111 104048 213062 172219 422030
6395 422030 320327 386780 279140 505799 542461 397705 327571 274147 244875 399366 562969
6384 562969 665998 540245 544918 479284 260789 598590 519166 580389 536810 496229 344867
6373 344867 525235 641563 465466 614741 404527 292857 148018 433013 429922 356047
6363 356047 176467 391832 380647 377242 297679 498716 480698 518493 454358 545890 534859
6352 534859 497441 399994 347960 581862 628507 714263 833961 887162 742904 898629 749847
6341 749847 838440 954936 1009731 920483 856109 704032 936757 974670 1048735 1003718 1090584
6330 1090584 1076881 1312765 1330016 1322827 1309406 1274079 1412506 1455467 1577055 1539104 1486186
6319 1486186 1220240 1231274 1254772 1244378 1454781 1512190 1193415 1426126 1421333 1514813 1607382
6308 1607382 1555730 1427835 1328562 1564997 1684931 1710273 1407067 1639793 1484257 1650708
6298 1650708 1809091 1813764 1878836 1852950 1988457 2003699 1894117 1867294 1890062 2077329 2155658
6287 2155658 2204610 2144298 2197170 2556104 2303581 2110513 2026272 1991305 2241361 2199582 2232874
6276 2232874 2508666 2641471 2736598 2633692 2837382 3009333 3431168 3302865 3157700 3524937
6266 3524937 3848164 3804310 3774402 3814595 3964668 4000662 4109670 4256928 4422585 4474891
6256 4474891 4580862 4616445 4834841 5170681 5282690 5614309 5562585 5842654 6125581 6180190
6246 6180190 6244212 6624001 6813701 7178632 7239364 7834669 8124789 8737323 9243155 9884236
6236 9884236 10655290 11229178 11565595 11716605 11604455 11108900 10561673 9714892 9444329 9043337
6226 9043337 9077277 8895366 9117260 9160431 9308812 9376117 9526760 9598974 9954307 10628867
6216 10628867 10890356 11240196 11468861 11754893 12349403 12917978 13137336 13863697 14369891
6207 14369891 15016137 15486718 16070159 17027100 18281584 19666439 20961495 22717467 24394142
6198 24394142 26636727 28874838 31497329 34401980 37971569 41746262 46659386 52607970
6190 52607970 60097745 68986374 79975197 92920630 105701603 116490982 122554132 122589283
6182 122589283 115109966 102941245 88017507 73764766 61439252 51732033 44310411
6175 44310411 38424167 33714820 30062659 27458487 25106339 23230290 21620553 20452555
6167 20452555 19433836 18546554 17503855 16865801 16058400 15477779 14514364 13571799 12923851
6158 12923851 12464497 11832211 11092852 10805484 10433173 10163869 9756307 9273934 8777452
6149 8777452 8411454 7882680 7453012 7155897 6855285 6529231 6580601 6173727 5895593 5670057
6139 5670057 5355824 5275467 5257116 5203102 4931616 4812496 4675271 4743424 4582804 4534578
6129 4534578 4341247 4538693 4307599 4240728 4131847 4037767 3853721 3767556 3687558 3689337 3877740
6118 3877740 3995671 4185712 3757398 3870599 3685351 3381709 3259399 3505191 3459496 3330709
6108 3330709 3218561 3177773 3145262 3357542 3348146 3076500 3150238 2989300 3165865 3110636 2766568
6097 2766568 2697131 2797945 2994361 3053083 3038428 2991601 3072205 2956818 2842616 2739525
6087 2739525 2662368 2628142 2582160 2577925 2575515 2403280 2451134 2131179 2135282 1982156 1925651
6076 1925651 1827892 1945230 1824547 1511998 1485112 1563326 1703276 1904546 1928782 1669720
6066 1669720 1768192 1665632 1911984 1739548 1627257 1681739 1780961 1503449 1583606 1635527
6056 1635527 1898570 2085836 2092068 1836171 1818199 1802535 1739867 1752662 1451648 1366426 1368921
6045 1368921 1514757 1614306 1732870 1615252 1831145 1689191 1755014 1779710 1511800 1570900
6035 1570900 1588921 1636867 1827045 1723299 1861342 1962743 2032847 2169873 2022586 2166843
6025 2166843 2034719 2368314 2381041 2577401 2779080 3087859 3059992 2978418 3135817 3175892
6015 3175892 2987312 3010229 2936845 2823307 3015585 2712649 2674677 2805403 2982815 2913839
6005 2913839 2947423 2712507 2652100 2649572 2915370 2932152 2265105 2017028 2254611 2064560
5995 2064560 2035685 2040960 2257351 2294947 2114684 2156827 2148230 2136071 1999194 2045716 1669638
5984 1669638 1502790 1474310 1485740 1578676 1818818 1587085 1637543 1690331 1597933 1222822 1211544
5973 1211544 1203908 938561 970392 951567 1353720 1056387 1163121 1229458 955046 909801 902728
5962 902728 854392 858748 835304 771273 761555 661490 658361 598905 756693 774666 877509 780372
5950 780372 696246 736777 542631 598622 754741 781566 745829 622060 592452 936101 855259
5939 855259 1006269 933798 822082 584583 430088 440137 628021 888213 1132120 1006840
5929 1006840 902543 909740 776822 1008535 1112875 903373 557838 804417 1070882 1048786
5919 1048786 998790 1046039 952252 913172 922306 730444 912324 859660 792152 481421 572793
5908 572793 770163 801047 753620 665318 768581 735757 608924 539488 485150 417299 371059
5897 371059 367125 425502 580420 983105 635647 379217 653875 755001 810998 610679
5887 610679 465825 530196 487112 391737 530800 586598 414227 860770 882923 574202 732958
5876 732958 564591 444976 490238 522485 610314 665933 682380 698018 559289 272005 684020
5865 684020 768751 1070979 962327 819143 573537 734416 571178 623770 746963 841685
5855 841685 791941 813398 649964 644474 727132 768647 775151 439053 644221 396274 321030
5844 321030 308988 425775 496710 602315 405191 360877 359457 449398 186711 259762 367073
5833 367073 362849 436519 502834 461193 342581 554881 509987 587746 522106 729711 488380
5822 488380 568432 771870 673903 950177 1077879 964365 870764 877363 741561 870090 647596
5811 647596 804669 983839 1194465 1083281 1126164 1002446 976387 890325 982262 985249 818846
5800 818846 741755 531617 474133 558639 812825 629612 878437 800292 830775 577699 373559
5789 373559 617548 869971 599199 768314 807586 851162 725864 758383 754810 783229 856902
5778 856902 711857 1207850 948996 1077438 886936 1077153 1082698 1122387 1129036 1274427 1264416
5767 1264416 1179773 1377961 1434135 1531961 1499543 1556642 1849778 1835626 1634347 1829661 1775958
5756 1775958 1716100 1489924 1729807 1599673 1806603 1703144 1317580 1600928 1441365 1254739
5746 1254739 1170938 1499311 1181277 1077722 1175441 1469970 1401913 1318960 1341778 1392779 1425219
5735 1425219 1411142 1211398 1056990 1200325 1044670 1286539 1403736 1274515 1153129 1315408
5725 1315408 1425121 1180531 904587 803439 991793 893668 782324 1010659 1123802 1231292
5715 1231292 1099417 1196220 1021384 962989 962000 1168792 1156246 1018422 1133644 1255958 1181584
5704 1181584 1192023 837454 900540 1061106 892484 1049179 1297996 1342301 1222331 1005112
5694 1005112 873894 962500 919226 857827 1059470 1003608 915670 964637 1172037 1327649 1033986
5683 1033986 895192 915416 904595 825877 953099 935640 772301 847202 818138 1007827 1133794
5672 1133794 995957 1245824 1100982 970577 1113237 1095654 1205515 1083913 982188 1423904
5662 1423904 1664977 1618955 1511940 1192404 1090024 1215186 1137975 1064870 1473168 1529594
5652 1529594 1495935 1463801 1431712 1521133 1423825 1227638 1185925 1461698 1275096 1242924 1323358
5641 1323358 1169443 1208322 1333542 1371121 1695296 1657025 1636432 1399295 1191612 1468241
5631 1468241 1503285 1525108 1581058 1664800 1707786 1687210 1449358 1384717 1541807 1631049 1650092
5620 1650092 1530478 1616180 1593000 1562937 1758034 1820205 1940773 1899308 1912960 2045433 2088979
5609 2088979 2304930 2115369 2184011 2168188 2195710 2151504 2025150 1977076 1983380 2188398 2257586
5598 2257586 2398471 2316110 2272779 2310649 2259075 2361928 2194258 2143942 2261345 2169812 2440572
5587 2440572 2335350 2300742 2240342 2491276 2444770 2601312 2620724 2290909 2623864 2672670
5577 2672670 2531428 2607238 2845402 3110415 3252628 2991910 3097734 3093572 3278963 3322366
5567 3322366 3146873 3273367 3567002 3500714 3469267 3683049 3623223 3735652 3835031 3836539 3688003
5556 3688003 3815094 3756031 3688927 3351147 3552287 3925849 4126473 4464767 3989598 4040249
5546 4040249 4166810 4054461 3792467 4125232 4181263 3971644 4346495 4385270 4470913 4445052
5536 4445052 4474353 4553199 4716117 4825021 4774620 4751240 4724255 4632359 4653419 4589489 5002026
5525 5002026 5189008 5494185 5333638 5062211 5224200 5125576 5233916 5424309 5622864 5382366
5515 5382366 5782610 5744203 5574311 5785207 5924800 6036317 5798927 6031045 6301130 6280652
5505 6280652 6190480 6002882 6062809 6319928 6523594 6640322 6714385 7121395 7028819 7198934
5495 7198934 7287110 7357912 7743123 7958243 7963604 7870463 8319245 8395371 8679009 8742818 8897395
5484 8897395 9090851 9535932 9957866 10274876 10426359 10668343 10974934 11342437 12018221 12203793
5474 12203793 12548082 13360209 13933488 14734838 15498291 16021894 16918169 17840356 18050565
5465 18050565 18076084 18271670 18198194 18163630 18036951 18068516 18040529 18198870 18700449 18912661
5455 18912661 18896950 19487031 20100340 20949017 21531227 22139610 22862826 23867084 25068851
5446 25068851 26085552 27184072 28577310 30292846 31920340 34035145 36250045 38700179
5438 38700179 41535104 44529482 47920560 51702742 55994877 60237094 64314503 67947735
5430 67947735 70492614 72699231 74092754 75077252 75784653 76609532 77626962 78470704 79311492
5421 79311492 79654418 79496731 78720964 77527097 76188897 75179106 74525201 74089016 74689017
5412 74689017 75861641 77292196 79732988 82771001 85980730 89019029 91624418 93480703
5404 93480703 95008751 95980592 96442908 97387719 98431323 99853767 101765267 103766078 105887482
5395 105887482 107877462 109652340 111081858 112573165 114284262 116502578 119213532 122817567
5387 122817567 127149092 131294644 135796127 139850774 142325916 143750398 143622377 142591740
5379 142591740 141356287 139604812 137649754 135538722 132795123 128657698 123234238 116573952
5371 116573952 109099210 101342850 93780234 86531460 79900817 74222360 69684322 65459576
5363 65459576 61516426 58456448 55562260 53023357 50296890 47513638 44914226 42373685
5355 42373685 40264905 38400107 36702016 35149789 33524546 32125688 30776842 29899110
5347 29899110 28730936 27696092 27107648 26469222 25714141 24796485 24266895 23994852 23932636
5338 23932636 23387457 23169370 23233358 23233707 23350791 23200578 23605205 23997515 24236043 24164591
5328 24164591 23598055 22783137 22060228 20911223 19843351 18847972 18123604 17659898 17176109
5319 17176109 16625987 15903141 15854782 15224152 15177030 14859237 14770024 14613283 14474259 14199226
5309 14199226 14092408 13902835 13764908 13712626 13273022 12952202 12634723 12379904 12376509 12352242
5299 12352242 11793342 11582190 11228690 11132985 11211571 10845142 10348542 10254243 9894405 9746332
5289 9746332 9486151 8888642 8791566 8814337 8406189 8355690 8218891 8241657 8193465 7840752
5279 7840752 7599021 7306609 7237536 7067316 6803909 6425839 6615909 6581042 6642569 6572611
5269 6572611 6380899 6184218 6110953 5893994 5655329 5597370 5421409 5696716 5503113 5396338
5259 5396338 5473216 5402657 5242280 4991551 4950379 4982942 5072272 5028664 5245325 5086286 4868693
5248 4868693 4975717 4779595 4729884 4929835 4741773 4797475 4761519 4715622 4624653 4533286 4644660
5237 4644660 4685706 4779742 4523261 4542493 4365338 4324785 4250795 4050650 4223225 4637524
5227 4637524 4520134 4279003 4009331 3981869 3976023 4173544 3897483 3900179 3973155 3883505 3856021
5216 3856021 3694438 3788548 3725630 4100067 3886180 3691498 3502018 3879058 3800242 3685500
5206 3685500 3663798 3433528 3728757 3955473 3845815 3697781 3750349 3521820 3736804 4013432
5196 4013432 4024302 3839521 3810795 3477049 3608062 3661513 3598631 3643845 3825423 3822276 3819421
5185 3819421 3668427 3494906 3745941 3933393 3867329 3415440 3583772 3746453 3701789 3512667
5175 3512667 3644809 3833255 3878985 3783554 3730901 3623805 3708232 3799970 3729547 3776469 3786239
5164 3786239 3922910 3743241 3730645 3660834 3676792 3671067 3833175 3783042 3644761 3689292 3688254
5153 3688254 3573219 3686631 4009003 4146870 4173312 3892953 3929298 4091497 3890207 3768852
5143 3768852 3945066 3828410 3946372 4298650 4424878 4388688 4270391 4059326 4239364 4277232
5133 4277232 4605468 4589426 4534779 4483373 4445447 4523302 4868712 5000976 5040984 5216349 5244238
5122 5244238 5163137 4980862 5133093 5328725 5349289 4996481 5325776 5310313 5633196 5664172
5112 5664172 5756850 5688614 5647503 5382967 5218043 5430881 5210894 5234480 5171298 5182231 5114523
5101 5114523 5072801 5024240 4900965 4804240 4656563 4696220 4842622 4640284 4532585 4649912
5091 4649912 4771117 4967549 4909049 4857764 4737708 4803843 4978029 4964869 4890673 4752983
5081 4752983 4663669 4661402 4664308 4663208 4828762 4955950 5144767 5059842 5016056 5020531 5162352
5070 5162352 5083627 5181595 5087062 4934895 4773969 4842287 5067199 5114593 4980400 4996039 5122995
5059 5122995 4826501 4739542 4909865 5118985 5368789 5453197 5401981 5498582 5522095 5518418 5639612
5048 5639612 5447268 5537759 5615671 5726951 5758375 5678771 5462852 5499954 5577267 5631260 5948207
5037 5948207 6048901 5723052 5659631 5795668 5630961 5787490 5938828 5920241 6037976 6299915
5027 6299915 6277597 6243456 6347376 6336288 6158218 5959435 6135227 6313799 6359374 6206806
5017 6206806 6062886 6218066 6343304 6406246 6600544 6511581 6253870 6137596 6161971 6314178
5007 6314178 6312452 6351519 6504898 6689216 6506143 6695310 6603802 6721091 6681287 6736973 6894012
4996 6894012 6818887 6920739 7134164 7216469 7116211 7038132 7042837 7251699 7358817 7406165 7443855
4985 7443855 7380182 7227594 7261288 7333553 7489358 7736144 7777509 7838891 7994538 8137556
4975 8137556 8022250 8240695 8301656 8288454 8357384 8576670 8832399 8975078 9102790 9183188
4965 9183188 9308170 9266859 9583057 10000740 10229742 9967761 9977015 10343784 10544947 10661435
4955 10661435 10523357 10467457 10913151 11177926 11284363 11299601 11594332 11674030 11612107 11795468
4945 11795468 12081573 12311756 12233843 12768296 12740543 12973628 13054046 13161516 13508665 13715621
4935 13715621 13826413 14119878 14472766 14644967 14796892 15276955 15707515 16013998 16564593
4926 16564593 17048920 17662392 17529160 17896322 18298806 18968425 19462189 20019850 20976126
4917 20976126 22024942 22856423 23563600 24543916 25341935 26002804 26723517 27405784 27790375
4908 27790375 28268205 28401924 28271580 28076669 27979114 27686541 27648831 27557455 27588872 27738808
4898 27738808 27349986 26905766 26701297 26877285 26774396 26672155 26641405 27139725 27061323 26728202
4888 26728202 26684867 26870251 27132697 27176196 26991239 27115468 28004837 28153211 28364621 28305775
4878 28305775 28504483 28777402 29191099 29586973 29838500 30359365 30657706 31062519 31349280
4869 31349280 31962599 32602607 33229235 33817425 34601216 35147390 35951013 36478242 37244348
4860 37244348 38324215 39594081 40386718 41364266 42896749 44209039 45701754 46731552
4852 46731552 48229272 49668814 51414541 53010968 54704363 56898520 59106410 61104746
4844 61104746 63542573 66089339 68764030 71712195 75043104 78420546 82333219 86511750
4836 86511750 90521235 95322161 100513080 106118360 112126509 118495879 125135740 132868790
4828 132868790 141271808 150231581 159915885 170550786 182139961 194167179 206479709
4821 206479709 218820120 230236519 240635971 249688600 257135497 263486427 269422169 274318163
4813 274318163 277680003 278620932 277162806 272319536 264287761 253670163 241554612 228624391
4805 228624391 215321596 202800977 191157643 180601484 171206300 162927833 155886871
4798 155886871 149999076 144664945 140378294 136613431 133602852 131119220 129056677 127387847
4790 127387847 126266001 125185625 124655987 124867959 124949806 125601133 126819970 128305325 129684309
4781 129684309 131370546 133435121 135427650 137615618 139878070 142227254 144716335 147165604
4773 147165604 149616323 151650332 153488363 154811454 155124999 155071957 154245111 152685194 150333602
4764 150333602 147248895 143786992 140100992 136364244 132724498 129142436 125540802 122007733
4756 122007733 118730584 115502111 112309488 109300926 106658951 103619512 100470154 97715545
4748 97715545 95046208 92277649 89554680 87321252 85214982 83181281 81384372 79644573
4740 79644573 78093599 76508785 74922173 73437882 72066582 70944949 69982858 68910983
4732 68910983 68235620 67602812 67165700 66998169 66804239 66874989 67409082 67798743 68010991 67926082
4722 67926082 67445166 66408599 64763323 62703262 60373787 58379979 56222277 54006414
4714 54006414 52266602 50243763 48552116 47185928 45893505 44549387 43275685 42190762
4706 42190762 41311746 40492309 39891690 39138487 38667436 38237853 37489287 37024475 36397644
4697 36397644 36001666 35605731 35220129 34751911 34704814 34553317 34351775 33966644 33751118 33415509
4687 33415509 33200719 32831713 32449100 32313126 32187341 32104497 31903938 31860541 31773398 31547130
4677 31547130 31504698 31541213 31335811 31280802 31065295 31096856 31062577 30972105 30780998 30479580
4667 30479580 30313135 30476330 30510345 30403802 30627436 30780289 30992845 31251495 31460740 31470619
4657 31470619 31980487 32442485 32640164 32819606 33239330 33376087 33725859 33642171 33315212 33246912
4647 33246912 33486071 33290658 33144093 32860136 32682646 32725070 32741516 33016353 33095768 33464767
4637 33464767 33593114 33942662 34555043 34961201 34937947 35304044 35699086 35705914 35981965 36300135
4627 36300135 36276042 36183245 35939517 35459225 35031563 34742969 34521658 34210755 34164252 34088105
4617 34088105 34235475 34391021 34762799 34954679 35037212 35497800 35591473 35646115 35821527 35873270
4607 35873270 35692673 35360677 35231921 35234736 34988748 34689583 33993226 33513413 33117810 32752544
4597 32752544 32408558 32531908 32318428 32366175 32704082 32769772 32643112 32834834 32947990 32897785
4587 32897785 32767193 32455937 32344090 32163318 31682057 30852440 30305382 29714680 29230082
4578 29230082 28862004 28799897 28424707 28165515 28004385 27841439 27833917 27878754 28039720 28070471
4568 28070471 28206514 28303742 28324394 28706045 28923324 28722664 28667726 28999992 29448303 29832507
4558 29832507 30305183 31229104 32383094 33683987 34697496 35554382 35428102 34807765 33562043
4549 33562043 31722118 30331158 29009970 28341756 27744435 27257225 26871087 26790175 26746086
4540 26746086 26833948 27034359 26893709 26880869 27252623 27384740 27825948 28365778 28880398 29210882
4530 29210882 30280219 31222406 32050494 33304863 35096021 37051564 39661086 43193418
4522 43193418 47436942 52258964 56325614 58328307 57707846 55576742 51568462 45948701
4514 45948701 41344079 37774722 34962791 33219163 31849656 30937498 30156108 29717562 29132084
4505 29132084 29011555 28956131 28873267 28768632 29094183 29340712 29722466 30175795 30695685 31197791
4495 31197791 31942063 32859987 33947623 35649218 37836873 40529416 43851800 48223668
4487 48223668 52841790 56933188 58770289 57912635 55046697 50527385 44793803 39794993
4479 39794993 36206103 33574056 31668261 30278951 29266185 28189146 27392950 26957424
4471 26957424 26606068 26498130 26348153 25960938 25896554 26078451 26060531 25829753 25750932 25853082
4461 25853082 25882868 26089706 26364632 26810821 27622974 28582063 29585934 30909220 32558459
4452 32558459 33648005 34159257 33605966 32461290 30689144 29015577 27739605 26639117
4444 26639117 25865730 25110026 24873974 24562121 24193567 23888891 23764462 23723187 23537219 23559530
4434 23559530 23648201 23407476 23380863 23406238 23376280 23322246 23628281 23708984 23790130 24053373 24341715
4423 24341715 24518297 24804869 24610284 23899758 23463226 22893934 22389792 22053393 21801529
4414 21801529 21296059 20987163 20973841 20856602 20739876 20596140 20773515 20818818 20806789 21136745
4404 21136745 20862606 21380958 21963105 22048054 22207071 22611116 22718811 22917127 22979152 22670651
4394 22670651 22574781 22649889 22352868 22157670 21978251 21316024 20634692 20330780 19978775 19549429
4384 19549429 19504922 19546055 19537490 19588472 19978723 20248827 20157586 20495274 21084785 21807027
4374 21807027 22177423 22174684 22428522 22336513 22038486 21406644 20692749 20027539 19632250 19156880
4364 19156880 19213751 19030114 18892944 19005786 19128834 19038058 19059941 19313531 19562155 19996946
4354 19996946 20087766 20162664 20744076 21257478 21716287 22471560 23147513 23775696 24659617 26248532
4344 26248532 27610698 29043269 30685528 32454826 34043578 35378820 35639242 35379432
4336 35379432 34717584 33405794 31662139 30132739 29099145 28226721 27819619 28048963 28359027
4327 28359027 28433973 28767025 29426478 30351228 31587768 33047684 34654364 36674893 38288922
4318 38288922 39582622 40405134 40904813 40807394 40638680 40566238 40338859 39929258 39224218 37708141
4308 37708141 35765230 33597412 31613621 29944539 28234199 26677992 25383357 24688072
4300 24688072 24264107 23395629 22667639 22365145 22208615 22402390 22613136 22692512 23111450 23623563
4290 23623563 24187468 24766123 25665077 26671555 27771112 28799389 29221212 29326441 29022452
4281 29022452 27807477 26189802 24699045 22894211 21577397 20316884 19429953 18640184
4273 18640184 18128694 17678228 17206485 16891850 16876680 16708526 16619685 16845834 16948307 17210101
4263 17210101 17383413 17803738 18242464 19254240 20163394 21110805 21822873 22739720 23733340
4254 23733340 24556582 25714681 27819545 30635255 33477741 35566909 36126785 34908545
4246 34908545 32858603 29712746 25282080 22081623 19920050 18236638 16848271 15822163
4238 15822163 15166493 15123621 14960313 14869028 14619305 14797604 14970967 14905739 14648057 14569136
4228 14569136 14361559 13857703 13288955 12638226 12364571 11757226 11261557 10849783 10430978
4219 10430978 10087561 9914912 9890354 9706736 9653809 9265352 8788108 8850544 8649336 8436538
4209 8436538 8533243 8251622 8157771 8105461 7902218 7878237 7688597 7736044 7612722 7632584 7525306
4198 7525306 7687260 7646208 7366968 7039438 7142332 7354461 7348328 7274309 7222960 7524023
4188 7524023 7461573 7328526 7135938 7049664 7021923 7066676 7162457 7278901 7337301 7266290 6927472
4177 6927472 6870706 6834226 7079007 7180486 7227135 7093168 6983898 6896853 6792905 6763068
4167 6763068 6788745 6909999 6818337 6725213 6682227 6648893 6797810 6568731 6275395 6454489
4157 6454489 6765672 6781495 6762564 6661321 6445385 6497393 6333454 6401639 6616072 6871036
4147 6871036 6768446 6592839 6322875 6484313 6675246 6892950 6533113 6565766 6538490 6550739
4137 6550739 6816752 6822464 6571289 6377566 6683453 6661145 6434777 6280649 6514942 6421468
4127 6421468 6716723 6915643 7078805 6996618 7099729 7412611 7509041 7320749 7126577 7317310
4117 7317310 7329945 7351439 7225783 7377431 7546223 7716084 7784750 7856208 7881901 7920909 7732459
4106 7732459 7783991 7914285 8005742 7926970 8060996 8002316 7980411 7969537 8117075 8660417 8607593
4095 8607593 8525967 8341102 8656777 8661092 8631376 8603845 8723410 8716842 8888317 9045071 9195588
4084 9195588 9237218 9137911 9166667 9231456 9065184 9081955 9067808 8983967 9046772 8803113 8972396
4073 8972396 9153759 9277925 9152324 9311672 9375750 9213860 9211196 9080328 8978260 8765884
4063 8765884 8699464 8592659 8494521 8431246 8430863 8369358 8368478 8201747 8356949 8237204 8046363
4052 8046363 7946798 7812746 7931053 8093590 8228775 7924815 8052061 8108661 8289757 8181114
4042 8181114 8388874 8165786 8119876 8138024 7970753 7964143 7989160 8048935 8164037 8085103 8226896
4031 8226896 8006303 7800787 8024083 7806027 7677229 7524654 7673246 7589694 7601281 7663740
4021 7663740 7698369 7778126 7996491 8143917 7916515 7613764 7959233 7987787 7946841 7862599
4011 7862599 7724042 7902041 8063706 7909122 8041014 8052495 7930182 7612659 7498219 7559254
4001 7559254 7622806 7663516 7311506 7269800 7099037 7328587 7309071 7388866 7451841 7274430 7063796
3990 7063796 6997477 6949579 7102272 6937879 6780560 6933036 6906052 6664358 6428372 6635356
3980 6635356 6508811 6551506 6590383 6549014 6557331 6738264 6776455 6606971 6685800 6700663 6948824
3969 6948824 6835564 6853085 7031439 7068564 6896170 6846492 6734705 7016421 7148525 7171286
3959 7171286 7129704 7255463 7376924 7450905 7481617 7315216 7487649 7315115 7269610 7357565
3949 7357565 7479233 7436862 7556135 7498877 7736226 7540813 7760340 7547210 7551839 7433026
3939 7433026 7459877 7622386 7750644 7802753 7763270 7906095 7970460 8031495 8189106 8336894
3929 8336894 8041197 7766810 7562992 7958754 8069187 8125511 7757625 7716952 7997844 8086243
3919 8086243 7868298 7870201 8188572 8073926 8108104 8084697 8010720 8010226 7902795 8075449 8151802
3908 8151802 8245448 8527125 8497429 8512729 8537602 8548702 8729769 8862742 8823765 8804997 8871343
3897 8871343 8969867 9033257 9267371 9451782 9429638 9495403 9588821 9603469 9445247 9697093 10008496
3886 10008496 10243396 10022341 9843480 9998232 10485981 10458199 10279521 10651607 10860093 10822645
3876 10822645 11132014 11286451 11086067 11143596 11130795 11110420 11412976 11498842 11633105 11918144
3866 11918144 11788898 11782537 11952409 12030554 12157246 12125088 12342883 12517603 12436900 12252108
3856 12252108 12055062 12335365 12514394 12693121 12847915 13145238 13175309 13108754 13099058 13299020
3846 13299020 13523284 14111219 14282697 14388514 14434286 14669148 14893302 14933996 14953363 15064163
3836 15064163 15069085 15134006 15373282 15494531 15647393 15806625 15956190 16012164 16145586 16138342
3826 16138342 16306897 16663175 16603103 16673001 16743820 16908423 17368121 17406577 17599332 17997844
3816 17997844 18189740 18351111 18732075 18807082 19171769 19205257 19734561 20255878 20500532 20783113
3806 20783113 21107894 21370180 21698172 21760796 21925353 22270701 22585107 22964115 23342035 23601191
3796 23601191 23815265 24483621 24714227 25059976 25602103 25733480 26514792 27194661 27714845
3787 27714845 28058562 28400652 28746249 29352866 29904369 30401584 31204049 31900676 32387820
3778 32387820 32842487 33147022 33962186 34593530 35266839 36134048 36876359 37909719 38498451
3769 38498451 39449341 40328936 41341948 42384387 43702560 45120113 46320652 47627971
3761 47627971 48898169 49887291 51249449 52909503 54374745 55825489 57504396 58939752
3753 58939752 60370993 61729014 63128462 64820188 66815403 68989404 71590089 74390435
3745 74390435 77305085 80480667 84041435 87569291 91710477 96097765 100533538 105308881
3737 105308881 110324030 115691324 121302137 127646011 134650560 142598186 151618942 161811061
3729 161811061 172811689 184534581 196514200 208275829 219535054 228907632 236263872
3722 236263872 240700599 242049369 240206799 236106737 230216514 223649315 217465535 211777492
3714 211777492 207654190 205341403 205043361 206198763 209024497 213332490 219489374 226889949
3706 226889949 235837505 246340730 258356931 271669177 286070937 300992708 316147539
3699 316147539 330659655 343183668 353456352 359543110 361394286 358514520 351934687 341786802
3691 341786802 329328468 315603927 301224612 287299558 273893968 261754731 250715783
3684 250715783 240690148 231337526 222604604 214202485 206068613 198028984 191004713 184085392
3676 184085392 177091062 170751879 164865104 159213890 153732469 149067929 144878289 141617344
3668 141617344 138789640 136321511 133956512 132112833 130354848 128896012 127924474 127152075
3660 127152075 126608662 126395637 126298309 125983166 125650483 125095287 125124196 124753774 124723060 124591054
3650 124591054 124647864 124367928 123793851 123025047 122351689 121428900 120429210 119721805 119018723
3641 119018723 118411481 117624489 117116077 116466648 115961667 115980775 116486233 116967794 118225088
3632 118225088 119382003 120755397 122596187 124516161 126625338 129151123 132105698 134866405
3624 134866405 138083413 141259606 143947338 146093727 148087974 149307498 149907306 149554556
3616 149554556 148583347 146929617 144546170 141775287 138307023 134857461 131256028 127440681
3608 127440681 124011114 120868313 118158119 115345807 112854002 110824464 108962659 107515143
3600 107515143 106315047 105598951 105271173 105079164 104860688 105096496 105277793 105751015 106195581
3591 106195581 106402514 106668049 106770843 106685754 106301728 105243650 103808398 102004882 99667463
3582 99667463 97254079 94588086 92268628 89519392 86709154 83616472 80814976 78193666
3574 78193666 75745240 73443833 71060132 69282905 67359562 65602660 64075260 62684340
3566 62684340 61372551 60111970 59101358 58328212 57352935 56628369 55564113 54659688 53437388
3557 53437388 52395079 51371471 50658254 49995617 49544515 49157989 48666535 48399579 48060801
3548 48060801 47590107 47004211 46499923 46130667 45911526 45681902 45571623 45185362 44966027
3539 44966027 44775154 44785406 44240948 44191543 44269794 43871473 43373869 42963108 42922405 42612610
3529 42612610 42592961 42790985 42626329 42742143 42895597 42696957 42655791 42366574 42084914 41995586
3519 41995586 42256539 42334159 42610001 42635046 42638758 42504276 42647579 43118536 43586484 44178247
3509 44178247 44419144 44718424 44891136 45127211 45295180 45747336 46305621 46542878 47068564
3500 47068564 47684606 48026597 48576496 48947631 49033031 49253363 49525383 50056179 50353036 50584448
3490 50584448 50690692 50642830 50634662 50971153 50995706 51059467 51343578 51488300 51590755 51917978
3480 51917978 52172773 52299147 52749582 52641219 52823081 53047040 53335094 53751084 54009368
3471 54009368 54087722 54489240 54774729 55426689 56004591 56624151 57099111 57533622 58039050 58337001
3461 58337001 58452307 58583745 58786435 58910947 58942449 59050478 59292432 59439621 59723536 59754151
3451 59754151 59523376 59621607 59743622 60225409 60846651 61252501 62337251 63050254 63947989
3442 63947989 65126341 66182392 67372996 68986669 70459659 71899251 73367844 74615926
3434 74615926 76026931 77136989 78176682 79374353 80605541 81893084 82865207 83772126
3426 83772126 84539683 85621897 86642520 87583721 88991198 90253815 91602688 92974088
3418 92974088 94505887 96297863 98113084 100320476 102743046 105648961 108718922 112061931
3410 112061931 115732177 119474780 123307800 127452404 132419692 137584141 142855399 148366202
3402 148366202 154009474 160183692 167294569 174856536 183604011 193445741 203756331 213917887
3394 213917887 223622885 232505205 240739030 248148165 254887865 258914378 258736146 253737290
3386 253737290 245121827 233772309 221170351 209917396 200859504 194365932 189627939 186897322
3378 186897322 185727907 185377299 186289175 188499637 191394864 195343812 200254518 206330529
3370 206330529 213391196 221404870 230297149 240583863 252283964 265630450 280975828
3363 280975828 298215677 318134771 340144041 364174512 387732670 408955971 424369891
3356 424369891 430525855 425807750 409684152 384542303 354259646 323794923 295574020
3349 295574020 270696480 249534631 231820662 216726938 204111482 193316682 184405606
3342 184405606 176442854 169934530 164404432 159803250 155578840 151940996 148933032 146382019
3334 146382019 144546915 143350244 142015688 141261561 140777038 140413668 140103832 139800668 139506284
3325 139506284 138647482 137562424 135807952 133356476 130558612 127765861 124897594 121826511
3317 121826511 119212093 116906855 114915220 113004115 111182859 110013889 108972625 108509010
3309 108509010 108557542 108643071 108522360 108653997 108788167 108485188 107738825 106996413 105801685
3300 105801685 104746455 103579935 102841270 101909080 101108510 100327178 99260070 98463264 97562075
3291 97562075 96290997 94978233 93814145 92427958 91020419 89507775 87938306 86571094
3283 86571094 85161935 83546983 82384149 81191916 80556930 80204468 79985504 79618027 79387447
3274 79387447 79527030 79860338 80311715 80882357 81840503 82739680 84006754 85244104 86328933
3265 86328933 86874025 87316889 87188824 86241755 85126449 83465685 81463289 79757483 78039033
3256 78039033 76520243 74971947 73654738 72467709 71152601 69625399 68559816 67689479
3248 67689479 66901891 66408514 66274116 66298917 66726805 67472998 68513489 69666881 70983612
3239 70983612 72614402 74310134 76115397 78152086 79840315 81518106 82838072 83460350
3231 83460350 84038647 83721126 83565484 83194939 82741704 82683868 83182077 83479409 84332876 85603458
3221 85603458 86714118 88457214 90172969 91864929 93784221 95373664 96564248 97472667
3213 97472667 97940175 98021134 97503875 96623609 95617740 94472614 93562500 92516733 91673589
3204 91673589 90691179 90221203 89648541 89346073 88790598 87748576 86696700 85825179 84740376
3195 84740376 83313528 82523602 81787656 81390321 80868541 80656476 80839579 81182769 81473626
3186 81473626 82204120 83281390 84581480 85634594 86933513 88904959 90761869 92644024
3178 92644024 95159438 98079030 101332497 105003519 108340479 112245266 116148654 120453431
3170 120453431 125195535 130327524 135665238 141837895 148841961 156448113 164873879 174484037
3162 174484037 185959754 199235274 214347595 231861078 252451188 274941908 300332072
3155 300332072 328296218 359221297 391638177 419700505 435429601 432862426 410613688
3148 410613688 374564414 333628578 296247459 265175796 239959311 219843131 203802121
3141 203802121 190593467 179667038 171161605 163816313 158037602 153488189 149717811 146845343
3133 146845343 144353260 142216280 140702984 139618646 138500035 137829289 137933488 138280793
3125 138280793 139252510 140075445 141609093 143605595 146324288 149164105 152468651 156324192
3117 156324192 160540594 165181530 170597688 177253900 184280938 191569049 199536486 207234742
3109 207234742 214884319 221817073 227888743 234212539 241272833 249932857 260782905 273830395
3101 273830395 289453353 308452149 329854616 352899857 376158601 397008867 412982278
3094 412982278 421514891 421096460 411661720 394173276 370552362 343460590 314698714 285881430
3086 285881430 259219563 235282889 214852417 197767422 183144847 170642313 160122294
3079 160122294 151432878 144020586 137504310 131916865 127031991 122145090 117901774 114214493
3071 114214493 110329361 107061026 103948578 101130246 97900356 94957241 91964289 89241229
3063 89241229 86341751 83073926 80429844 77772145 75223724 73283608 70711639 68505872
3055 68505872 66645309 64861171 63008688 61229709 59861129 58187738 56869805 55100181
3047 55100181 53625878 52095737 50881996 49754798 48502573 47671095 46741689 45741079
3039 45741079 44819479 44059778 43376973 42745534 42114449 41679976 41535898 40901947 40259008
3030 40259008 39686621 38985368 38977333 38719847 38474435 38071988 37406307 37085340 36654794 36254810
3020 36254810 35773355 35490902 34904542 34389495 33603184 33041314 32767325 32393707 31648488
3011 31648488 31020305 30574882 30246075 30101953 29894105 29766199 29096644 28511525 28243082
3002 28243082 28085834 27616580 27401086 26830295 26658125 26417467 25871648 25329881 24843694
2993 24843694 24271011 24159212 24152449 23739309 23483932 23311615 23153401 22770605 22541147 21971299
2983 21971299 21914992 21941446 21691005 21328254 21299744 21314457 21241014 21026883 21146290 21051492
2973 21051492 21075733 21432695 21514447 21308567 21229088 21063838 20979545 21272842 21430679 21745847
2963 21745847 21528901 21295911 21077583 21039935 21066278 21015408 21112905 21372330 21410808 21180963
2953 21180963 21150962 21117655 20932555 20908566 20592673 20595186 21042627 20823738 20497599 20441083
2943 20441083 20334474 19998437 19966806 19894420 19726924 19596797 19452510 19453683 18996991 18720846
2933 18720846 18442487 18070882 17904724 17582995 17201987 17016374 16774829 16372581 16214443
2924 16214443 15922890 15779339 15585327 15457113 15394750 15199780 14796187 14517341 14364704 14467790
2914 14467790 14237046 13962326 13807597 13845101 13799520 13674785 13573820 13012595 12838942 12669319
2904 12669319 12537384 12589164 12593343 12561010 12493116 12292865 12378237 12042587 11797146 11988660
2894 11988660 12003728 11833937 11642303 11633085 11572603 11530691 11221462 10848164 11067869 11078707
2884 11078707 11027321 10919139 10614123 10331623 10320853 10390204 10226775 10389703 10302866 10283455
2874 10283455 10095116 10041226 9846411 9763582 9741250 9588676 9453250 9677682 9807557 9570880
2864 9570880 9585109 9703940 9568566 9224560 9332602 9362601 9593957 9322741 9294543 9397506
2854 9397506 9455790 9511999 9592839 9745685 9668019 9646809 9928116 10060445 9985232 10159885 10415120
2843 10415120 10421383 10431578 10261375 10402479 10336638 9915796 9504958 9388635 9363660 9339895
2833 9339895 9270208 9114393 9024394 8774705 8765737 8904299 8522279 8374580 8180759 8221023
2823 8221023 8397345 8284609 8229961 7973946 8129463 8240536 8338415 8142508 8182337 8015125
2813 8015125 7984543 8022120 7869093 7863242 8216300 8269013 8168102 7694391 7730052 7763128 8227604
2802 8227604 8084901 7985393 8221711 7917447 8244659 8359032 8421870 8080132 8321055 8603314
2792 8603314 8538756 8510772 8505882 8399104 8726789 8746536 8609982 8510322 8654989 8499272 8086830
2781 8086830 8213245 8381779 8449934 8701217 8842739 8824493 9024387 9072447 9234524 9215196
2771 9215196 9272353 9402784 9421708 9251389 9327304 9401666 9301503 9107991 8922370 8786308
2761 8786308 8863512 8798347 8890581 8672943 8307639 8391465 8595489 8484912 8464557 8431296 8188208
2750 8188208 8101868 8019685 8077636 7722423 7730035 7689127 7518440 7607034 7659280 7602413 7678947
2739 7678947 7469951 7458216 7271039 7601272 7676013 7521611 7511253 7156344 7236904 7045705
2729 7045705 6974258 7067383 7172985 7051621 7199539 7183072 7190065 7125624 7027913 7117585 6899887
2718 6899887 6758799 6764856 6984869 6892089 6602187 6439290 6485159 6451602 6570051 6646345 6381094
2707 6381094 6114889 6180289 6172310 6042722 6058167 5855571 5836059 6046765 6122861 5832751 6069557
2696 6069557 6236792 6249846 6088965 6002642 6116733 6122345 6432591 6565585 6553510 6504204 6680831
2685 6680831 6895750 6932562 6784794 6691275 6737574 6731755 6605197 6641789 6416422 6125697 5961850
2674 5961850 6021495 6008972 5908916 5808394 5443078 5292777 5075855 4734322 4732324 4906306
2664 4906306 4877717 4611829 4443609 4508219 4459201 4290059 4257431 4101461 4063391 4189039
2654 4189039 4080944 3999860 4052993 4147648 4209287 4198263 4045368 4104480 4021342 3985512 3752048
2643 3752048 3887269 4110243 4284989 4139972 4059270 3946874 4121252 4040845 3951691 4219738
2633 4219738 4426958 4542773 4414951 4453719 4368270 4487797 4413154 4475123 4401215 4697478
2623 4697478 4843044 4890378 4832603 4914630 4950412 4765652 4802968 5024814 5070074 5117204 5306270
2612 5306270 5241277 5245661 5267817 5553056 5538218 5575460 5443670 5426573 5595612 5265164 5371534
2601 5371534 5500392 5289962 5374413 5900814 6198326 6084585 5724977 5819972 5737614 5745490
2591 5745490 5749654 5899173 6117694 6365057 6157445 6043696 6194648 6117335 6085577 6014720
2581 6014720 6160948 6113056 6371802 6323587 6334721 6451674 6501418 6812685 7095095 7189058
2571 7189058 7363640 7494182 7884005 8115694 7992937 8462113 8642321 8804943 9026557 9261564
2561 9261564 9696343 9674542 9889227 10095446 10640522 11021129 10935193 11141029 11893976 12189541
2551 12189541 12509933 12837823 13088181 13392141 13410087 13669946 14019505 14526277 14740259 14524453
2541 14524453 14804463 15089630 15109791 15267371 15216571 15245235 15435288 15470283 15458646 15122426
2531 15122426 15204580 15389347 15086312 14752768 14483140 14406231 14323021 14012828 13738428 13771835
2521 13771835 13462695 12950861 12744620 12688357 12533396 12259413 11826951 11588754 11299350 11210392
2511 11210392 10961806 10798801 10554302 10532113 10184728 10136826 9944612 9786584 9499743 9361091
2501 9361091 9461916 9459528 9585384 9418297 9122619 8788332 8972363 8928293 8657642 8676831
2491 8676831 8709021 8776082 8673078 8374426 8353833 8594135 8653451 8513978 8536065 8313362
2481 8313362 8373799 8186976 8127255 8315927 8136994 8016817 8116177 7966541 7637013 7434181
2471 7434181 7385586 7190494 7267251 7247904 7222461 7225711 6851564 6796554 6708831 6429593 6214143
2460 6214143 6190209 6265379 6173294 6052781 5940201 5947789 5712461 5704900 5831811 5905017 5887875
2449 5887875 5805195 5491579 5241873 5312920 5404456 5348527 5567477 5760129 5587040 5438903
2439 5438903 5585830 5493666 5498523 5531139 5604081 5730612 5853937 6017286 6030655 6062794 6003783
2428 6003783 6249447 6143377 5920239 5858479 5949189 6042795 6141337 6097077 6239107 6272849 6178455
2417 6178455 6412110 6401164 6399084 6418540 6547822 6569830 7021865 6937624 6866555 6652338 6648552
2406 6648552 6684058 6438614 6343312 6289606 6279671 5853805 5868878 5600839 5610812 5458106 5112613
2395 5112613 4833274 5077663 4850054 4654186 4279231 3948181 3845670 4065680 4068941 3828400
2385 3828400 3773812 3476314 3760792 3491332 3246848 3150914 3381135 3457924 3503616 3602555
2375 3602555 3342712 3241298 3296109 3284641 3271749 3021799 3156485 3101407 3115343 3339380
2365 3339380 3211408 3099041 3051252 3226300 3191306 3251576 3051761 3138665 3105379 3342628
2355 3342628 3210443 3180614 3331757 3454879 3505906 3234634 3354847 3497302 3341999 3437075
2345 3437075 3777398 3940805 4102244 4354843 4525260 4321091 4242454 4106562 4059173 4048710
2335 4048710 3977271 3914761 4057417 4025216 3865907 3795361 3790273 3749069 3512547 3410820 3260541
2324 3260541 3337439 3415673 3399821 3201602 3353965 2921816 2939899 2961366 3122171 3062919 2846662
2313 2846662 2883075 2623208 2718109 2708415 3039203 2960164 2920498 2908131 3014965 2974857 2809562
2302 2809562 2711819 2580029 2573207 2632518 2728690 2977820 2810691 2766195 2606732 2325718 2530664
2291 2530664 2573343 2583250 2636259 2497062 2544098 2681423 2681410 2867754 2971241 3024937 3064686
2280 3064686 2939079 2883402 2875688 2894958 3077837 3303428 3484731 3437193 3442813 3565471 3531180
2269 3531180 3665989 3462255 3367556 3445490 3602034 3355276 3524517 3555425 3648231 3765008
2259 3765008 3727693 3616377 3346895 3493768 3497911 3703149 3800670 3630960 3727121 3767834 3755306
2248 3755306 3888960 3873091 4098819 4210589 4555061 4366664 4385404 4293233 4443773 4758220
2238 4758220 4791015 5124698 5203204 5475503 5683075 5813976 5639848 5709937 5726220 5876732
2228 5876732 6111702 6367048 6740797 7044874 6883121 7314728 7617423 8063567 8285270 8487071
2218 8487071 8692446 8536059 8607268 8457984 8323669 8370347 8495844 8360797 8179615 8162582
2208 8162582 8136551 7905965 7919511 7576240 7249935 7193914 6958408 7025456 7154636 7126734
2198 7126734 7273404 7082395 7051271 7077222 7126579 7031335 7223634 7255556 7388714 7265264
2188 7265264 7469030 7810049 8178284 8308212 8263855 8482976 8765527 9036575 8932936 9475287
2178 9475287 9826223 10515408 10802778 11433079 12188012 12976887 14172944 14958811 15991096
2169 15991096 17315576 19325362 21955877 25210772 29496072 34896526 39906435 43429899
2161 43429899 43546377 41253717 36709550 30558155 25418355 21761381 19439866 17744032
2153 17744032 16567654 15591309 14988781 14297113 14489838 14601744 14856613 14967244 15178210
2144 15178210 15827706 16536570 17339675 18368592 19616905 20850771 22287828 24070329 26374040
2135 26374040 28997933 32835176 37815049 44667259 53725609 64404188 74099024 79612665
2127 79612665 77668850 72376117 61747948 49020142 39707002 32973503 28207434 24492545
2119 24492545 22002527 20182763 18794019 17306222 16488868 15679722 15347211 14923346 14768111
2110 14768111 14737612 14763062 15048876 15265863 15686511 16036426 16402748 17064512 17786817 19004786
2100 19004786 20638664 23083676 26338816 30481885 35335105 39538742 41519181 39962930
2092 39962930 36774007 31635335 25573405 20974442 17554238 15156642 13590393 12462277
2084 12462277 11410635 10486356 9718573 9038020 8633429 8127247 7755058 7513331 7192492
2075 7192492 6971846 6744780 6643577 6294528 6005338 5898977 5733073 5593066 5355311 5292535
2065 5292535 5132572 4679649 4437151 4216308 4300499 4354767 4319015 4030272 3967047 3851861
2055 3851861 3711260 3645158 3675571 3603514 3559082 3504023 3514512 3281915 2998876 3070073 3191827
2044 3191827 3043855 3075521 2861143 2886166 2780775 2915699 2825915 2848103 2954099 2949823 3083036
2033 3083036 3055665 2857176 2758699 2801063 2656224 2712589 2690442 2575329 2402310 2378199 2129461
2022 2129461 2103788 1973902 1965366 1857085 1800784 1771202 1570368 1833964 1783299 1829865 1810730
2011 1810730 1764552 1775491 1858662 1815555 1611726 1779818 1777821 1416694 1507268 1326128 1401804
2000 1401804 1534479 1804098 1852302 1502450 1566980 1321579 1453977 1492630 1711077 1466566
1990 1466566 1309539 1278964 1480554 1536656 1472393 1204991 1416788 1558754 1503720 1317315
1980 1317315 1171101 962398 1009855 1083879 1200019 1264568 1366863 1614231 1441030 1437339
1970 1437339 1433529 1337776 1040191 1105127 907897 1024467 1128237 1223708 1375971 1451724 1379086
1959 1379086 988354 1014625 1132151 1168451 1070217 1043739 958174 1010898 1048679 1113634 918994
1948 918994 1058474 1232977 1109200 1220783 1095479 1069648 1061921 1065946 867407 953597 1194447
1937 1194447 1456114 1482702 1252202 1043629 960356 881038 675212 715276 956589 1002031
1927 1002031 860253 1069981 1208242 1126338 1100140 1130057 1078227 1015766 942500 924641 857663
1916 857663 850392 889750 797862 927567 1065685 937982 955067 917499 893473 889656 854881
1905 854881 938613 1089258 1037419 1273364 1504091 1330147 1400769 1334117 1352663 1090159 1227499
1894 1227499 1565344 1586458 1408930 1389267 1532013 1473300 1426637 1518355 1661922 1763697
1884 1763697 1975575 1983847 1859824 1804613 1643090 1696532 1883151 1670062 1955242 2208183
1874 2208183 2076422 1776725 1889740 1910793 1786522 1856740 1719683 1641697 1793562 1977899
1864 1977899 2028827 2206781 2307688 2374867 2270194 2354363 2222604 2082448 2376108 2210163
1854 2210163 2296818 2442981 2613776 2761925 2680524 2369480 2337495 2227121 2027719 2083881
1844 2083881 2008183 1882567 1546305 1437602 1590188 1869735 1977892 2012286 2061425 2222488
1834 2222488 2056669 1989205 1769620 1938677 2187437 2136953 2367172 2319879 2309816 2448385
1824 2448385 2548344 2329694 2203382 2295962 2098316 1958591 1816961 1510488 1406001 1593045
1814 1593045 1736630 1695824 1869484 1687913 1247854 1281780 1446007 1232176 1091664 1064322
1804 1064322 972635 1040643 1044857 1129036 1024600 1050566 1261862 1190424 1104171 1153597 907938
1793 907938 911590 985150 910997 918763 1155824 1100396 1109682 1044539 989522 997458 1160823 898105
1781 898105 774218 961009 1046314 1015077 1011553 1146153 1104151 1017355 936009 613679 780629
1770 780629 936497 614002 502279 362496 353526 187094 733606 522047 582682 591364 456612
1759 456612 461823 348079 178825 -59828 209611 263671 231080 292471 551484 472577 262837
1748 262837 39056 38999 120818 429866 274959 119287 30408 164795 248619 477486 368339
1737 368339 188547 394691 447709 396869 333121 266576 198378 50463 -108530 213349 427960
1726 427960 682139 729927 654296 735195 534179 474822 483250 427477 330290 77718 226985
1715 226985 347518 550428 540497 316065 75640 211326 270563 395657 510307 434569
1705 434569 17643 307499 239893 326316 358470 451724 170086 -40538 139604 -72848
1695 -72848 249031 37154 54477 288373 236788 252290 288780 212785 167618 -44891 -31227
1684 -31227 129433 119588 271965 141697 55557 -73699 146173 -28365 364181 455523 273650
1673 273650 211181 332147 323849 239394 332635 30905 12993 76604 338458 224379 185169
1662 185169 93358 118965 229378 373973 366754 411059 480526 279869 177987 152064 175153
1651 175153 339486 248168 71268 150390 378763 365398 376797 199990 42792 -901 111866
1640 111866 265526 197686 48390 8701 174867 317721 362446 253772 296746 457003
1630 457003 453775 297808 273802 204442 270429 345216 10942 47526 -86201 45112 322257
1619 322257 103342 -46018 -170600 -79572 78751 42671 263402 495128 338164 24932
1609 24932 136763 53477 -260643 66721 106860 103856 423992 246753 167945 49998 136951
1598 136951 -40524 283959 375899 316255 292450 258189 322734 -29663 -36908 146943 171448
1587 171448 299799 262072 218800 204488 58106 -185990 -6029 423368 129854 144043
1577 144043 29188 240248 142543 -938 196733 132981 160876 -45616 59459 156882
1567 156882 250918 -57360 -87106 13439 -56598 138954 232512 118547 -217604 70129
1557 70129 159817 49697 74406 192022 311690 -13256 -145790 44505 118973 313649
1547 313649 199439 132291 62294 -132814 62145 -35747 52847 -23328 197363 279928 343158
1536 343158 513368 261148 259084 266039 194523 217876 316460 439597 170888 105994 246445
1525 246445 291817 324509 426034 341155 127436 158150 16414 203027 278779 489804 441830
1514 441830 257929 399682 171820 74488 -193841 -72251 -30984 -364237 -284158 -254733
1504 -254733 -175995 -190329 -195603 12358 127366 231117 232263 103212 -218085 -259188 71484
1493 71484 205223 333921 307248 17765 -11437 206450 -20481 121815 -58008 45815
1483 45815 233750 499988 561591 394088 167357 280885 124066 -30255 -76051 52894
1473 52894 112429 -151733 -327722 4854 375581 415224 610773 300636 57143 -146029
1463 -146029 -59367 6829 -209805 114440 119485 174348 165672 78463 82706 -100378 -194119 -68701
1451 -68701 -60320 -44196 -69554 -162024 -56480 95341 -106398 -93892 -90945 188076 245005
1440 245005 -33088 78164 137977 90503 -60087 -77484 -134023 -75532 -103543 30984 61288
1429 61288 83632 -15657 33829 -43886 -13143 74685 59110 174944 -93529 -165892 149425
1418 149425 173561 -38227 -172984 13749 41350 -374 -32554 -19268 -41370 -289136 -194534
1407 -194534 127559 382476 319313 124491 154919 52221 -57960 -215521 -75720 242137
1397 242137 363087 166514 40855 -49412 128696 -225940 17035 -7311 18468 17842 -201646
1386 -201646 -164385 -331297 -263061 -276427 -107596 53959 276112 76373 -68299 -132454
1376 -132454 1923 -84519 -199098 -196639 -117040 -143172 8986 216685 233615 157792 112334
1365 112334 246867 15752 247382 15907 -70650 -197850 -77454 2710 96938 285003
1355 285003 357864 336688 204486 -13886 -169782 -33442 146203 130128 -2802 110724
1345 110724 267880 304941 297658 183009 -19384 -255451 -282002 -223166 -127371 30285 -8386
1334 -8386 -219236 -400942 -332828 -124543 -144427 -89667 -38609 177313 202261 170377 -41298
1323 -41298 6115 125192 -47838 252327 271886 274971 192135 103897 91851 285178 70687
1312 70687 227007 146909 62875 -191081 -249070 -85205 187042 114378 -218265 -147184 -209679
1301 -209679 63481 -68384 86 -105713 -141109 35513 34362 -128006 24445 175906
1291 175906 143519 288587 99780 301640 247725 496776 265201 246712 119999 331022
1281 331022 417516 467313 505213 324860 253011 267733 90345 66295 44827 49660 334826
1270 334826 224170 221621 293182 347231 154228 423217 156867 -4927 -71111 -193646 -154711
1259 -154711 -47882 125338 -84370 116360 -16904 -285703 -289743 -281238 -56159 -142634 -342251
1248 -342251 -19909 -102461 -203324 -102832 -42069 -143544 2031 236296 187237 104237
1238 104237 -94070 64897 -26694 195232 278167 264511 345264 188737 63923 81881 161389
1227 161389 93437 343025 204274 14008 203314 281688 183093 203200 119457 39960 82811
1216 82811 101009 -40697 35675 72467 135763 18176 -17352 -69361 -68514 130983 -29861
1205 -29861 -34836 145871 125062 -189094 -145415 -322995 -286101 54163 55086 -76810 111282
1194 111282 -23458 107197 20529 62651 83424 89211 -71683 200549 371309 396948 357477
1183 357477 82443 185692 207253 38304 164265 103623 26931 117234 6172 -5539 190855
1172 190855 287119 57490 125265 -51647 233400 383735 282748 172652 289139 217549
1162 217549 82913 50216 -38596 304314 70589 120396 66027 263814 319327 200070 274746
1151 274746 262340 551578 700648 835417 554159 303106 450305 598020 578833 389300
1141 389300 272632 374117 186177 175428 21402 390128 247637 207282 79108 104461
1131 104461 357810 174266 391659 332574 532173 285010 452707 547512 694522 479739
1121 479739 356761 438752 433153 535049 714106 783505 952493 1067373 921205 927704 573712
1110 573712 657793 785540 907081 586602 656892 389321 393334 400835 275640 667764 640427
1099 640427 1040498 920920 1100806 921088 965172 1261312 1385058 1567988 1565665 1737640
1089 1737640 1574045 1148168 1138933 1136423 1182153 1168121 1243101 1180417 1159367 1139881 974276
1078 974276 1360870 1107404 1123935 1176308 1307907 1452768 1171269 1256482 1134373 1323960
1068 1323960 1288107 1303653 1549842 1308834 1403336 1488314 1677816 1784962 1643195 1760451
1058 1760451 1717191 1656868 1636611 2032884 2024818 1912739 1981005 1659103 2103893 1795566 2156769
1047 2156769 2388893 2318712 2121402 2163482 2638829 3021170 3209043 3161283 3338319 3345026
1037 3345026 3612365 3699070 3452160 3651618 3903159 3953516 4528066 4827943 5305366 5826059
1027 5826059 6059032 6253310 6697266 7115769 7929065 8963885 9960415 11236925 12210647
1018 12210647 13039749 13420579 14256298 15443989 16945393 18706182 21117954 23877695 27288457
1009 27288457 32042732 38296624 46309002 58054833 73606459 89941127 94385143 83214176
1001 83214176 63692542 46769471 36639637 29624933 25202611 21138187 18313320 15593093
993 15593093 14125814 12967053 11906058 11261841 11039075 10990143 10734547 10328809 9529714
984 9529714 8551359 7722698 7241905 6923760 6422227 6038196 5780489 5486287 5478314 5250973
974 5250973 5081799 4754984 4367398 4112311 3852126 3485146 3260188 3386054 3358080 3263422
964 3263422 3051164 2766777 2842337 2844238 2755985 2604006 2451956 2549978 2283071 2238689 2125834
953 2125834 2065943 1883514 1858200 2043203 2149681 2149390 2134146 2011528 1747675 1688936 1477458
942 1477458 1634485 1927434 1532973 1496100 1660611 1633780 1632129 1721272 1634344 1486607 1378489
931 1378489 1258292 1206343 1382876 1320871 1163267 1330178 1354648 1322364 1182470 1017242
921 1017242 988587 943133 1052239 892169 846344 934086 939010 1009858 961358 902100 1062274
910 1062274 995983 904932 706891 485013 430260 566389 684238 661202 670702 562043 639852
899 639852 716461 774534 674941 359896 482427 330081 67921 116438 191937 294692 177255
888 177255 408445 523862 633404 797132 688108 719340 371829 100045 312545 750940
878 750940 734752 567468 475335 285873 405858 312793 301485 450204 532236 394549 362654
867 362654 182372 175636 33629 -91778 -51489 50472 24725 154957 168509 103935 -5829
856 -5829 133411 77860 -144132 70454 335128 322340 264361 131927 4787 35733 -128340
845 -128340 -107969 177212 266800 238402 302052 183187 135279 247538 337297 372922 322968
834 322968 308893 396394 373081 339365 355119 355748 261162 499681 385246 413728 431916 371490
822 371490 405815 298535 140793 -49169 102438 109076 259337 84981 193053 -35688
812 -35688 -181133 22339 4779 -127068 -192130 -126328 -138876 -281729 -349350 -239508 -190667
801 -190667 -1804 -80653 241069 242856 132004 64062 -39874 -143704 -40199 136841 298397
790 298397 291552 484842 449058 -42986 -161348 -226368 -130288 -60927 235532 100465 230775
779 230775 117654 -112425 -400195 -197899 -46628 236785 195675 150395 187023 13827
769 13827 -198071 -211695 53113 253181 339148 119079 185988 -223410 -279515 -142561 -304048
758 -304048 -440313 -165677 -208041 -80490 -48456 -159272 -69912 -12244 -358084 -365808 65741
747 65741 -21114 -34079 -45716 49447 -255127 -485597 -356171 -45479 120794 288161 66426
736 66426 -160853 -305796 -170242 -127159 -140846 -54352 -100625 176334 302941 431358 196101
725 196101 261226 -51615 180616 67948 -2072 345104 408587 249938 180414 445612 257159
714 257159 102630 232628 343708 -24067 192467 224141 15564 -164671 -91382 -94702 1568
703 1568 92586 177138 189428 -47095 98405 64351 -64091 -232060 -89855 -168266 -214198
692 -214198 -409258 -416424 -427463 -13342 -189840 -216777 -90286 69180 218319 1403 -219711
681 -219711 -187973 -337676 -344103 -416124 -167536 -114605 -105683 -122424 -345240 -229753 -95456
670 -95456 85980 -65726 -57425 2441 -112853 -172791 -128479 -43278 -158157 -166800 5709
659 5709 99098 198111 -99015 -215329 -279917 -113388 79570 137616 34327 -279496 -240753
648 -240753 -173039 -238911 -201160 -298592 -238164 -246966 -301758 -364021 72420 392015 130878
637 130878 -126801 -49873 -262158 -319971 -251669 -172825 -382483 -298904 -152660 -100131 -21176
626 -21176 -155565 -206022 -441588 -136491 4559 -80450 -208932 -245904 -383640 -382507 -469247
615 -469247 -331837 112534 152201 -1139 -35759 -313837 -420641 -121579 -94389 -545262
605 -545262 -444928 -55897 -73634 105658 -86909 -236694 -449284 -116625 -103667 4810
595 4810 -202866 -422378 -511262 -386781 -97797 -151517 -179835 -40993 -53010 -296324 -328159
584 -328159 -268411 -353920 -266116 -250057 -271554 -350414 -193316 -231011 -271169 -325207 -307025 -251008
572 -251008 -147016 -418973 -480555 -482387 -345170 -264971 -141106 -98862 -212065 -41447 -123761
561 -123761 -43473 -58651 34986 -319320 -433578 -112338 -126419 -265428 -107040 -26997 269623
550 269623 264800 -56801 -206476 -270393 -154976 -235350 -161965 -141079 45370 142956 -18313
539 -18313 38597 -12013 -207910 -268130 -83712 -151548 -95486 -121962 -94083 -227693 -284998
528 -284998 -266902 -107446 -69979 106337 37478 -167856 -422549 -172965 -284992 -445631
518 -445631 -371630 -314170 -153448 -91520 -207634 -353957 -557875 -488652 -308663 -406265 -385837
507 -385837 -457049 -377883 -333861 -207189 -267467 -258032 -217953 -133811 149902 -92505 -27491
496 -27491 -147721 -360512 -463837 -233652 -58416 -217591 -143810 -157213 -266364 -438474
486 -438474 -465154 -138137 -193979 -360151 -284530 -314588 -202646 -308720 -370333 -453758 -160133
475 -160133 43235 -106558 -94212 -156109 -228394 -613096 -645464 -402917 -356263 -94981 30850
464 30850 37164 -99450 -98296 -119754 -321979 -459501 -364438 -295922 -434910 -426636 -239153 -142425
452 -142425 -128658 -222770 -512765 -355118 -254431 -41084 -10454 -52312 -204236 -202140 -472216
441 -472216 -271806 -167324 -285608 -79448 -238387 -26509 -240731 -286857 -338035 -200136
431 -200136 -419219 -418974 -281761 -70093 -326289 -312862 -450322 -483390 -309488 -406456 -369851
420 -369851 -590553 -432420 -346323 -126101 -163124 -228851 -615344 -238040 -68339 -203513
410 -203513 -269290 -207755 -111963 -116318 -118834 -314145 66091 103279 420313 31998 -52026
399 -52026 -87432 86240 -98338 -148125 -271349 -344278 -170188 -323486 -71926 -194485 -113559
388 -113559 -343287 -126160 -285265 -100012 -260015 -321594 -331704 -353155 -445571 -428040 -355502
377 -355502 -251719 -137032 -313419 -59729 -105079 97087 -111111 -237253 -369624 -168640
367 -168640 -210129 -146398 -121995 -190997 -424526 -305084 -235379 -164210 -153768 -434837 -101925
356 -101925 -67374 -177115 60526 159986 -162238 -138753 -143460 -240263 -298371 -93536 126392
345 126392 -15155 -71396 -220668 -204226 -145619 117255 -166844 -245834 -239690 -288717 -456725
334 -456725 -481928 -411132 -335547 -204485 -29373 139447 -262452 -454214 -418419 -271956 -137256
323 -137256 -106666 62795 15007 -233754 -336801 -309523 -329226 -422519 -250675 36475 -95758
312 -95758 -133108 -39228 -52260 -288195 -431278 -360711 -124935 228644 59345 -62792 -199199
301 -199199 -104599 -137984 -59736 -286822 -344180 -332467 -207063 -409017 -442646 -505385 -197041
290 -197041 -166310 -320908 -560726 -373260 -68083 -134775 -141082 -521479 -833801 -680221 -394205
279 -394205 -141527 -29530 -47760 -84738 -127602 20737 -129944 -362333 -404024 -208688 126247
268 126247 39601 -57050 -92289 -176909 -345972 -354239 -328568 -529843 -130593 -67964 -307083
257 -307083 -537464 -572929 -518759 -348062 -190104 -177297 -80590 -127304 -283768 -458592 -431204
246 -431204 -473339 -439160 -392153 -128709 -84951 -217616 -289713 -296663 -528081 -397077 -209392
235 -209392 -221241 -126892 -373082 -200032 -193974 -150887 -246968 -111026 -203307 -49836 -71076
224 -71076 -123621 -3885 -151794 -577131 -588792 -306957 -252852 -347806 -388914 -242483 -369099
213 -369099 -418605 -388376 -212857 -65477 -6304 -259785 -239608 -424857 -624502 -544717 -538936
202 -538936 -431114 -229062 -184448 -216973 -259757 -284552 -405587 -655988 -582016 -422096 -303100
191 -303100 -376244 -292951 -332075 -396046 -218400 -330173 -458607 -359356 -285805 -442563 -423464
180 -423464 -302913 -133731 -266019 -190095 -340663 -397025 -289572 -146446 -75220 -274387
170 -274387 -289036 -338255 -199768 -280796 -233211 -276322 -174534 -447733 -224813 -340878 -415753
159 -415753 -417894 -211649 -380706 -494906 -477346 -490084 -372329 -558798 -488423 -576268 -448080
148 -448080 -432171 -313264 -374703 -209114 -248066 -264742 -196588 -404523 -431384 -520446 -419386
137 -419386 -35518 -182855 -292439 -367656 -438470 -246532 -401713 -386022 -357188 -315013 -379564
126 -379564 -385243 -398514 -443212 -203077 -166409 -256573 -207975 -215993 -523562 -454491 -470476 -543566
114 -543566 -445168 -343142 -351885 -450983 -303909 -449490 -467162 -388131 -172926 -249956 -436877
103 -436877 -596063 -638354 -446711 -456446 -515251 -429254 -143612 -359299 -519508 -600252 -310181
92 -310181 -275492 -236215 -351956 -406153 -479709 -452611 -327846 -295314 -178327 -301639 -389149
81 -389149 -470115 -449398 -567321 -577902 -673980 -433884 -243046 -406984 -339779 -495713 -499912
70 -499912 -409014 -379631 -396403 -446837 -339771 -223870 -414732 -426338 -534907 -262973 -382376
59 -382376 -399637 -356160 -268156 -122674 -264950 -298700 -333166 -331721 -423548 -190238 -460331
48 -460331 -464845 -442666 -327895 -327556 -338317 -557599 -522021 -580714 -561024 -649702 -531893 -348514
36 -348514 -486034 -408419 -394268 -438705 -606480 -542172 -487017 -358045 -604413 -713356 -413775
25 -413775 -383450 -491104 -375929 -316991 -393580 -473255 -383066 -510037 -526221 -490651 -573138
14 -573138 -553340 -555833 -388695 -416448 -365986 -306688 -395529 -396887 -382263 -540371 -592057 -512994
2 -512994 -436637 -351514
0 -351514
$$ Imaginary data points
##PAGE= N=2
##DATA TABLE= (X++(I..I)), XYDATA
16383 -5029183 -4988725 -4934169 -4956226 -4736293 -4488080 -4654639 -4629386 -4534044 -4285985 -4082331
16373 -4082331 -4104442 -4001123 -4082493 -4002174 -3807237 -3706923 -3685621 -3651731 -3505501 -3165526
16363 -3165526 -2986574 -3126798 -3054149 -2971900 -2845916 -2914179 -3049173 -2905981 -2850475 -2781148
16353 -2781148 -2550149 -2483316 -2398475 -2198504 -1989373 -2031181 -2021619 -1994721 -1937997 -1748292 -1841352
16342 -1841352 -1841711 -1673004 -1436459 -1611603 -1704447 -1585923 -1455589 -1155208 -1219278 -1270033
16332 -1270033 -1261703 -1157880 -1042724 -1050247 -838572 -754346 -604581 -402799 -398679 -428948 -390101
16321 -390101 -206724 -315794 -308942 -260407 27346 228885 34194 192359 241711 320251
16311 320251 311506 422949 542514 675719 705043 570750 634438 623190 621659 853074 879526
16300 879526 1035645 1323463 1360626 1391339 1340633 1269489 1379170 1539395 1575498 1956849
16290 1956849 2148752 2140177 2032368 1971878 1943570 2193507 1972559 1965045 2301828 2283818 2209283
16279 2209283 2172495 2182391 2381317 2401540 2416338 2588235 2668885 2742931 2531832 2437276 2579745
16268 2579745 2655705 2703965 2831687 2974632 2827184 2891864 2835867 3067777 3006461 2868218
16258 2868218 3151692 3020076 3226474 3409315 3544549 3545641 3661876 3643178 3554099 3641690
16248 3641690 3706943 3591155 3733443 3903319 3999628 3984820 4349727 4359105 4154871 4003481
16238 4003481 4092410 4358489 4142318 4268444 4582499 4640039 4501721 4317746 4426630 4468346
16228 4468346 4446529 4652091 4780865 4486095 4484098 4747316 4893157 4800071 4662047 4488911
16218 4488911 4656641 4891992 4774728 4812776 4827878 4905464 5063229 5316125 5222133 4866231
16208 4866231 4747431 5185143 5082544 5107473 5141274 5196204 5532369 5445669 5245491 5439548
16198 5439548 5784294 5527770 5290121 5251805 5414394 5603481 5626070 5746370 5782030 6015914
16188 6015914 6128609 6006275 5824327 5588789 5627293 5688372 5727869 5821014 6050045 6308589
16178 6308589 6258003 6088997 5965772 6026834 6247114 6182451 6016102 5861320 5714297 5820750
16168 5820750 6190074 6241925 6291657 6227909 5964002 6018043 5901345 5745469 5848481 5875654
16158 5875654 5829863 6181493 6238449 6278189 6535389 6391296 6175200 6052200 6283840 6274583
16148 6274583 6358639 6425244 6296311 6085354 6392368 6365659 6507017 6725019 6911465 6710235
16138 6710235 6440278 6420160 6582351 6741943 6669025 6556388 6567642 7086972 7179976 7064039
16128 7064039 6822864 6965875 6806215 6585273 6651739 6922996 6844958 6811199 6751922 6849898
16118 6849898 6900353 6767364 6937596 6987719 6514310 6233126 6428545 6661123 6780639 6693737
16108 6693737 6670079 6613217 6473039 6620411 6946289 6945671 6617402 6556574 6842032 6985792
16098 6985792 6732260 6658513 6780624 6875512 6608487 6808358 6977824 7235862 7060160 6779065
16088 6779065 6848381 7053434 7020224 6813956 6721407 6799248 6935701 7048547 7113182 7265378
16078 7265378 7339469 7229835 7337201 7138768 7198402 7073679 7235171 7070857 7215345 7240773
16068 7240773 7419573 7356836 7302926 7237539 7091280 6939092 6897302 7012032 7187748 6925352
16058 6925352 6735741 6917833 7021332 7112856 6905563 7205581 6927576 6777047 6458526 6504051
16048 6504051 6679214 6619118 6875474 7127906 7266845 7348457 7195329 7019799 6869560 6915570
16038 6915570 6837207 6899685 7197449 7179024 7426504 7328240 7233278 7053934 7108052 7509079
16028 7509079 7407726 7330496 7039052 7100928 7289376 7165978 7156658 7291734 7307311 7266519
16018 7266519 7305883 7352613 7114325 6990584 7169691 7030384 7070584 7237816 7144831 7030785
16008 7030785 7291912 7309635 6944592 7052449 7115200 6998176 7147962 7059072 7129781 7121518
15998 7121518 7168133 6986220 7099823 7111807 6962442 7045849 7114428 7105676 7027634 6998640 6862483
15987 6862483 6771990 6890488 7016812 6855755 6966974 7070003 7087264 7038548 7143111 6971310
15977 6971310 7139983 7093696 7009604 7039586 7041126 7057983 7044203 7316671 7236920 7379430 7374661
15966 7374661 7423457 7284240 7137628 7054649 7121551 7112594 7286349 6999357 7126684 7470666
15956 7470666 7282934 7242870 7035864 7014618 6952353 6920296 7031071 7135122 7330454 7303516
15946 7303516 7248651 7241676 7230634 7170773 7154020 7313011 7027541 7043678 7164771 7023889 7075871
15935 7075871 7384986 7608712 7331545 7298872 7202577 7239967 7198277 7048078 7087355 6931885
15925 6931885 7108468 7104905 7134319 7386186 7345358 7275058 7169374 7356863 7221199 7241496
15915 7241496 7303428 7323912 7568645 7582736 7433249 7509863 7346123 7383450 7479292 7355800
15905 7355800 7384611 7338076 7338384 7505811 7429500 7152459 7183260 7226457 7341654 7462820 7468156
15894 7468156 7345223 7233920 6884796 7091240 7312664 7194898 7261981 7285625 7172633 7156805
15884 7156805 7033952 7044250 6947328 7011173 6885191 6967325 6979543 7312083 7243574 7297859 7286922
15873 7286922 7240127 7440775 7664447 7505119 7488001 7570209 7413876 7188696 7217922 7214432
15863 7214432 7340660 7224310 7013259 7285016 7310281 7363304 7074077 7154677 6976509 7112359
15853 7112359 7038243 7204416 7227550 6941139 6956847 7094504 7111275 7119169 7465938 7246668
15843 7246668 7092074 6986865 7109034 7053896 7007750 7033471 7062866 7059597 7316519 7180853
15833 7180853 7398204 7491269 7387768 7275235 7297490 7275360 7352386 7415044 7116389 7537219
15823 7537219 7443051 7489428 7366936 7197377 7041050 7113495 6989106 7161163 7215313 7442156
15813 7442156 7248091 7177669 7343925 7406800 7471701 7435702 7414494 6989358 6941920 6957017 7088361
15802 7088361 7049142 7107682 7218934 7471219 7388281 7335431 7452658 7332145 7223825 7167024
15792 7167024 7112066 7274881 7716682 7641412 7666348 7450996 7338668 7358295 7500785 7588254
15782 7588254 7625808 7257386 7310063 7100050 7044305 7140918 7353343 7667527 7648951 7574393
15772 7574393 7455248 7413827 7141033 7249595 7294279 7320941 6958686 7304370 7473962 7319438
15762 7319438 7087441 7203664 7374132 7199966 7096804 7197444 7351062 7251952 7325176 7071547
15752 7071547 7334405 7255601 7223830 7296289 7473440 7126690 7236927 7382828 7470057 7410585
15742 7410585 7159152 7250000 7351335 7291165 7232618 7611479 7647111 7588384 7423896 7557998
15732 7557998 7492189 7468575 7491187 7322790 7226568 7347248 7399402 7352633 7341100 7355638 7211334
15721 7211334 7531274 7606049 7376042 7102164 7346277 7276109 7093765 7209330 7367834 7289291
15711 7289291 7303060 7360373 7447023 7057188 6983556 7084730 7071881 7273832 7119933 7235567
15701 7235567 7268687 7350660 7219005 7264878 7218541 7219584 7078046 7042993 7064066 7211239 7196580
15690 7196580 7461786 7470908 7391647 7310217 7368501 7656391 7395242 7384586 7463774 7451375 7214700
15679 7214700 7384262 7519252 7375442 7497967 7464263 7575513 7750665 7504778 7371434 7533005
15669 7533005 7622274 7559845 7479474 7410390 7670890 7669075 7349281 7244655 7330014 7247150 7428964
15658 7428964 7700564 7718237 7387482 7208370 7204268 7246675 7231388 7319324 7248116 7226636 7482692
15647 7482692 7420080 7115759 7138737 7164347 7182335 7354029 7351720 7403553 7581193 7691382 7516568
15636 7516568 7338479 7230644 7251960 7397591 7350248 7452468 7505487 7443422 7554436 7260785
15626 7260785 7410387 7515665 7537014 7722330 7627087 7688542 7499537 7649030 7513706 7421341
15616 7421341 7555580 7644685 7555130 7689919 7469959 7372893 7469041 7458381 7230311 7164173
15606 7164173 7250440 7363876 7502159 7350779 7423101 7266597 7408375 7511860 7473012 7600719
15596 7600719 7311101 7202821 7311939 7252408 7137129 7240712 7617465 7535181 7540402 7418411
15586 7418411 7683566 7504040 7520150 7336350 7432902 7526084 7545552 7420390 7647297 7607380
15576 7607380 7357745 7392923 7763828 7754542 7568505 7595612 7356468 7091332 7238058 7545400
15566 7545400 7506813 7517765 7365181 7427090 7435889 7357333 7390704 7406226 7364848 7455370 7490925
15555 7490925 7563369 7716973 7648167 7448701 7518514 7438236 7641628 7622424 7288890 7261766
15545 7261766 7289462 7242823 7584430 7576904 7514621 7493446 7599711 7332800 7314492 7517676 7771504
15534 7771504 7683573 7311183 7220310 7356797 7516409 7186166 7378423 7507793 7710125 7382061
15524 7382061 7468329 7288752 7267542 7340168 7212177 7211942 7412726 7587242 7587408 7612189 7550209
15513 7550209 7415225 7448791 7579806 7391706 7487308 7487036 7482971 7341060 7504958 7793768 7383321
15502 7383321 7228300 7336036 7397725 7457851 7500287 7460653 7477373 7665566 7245510 7160158
15492 7160158 7215928 7570691 7618077 7770816 7498831 7590306 7575442 7449814 7297474 6963225
15482 6963225 7053617 7316535 7577062 7744687 7565295 7454619 7385778 7213128 7327752 7405352
15472 7405352 7616199 7451396 7556253 7414585 7593418 7456178 7343779 7619690 7628459 7771874
15462 7771874 7663533 7638604 7605518 7698947 7560755 7440637 7705807 7670340 7648604 7781025
15452 7781025 7789215 7787770 7619177 7562077 7509367 7540545 7449546 7514269 7602204 7384637 7471437
15441 7471437 7453739 7491938 7549913 7479040 7509964 7498691 7489384 7355246 7613325 7452338 7496432
15430 7496432 7319031 7503459 7723146 7501758 7553015 7505955 7536820 7365188 7285278 7440246
15420 7440246 7716627 7751892 7849850 7697914 7761043 7710549 7800261 7627991 7644105 7753969
15410 7753969 7813487 7696154 7540197 7371233 7536626 7729352 7856790 7918431 7986180 8051013
15400 8051013 7908185 7801960 7717602 7623684 7380786 7466952 7658531 7817951 7717473 7549479
15390 7549479 7482687 7464289 7575612 7468716 7601864 7576421 7345303 7512640 7537503 7422660
15380 7422660 7430362 7539837 7707120 7638288 7414632 7534798 7555542 7509592 7472577 7610245
15370 7610245 7440829 7517927 7791593 7880164 7829293 7778429 7625170 7575356 7528580 7550911 7526905
15359 7526905 7472482 7503472 7554929 7800108 7712830 7777893 7778320 7809417 7562403 7653875 7693349
15348 7693349 7791106 7922646 7827090 7494381 7480037 7530008 7575849 7591067 7685955 7920187 7755758
15337 7755758 7888638 7560510 7458461 7473162 7584756 7568176 7559600 7800870 7696169 7609296
15327 7609296 7629664 7610464 7792299 7603158 7775450 7678708 7614328 7570710 7530297 7754962
15317 7754962 7692631 7684888 7543029 7833836 7874020 7621842 7817524 7873712 7791058 7841177 7915254
15306 7915254 7828559 7454859 7745348 7789011 7933081 7898065 7742401 7871979 7699355 7705215
15296 7705215 7625084 7683435 7987228 7958926 7766902 7982839 7910379 7828109 7703001 7537123
15286 7537123 7666721 7745433 7824553 7758249 7804708 7776942 7469156 7467967 7596405 7352396 7489349
15275 7489349 7691610 7637953 7390407 7403745 7452401 7832847 7931787 7623092 7646018 7580177
15265 7580177 7469539 7437055 7636673 7463062 7520045 7457681 7731343 7724551 7636000 7797073
15255 7797073 7794573 7616826 7506466 7622634 7764136 7729391 7454716 7579830 7788936 7845485
15245 7845485 7408550 7700407 7618658 7674751 7544333 7905480 7839086 7644458 7678871 7548861
15235 7548861 7656845 7693168 7892018 7785771 7887823 7901697 7840273 7856350 8000874 7703504
15225 7703504 7832531 7735319 7786282 7552118 7547460 7677546 7773201 7575929 7559606 7695872
15215 7695872 8064734 8123198 7945310 7957512 7769096 7649019 7589050 7857481 7721987 7860146
15205 7860146 7683324 7474811 7720311 7519399 7436379 7373046 7430871 7623315 7837931 7985026
15195 7985026 7830114 7797837 7746918 7685793 7696158 7698434 7897824 7932965 7875675 7928018 7712797
15184 7712797 7784798 7811611 7740143 7758916 7852190 7758257 7855713 8046499 7886310 7912591 7695569
15173 7695569 7758822 7881565 8161139 8074727 8026698 7947755 7778858 7733914 7465268 7569646
15163 7569646 7695323 7862458 7935751 7702068 7771849 8010454 7922747 7856850 7806634 7748665
15153 7748665 7623835 7842501 7791491 7665285 7690068 7776911 7928262 7860881 7735661 7836504
15143 7836504 7978056 7892081 7793522 7798374 7486825 7670800 7594339 7869252 7921863 7758978
15133 7758978 8070860 8120054 8051439 7959314 7947388 7821108 7965143 7994471 8015119 7893775
15123 7893775 7798907 8018705 7865288 8062403 8194011 8158589 8225342 8016041 7805446 7446683
15113 7446683 7420767 7543047 7808649 7907295 7769029 7986131 7968857 7927668 7766134 7810810
15103 7810810 7864988 7921025 8020341 8022444 8089186 7777431 7766040 7688145 7704854 7996076 8213089
15092 8213089 8235237 8190574 7811670 7824833 7851910 7674279 7700401 7781846 7976103 7994688 7983462
15081 7983462 7950466 8108956 7858034 7806887 7765154 7980084 7982702 7883954 7913271 7819475 7713762
15070 7713762 7618388 7777866 7722510 7740320 7651535 7701242 7745513 7707285 7661655 7819467 7767291
15059 7767291 7672267 7631458 7730337 7643200 7788796 7637699 7693007 7687126 7810550 7893267 8027646
15048 8027646 8242629 8125577 8062703 7982162 8139487 8072201 7994228 8085963 8189392 8051739
15038 8051739 8060771 7785941 7936717 7849115 7898300 8093499 7981952 7947101 7911039 7714641
15028 7714641 7742852 7853416 7756233 7769300 7615100 7808999 7777954 7741053 7777260 7634261
15018 7634261 7513905 7782096 8034439 8241902 8162377 8059741 7816328 7874367 8074441 8081205
15008 8081205 8238840 8138292 8019531 7889456 7780941 7740369 7778501 7696773 7841452 7889217
14998 7889217 7870731 8054062 7928035 7727240 7827216 7821971 8018056 8109597 7928289 8142151
14988 8142151 8230858 8174169 7971235 7823731 7736364 7751612 7832319 7745784 8041142 7932038
14978 7932038 7805059 7559967 7549115 7733873 7719120 7816698 8108296 8134508 8056578 7911556
14968 7911556 7700445 7706605 7811230 7950209 7848452 8091665 8253644 8387996 8220283 7960221
14958 7960221 8058826 8288902 8358113 8067038 7944020 7953145 8118808 7996972 7903035 8088571
14948 8088571 8282951 8098024 7964770 7993260 8140260 8128287 8205221 7953204 7809456 7949277
14938 7949277 8240157 8380350 8322831 8119486 8019308 7957460 7739177 7653503 7968122 7973598
14928 7973598 7817278 8032939 8225088 8268641 8017909 8065650 8197529 8358883 8069339 8076048
14918 8076048 8244724 8205232 8051881 7705367 7773466 8149656 8085826 8256800 8360543 8148586
14908 8148586 7847939 7862632 7967093 7975824 7638099 7796754 7964723 8114670 7973132 8047890
14898 8047890 8174348 8088758 7946611 7896042 8169869 8063496 8088783 7839117 7796727 7839053
14888 7839053 8056483 8180028 8268754 8452710 8352801 8059095 7877785 7899025 8029820 8127115
14878 8127115 8129624 8188907 8232990 8324765 8219087 8284014 8126549 7940358 8044970 8157965
14868 8157965 8171520 8221289 7971508 7857260 7960585 8055892 8351671 8289843 8192941 8148974
14858 8148974 8096487 8106554 8093070 7926145 7819715 7848849 7817309 7971794 7906458 7951411 7927912
14847 7927912 7828465 7993624 8202476 8085431 7990446 7968944 8034599 8037027 8141486 8056420 7975952
14836 7975952 8243958 8429555 8351814 8073778 8086653 7993415 8109222 7919826 7738554 7856005
14826 7856005 8179674 8117949 8249725 8095889 8087201 7953907 7953632 7775077 7813844 7737499 7932122
14815 7932122 7908618 8056935 8200137 8121469 8280279 8227764 8203467 8239387 8440422 8152721
14805 8152721 7989607 8004352 8280738 8208509 8129016 8041963 8344364 8391311 8166407 7858403
14795 7858403 8092134 8206554 8142612 8138625 8144120 8450987 8248740 8366988 8065471 8034357
14785 8034357 8003500 7908252 8178702 8083476 8053601 7835443 7982721 8182180 8125204 8201673
14775 8201673 8262999 8390463 8318320 8201512 8140962 7917384 7912349 8177111 8347125 8080798
14765 8080798 8057400 8102718 8482411 8330499 8093822 8195965 8363033 8515481 8486306 8373357
14755 8373357 8222680 7993933 8238618 8402360 8212876 8263852 8199197 8303283 8196481 8242397
14745 8242397 8193898 8230931 7997037 7989681 7975478 8110534 8293549 8418276 8331343 8395928 8276762
14734 8276762 8025868 8094822 8194622 8419253 8270451 8307429 8098427 8332926 8256244 7921950
14724 7921950 7958212 8256397 8116647 8153045 7958686 7913699 7713188 7782518 8012187 7971830
14714 7971830 8302060 8285619 8493126 8352496 8391047 8176203 8032143 8284161 8350064 8405470
14704 8405470 8518356 8352492 8301646 8372347 8394384 8307738 8246284 8382091 8604943 8616649
14694 8616649 8313394 8164168 8076649 8421730 8292910 8183428 8286071 8289757 8291189 8311924
14684 8311924 8258564 8019445 7936417 8237371 8328571 8230630 8322911 8201561 8191699 8014401 7873364
14673 7873364 7841605 8076744 8146613 8371313 8446307 8298988 8155516 8189980 8190143 8043532 8068859
$$ [...]
##END NTUPLES=NMR SPECTRUM
##END=
