##TITLE=1H_TG-2413
 200.13Hz, DMSO
 8 sc
3.8.2026
##JCAMPDX= 6.0         $$ Bruker NMR JCAMP-DX V2.0
##DATA TYPE= NMR SPECTRUM
##DATA CLASS= NTUPLES
##ORIGIN= UXNMR, Bruker Analytische Messtechnik GmbH
##OWNER= pz
$$ XWIN-NMR		Version 3.5
$$ Tue Aug  4 13:08:36 2026 Russian Standard Time (UT+4h)  she@DPX200
##.OBSERVE FREQUENCY= 200.1313
##.OBSERVE NUCLEUS= ^1H
##.ACQUISITION MODE= SIMULTANEOUS
##.ACQUISITION SCHEME= undefined
##.AVERAGES= 8
##.DIGITISER RES= 18
##SPECTROMETER/DATA SYSTEM= spect
##.PULSE SEQUENCE= zg30
##.SOLVENT NAME= DMSO
##.SHIFT REFERENCE= (INTERNAL, DMSO, 0, 15.5001)
##AUDIT TRAIL= $$ (NUMBER, WHEN, WHO, WHERE, WHAT)
$$ ##TITLE= Audit trail, XWIN-NMR		Version 3.5
$$ ##JCAMPDX= 5.01
$$ ##ORIGIN= Bruker BioSpin GmbH
$$ ##OWNER= she
$$ F:/spectra/data/she/nmr/H-C/1/pdata/1/auditp.txt
$$ ##AUDIT TRAIL=  $$ (NUMBER, WHEN, WHO, WHERE, WHAT)
(   1,<2026-08-04 13:07:21.06 +0400>,<she>,<DPX200>,
      <created by zg, POWCHK disabled, PULCHK disabled
       configuration hash MD5:
       00 E9 B6 7A A2 85 ED C7 34 08 36 98 17 FE 4E 26
       data hash MD5: 16K
       4A 1D 66 EA A5 87 6C 15 BE 96 EB 43 E0 BA C2 9C>)
(   2,<2026-08-04 13:07:23.39 +0400>,<she>,<DPX200>,
      <Start of raw data processing
       efp BC_mod = 2 LB = 0.25 FT_mod = 6 PKNL = 1 PHC0 = -4220.53 PHC1 = 11.9923 SI = 16K 
       data hash MD5: 16K
       B3 7C 27 BA D1 DA A5 94 D7 CC EA E9 BD FA C2 E7>)
(   3,<2026-08-04 13:07:44.95 +0400>,<she>,<DPX200>,
      <pk PHC0 = 3.582035 PHC1 = -3.6 
       data hash MD5: 16K
       F2 92 43 12 90 3D 4C F7 37 96 90 B6 F4 E6 29 63>)
(   4,<2026-08-04 13:07:50.64 +0400>,<she>,<DPX200>,
      <abs ABSG = 5 
       data hash MD5: 16K
       3B 95 5F 7C 7A F6 63 06 A3 A5 85 D2 D0 0E B6 03>)
$$ ##END=
$$ 
$$ hash MD5
$$ 34 15 29 FC 0B 83 6B 89 68 1D CA DA 6A C8 05 89
##$RELAX= 
##$RELAX= 
##$RELAX= 
##$RELAX= 
##$RELAX= 
##$RELAX= 
$$ Bruker specific parameters
$$ --------------------------
##$DU= <F:/spectra>
##$EXPNO= 1
##$NAME= <H-C>
##$PROCNO= 1
##$TYPE= <nmr>
##$USER= <she>
##$AMP= (0..31)
100 100 100 100 100 100 100 100 100 100 100 100 100 100 100 100 100 100 
100 100 100 100 100 100 100 100 100 100 100 100 100 100 
##$AQSEQ= 0
##$AQ_mod= 1
##$AUNM= <au_zg>
##$AUTOPOS= <>
##$BF1= 200.13
##$BF2= 200.13
##$BF3= 200.13
##$BF4= 200.13
##$BF5= 200.13
##$BF6= 200.13
##$BF7= 200.13
##$BF8= 200.13
##$BYTORDA= 1
##$CFDGTYP= 0
##$CFRGTYP= 5
##$CHEMSTR= <none>
##$CNST= (0..31)
1 1 145 1 1 1 1 1 1 1 1 1 1 1 1 1 1 1 1 1 1 1 1 1 1 1 1 1 1 1 1 1 
##$CPDPRG= <>
##$CPDPRG1= <>
##$CPDPRG2= <>
##$CPDPRG3= <>
##$CPDPRG4= <mlev>
##$CPDPRG5= <mlev>
##$CPDPRG6= <mlev>
##$CPDPRG7= <mlev>
##$CPDPRG8= <mlev>
##$CPDPRGB= <>
##$CPDPRGT= <>
##$D= (0..31)
0 0.7 0 0 0 0 0 0 0 0 0 0.03 0 0 0 0 0 0 0 0 0 0 0 0 0 0 0 0 0 0 0 0 
##$DATE= 1785834440
##$DBL= (0..7)
120 120 120 120 120 120 120 120 
##$DBP= (0..7)
150 150 150 150 150 150 150 150 
##$DBP07= 0
##$DBPNAM0= <>
##$DBPNAM1= <>
##$DBPNAM2= <>
##$DBPNAM3= <>
##$DBPNAM4= <>
##$DBPNAM5= <>
$$ [...]
##$SUBNAM3= <"">
##$SUBNAM4= <"">
##$SUBNAM5= <"">
##$SUBNAM6= <"">
##$SUBNAM7= <"">
##$SUBNAM8= <"">
##$SUBNAM9= <"">
##$SW= 18.0517328524113
##$SWIBOX= (0..15)
0 0 2 0 0 0 0 0 0 0 0 0 0 0 0 0 
##$SW_h= 3612.71676300578
##$TD= 16384
##$TD0= 1
##$TE= 0
##$TE2= 300
##$TE3= 300
##$TEG= 300
##$TL= (0..7)
0 120 120 120 120 120 120 120 
##$TP= (0..7)
150 150 150 150 150 150 150 150 
##$TP07= 0
##$TPNAME0= <>
##$TPNAME1= <>
##$TPNAME2= <>
##$TPNAME3= <>
##$TPNAME4= <>
##$TPNAME5= <>
##$TPNAME6= <>
##$TPNAME7= <>
##$TPOAL= (0..7)
0.5 0.5 0.5 0.5 0.5 0.5 0.5 0.5 
##$TPOFFS= (0..7)
0 0 0 0 0 0 0 0 
##$TUNHIN= 0
##$TUNHOUT= 0
##$TUNXOUT= 0
##$USERA1= <user>
##$USERA2= <user>
##$USERA3= <user>
##$USERA4= <user>
##$USERA5= <user>
##$V9= 5
##$VALIST= <valist>
##$VCLIST= <CCCCCCCCCCCCCCC>
##$VD= 0
##$VDLIST= <DDDDDDDDDDDDDDD>
##$VPLIST= <PPPPPPPPPPPPPPP>
##$VTLIST= <TTTTTTTTTTTTTTT>
##$WBST= 1024
##$WBSW= 4
##$XGAIN= (0..3)
0 0 0 0 
##$XL= 0
##$YL= 0
##$YMAX_a= 594797
##$YMIN_a= -599615
##$ZGOPTNS= <>
##$ZL1= 120
##$ZL2= 120
##$ZL3= 120
##$ZL4= 120
##$ABSF1= 15.48907
##$ABSF2= -2.562779
##$ABSG= 5
##$ABSL= 3
##$ALPHA= 0
##$AQORDER= 0
##$ASSFAC= 0
##$ASSFACI= 0
##$ASSFACX= 0
##$ASSWID= 0
##$AUNMP= <proc_1d>
##$AZFE= 0.1
##$AZFW= 0.1
##$BCFW= 0
##$BC_mod= 2
##$BYTORDP= 0
##$COROFFS= 0
##$CY= -3
##$DATMOD= 1
##$DC= 0
##$DFILT= <>
##$DTYPP= 0
##$F1P= 0
##$F2P= 0
##$FCOR= 1
##$FTSIZE= 16384
##$FT_mod= 6
##$GAMMA= 0
##$GB= 0
##$INTBC= 1
##$INTSCL= 3.241238e-09
##$ISEN= 128
##$LB= 0.25
##$LEV0= 0
##$LPBIN= 0
##$MAXI= 10000
##$MC2= 0
##$MEAN= 0
##$ME_mod= 0
##$MI= 1.114404
##$NCOEF= 0
##$NC_proc= -6
##$NLEV= 6
##$NOISF1= 3.799351
##$NOISF2= 2.8
##$NSP= 0
##$NTH_PI= 0
##$NZP= 0
##$OFFSET= 15.50009
##$PC= 1
##$PHC0= -4216.948
##$PHC1= 8.3923
##$PH_mod= 1
##$PKNL= yes
##$PPARMOD= 0
##$PSCAL= 0
##$PSIGN= 0
##$REVERSE= no
##$SF= 200.130004325595
##$SI= 16384
##$SIGF1= 3
##$SIGF2= 2
##$SINO= 0.751879
##$SIOLD= 32768
##$SREGLST= <19F.Aceton>
##$SSB= 0
##$STSI= 16384
##$STSR= 0
##$SW_p= 3612.71676300578
##$SYMM= 0
##$S_DEV= 0
##$TDeff= 16384
##$TDoff= 0
##$TI= <>
##$TILT= no
##$TM1= 0
##$TM2= 0
##$TOPLEV= 0
##$USERP1= <user>
##$USERP2= <user>
##$USERP3= <user>
##$USERP4= <user>
##$USERP5= <user>
##$WDW= 1
##$XDIM= 16384
##$YMAX_p= 521471502
##$YMIN_p= -1004959
$$ End of Bruker specific parameters
$$ ---------------------------------
##NTUPLES= NMR SPECTRUM
##VAR_NAME=  FREQUENCY,     SPECTRUM/REAL,   SPECTRUM/IMAG
##SYMBOL=    X,             R,               I
##VAR_TYPE=  INDEPENDENT,   DEPENDENT,       DEPENDENT
##VAR_FORM=  AFFN,          ASDF,            ASDF
##VAR_DIM=   16384,         16384,           16384
##UNITS=     HZ,            ARBITRARY UNITS, ARBITRARY UNITS
##FACTOR=    0.220516191357247, 1,           1
##FIRST=     3102.03300777816, 0,            0
##LAST=      -510.683755227622, 0,           0
##MIN=       -510.683755227622, -1004959,    0
##MAX=       3102.03300777816, 521471502,    0
$$ Real data points
##PAGE= N=1
##DATA TABLE= (X++(R..R)), XYDATA
$$ [...]
5832D6419772n754367n548135n271139m580017l732422k762146k014392j435383
$$ 46419772 40665405 35117270 29846131 25266114 21533692 18771546 16757154 15321771
5824A5321771r93499q59435q00653m83794m01463m95480m44883l79578r5810k9375
$$ 15321771 14328272 13468837 12668184 12184390 11782927 11287447 10842564 10462986 10367176 10337801
5814A0337801j66924j64153q8832R0338O3591r106J51645J93376L04319L35148
$$ 10337801 10170877 10006724 9917892 10008230 10071821 10062715 10214360 10407736 10712055 11047203
5804A1047203M00255M39116N62413P33105R78657J207645J608343K055421K263455
$$ 11047203 11447458 11886574 12448987 13182092 14160749 15368394 16976737 19032158 21295613
5795B1295613K699828L222470L168357K885340K007642J850719K327670K904029
$$ 21295613 23995441 27217911 30386268 33271608 35279250 37129969 39457639 42361668
5787D2361668M582335O661245Q288920Q697322O159264K329559q91867k839333
$$ 42361668 46944003 53605248 61894168 70591490 76750754 79080313 78188446 75349113
5779G5349113m864566o111594o741963p150409o764855o188626n445978m379270
$$ 75349113 70484547 64372953 57630990 50480581 43715726 37527100 32081122 27701852
5771B7701852l339860k616066j893813j432166j000749p21696n46843m91946m285
$$ 27701852 24361992 21745926 19852113 18419947 17419198 16697502 16150659 15658713 15654428
5762A5654428L39063P43688J463337L426047N413904O734896N936914L087104
$$ 15654428 15993491 16737179 18200516 21626563 27040467 33775363 39712277 42799381
5754D2799381p6173j156547k207564l589401l440475l513515l659350l557661
$$ 42799381 42723208 41566661 39359097 35769696 32329221 28815706 25156356 21598695
5746B1598695l167918k557024j996364j267459r21120p18005m25395m45681m17515
$$ 21598695 18430777 15873753 13877389 12609930 11688810 10970805 10545410 10099729 9682214
5737I682214l13996l93988l13546k41105n261r8626k15289j05960j97197j9283
$$ 9682214 9368218 8974230 8660684 8419579 8414318 8315692 8100403 7994443 7797246 7777963
5727G777963r7232j34467M8054O971n8307q7088J06953K3958j5515J2985R2388
$$ 7777963 7680731 7546264 7594318 7601289 7542982 7455894 7562847 7586805 7571290 7584275 7676663
5716G676663j5952j01598p9614l0249N5524M3484J34131Q4262J42433J4248k1562
$$ 7676663 7660711 7559113 7479499 7449250 7504774 7548258 7682389 7766651 7909084 7923332 7901770
5705G901770J30032K45960K59378K35651K20599K00375J34502J67071J79380L18990
$$ 7901770 8031802 8277762 8537140 8772791 8993390 9193765 9328267 9495338 9674718 9993708
5695I993708M14884N16405L49422L49472O13295N20072N41287N73922P68422J095728
$$ 9993708 10408592 10924997 11274419 11623891 12237186 12757258 13298545 13872467 14640889 15736617
5685A5736617J201826J178124J416664J793938K236280K706181L256403L595772
$$ 15736617 16938443 18116567 19533231 21327169 23563449 26269630 29526033 33121805
5677C3121805L949949L916426L939049M575796O512011R982122J6557137K3171299
$$ 33121805 37071754 40988180 44927229 49503025 56015036 65997158 82554295 105725594
5669A05725594K6974699K3200314J2358677J902163m444428r666873j4660232
$$ 105725594 132700293 155900607 168259284 170161447 165717019 156050146 141389914
5662A41389914j6016754j6804515j6655621j5684586j4124486j1614742q739346
$$ 141389914 125373160 108568645 91913024 76228438 62103952 50489210 41749864
5655D1749864o193136m440498l667075k756561k173887j839549j624380j336681
$$ 41749864 35556728 31116230 27449155 24692594 22518707 20679158 19054778 17718097
5647A7718097j260135j010291q47221o55334o43684n46844m80583n39270m98923
$$ 17718097 16457962 15447671 14600450 13945116 13301432 12754588 12274005 11734735 11235812
5638A1235812k98074k97283j51352l36494k16964k41026j43250j65797k03842
$$ 11235812 10937738 10640455 10489103 10152609 9935645 9694619 9551369 9385572 9181730
5629I181730l25655j69747j828p8266n6356k19551j27196j49475Q005k4025j63559
$$ 9181730 8856075 8686328 8684500 8606234 8549878 8330327 8203131 8053656 8061661 8037636 7874077
5618G874077k28317j72913n9527j27531j55665Q1860r6523o8657m3588o6972p5167
$$ 7874077 7645760 7472847 7413320 7285789 7130124 7211984 7115461 7046804 7003216 6936244 6861077
5607F861077m0356k39051j88212j18609j226l6087j61794j14831m3936q5386P2348
$$ 6861077 6820721 6581670 6393458 6274849 6273623 6237536 6075742 5960911 5916975 5831589 5903937
5596E903937p135J2937k0650q3660m2562q3443K7144k0066j44380j292j15954
$$ 5903937 5896802 5909739 5889089 5805429 5762867 5679424 5706568 5686502 5542122 5540830 5424876
5585E424876r4267K3985n4308o6474M5635l3754l7365j04348N5187Q9462J25863
$$ 5424876 5330609 5354594 5300286 5233812 5279447 5245693 5208328 5103980 5159167 5248629 5374492
5574E374492o5933j44001p1901j6206J45160L5589J14745L9731J26770J07182
$$ 5374492 5308559 5164558 5092657 5076451 5221611 5257200 5371945 5411676 5538446 5645628
5564E645628k45227L918J19853k2609M17k8175K9886Q7567J24151J02468M1793
$$ 5645628 5400401 5404319 5524172 5501563 5501980 5473805 5503691 5591258 5715409 5817877 5859670
5553E859670R1488J5351L8281L29612J92284J51562J12271J64458K60131L90115
$$ 5859670 5951158 5966509 6004790 6334402 6526686 6678248 6790519 6954977 7215108 7605223
5543G605223M78215O04294O28750P44948J078223J007475J248088R91083O05929
$$ 7605223 8083438 8687732 9316482 10061430 11139653 12147128 13395216 14386299 14992228
5534A4992228M27493J41668n7274j27448J09209K40542K97616L28153K68158J9402
$$ 14992228 15419721 15561389 15504115 15376667 15485876 15726418 16024034 16352187 16620345 16639747
5524A6639747k43687n33302n46402o31807p99330q43747q74080r50397p60406
$$ 16639747 16396060 15862758 15316356 14684549 13885219 13041472 12167392 11216995 10456589
5515A0456589p89985o44230n44071n01764j26607l11834k48743k39595j59288
$$ 10456589 9666604 9022374 8478303 7976539 7849932 7538098 7289355 7049760 6890472
5506F890472k47573q5342N2382J40837j23580r9585l094p7295Q0908j15597j37558
$$ 6890472 6642899 6557557 6609939 6750776 6627196 6527611 6524517 6447222 6528130 6412533 6274975
5495F274975q5592M434n5185j106j22698J2026K9642K4266j0836J04610j08743
$$ 6274975 6189383 6193817 6138632 6137526 6014828 6026854 6056496 6080762 6069926 6174536 6065793
5484F065793m0804J09651j17622j20141K4068m0544j24978O3163j5699j85063
$$ 6065793 6024989 6134640 6017018 5896877 5920945 5880401 5755423 5818586 5802887 5617824
5474E617824o2132J83928J8814N5174J60236k8261L0909l998P4940j23135j7318
$$ 5617824 5555692 5739620 5758434 5813608 5973844 5945583 5976492 5972494 6047434 5924299 5906981
5463E906981R0397l1779n5086Q9559K1578N4835P6749l5682J8129O4156O5849
$$ 5906981 5997378 5965599 5910513 6000072 6021650 6076485 6153234 6117552 6135681 6199837 6265686
5452F265686P8217L8678J21730l3202n877j836L0136P3696J4757J2425J40673
$$ 6265686 6343903 6382581 6504311 6471109 6465232 6463396 6493532 6567228 6581985 6594410 6735083
5441F735083M4748J6779j46401q9026P6420p911L2839P1744J02499j43244m0706
$$ 6735083 6779831 6796610 6650209 6561183 6637603 6629692 6662531 6734275 6836774 6693530 6652824
5430F652824j04640J46288M4597P1341N2526O7367J1230m2779J0996m2889N4300
$$ 6652824 6548184 6694472 6739069 6810410 6862936 6930303 6941533 6898754 6909750 6866861 6921161
5419F921161J09906j0144L9640n8641l386J42636K3577k9272J67740J9109K0603
$$ 6921161 7031067 7020923 7060563 7001922 6998536 7141172 7164749 7135477 7303217 7322326 7342929
5408G342929R0640p156M8155k4701P7386J05026n9615m812L8684N6323Q2737R445
$$ 7342929 7433569 7426413 7474568 7449867 7527253 7632279 7572664 7567852 7606536 7662859 7745596 7755041
5396G755041J83641l6240o3108M3585L2285K8806O8536M7259O2042j1725j01134
$$ 7755041 7938682 7902442 7839334 7882919 7915204 7944010 8012546 8059805 8121847 8110122 8008988
5385H008988N0277J34931Q6288q81N8256m8806J85952j01729J4197J00225J8504
$$ 8008988 8059265 8194196 8280484 8279603 8337859 8289053 8475005 8373276 8387473 8487698 8506202
5374H506202J25997l9386J59267m7272n2235J74127J75187K33792O2055P3611
$$ 8506202 8632199 8592813 8752080 8704808 8652573 8826700 9001887 9235679 9297734 9371345
5364I371345j12295o6670O1930K12910J03184Q8532p012q8868J91127J58961r109
$$ 9371345 9259050 9192380 9254310 9467220 9570404 9658936 9651924 9563056 9754183 9913144 9904035
5353I904035J08369O9326M3395K35975J71842J39152N9597J34624K41567O879
$$ 9904035 10012404 10081730 10125125 10361100 10532942 10672094 10731691 10866315 11107882 11114761
5343A1114761N0367L45021K51952K23728J66064K90157K85986M28236M65305K90312
$$ 11114761 11165128 11510149 11762101 11985829 12151893 12442050 12728036 13156272 13621577 13911889
5333A3911889K47482L70449K45876K49936M02630M25809N10179N82534Q06223
$$ 13911889 14159371 14529820 14775696 15025632 15428262 15854071 16364250 16946784 17753007
5324A7753007Q27006J013928J192660J335641J676029K046243K690835L727928
$$ 17753007 18580013 19593941 20786601 22122242 23798271 25844514 28535349 32263277
5316C2263277N441871Q080974J1702374J4714319J4913580J1435842O076399J616586
$$ 32263277 37705148 45786122 57488496 72202815 87116395 98552237 104628636 106245222
5308A06245222j483542l754388m461283l928790j910947J502175N240661P910711
$$ 106245222 104761680 101007292 96546009 92617219 90706272 92208447 97449108 105359819
5300A05359819O949689K930863j486500m475363o961057q775807r444293r751092
$$ 105359819 112309508 115240371 113753871 109278508 102317451 93541644 84097351 74346259
5292G4346259r582502r026325q122901o902923n286432l792656k805822k346957
$$ 74346259 64763757 55737432 47614531 40711608 35425176 31632520 28826698 26479741
5284B6479741j825274j591959j268387j117028q76065p78377p72258o51138o33755
$$ 26479741 24654467 23062508 21794121 20677093 19801028 19022651 18250393 17599255 16965500
5275A6965500n59337l49536k73198m11243l73708l17291m23912k33557k77088
$$ 16965500 16406163 16056627 15783429 15372186 14998478 14681187 14257275 14023718 13746630
5266A3746630j38252P6033k44579l12538j50997o9868p6287j75032j25179r8187
$$ 13746630 13608378 13684411 13439832 13127294 12976297 12906429 12830142 12655110 12529931 12431744
5256A2431744j23398R0459j23603j80484j03009j86524k7008l7675k3098l4882
$$ 12431744 12308346 12398805 12275202 12094718 11991709 11805185 11778177 11740502 11717404 11682522
5246A1682522k70204r7610j8571L3209J4822m5180m7213r9668j34324j2932O7305
$$ 11682522 11412318 11314708 11296137 11329346 11344168 11298988 11251775 11152107 11017783 11004851 11072156
5235A1072156p576l4643j00987l1691J0224j21454j9847m95l1997o9645J4190
$$ 11072156 11064580 11029937 10928950 10897259 10907483 10786029 10766182 10765687 10733690 10664045 10678235
5224A0678235r5763J27739K18957k7989j89551j73812J0484n6716R6639m347j91562
$$ 10678235 10582472 10710211 10929168 10901179 10711628 10537816 10548300 10491584 10588223 10583876 10392314
5213A0392314Q0253l671j57281K5588m2450m9097K1839K7345j00563j9575o5812
$$ 10392314 10472567 10468896 10311615 10337203 10294753 10245656 10267495 10294840 10194277 10174702 10108890
5202A0108890j9518O4289j70944L8771L8923l913n5080o1931q1589Q6273J04582
$$ 10108890 10089372 10153661 9982717 10021488 10060411 10056498 10001418 9939487 9857898 9944171 10048753
5191A0048753m6830l7858l1153r4300o8234j3647j6481J8149j85428k0454Q4395
$$ 10048753 10001923 9964065 9932912 9838612 9770378 9756731 9740250 9758399 9572971 9552517 9636912
5180I636912O9730L1476r8158j49570J59830L1664k2868j31067k0600J0291O3081
$$ 9636912 9706642 9738118 9639960 9490390 9650220 9681884 9659016 9527949 9507349 9517640 9580721
5169I580721L9390r6635J7690N7147n7944j80814O3384j1693j40533m8745q7281
$$ 9580721 9620111 9523476 9541166 9598313 9540369 9359555 9422939 9411246 9270713 9221968 9134687
5158I134687J02928P0980l7995K1584n7774q7499j21042k2983j8584M145n219
$$ 9134687 9237615 9308595 9270600 9292184 9234410 9146911 9025869 9002886 8984302 8988447 8983228
5147H983228k1521q0172j5126q7665Q4380R3442n9110o7198K2455J56521K1424
$$ 8983228 8961707 8881535 8866409 8778744 8863124 8956566 8897456 8830258 8852713 9009234 9030658
5136I030658r6821k6137k9171L4389p0191m808j17409M0878J45887o3173l0407
$$ 9030658 8933837 8907700 8878529 8912918 8842727 8837919 8720510 8761388 8907275 8844102 8813695
5125H813695J0633q808P6631r6614j43920n9502p4640o1394K6176j9876O8736
$$ 8813695 8824328 8815520 8892151 8795537 8651617 8592115 8517475 8456081 8482257 8462381 8531117
5114H531117j7907P1053J0409q594j42038N1917J07743o389j5800r1555j44892
$$ 8531117 8513210 8584263 8594672 8586078 8444040 8495957 8603700 8597311 8581511 8489956 8345064
5103H345064K4524o156o3870P1035r7254n5138p2010R1834j04249J94055k6666
$$ 8345064 8369588 8363432 8299562 8370597 8273343 8218205 8146195 8238029 8133780 8327835 8301169
5092H301169j61464J08288n8408n9357M0334o0965q171R8623k6142o7794K986
$$ 8301169 8139705 8247993 8189585 8130228 8170562 8109597 8101426 8200049 8173907 8106113 8109099
5081H109099N2606n1723o8135J5571K9200P8650n3250o2798r7367M1158m4059
$$ 8109099 8161705 8109982 8041847 8057418 8086618 8165268 8112018 8049220 7951853 7993011 7948952
5070G948952L7297j8047j05863j02523l707J0028m1391o1706p471j26693N7837
$$ 7948952 7986249 7968202 7862339 7759816 7756109 7766137 7724746 7663040 7655569 7528876 7586713
5059G586713Q7136r9091l5834j4696j4714Q396j66371o1595J05335L0409l8236
$$ 7586713 7673849 7574758 7538924 7524228 7509514 7517910 7351539 7289944 7395279 7425688 7387452
5048G387452j49536j9985P8452r110j55866n862k5403j5170J14146r8932Q0343
$$ 7387452 7237916 7217931 7296383 7287273 7131407 7125545 7100142 7084972 7199118 7100186 7180529
5037G180529j1126k2864l9271P2129J1733l140J7877k03887J11906K2710k186
$$ 7180529 7169403 7146539 7107268 7179397 7191130 7187990 7205867 7001980 7113886 7136596 7134410
5026G134410n6823l5342O7278r7291q2585P6834K3138j12037k3597L29K2224J5964
$$ 7134410 7077587 7042245 7109523 7012232 6929647 7006481 7029619 6917582 6893985 6894314 6916538 6932502
5014F932502p7582k3756m4758J631m177L5963P2104k5366p779l8168j06330k6502
$$ 6932502 6854920 6831164 6786406 6788037 6783860 6819823 6891927 6866561 6858782 6820614 6714284 6687782
5002F687782r3381M4136R2469R9018m3750J480J14356Q6549L2046M3370J63641
$$ 6687782 6594401 6638537 6731006 6830024 6786274 6787754 6902110 6988659 7020705 7064075 7227716
4991G227716Q6189O0265N49J71270K54730j8244o9671q2811m1029q5315k09418
$$ 7227716 7313905 7374170 7374719 7545989 7800719 7782475 7712804 7629993 7588964 7503649 7294231
4980G294231l71743j17321r0527j97274j47952k8370l1337q9977P6026K3528n1327
$$ 7294231 6922488 6805167 6714640 6517366 6369414 6341044 6309707 6219730 6295756 6319284 6267957
4969F267957O431m9223n1147j18006r2914k1585m1038J96952O0701q6310P099
$$ 6267957 6274388 6225165 6174018 6056012 5963098 5941513 5900475 6097427 6158128 6071818 6078917
4958F078917q5980J18030k142j79618J4977Q1453L256O7286N9056r8667J5721
$$ 6078917 5992937 6110967 6108825 5929207 5944184 6025637 6028893 6096179 6155235 6056568 6072289
4947F072289j15845l3989q0239j5958Q5395o796p2242R653R517j04715j17083
$$ 6072289 5956444 5922455 5842216 5826258 5911653 5904857 5832615 5842268 5851785 5747070 5629987
4936E629987J68468N503k0153j929L9752P4785k2878j12790r1486J26026p4922
$$ 5629987 5798455 5803958 5783805 5781876 5821628 5896413 5873535 5760745 5669259 5795285 5720363
4925E720363M0066P3200p4613L2769J10342J5632n5631n1420J42946k6043j42390
$$ 5720363 5760429 5833629 5759016 5791785 5902127 5917759 5862128 5810708 5953654 5927611 5785221
4914E785221q4743J60918Q2659n7678M846O1177m1344K9147j7592J26943r3218
$$ 5785221 5700478 5861396 5944055 5886377 5891223 5952400 5911056 5940203 5922611 6049554 5956336
4903E956336J501k0489o524J9645k5912J08349n1956O308K6576L3403O0087j0893
$$ 5956336 5957837 5937348 5930824 5950469 5924557 6032906 5980950 5987258 6013834 6047237 6107324 6096431
4891F096431M9562j09293L7029J96889p2401J2071J15545R7093p992Q0979n908
$$ 6096431 6145993 6036700 6073729 6270618 6198217 6210288 6325833 6422926 6414934 6495913 6490005
4880F490005R4286J14388O4331M0977M3685J17930N3940Q7885N1921M8413K97120
$$ 6490005 6584291 6698679 6763010 6803987 6847672 6965602 7019542 7107427 7159348 7207761 7504881
4869G504881R2228L3321K24982K9899J28398J71478J73605L18481K78857L78046
$$ 7504881 7597109 7630430 7855412 7885311 8013709 8185187 8358792 8677273 8956130 9334176
4859I334176K80210K98785L56922O10739P52686P43727R62477J100379J095983
$$ 9334176 9614386 9913171 10270093 10880832 11633518 12377245 13339722 14440101 15536084
4850A5536084J112888R72258Q61014Q13821R52436R81023R83624J302196J501197
$$ 15536084 16648972 17621230 18482244 19296065 20248501 21229524 22213148 23515344 25016541
4841B5016541J317201J075772P63335O00550P2000j31067j41174j06953m50669
$$ 25016541 26333742 27409514 28172849 28773399 28845399 28714332 28573158 28466205 28015536
4832B8015536m57684k88077o492k10046k3709L56832M47264Q36210J885363L492061
$$ 28015536 27557852 27269775 27263283 27053237 27029528 27386360 27833624 28669834 30555197 34047258
4822C4047258M778952N020563L295456J179097k17740q91130j985477k237320
$$ 34047258 38826210 43846773 47142229 48321326 48103586 47212456 45226979 42989659
4814D2989659k099705k233426k214133k047987j684874j125395o42118m65635
$$ 42989659 40889954 38656528 36442395 34394408 32709534 31584139 30942021 30476386
4806C0476386j97106k2009k83336k87867k54261K9309j19752j58586J91235n433
$$ 30476386 30279280 30257271 29973935 29686068 29431807 29461116 29341364 29182778 29374013 29368580
4796B9368580j00767O4365J01228q4681R4423J65614K2185J71321J72993J61436
$$ 29368580 29267813 29332178 29433406 29348725 29443148 29608762 29630947 29802268 29975261 30136697
4786C0136697J38207J51453K85892K80618R9795J49276K62307L89961M04018L42323
$$ 30136697 30274904 30426357 30712249 30992867 31092662 31241938 31504245 31894206 32298224 32640547
4776C2640547M09958M37373L79294K42821M40175L82478M62185L68179M30215
$$ 32640547 33050505 33487878 33867172 34109993 34550168 34932646 35394831 35763010 36193225
4767C6193225M31575M14124L47665J45468K00125J18383K47920Q5897M49J17109
$$ 36193225 36624800 37038924 37386589 37532057 37732182 37850565 38098485 38184382 38184831 38301940
4757C8301940M8692P6857k27626k09535k52115k32311j19379k41141l55689l10106
$$ 38301940 38350632 38427489 38199863 37990328 37738213 37505902 37386523 37145382 36789693 36479587
4747C6479587m32380n59306n25717o47282o20208n40731m74381n66577p19446
$$ 36479587 36047207 35487901 34962184 34314902 33694694 33153963 32679582 32113005 31393559
4738C1393559n43799l72500l50600l74331m85166l30790l68359l27134l97617
$$ 31393559 30849760 30477260 30126660 29752329 29267163 28936373 28568014 28240880 27843263
4729B7843263k77465k89051l00961l53214k66043k72937k21069l68263l05780
$$ 27843263 27565798 27276747 26975786 26622572 26356529 26083592 25862523 25494260 25188480
4720B5188480p6989R5954j07621L4797J65807J23258J09489J94641L81820M13737
$$ 25188480 25111491 25207445 25099824 25134621 25300428 25423686 25533175 25727816 26109636 26523373
4710B6523373J95884L26879L13509L39154M72803N99818N06775M80221M25682
$$ 26523373 26719257 27046136 27359645 27698799 28171602 28771420 29278195 29758416 30184098
4701C0184098K90085K78333L95036J84161R4527K83374J13789K38534L54465N95440
$$ 30184098 30474183 30752516 31147552 31331713 31426240 31709614 31823403 32061937 32416402 33011842
4691C3011842P31315P66049J027370J176830J412306J245253J213366J410234
$$ 33011842 33743157 34509206 35536576 36713406 38125712 39370965 40584331 41994565
4683D1994565J298500J436094J110435J198971J123625R52406R63497P11051N00458
$$ 41994565 43293065 44729159 45839594 47038565 48162190 49114596 50078093 50789144 51289602
4674E1289602K02722Q3416M3434k04858j92963m01586m74013n33891m27971n69981
$$ 51289602 51492324 51575740 51619174 51414316 51221353 50819767 50345754 49811863 49383892 48813911
4664D8813911o08371n74921n68269p55017m75577n58556m43029n28745n37891
$$ 48813911 48205540 47630619 47062350 46307333 45831756 45273200 44830171 44301426 43763535
4655D3763535m85081o68307p54812q47955r36422q35436j163364j275716j214239
$$ 43763535 43278454 42610147 41855335 41007380 40070958 39235522 38072158 36796442 35582203
4646C5582203j406173j360907j217555j197328j193118j120230q76837r91411
$$ 35582203 34176030 32815123 31597568 30400240 29207122 28086892 27210055 26218644
4638B6218644q89284p43535q39886n79604o98618o41556m33574l28825j19210
$$ 26218644 25329360 24585825 23745939 23166335 22467717 21826161 21392587 21063762 20944552
4629B0944552L75256P81449R34391O64235J22981m28493m74906q46850j025649
$$ 20944552 21319808 22101257 23035648 23699883 23822864 23394371 22919465 22072615 21046966
4620B1046966r64339r65058j089503p35697p09259o23164k38659l0625K19458
$$ 21046966 20082627 19117569 18028066 17292369 16583110 15959946 15721287 15690662 15910120
4611A5910120M17276O02340M66723M82391N03071L92733L65624N20657Q97703
$$ 15910120 16327396 16929736 17396459 17878850 18381921 18774654 19140278 19660935 20558638
4602B0558638J127582J110375R37121O80464M40551K85433L12319O02622J044967
$$ 20558638 21686220 22796595 23733716 24414180 24854731 25140164 25452483 26055105 27100072
4593B7100072J110428R50179M37344o593l18472m10832n08949l61593j67158k31510
$$ 27100072 28210500 29160679 29598023 29591430 29272958 28862126 28353177 27991584 27824426 27592916
4583B7592916j43298o67093q10336r20129q98035p58142o01532p24918m77688
$$ 27592916 27449618 26782525 25972189 25052060 24154025 23395883 22794351 22069433 21591745
4574B1591745n83475n30169n37458n50681l46739k69462j88965p3757N3011J01263
$$ 21591745 21008270 20478101 19940643 19389962 19043223 18773761 18584796 18511039 18564050 18665313
4564A8665313L98071N18180O68534O93641Q68344P44458Q76121J011692R62835
$$ 18665313 19063384 19581564 20250098 20943739 21812083 22556541 23432662 24444354 25407189
4555B5407189R98299Q67770P55297P18687N71891M43894N14131O63914O19516
$$ 25407189 26405488 27273258 28028555 28747242 29319133 29763027 30277158 30941072 31560588
4546C1560588P69325R53311J157028J162889J205431J133598Q88599Q92934R11147
$$ 31560588 32329913 33283224 34440252 35603141 36808572 37942170 38830769 39723703 40634850
4537D0634850R06716J373617J648364J888295K544403L204294L432101L397062
$$ 40634850 41541566 42915183 44563547 46451842 48996245 52200539 55632640 59029702
4529E9029702K975162J632990J31694n83834j103311j282691j120725l19610J149131
$$ 59029702 62004864 63637854 63769548 63185714 62082403 60799712 59678987 59359377 60508508
4520F0508508K595720M246713L983173K034822l80280k191844k821373l106750
$$ 60508508 63104228 67350941 71334114 73368936 72988656 70796812 67975439 64868689
4512F4868689l114028k925411k640275j933238r88824m81203o64891j404548k063687
$$ 64868689 61754661 58829250 56188975 54255737 53266913 52785710 52120819 50716271 48652584
4503D8652584k560770k844547k944357l000401l195447l091832k904846k637194
$$ 48652584 46091814 43247267 40302910 37302509 34107062 31015230 28110384 25473190
4495B5473190k457919k003577j536327j476834j344584j206409r65427j034091
$$ 25473190 23015271 21011694 19475367 17998533 16653949 15447540 14482113 13448022
4487A3448022p66443p91252o43310n62966n24823l12977m21802l50158k98566
$$ 13448022 12681579 11890327 11247017 10684051 10159228 9846251 9424449 9074291 8775725
4478H775725m08618l53182j81377j83771k59727j05638j94678k23184k52284k19961
$$ 8775725 8367107 8013925 7832548 7648777 7389050 7283412 7088734 6865550 6613266 6393305
4468F393305j91696j48768l6603j12344m3523j32185k36814k35835r5016k4437
$$ 6393305 6201609 6052841 6016238 5903894 5860371 5728186 5491372 5255537 5160521 5136084
4458E136084n7847j12622n8547j9300j96534r1022j3040r5927r5654p997q3986
$$ 5136084 5078237 4965615 4907068 4887768 4691234 4600212 4587172 4491245 4395591 4387594 4303608
4447D303608k5803L9730k85277Q897J10826o6000q3802n2240K1375j30943M7628
$$ 4303608 4277805 4317535 4032258 4041155 4151981 4085981 4002179 3949939 3971314 3840371 3887999
4436C887999R724j19435o6480o910R5097n7372m2510m0624p3082R7075j3519O0565
$$ 3887999 3897723 3778288 3711808 3704898 3799995 3742623 3700113 3659489 3586407 3683482 3669963 3730528
4424C730528j51119j77837l309m7010J46182r4499M2738O7390J4680R5745L80
$$ 3730528 3579409 3401572 3398263 3351253 3497435 3402936 3445674 3513064 3527744 3623489 3623869
4413C623869j09307R9955N3576q5746O76M7623N574R3655o8152r9184N5917P6181
$$ 3623869 3514562 3614517 3668093 3582347 3583023 3630646 3636220 3729875 3661723 3562539 3618456 3694637
4401C694637J20037j5720p6305j7973O8729J1186j11666k0230K5276j43794M9527
$$ 3694637 3814674 3798954 3722649 3704676 3773405 3784591 3672925 3652695 3677971 3534177 3583704
4390C583704O5284n0576J12383l2714j15608o4830N3709K8522J02451J31023k7745
$$ 3583704 3648988 3598412 3710795 3678081 3562473 3497643 3551352 3579874 3682325 3813348 3785603
4379C785603K137J70706L0900l7500L2423p3478K6215K9153J74136n2757q4154
$$ 3785603 3787740 3958446 3989346 3951846 3984269 3910791 3937006 3966159 4140295 4087538 4003384
4368D003384O0827O6196N8723J0112O4053q858n5660J08051j1482K2684K34884
$$ 4003384 4064211 4130407 4189130 4199242 4263295 4254437 4198777 4306828 4295346 4318030 4552914
4357D552914L3353K0631J17314R6734R2836M1287K84335J83148K40089K98349
$$ 4552914 4586267 4606898 4724212 4820946 4913782 4955069 5239404 5422552 5662641 5960990
4347E960990J45315K56825J78238J09438K47382J45937N6199M9785K02733J90028
$$ 5960990 6106305 6363130 6541368 6650806 6898188 7044125 7100324 7150109 7352842 7542870
4337G542870K13119J72707Q3036M29794K70883K05912K64515L29897K17266M51217
$$ 7542870 7755989 7928696 8011732 8441526 8712409 8918321 9182836 9512733 9729999 10181216
4327A0181216L53273J99617K43937M5703J85139J93690K85082K00584K26958K02202
$$ 10181216 10534489 10734106 10978043 11023746 11208885 11402575 11687657 11888241 12115199 12317401
4317A2317401K06002L02731K50301K24862J61304K40399J97267K93503J62044
$$ 12317401 12523403 12826134 13076435 13301297 13462601 13703000 13900267 14193770 14355814
4308A4355814N8848J01257K0855J019o6813j36779j15838q079j61926j70756r1957
$$ 14355814 14414662 14515919 14536774 14537793 14470980 14334201 14218363 14210284 14048358 13877602 13785645
4297A3785645M020j54906k77830k40933k24455j81948l89894j90925k61848l06543
$$ 13785645 13789665 13634759 13356929 13115996 12891541 12709593 12319699 12128774 11866926 11560383
4287A1560383l11578k50343j48854k29485j67977o3801k62710k12293L575J4999
$$ 11560383 11248805 10998462 10849608 10620123 10452146 10388345 10125635 9913342 9916917 9931916
4277I931916k00277r7356J35630n6865r7780j26777N4315K47020J08996O7898
$$ 9931916 9731639 9634283 9769913 9713048 9615268 9488491 9542806 9789826 9898822 9966720
4267I966720J22002L8888R8875J12186J31947J29805J80314M31081O83020L96408
$$ 9966720 10088722 10127610 10226485 10338671 10470618 10600423 10780737 11211818 11894838 12291246
4257A2291246O66946P78733O77675R19348P45414K99725M83195M12120L22603
$$ 12291246 12958192 13736925 14414600 15333948 16079362 16379087 16862282 17274402 17597005
4248A7597005L94433K80012O36707R98665J088102J351660J673313J680690J521662
$$ 17597005 17991438 18271450 18908157 19906822 20994924 22346584 24019897 25700587 27222249
4239B7222249J401778J052483M68680K53639J51525m1144J95183J66378L54678
$$ 27222249 28624027 29676510 30145190 30398829 30550354 30509210 30704393 30870771 31225449
4230C1225449J028931J270341J590472J885978J772505J453816J015104N05318
$$ 31225449 32254380 33524721 35115193 37001171 38773676 40227492 41242596 41747914
4222D1747914j79205n57120n47550o32618n25375l75590P8989M41436J010983
$$ 41747914 41568709 41011589 40464039 39831421 39306046 38930456 39009445 39450881 40461864
4213D0461864J418522J439737J417289J029246O16396L53824n4997k78302o64271
$$ 40461864 41880386 43320123 44737412 45766658 46383054 46736878 46681881 46403579 45739308
4204D5739308q49906j023604r00461r17606p81712o48405n22256o08243n43463
$$ 45739308 44889402 43865798 42965337 42047731 41266019 40617614 40095358 39487115 38943652
4195C8943652q16526r80720q75929j201438j221734j254690j107704j355527j382731
$$ 38943652 38127126 37146406 36270477 35069039 33847305 32592615 31484911 30129384 28746653
4186B8746653j385876j281530j333863j366989j164903j197804j264013j154893
$$ 28746653 27360777 26079247 24745384 23378395 22213492 21015688 19751675 18596782
4178A8596782j260778r72680j022970r13402p58001o86861p11632o86845n28523
$$ 18596782 17336004 16363324 15340354 14426952 13668951 12982090 12270458 11583613 11055090
4169A1055090m28449l83322m78892k92301k84720l42067l68988j37647j52787
$$ 11055090 10626641 10243319 9764427 9472126 9187406 8845339 8476351 8338704 8185917
4160H185917j91302m17551l22030n594k86237k0440O2864j80640m8771l9671j91603
$$ 8185917 7994615 7577064 7255034 7249440 6963203 6942763 7005627 6824987 6776216 6736545 6544942
4149F544942k46766j85426K4699O8966n58n1415k42168p1909Q1065k4697q3327
$$ 6544942 6298176 6112750 6137449 6206415 6205857 6154442 5912274 5840365 5921430 5896733 5813406
4138E813406k5961j711n9359L4462k8613l6461O9247l4487l7399k9113o2654r886
$$ 5813406 5787445 5785734 5726375 5760837 5732224 5695763 5765010 5730523 5693124 5664011 5601357 5591471
4126E591471R3581J19922m0948r3136J30128p5844K2190J25233j6618P2840M1878
$$ 5591471 5685052 5804974 5764026 5670890 5801018 5725174 5747364 5872597 5855979 5928819 5970697
4115E970697n1451P6691M5044m8988J11114l342o8580q5513J0340L5021K4857
$$ 5970697 5919246 5995937 6040981 5991993 6103107 6099765 6031185 5945672 5956012 5991033 6015890
4104F015890J37264O0090J3594L9338p432K9880o9622j63534J20603J35972M4078
$$ 6015890 6153154 6213244 6226838 6266176 6258744 6288624 6219002 6055468 6176071 6312043 6356121
4093F356121R4732o6353J25269J76445J27962K09315N655P9024J72896J69918
$$ 6356121 6450853 6384500 6509769 6686214 6814176 7023491 7029146 7108170 7281066 7450984
4083G450984J89748R2197P3567K82636K58248L10551J23078L74837L98261K32087
$$ 7450984 7640732 7732929 7806496 8089132 8347380 8657931 8781009 9155846 9554107 9786194
4073I786194M52513M72764M55605N31008O17656N93042M64313O19484N39126N78996
$$ 9786194 10238707 10711471 11167076 11698084 12315740 12908782 13373095 13992579 14531705 15110701
4063A5110701N23513O26693O89870M95930O03044N96430M72656M60982N63553
$$ 15110701 15634214 16260907 16950777 17446707 18049751 18646181 19118837 19579819 20143372
4054B0143372M78782L64788L49610L45263J96760K02942M4907k4441P9633j11512
$$ 20143372 20622154 20986942 21336552 21681815 21878575 22081517 22126424 22101983 22181616 22070104
4044B2070104r5559j92103l61073l85763k15607j14629k21710l92O930K00188
$$ 22070104 21974545 21782442 21421369 21035606 20819999 20705370 20483660 20483268 20490198 20690386
4034B0690386L12079O21561N31252Q21099R92703J260747J462880J675614K052285
$$ 20690386 21002465 21624026 22155278 22976377 23969080 25229827 26692707 28368321 30420606
4025C0420606K372894K680847L030779L354936L717634L815687L896713L823591
$$ 30420606 32793500 35474347 38505126 41860062 45577696 49393383 53290096 57113687
4017E7113687L631260L110148K542537J664659R30753L1163q07143j531853k322160
$$ 57113687 60744947 63855095 66397632 68062291 68993044 69024207 68217064 66685211 64363051
4008F4363051k667319l048755l175280l220592k996312l047549k853746k590770
$$ 64363051 61695732 58646977 55471697 52251105 49254793 46207244 43353498 40762728
4000D0762728k227533j982152j776278j542497j333465j159356j068663r46892
$$ 40762728 38535195 36553043 34776765 33234268 31900803 30741447 29672784 28725892
3992B8725892o87842q69133l16763k19406l05059j66961Q7301J60826J31395K38634
$$ 28725892 28038050 27168917 26852154 26632748 26327689 26160728 26248029 26408855 26540250 26778884
3982B6778884J05104L64301M63965L09926M10969N40153M09618K62697L43443
$$ 26778884 26883988 27248289 27712254 28022180 28433149 28973302 29382920 29645617 29989060
3973B9989060N41654N36651O09376P08630P84434J002305J197652J047946J206607
$$ 29989060 30530714 31067365 31676741 32385371 33169805 34172110 35369762 36417708 37624315
3964C7624315J171986J085561J108293R17073R98801Q05829Q97704R42191Q67170
$$ 37624315 38796301 39881862 40990155 41907228 42906029 43711858 44609562 45551753 46418923
3955D6418923R79765R83424J017618J103802J068595J033401J013775R22757J018778
$$ 46418923 47398688 48382112 49399730 50503532 51572127 52605528 53619303 54542060 55560838
3946E5560838J089153J267582J233196R50733O46492K66272P6078J00275o2687
$$ 55560838 56649991 57917573 59150769 60101502 60747994 61014266 61090344 61190619 61127932
3937F1127932L4249r6603l2233l2840q4798Q3871J86877R583N9783K65084L24010
$$ 61127932 61162181 61065578 61033345 61000505 60915707 60999578 61186455 61196038 61255821 61520905 61844915
3926F1844915M76279M43500M94890Q21639P95814R38835J157330J009634R17366
$$ 61844915 62321194 62764694 63259584 64081223 64877037 65815872 66973202 67982836 68900202
3917F8900202Q81266R55975Q76177R68935J102453Q71973K03013k01450k94009
$$ 68900202 69781468 70737443 71613620 72582555 73685008 74556981 74759994 74558544 74264535
3908G4264535m54947p39760o39761n66796m72781m42713j42748j12235L25110
$$ 74264535 73809588 73069828 72430067 71863271 71390490 70947777 70805029 70692794 71017904
3899G1017904N00500P45908R18182J081880J431630J273392J240472Q56538N43833
$$ 71017904 71518404 72264312 73182494 74264374 75696004 76969396 78209868 79066406 79610239
3890G9610239K01094k86173o00743o35214q87287q55233q66120q44134r58039
$$ 79610239 79811333 79525160 78924417 78289203 77401916 76546683 75680563 74836429 73878390
3881G3878390p72128o32924p42621p77468p73973p84200q59740q61875o37516
$$ 73878390 73106262 72473338 71730717 70953249 70179276 69395076 68535336 67673461 67035945
3872F7035945o99401p12729k94286l25474j59981m30346m95393o41799j098267
$$ 67035945 66336544 65623815 65329529 65004055 64844074 64413728 63918335 63276536 62178269
3863F2178269j363752j674652j923638k274163k291106k192406k263784k198480
$$ 62178269 60814517 59139865 57216227 54942064 52650958 50458552 48194768 45996288
3855D5996288k004389j612168j628813j432165j273151j001228q62266r66650
$$ 45996288 43991899 42379731 40750918 39318753 38045602 37044374 36182108 35215458
3847C5215458q68045o84183n60001o30219m59975m77443n94565o76946p61111
$$ 35215458 34347413 33663230 33103229 32473010 32013035 31535592 30941027 30264081 29502970
3838B9502970n86562n51721o80842q83101p06941p80291q61549p47917o04203
$$ 29502970 28916408 28364687 27683845 26800744 26093803 25313512 24451963 23704046 23099843
3829B3099843n01369p45100o62465n67505n01623o33268m24546n56360l49408
$$ 23099843 22598474 21853374 21190909 20623404 20121781 19488513 19063967 18507607 18158199
3820A8158199l34950m16390l20351j85461k48986k55152k37299j20420j97581
$$ 18158199 17823249 17406859 17086508 16901047 16652061 16396909 16159610 16039190 15841609
3811A5841609j84438l1442l67801j41793j26779k07249m1728j81238j19868p3138
$$ 15841609 15657171 15625729 15257928 15116135 14989356 14782107 14740379 14559141 14439273 14366135
3801A4366135k21862j26871O0358O5879l4176J29457k0778n3168Q7114K12637
$$ 14366135 14144273 14017402 14077760 14143639 14109463 14238920 14218142 14164974 14252088 14464725
3791A4464725J76434O8122J18482L9404K21689p1401p8145o5763j82221m7524
$$ 14464725 14641159 14709281 14827763 14867167 15088856 15017455 14939310 14873547 14691326 14643802
3781A4643802m8462M0718k29869p325o1186j49633p1482j53517q4020j30971p2575
$$ 14643802 14595340 14636058 14406189 14398864 14337678 14188045 14116563 13963046 13879026 13748055 13675480
3770A3675480j60900j87973l09018k51516l33362l37519l31362m12653k08005
$$ 13675480 13514580 13326607 13017589 12766073 12432711 12095192 11763830 11351177 11143172
3761A1143172k09093l94852j89052j97242p5231j50516j87840j44838r8276p6542
$$ 11143172 10934079 10539227 10350175 10152933 10077702 9927186 9739346 9594508 9496232 9419690
3751I419690M5521m3256j08610P8019K8731j06014k6289q7260n9755m0878q8606
$$ 9419690 9465211 9421955 9313345 9391364 9420095 9314081 9287792 9200532 9140777 9099899 9011293
3740I011293N4141r5100p3040O1373J40322O0447l1208j4660j31976p991L783
$$ 9011293 9065434 8970334 8897294 8958667 9098989 9159436 9128228 9113568 8981592 8973601 8977384
3729H977384J91706P7721O618J81231r0207l3681L850J59839L8433l3081R3952
$$ 8977384 9169090 9246811 9253429 9434660 9344453 9310772 9314622 9474461 9512894 9479813 9573765
3718I573765M3625k2834J35470k9362N8723q9538N5429p380l0746Q589N0486j41574
$$ 9573765 9617390 9594556 9730026 9700664 9759387 9669849 9725278 9717898 9687152 9695741 9746227 9604653
3706I604653R8045Q3588N4024J7010l3051r392J65242J59305J97512J42971N6321
$$ 9604653 9702698 9786286 9840310 9857320 9824269 9814877 9980119 10139424 10336936 10479907 10536228
3695A0536228l7200M782J43732o1595O499Q4428N7474R4223O4390O4070J05607
$$ 10536228 10499028 10503810 10647542 10585947 10592446 10676874 10734348 10828571 10892961 10957031 11062638
3684A1062638R2508K13196J01682R1622J10116J49836J71687K29647K17183K22837
$$ 11062638 11155146 11368342 11470024 11561646 11671762 11821598 11993285 12222932 12440115 12662952
3674A2662952J15709K26459K90083M18586J66487K68192L45057L16157K96401
$$ 12662952 12778661 13005120 13295203 13713789 13880276 14148468 14493525 14809682 15106083
3665A5106083L39226M21420N40304M28864M60762M74088L94627P17157M01461
$$ 15106083 15445309 15866729 16407033 16835897 17296659 17770747 18165374 18882531 19283992
3656A9283992M85380O30528P12821N98368M45215N67260O63250P01571P76527
$$ 19283992 19769372 20399900 21112721 21711089 22156304 22723564 23386814 24088385 24864912
3647B4864912R36081P99921J010376J084618J108891J136470J325037J768434
$$ 24864912 25800993 26600914 27611290 28695908 29804799 30941269 32266306 34034740
3639C4034740K131207K469621L117950L613055M306956M796408N353130N542177
$$ 34034740 36165947 38635568 41753518 45366573 49673529 54469937 59823067 65365244
3631F5365244N441689N110640M445643L793565K849091J832480R07056K53223
$$ 65365244 70806933 75917573 80363216 84156781 87005872 88838352 89745408 89998631
3623H9998631m16239m44521n00473l02515J72731P47638J158788J199379J097870
$$ 89998631 89582392 89137871 88637398 88334883 88507614 89255252 90414040 91613419 92711289
3614I2711289J022914O30436j37811r72815j901602k819336l588041m142964m526373
$$ 92711289 93734203 94364639 94226828 93254013 91352411 88533075 84945034 80802070 76275697
3605G6275697m705905m574746m252061l877463l338028k803998k208381j847489
$$ 76275697 71569792 66995046 62742985 58865522 55527494 52723496 50515115 48667626
3597D8667626j368232j047881r01535m49112m66216l01670j27020k81336l41030
$$ 48667626 47299394 46251513 45349978 44900866 44434650 44132980 44005960 43724624 43383594
3588D3383594k88937l30880l61378k28114m47218j80263l54808l61135j77333
$$ 43383594 43094657 42763777 42402399 42174285 41727067 41546804 41191996 40830861 40653528
3579D0653528k22757n05972q27763j052093j173239j161478j427637j242581j231486
$$ 40653528 40430771 39924799 39097036 38044943 36871704 35710226 34282589 33040008 31808522
3570C1808522j187981j052355r78968p07379o20165n48483l61089k05529j56474
$$ 31808522 30620541 29568186 28589218 27881839 27261674 26713191 26352102 26146573 25990099
3561B5990099j90415J09020L29907K43642K93946L30303L92486M24319P16136
$$ 25990099 25799684 25908704 26238611 26482253 26776199 27106502 27498988 27923307 28639443
3552B8639443Q00258P96689Q73744O07833L19029K85283O0282l7269k77791m13099
$$ 28639443 29439701 30236390 31110134 31717967 32036996 32322279 32382561 32345292 32067501 31654402
3542C1654402m52078n29582m26166l21153k12980J02069J41717L57381N97189
$$ 31654402 31202324 30672742 30246576 29925423 29712443 29814512 29956229 30313610 30910799
3533C0910799P72592R12473Q28776O60688N57450L15190J03737K75820J40840
$$ 30910799 31683391 32595864 33424640 34085328 34642778 34957968 35061705 35337525 35478365
3524C5478365K94324J84043N63553O43127O42346R20440R82538R89182J114633
$$ 35478365 35772689 35956732 36520285 37163412 37805758 38726198 39708736 40697918 41812551
3515D1812551Q53905Q05308Q49713Q48447O73507P73500R52185Q01098O54112
$$ 41812551 42666456 43471764 44321477 45169924 45843431 46616931 47569116 48370214 49024326
3506D9024326R19958J231174J150773J499717J957681K141168K400733K365846
$$ 49024326 49944284 51175458 52326231 53825948 55783629 57924797 60325530 62691376
3498F2691376J882376J776667J845520J723097J607438J531283J251619J022235
$$ 62691376 64573752 66350419 68195939 69919036 71526474 73057757 74309376 75331611
3490G5331611J126673R49845Q76733Q07575Q08157J005905J357525J716506K409299
$$ 75331611 76458284 77408129 78284862 79092437 79900594 80906499 82264024 83980530 86389829
3481H6389829L105063L947448N168291N925040O700983P399143P794240P852040
$$ 86389829 89494892 93442340 98610631 104535671 111236654 118635797 126430037 134282077
3473A34282077Q018961P706033P226173O967878O526430O036170N460625M812845
$$ 134282077 142301038 150007071 157233244 164201122 170727552 176763722 182224347 187037192
3465A87037192M505006M051393L653033L530225L027013K536535K046387J347369
$$ 187037192 191542198 195593591 199246624 202776849 205803862 208340397 210386784 211734153
3457B11734153O36464J00984o56165j158374j533991k077653k214000k041154
$$ 211734153 212370617 212471601 211815436 210657062 209123071 207045418 204831418 202790264
3449B02790264j848133j572889j002649k98236L87905J050263J816783K044574
$$ 202790264 200942131 199369242 198366593 198068357 198456262 199506525 201323308 203367882
3441B03367882K155040K303110J974667J432162N60207j72306j363138k466679
$$ 203367882 205522922 207826032 209800699 211232861 211793068 211620762 210257624 207790945
3433B07790945l379799m067596m565397m976470n003551n000057m583777m097455
$$ 207790945 204411146 200343550 195778153 190801683 185798132 180798075 176214298 172116843
3425A72116843l220401k708009j826267j282645q13040o70103n93306q33450j489126
$$ 172116843 168896442 166188433 164362166 163079521 162266481 161596378 161003072 160169622 158680496
3416A58680496j866663k588578l423000m167761m990485n651289o080086o386770
$$ 158680496 156813833 154225255 150802255 146634494 141644009 135992720 129912634 123525864
3408A23525864o705064o732699o616739o388190o070386n510050m970224m713656
$$ 123525864 116820800 110088101 103471362 97083172 91012786 85502736 80532512 75818856
3400G5818856l998713l684869l460944l008705k635340k554338k306729k129945
$$ 75818856 71820143 68135274 64674330 61665625 59030285 56475947 54169218 52039273
3392E2039273j962755j781951j385002j440245j624793j243171r75313r67530
$$ 52039273 50076518 48294567 46909565 45469320 43844527 42601356 41626043 40658513
3384D0658513p07347o74412l88498l65073l03505o0050L7914L21912M34666N78646
$$ 40658513 39951166 39276754 38888256 38523183 38219678 38159628 38197542 38519454 38954120 39532766
3374C9532766P20310R38044J175254J165701J320070J464724J324923J381831
$$ 39532766 40253076 41191120 42366374 43532075 44852145 46316869 47641792 49023623
3366D9023623J188219J031415O55605K43400l9552j22532o84678j032627j153795
$$ 49023623 50211842 51243257 51898862 52142262 52102710 51980178 51295500 50262873 49109078
3357D9109078j443603j406574j668972j468945j475438j635586j421170j261095
$$ 49109078 47665475 46258901 44589929 43120984 41645546 40009960 38588790 37327695
3349C7327695j288294j072466j223871j152262j127340j159468j129060r78597
$$ 37327695 36039401 34966935 33743064 32590802 31463462 30303994 29174934 28196337
3341B8196337p22703q19087o59210o19217m25389m82204k59332k61271l20946
$$ 28196337 27473634 26654547 25995337 25376120 24950731 24468527 24209195 23947924 23626978
3332B3626978j62195l1437r7319N6343M7767K19197K84939K54715K24550N12005
$$ 23626978 23464783 23433346 23336027 23392370 23440137 23659334 23944273 24198988 24423538 24935543
3322B4935543N30172N95982Q07752Q90788J092137J303157J675355J997785K400882
$$ 24935543 25465715 26061697 26869449 27760237 28852374 30155531 31830886 33828671 36229553
3313C6229553K722460L584340M181882M871791N732458O306093P179632P519568
$$ 36229553 38952013 42536353 46718235 51590026 57322484 63628577 70808209 78327777
3305G8327777P671664Q031960P864750P565528P005893N860209M467466K773860
$$ 78327777 85999441 94031401 101896151 109461679 116467572 122327781 126795247 129569107
3297A29569107R22573j304181l072909m591287o059696p016306p869150q260573
$$ 129569107 130491680 129187499 126114590 121523303 115463607 108447301 100578151 92317578
3289I2317578q261302q118472p689972p005514o388280n461206m842827m163950
$$ 92317578 84056276 75937804 68247832 61242318 54854038 49392832 44550005 40386055
3281D0386055l624055k901276k507581k077328j791698j566051j343918j109191
$$ 40386055 36762000 33860724 31353143 29275815 27484117 25918066 24574148 23464957
3273B3464957j114707r06350p74424p75227o56339o19658n24043m39912l08282
$$ 23464957 22350250 21443900 20669476 19894249 19237910 18618252 18094209 17654297 17346015
3264A7346015m05038n36299k66882k31627k90091k49995l39095j71156j71533
$$ 17346015 16940977 16404678 16137796 15906169 15616078 15366083 15026988 14855832 14684299
3255A4684299k7369j07779k09860q1038J10561n9365o1605J05112j9152j37717
$$ 14684299 14656930 14549151 14339291 14258253 14368814 14309449 14247844 14352956 14333804 14196087
3245A4196087J17861N695j66667L0677m3535j89785k18250n6487q7146j35534
$$ 14196087 14313948 14319643 14152976 14183653 14140118 13950333 13732083 13675596 13588450 13452916
3235A3452916j25476q7075Q2051j40028j91972p6661p3280j34129O1927k913j74028
$$ 13452916 13327440 13240365 13322416 13182388 12990416 12913755 12840475 12706346 12768273 12765360 12591332
3224A2591332R4207N2424q3370j1272K8791J44448R0554q0834R3490L2359Q6846
$$ 12591332 12685539 12737963 12654593 12643321 12672112 12816560 12907114 12826280 12919770 12952129 13038975
3213A3038975J43935J28406J10242K57487L19745L58968N16454M16035N38035
$$ 13038975 13182910 13311316 13421558 13679045 13998790 14357758 14874212 15290247 15828282
3204A5828282N41763N30125O40181P27097P16567O72320M56966M16910L28644
$$ 15828282 16370045 16900170 17540351 18267448 18984015 19656335 20113301 20530211 20858855
3195B0858855P7671r4954j28319r6630p0256j07660j63593j19150j4612O6499
$$ 20858855 20936526 20841572 20713253 20616623 20546367 20438707 20275114 20155964 20141352 20207851
3185B0207851l5369Q0652R4950L2687K33127K38020K45390K74054M03633L34756
$$ 20207851 20172482 20253134 20348084 20380771 20613898 20851918 21097308 21371362 21774995 22109751
3175B2109751L38601L82550M95876N25400O87454J056818R70922J113998J400765
$$ 22109751 22448352 22830902 23326778 23852178 24539632 25596450 26567372 27681370 29082135
3166B9082135J367827J566018J828661J695778J593792R83027O50305L49208p8546
$$ 29082135 30449962 32015980 33844641 35540419 37134211 38117238 38767543 39116751 39038205
3157C9038205l19149l75305n52128n52885l92171l59823l69180k08583j34404
$$ 39038205 38719056 38343751 37791623 37238738 36846567 36486744 36117564 35908981 35774577
3148C5774577J7380K78811K15649N02674N56559N60983Q44523J200982J288476
$$ 35774577 35791957 36070768 36286417 36789091 37345650 37906633 38751156 39952138 41240614
3139D1240614J366841J821110J975284K267707K708473L057792L294974L817375
$$ 41240614 42607455 44428565 46403849 48671556 51380029 54437821 57732795 61550170
3131F1550170M380772N008246N997262P041773Q055120R352207J0600755J1520591
$$ 61550170 65930942 70939188 76936450 83978223 92033343 101385550 111986305 123506896
3123A23506896J2064223J1578815J0013031P335614M301811J251509j577666l890968
$$ 123506896 135571119 147149934 157162965 164498579 168800390 170051899 168474233 164583265
3115A64583265n423987o552842p035558p431412p340538p191969o680620o239714
$$ 164583265 159159278 152606436 145570878 138139466 130798928 123606959 116926339 110686625
3107A10686625n903246n455427m925695m291606l693755l172084k749743k361490
$$ 110686625 104783379 99327952 94402257 90110651 86416896 83244812 80495069 78133579
3099G8133579j866359j546645j307745j053162p90841n11152k00436R5111L61077
$$ 78133579 76267220 74720575 73412830 72359668 71568827 71057675 70857239 70952350 71313427
3090G1313427P82172J260806J684302K226240K753109L522944M243325N027097
$$ 71313427 72095599 73356405 75040707 77266947 80020056 83543000 87786325 92813422
3082I2813422O485192Q010477R490003J0613358J1499840J2623203J4691112J8835082
$$ 92813422 99298614 107309091 116799094 127412452 138912292 151535495 166226607 185061689
3074A85061689K6477555L8155516N2376442O3675064O5022688N2837963L0614843
$$ 185061689 211539244 249694760 302071202 365746266 430768954 483606917 514221760
3067E14221760P249742j1733678k6899348l7658749m3892950m6613189m6650580
$$ 514221760 521471502 509737824 482838476 445179727 401286777 354673588 308023008
3060C08023008m4267810l9879787l3930231k7303645k1483373j6800118j3384449
$$ 308023008 263755198 223875411 189945180 162641535 141158162 124358044 110973595
3053A10973595j1126996r245105q178417o996485o256021n402281m563210m098584
$$ 110973595 99846599 90601494 82423077 75426592 69170571 63768290 59205080 55106496
3045E5106496l412990l084398k722650k524288k397542k144784j805215j613446
$$ 55106496 51693506 48609108 45886458 43362170 40964628 38819844 37014629 35401183
3037C5401183j723502j433889j187079j028875r80269o11604o62186q68304p27765
$$ 35401183 33677681 32243792 31056713 30027838 29047569 28435965 27773779 26905475 26177710
3028B6177710m67446p60013p05389m08418l87607o09954o65551o32576o58008
$$ 26177710 25710264 24950251 24244862 23836444 23448837 22838883 22173332 21540756 20882748
3019B0882748n80825n18981m59300n26603n34642m40195m72633m00819l64372
$$ 20882748 20301923 19782942 19323642 18797039 18262397 17822202 17349569 16948750 16584378
3010A6584378l79782j81793l85976m32827n14560l55745m59835l52087j88578
$$ 16584378 16204596 16022803 15636827 15204000 14689440 14333695 13873860 13521773 13333195
3001A3333195k78662m06562j52559l05167k40465j60463j87735k03695j07672
$$ 13333195 13054533 12647971 12495412 12190245 11949780 11789317 11601582 11397887 11290215
2992A1290215k44719j16113j66213l58675k14926k31908k27985l68542j94321
$$ 11290215 11045496 10929383 10763170 10404495 10189569 9957661 9729676 9361134 9166813
2983I166813k76341m21279q7031q1461j65733j13937j09142r7900j76107j39461
$$ 9166813 8890472 8469193 8382162 8300701 8134968 8021031 7911889 7813989 7637882 7498421
2973G498421m1291j05753j65349n0870p5080j87197k8861j51092j76800n8725
$$ 7498421 7457130 7351377 7186028 7135158 7060078 6872881 6844020 6692928 6516128 6457403
2963F457403m7967m9553k16712p4722p9358j23030q0333j08047q1638l1620k20492
$$ 6457403 6409436 6359883 6143171 6068449 5989091 5866061 5785728 5677681 5596043 5564423 5343931
2952E343931j58589K6761j47356j1437m2837j53184k4194j53932j33188M1348
$$ 5343931 5185342 5212103 5064747 5053310 5010473 4857289 4833095 4679163 4545975 4587323
2942D587323j02415j87708o7889l9537n8788j1076k27197q1836P5815k6868O4483
$$ 4587323 4484908 4297200 4229311 4189774 4130986 4119910 3892713 3810877 3886692 3859824 3924307
2931C924307p2430p4898j6919q6873q4447r629K02921P6063j22364k25806p6293
$$ 3924307 3851877 3776979 3760060 3673187 3588740 3579111 3782032 3858095 3735731 3509925 3433632
2920C433632j33653l7312j12289k15388Q8546m6326j74752r8498j07278J0689
$$ 3433632 3299979 3262667 3150378 2934990 3023536 2977210 2802458 2703960 2596682 2607371
2910B607371L366M4366O1349N2236K0450n6160j8429L4945Q1668J0261O8152j1745
$$ 2607371 2610737 2655103 2716452 2768688 2789138 2732978 2714549 2749494 2831162 2841423 2909575 2897830
2898B897830j0072o2822n6280j16928j16969j89567n299K1139J9246k54451k5128
$$ 2897830 2887758 2824936 2768656 2651728 2534759 2345192 2339893 2361032 2380278 2125827 2100699
2887B100699K2702p1395Q3934j0075J6008j2622r5799l7894l4358L3464J49677
$$ 2100699 2123401 2052006 2135940 2125865 2141873 2129251 2033452 1995558 1961200 1994664 2144341
2876B144341j3305j08035n7948R4920m6826n3672R7959Q4944n665q9452m4051
$$ 2144341 2131036 2023001 1965053 2059973 2013147 1959475 2057434 2142378 2136713 2047261 2003210
2865B003210K3863J05087J6838J8957o8644L4091j40578j7697L74P1401M6277
$$ 2003210 2027073 2132160 2148998 2167955 2099311 2133402 1992824 1975127 1975501 2046902 2093179
2854B093179o487J39815L1869J25028l702Q9207J72955P9482l773K66374K03439
$$ 2093179 2086692 2226507 2258376 2383404 2379702 2468909 2641864 2721346 2717573 2983947 3187386
2843C187386K4113j24728p852J57255J06685J12246Q4244Q2801O8868j43487J46634
$$ 3187386 3211499 3086771 3078919 3236174 3342859 3455105 3539349 3622150 3691018 3547531 3694165
2832C694165J11245j31357j55127o4534j5225J15123J8497q8342q6146q416O0374
$$ 3694165 3805410 3674053 3518926 3454392 3439167 3554290 3572787 3484445 3398299 3389883 3450257
2821C450257n1629l9154P7559J47759o870J62372L13944L55608K43243K26149
$$ 3450257 3398628 3359474 3437033 3584792 3577922 3740294 4054238 4409846 4653089 4879238
2811D879238K63776J87523K11779J97274R8769n1664j06507j24154m1216j07616
$$ 4879238 5143014 5330537 5542316 5739590 5838359 5786695 5680188 5556034 5514818 5407202
2801E407202j70023j03920q7574n4943K22141J29078P9320J11586M7745J16870
$$ 5407202 5237179 5133259 5045685 4990742 5212883 5341961 5421281 5532867 5580612 5697482
2791E697482J13920L48932K04876K09023L51968K43142K01852J68310N0578n5031
$$ 5697482 5811402 6160334 6365210 6574233 6926201 7169343 7371195 7539505 7590083 7535052
2781G535052J61888K18628K49783K23562j63190n9677M8919m9570j20278k79733
$$ 7535052 7696940 7915568 8165351 8388913 8225723 8166046 8214965 8165395 8045117 7765384
2771G765384k00314l16222m89683m27398l88014k91534k83992l2247j32315o6624
$$ 7765384 7565070 7248848 6759165 6331767 5943753 5652219 5368227 5335980 5203665 5137041
2761E137041k7168l0422j6457p3922O0423L6346r8917j76025j71699j80027p6238
$$ 5137041 5109873 5079451 5062994 4989072 5049495 5085841 4986924 4810899 4639200 4459173 4382935
2750D382935j39389L6046j04306N400K12911P3424K42778L05034J58544K43864
$$ 4382935 4243546 4279592 4175286 4180686 4393597 4467021 4709799 5014833 5173377 5417241
2740E417241K39737l8579j87314q5359j26093l77830k69162k93799k12563l41061
$$ 5417241 5656978 5618399 5431085 5345726 5219633 4841803 4572641 4278842 4066279 3725218
2730C725218j15914l77805k63296P4313K2777j07386k14576P4622O0339l2247
$$ 3725218 3609304 3231499 2968203 3042516 3065293 2957907 2743331 2817953 2878292 2846045
2720B846045j47072j44752n2492J6697J11531j76724k28228j87992j16644k5913
$$ 2846045 2698973 2554221 2501729 2518426 2629957 2453233 2225005 2037013 1920369 1894456
2710A894456K488J37344n7789R9283Q887k7711K8365N142j81528j15908j89610
$$ 1894456 1896944 2034288 1976499 2075782 2084669 2056958 2085323 2090465 1908937 1793029 1603419
2699A603419j6789K493n277o8264n3134r7169r7831j12027p1193M5362n1876M4092
$$ 1603419 1586630 1589123 1583846 1515582 1462448 1365279 1267448 1155421 1084228 1129590 1077714 1121806
2687A121806O4494p4851o6471j26869N780l9201j05975J42570j2753j30679j62751
$$ 1121806 1186300 1111449 1044978 918109 923889 884688 778713 921283 908530 777851 615100
2676F15100P5642J17163l6452r0491j28669n293M8157o9657N7458j827J6566J05489
$$ 615100 690742 807905 771453 680962 552293 547000 595157 525500 582958 581131 597697 703186
2664G03186j27199j35831k8313R0155P4766n0849k2849j3083j8117n7060M4790
$$ 703186 575987 440156 411843 501998 576764 525915 503066 489983 471866 414806 459596
2653D59596O3066o9882j54892o7335J16797J27580j90701p0249Q9900l1044Q6816
$$ 459596 522662 452780 297888 230553 347350 474930 284229 213980 303880 272836 359652
2642C59652P7085j20413n5819L1379R5500n3858k1700M1194O7614K0074o688K1062
$$ 359652 436737 316324 260505 291884 387384 333526 311826 353020 420634 440708 434020 455082
2630D55082j16139L382q4622m5910J26567K9894k4834l0218L8830J71082o2206
$$ 455082 338943 342325 257703 211793 338360 368254 343420 313202 352032 523114 460908
2619D60908k13370M685J00062P6765P895n2121O3859R558j36551j15645k7173
$$ 460908 247538 252223 352285 429050 436945 384824 448683 458241 321690 206045 178872
2608A78872K8308K7499K0901M0017q4143M333J0263m3781J62783J26849p4298
$$ 178872 207180 234679 255580 295597 211454 215787 226050 182269 345052 471901 397603
2597C97603n3275n1976k0444R3013m8822k9556P4282N7531p0400P5403J88795
$$ 397603 344328 292352 271908 364921 316099 286543 360825 418356 347956 423359 612154
2586F12154J44844P3464O8902P845j12942n1695N4855L4339r7224J2426j78701
$$ 612154 756998 830462 899364 907209 794267 742572 797427 831766 734542 746968 568267
2575E68267j79154l6492N3036p7496j11726J20156R9427q3667j2708L0128k2557
$$ 568267 389113 352621 405657 328161 216435 336591 436018 352351 339643 369771 347214
2564C47214p9486J48642j5972j32943J14854r6434n8294J9572P637k6057K3690
$$ 347214 267728 416370 400398 267455 382309 285875 227581 247153 254790 228733 252423
2553B52423k5815j5998Q314M2267j10516K9793L020J0078m6578p688J57769R1186
$$ 252423 226608 210610 218924 261191 150675 180468 183488 193566 146988 139300 297069 388255
2541C88255n6948j90333j9725L6251J09436L7229k0156J013o7932M2067K2158
$$ 388255 331307 140974 121249 157500 266936 304165 284009 285022 217090 259157 281315
2530B81315O8987l0415j53668J17204j13662M766m6747J21276J78M4254N4228
$$ 281315 350302 319887 166219 283423 169761 174527 127780 249056 249234 293488 347716
2519C47716j13648o9205j1183J78430j8523p1924r5326J00124o6035q5441n1114
$$ 347716 234068 164863 153680 332110 313587 241663 146337 246461 180426 94985 43871
2508D3871k5100J89375L6715J0895P9421j08251L110M4716O3662p4673p6692r7973
$$ 43871 18771 208146 244861 255756 335177 226926 230036 274752 338414 263741 187049 89076
2496H9076J11373J08453j04879k716J59001l7047j8648J4102j7820k6549j64800
$$ 89076 200449 308902 204023 201307 360308 323261 304613 318715 300895 274346 109546
2485A09546M9470N0057N0064l2887j12228k1504J13352l4243q066n376K0879J00018
$$ 109546 159016 209073 259137 226250 114022 92518 205870 171627 163561 158185 179064 279082
2473B79082N8731j6011O5239P2975j28946n9324J44816j6425N7252o2867j75127
$$ 279082 337813 321802 387041 460016 331070 271746 416562 400137 457389 394522 219395
2462B19395m1692K0672L6284j2686J48374M5499m0278j36615R220k1924O7848
$$ 219395 177703 198375 234659 221973 370347 415846 375568 238953 248173 226249 294097
2451B94097Q7590L8333J67793r4843j27374L0853J07181m9654p0166J6906j220
$$ 294097 381687 420020 587813 492970 365596 396449 503630 453976 383810 400716 399496
2440C99496j8015p6593P8591L1972K0360O7041R5077r0461k451J29403L8954j26414
$$ 399496 381481 304888 383479 415451 435811 502852 597929 507468 505017 634420 673374 546960
2428E46960k6597K1247j06970J42537K2957o8587l9576K3996J3555N3574R3628
$$ 546960 520363 541610 434640 577177 600134 531547 491971 515967 529522 583096 676724
2417F76724r7309J0803r6040l2980J46320L8061M1167j9334l1849K9093Q6741
$$ 676724 579415 590218 494178 461198 607518 645579 686746 667412 635563 664656 751397
2406G51397M1255j18693r9111O1016M4633K02059p6791j14210o3768J49644M0114
$$ 751397 792652 673959 574848 635864 680497 882556 805765 691555 627787 777431 817545
2395H17545m9123O2811l8576N0407J00885r2066J7591P3830k5932O6488o4247
$$ 817545 768422 831233 792657 843064 943949 851883 869474 943304 917372 983860 919613
2384I19613J26218J38105j150m1593o6718L2747j8162J11704P0555O0758O5462
$$ 919613 1045831 1183936 1182786 1141193 1074475 1107222 1089060 1200764 1271319 1332077 1397539
2373A397539k1839L823O4700m3991J29993K8283K27486K9576L8539m5471J5663
$$ 1397539 1375700 1379523 1444223 1400232 1530225 1558508 1785994 1815570 1854109 1808638 1824301
2362A824301J15112J9776n2185K3032N3656J10623K03479K9627L9166J46397J09079
$$ 1824301 1939413 1959189 1907004 1930036 1983692 2094315 2297794 2327421 2366587 2512984 2622063
2351B622063J33875J91257R3245J66874P2437J21007Q7031J46668o9820K73634
$$ 2622063 2755938 2947195 3040440 3207314 3279751 3400758 3487789 3634457 3564637 3838271
2341C838271L16725P0043L9527J08955L07291N58251Q23446J119803J318213J188196
$$ 3838271 4154996 4225039 4264566 4373521 4680812 5239063 6062509 7182312 8500525 9688721
2331I688721J078933Q93128J095950J082120J257385J415754K002779K723422
$$ 9688721 10767654 11660782 12756732 13838852 15096237 16511991 18514770 21238192
2323B1238192L780230O145571J0990026J9411581K6318933K8961451J9332698
$$ 21238192 25018422 31163993 42154019 61565600 87884533 116845984 136178682
2316A36178682O188880k304218n736386j1773835j5043144j4738457j5390462
$$ 136178682 142367562 140063344 134326958 122553123 107509979 92771522 77381060
2309G7381060j3927467j3180335j1009806q058644n315226l174454j996356j768534
$$ 77381060 63453593 50273258 39263452 31204808 25889582 22715128 20718772 18950238
2301A8950238j514108j545483j246133j189586j304639j095256r22450j070141
$$ 18950238 17436130 15890647 14644514 13454928 12150289 11055033 10132583 9062442
2293I062442p46230o45557m27383n51989n30623m49881k10196l65146l08019l22699
$$ 9062442 8316212 7670655 7243272 6691283 6160660 5710779 5500583 5135437 4827418 4504719
2283D504719j46393k52393j35952j97153o5260P9033m2875j54961n6818n7028
$$ 4504719 4358326 4105933 3969981 3772828 3707568 3786601 3743726 3588765 3531947 3474919
2273C474919j78892o9252l5419r0017j18022j54773m2935r2338j63761j65085
$$ 3474919 3296027 3226775 3191356 3101339 2983317 2828544 2785609 2693271 2529510 2364425
2263B364425Q361l1971j56181n4110O0407j10605j66576P5726l1919j87935j17431
$$ 2364425 2372786 2340815 2184634 2130524 2190931 2080326 1913750 1989476 1957557 1769622 1652191
2252A652191j13732o691l2687m1607Q3145k020J2679O8284r3140p9929j42182
$$ 1652191 1538459 1531768 1499081 1457474 1540619 1538599 1551278 1619562 1526422 1446493 1304311
2241A304311j11987O5465L1577j79096O28p5080M5139j0653j093J966n5115r5200
$$ 1304311 1192324 1257789 1289366 1110270 1110898 1035818 1080957 1070304 1069211 1071177 1016062 920862
2229I20862p4312j6191l2552l5518J1567O7136m5707J04935k6861q2773j68805
$$ 920862 846550 830359 797807 762289 773856 840992 795285 900220 873359 790586 621781
2218F21781J16205J42215l8060k950O1173p0587j20605J3545P5582r2652J282
$$ 621781 737986 880201 842141 839191 900364 829777 709172 722717 798299 705647 706929
2207G06929m3430j97842m8839n7012J33077o7058k4219Q6627o602J14423r6252
$$ 706929 663499 465657 416818 359806 492883 425825 401606 488233 481631 596054 499802
2196D99802O7358P500n2645M6436L5335n6166j13530o8228P3688l7134j27012
$$ 499802 567160 574660 522015 568451 603786 547620 434090 365862 439550 402416 275404
2185B75404j595R3606k8863j56092J47348O2701j78444O6647L2173j5011J3125
$$ 275404 273809 367415 338552 182460 329808 392509 214065 280712 312885 297874 310999
2174C10999O7482J16615j17663j05927Q7368M7415q3200j32298J09366q7105J5459
$$ 310999 378481 495096 377433 271506 358874 406289 323089 190791 300157 213052 228511
2163B28511P0037j142R4831p5571q1328N6195J39388n1884j71210m3352k817K113
$$ 228511 298548 297406 392237 316666 235338 291533 430921 379037 207827 164475 161658 163771
2151A63771p8525L7985M3369O7721J18866p8529j54086Q1845L4003n5088L1608
$$ 163771 85246 123231 166600 234321 353187 274658 120572 202417 236420 181332 212940
2140B12940J4352j48796L7835L0769M5172j6270l2223l4711j08268J2141J6336
$$ 212940 227292 78496 116331 147100 192272 176002 143779 109068 800 12941 29277
2129B9277K2287o216J30048n1894m6148P8343j9955k3400j6063K4334J19430q0712
$$ 29277 51564 45348 175396 123502 77354 155697 135742 112342 96279 120613 240043 159331
2117A59331o7666M1576M6916m119o2935m7150J9407J5660N877q1110l6845p902
$$ 159331 91665 133241 180157 176038 113103 65953 85360 101020 106897 25787 -11058 -18960
2105a8960O742Q3127l9559N5296k9322q33p5958L6462Q2382P0317k9869r8966
$$ -18960 -12218 70909 31350 86646 57324 56491 -19467 16995 99377 169694 139825 40859
2093D0859J15414p5789n6265L1905n1389k6942n2127P4655J31954K1904n1658
$$ 40859 156273 80484 24219 56124 4735 -22207 -74334 321 132275 154179 102521
2082A02521J5165L6570l4073P3194o8170K5961K9259m1014P3315o3506m1039J7323
$$ 102521 117686 154256 120183 193377 125207 151168 180427 139413 212728 149222 108183 125506
2070A25506q0132o7191j30505O0499J27168P86j35354j7493O1415N4369m6506
$$ 125506 45374 -21817 -152322 -91823 35345 36131 -99223 -116716 -55301 -932 -47438
2059d7438N6044q9886O4729K03244o772k5782J24534k6748J28000J39441J11127
$$ -47438 8606 -81280 -16551 186693 179921 154139 278673 251925 379925 519366 630493
2048F30493R3615J35840j955o2761n5771j20845J3222q378k11234j97397j2680
$$ 630493 724108 859948 857993 795232 739461 618616 631838 623460 412226 214829 202149
2037B02149R5779j40342l9078M0258j15859j8352O1356J33780j8285r0580j16073
$$ 202149 297928 157586 118508 158766 42907 24555 85911 219691 201406 110826 -5247
2026e247J56712L0406l5966r9742J72892l5977j26732J38776n7238k08516L2211
$$ -5247 151465 181871 145905 46163 219055 183078 56346 195122 137884 -70632 -38421
2015c8421J09797M7440j09282m3670L3512K0005n0625k1995J26617j08990k6087
$$ -38421 71376 118816 9534 -34136 -624 19381 -31244 -53239 73378 -35612 -61699
2004f1699J44394k2739r5560j4091K8615J36830n6882j54257J03794j31175k7090
$$ -61699 82695 59956 -35604 -49695 -21080 115750 58868 -95389 8405 -122770 -149860
1993a49860r959R3927m8580o5983K40008r6595Q5542K0631P220J36121K5996j01031
$$ -149860 -159819 -65892 -114472 -180455 59553 -37042 48500 69131 76351 212472 238468 137437
1981A37437r5943j24466o098K6809R3851K2067J3387r163j8776l349K7982O9561
$$ 137437 41494 -82972 -89070 -62261 31590 53657 67044 57881 39105 35756 63738 133299
1969A33299M2008n557j03980N6469m6787L5671M4608q3964r8830J15723m7759
$$ 133299 175307 169750 65770 122239 75452 111123 155731 71767 -27063 88660 40901
1958D0901q8955R433J08389k2275k4031J11541r5408r3414j32829L199J12263
$$ 40901 -48054 -38621 69768 47493 23462 135003 39595 -53819 -186648 -183449 -71186
1947g1186N5312P5695j1636q307j24834r6749R8281k0631j42Q5724m6266O012
$$ -71186 -15874 59821 48185 39878 -84956 -181705 -83424 -104055 -104197 -18473 -64739 -58727
1935e8727K099j2980R6731j36831K2370O2137j00890L8001L9087M8426J2522P4472
$$ -58727 -56628 -69608 27123 -109708 -87338 -25201 -126091 -88090 -49003 -577 11945 86417
1923H6417l2104k5074N7982o8951q2725R6631j1696p264P4456l4688r4387N8387
$$ 86417 54313 29239 87221 18270 -64455 32176 20480 13216 87672 52984 -41403 16984
1911A6984P2826J4326J0787j13033R895q1435J01381J8950N4271M2666k02210
$$ 16984 89810 104136 114923 1890 11785 -69650 31731 50681 104952 147618 -54592
1900e4592q5617N1176J10127m8880r65n7065L7989M0886P6352K3293k3464J21936
$$ -54592 -140209 -89033 21094 -27786 -28751 -85816 -47827 -6941 69411 92704 69240 191176
1888A91176L1204q9114k8545j37268Q5257R7871l2666k7340l9817k0705j15676
$$ 191176 222380 133266 104721 -32547 52710 150581 117915 90575 50758 30053 -85623
1877h5623K3075N7412p0332O3515j1492j40203Q8399j6562Q9215K9254o0711j7736
$$ -85623 -62548 -5136 -75468 -11953 -23445 -163648 -75249 -91811 -2596 26658 -34053 -51789
1865e1789m4012k6248O5410P3064n831j00836R1477O1270o2443p8245L2332Q3225
$$ -51789 -95801 -122049 -56639 16425 10594 -90242 1235 62505 62 -78183 -45851 37374
1853C7374J62454N476j28108p9874K573O672q098R4667N9302p3291J897N8151
$$ 37374 199828 205304 77196 -2678 -105 6567 -1531 93136 152438 79147 81044 139195
1841A39195J0330n0062k9245r7607P2133j2664O4650l8083j9766N2731p7214J14962
$$ 139195 149525 99463 70218 -27389 44744 32080 96730 58647 38881 91612 14398 129360
1829A29360j24956L1747r371K0216m3858M1589p521j5127l1285K0808J48097j1895
$$ 129360 4404 36151 26780 46996 3138 44727 37206 22079 -9206 11602 159699 147804
1817A47804K487j74422o5743M3335N5428j2702p1202R2228M8124j00853j00402
$$ 147804 150291 -24131 -89874 -46539 8889 -3813 -75015 17213 65337 -35516 -135918
1806a35918J3596R2827O751N0444M2968m8512o6569j67878J29986N7175q0589
$$ -135918 -122322 -29495 -22744 27700 70668 22156 -44413 -212291 -82305 -25130 -105719
1795a05719M7998q0801J8096N1644J40539j1601m8225J21459l8833q2727k2485
$$ -105719 -57721 -138522 -120426 -68782 71757 60156 11931 133390 94557 11830 -10655
1784a0655P6845k5766n9642N007J01779J7716L693l5024l2832n5681m3796k4093
$$ -10655 66190 40424 -19218 -14211 87568 105284 108977 73953 41121 -14560 -58356 -82449
1772h2449n5175p7414Q2224o5825N3511R269n3345Q3716O7817J06675K5138J2396
$$ -82449 -137624 -215038 -132814 -198639 -145128 -135859 -189204 -105488 -37671 69004 94142 106538
1760A06538k19840K8555M4811J13274Q7475j65293n0397n2475J13172R538j25198
$$ 106538 -113302 -84747 -39936 73338 160813 -4480 -54877 -107352 5820 15358 -109840
1749a09840Q304Q6927J17841j75853n583J35405N8871j66263Q8725O9297j51172
$$ -109840 -101536 -14609 103232 -72621 -78204 57201 116072 -50191 38534 107831 -43341
1738d3341k3701J6190J31332n9962j18280P0526j3308N4458n6529Q2207l0160
$$ -43341 -67042 -50852 80480 20518 -97762 -27236 -40544 13914 -42615 39592 9432
1727I432r0455J7138J67616J6549p9982j7072j24731M9338n0794J18231k6057
$$ 9432 -81023 -63885 103731 120280 40298 23226 -101505 -52167 -102961 15270 -10787
1716a0787l4592m2900J9573J0025P6536J5834p5817k1801N1241Q603O1349K5794
$$ -10787 -45379 -88279 -68706 -58681 17855 33689 -42128 -63929 -12688 -4085 57264 83058
1704H3058p4162j74029J36090L7559q3326j07219P4978K8222j473J43760O90j04079
$$ 83058 8896 -165133 -29043 8516 -74810 -182029 -107051 -78829 -80302 63458 64148 -39931
1692c9931k1973R8129q0468L2312l4416j5332N8746j1319k6517P3725j8850Q3334
$$ -39931 -61904 36225 -44243 -11931 -46347 -61679 -2933 -14252 -40769 32956 14106 97440
1680I7440j52426j13461j8713J49744J36360q5780q2525l7887M1090M6906j5838
$$ 97440 -54986 -168447 -187160 -37416 98944 13164 -69361 -107248 -66158 -19252 -35090
1669c5090p4229o3691J09374K9464J05759P6033n4279l6457p2181J62023k01111
$$ -35090 -109319 -173010 -63636 -34172 71587 147620 93341 56884 -15297 146726 -54385
1658e4385n5116J80405j1431P1304O190j23896o991O4291O8223N5119q9945j34413
$$ -54385 -109501 70904 59473 130777 136967 13071 6080 70371 138594 193713 103768 -30645
1646c0645J0486J190N5134L8203n7576k3911o547J6123k3342k0792Q3595m669
$$ -30645 -20159 -18969 36165 74368 16792 -7119 -13666 2457 -20885 -41677 41918 37249
1634C7249k31652P5686J19003l5427l9692K8520M8004o7922K7983j04867O3211
$$ 37249 -194403 -118717 286 -35141 -74833 -46313 1691 -66231 -38248 -143115 -79904
1623g9904K4427m3476j7848p3233K4992J25018O6550j12615l0190m7002Q2629
$$ -79904 -55477 -98953 -116801 -190034 -165042 -40024 26526 -86089 -116279 -163281 -80652
1612h0652M2773J09643l3627j13919J835J18487N8990o2968j68618m0728J33318
$$ -80652 -37879 71764 38137 -75782 -73947 44540 103530 40562 -128056 -168784 -35466
1601c5466j62355J00348j5382j3696N5954k7574R110q2716M0075K49K9929L8714
$$ -35466 -197821 -97473 -112855 -126551 -70597 -98171 -89061 -171777 -131702 -131453 -101524 -62810
1589f2810J04095m0109k1620j0402J14209M9525j35321k1489q223N9292p2641
$$ -62810 41285 1176 -20444 -30846 83363 132888 -2433 -23922 -32145 27147 -45494
1578d5494L7292J1286j7113P152Q2732k4315r2683Q4356n5848J20915j2658j65160
$$ -45494 -8202 3084 -14029 -6877 75855 51540 -41143 43213 -12635 108280 95622 -69538
1566f9538K2836M5891k3587K1313K2263m0571l3585r4034O856J63980l7246j65991
$$ -69538 -46702 -811 -24398 -3085 19178 -21393 -54978 -149012 -142156 21824 -15422 -181413
1554a81413Q9494m1044J22338K2910m4107P6843k1080o8181Q0736M0770k4535
$$ -181413 -91919 -132963 -10625 12285 -31822 45021 23941 -44240 36496 77266 52731
1543E2731o6221m9776J04837q4342R440K2620O4343j20529J6346m57O3110N1924
$$ 52731 -13490 -63266 41571 -42771 -33331 -10711 53632 -66897 -50551 -51008 12102 64026
1531F4026M8370k6975m3608m8438L6436j2931q7486O1909L9912O2022J15114M8893
$$ 64026 112396 85421 41813 -6625 29811 16880 -70606 -8697 31215 93237 208351 257244
1519B57244n8250j43433r4789q761M2627m5473j10884L6522k2966J50367J15100
$$ 257244 198994 55561 -39228 -47989 -5362 -50835 -161719 -125197 -148163 2204 117304
1508A17304m7625j61613J23363k4080j35094n3309N9498L2213R7867N0715k8965
$$ 117304 69679 -91934 31429 7349 -127745 -181054 -121556 -89343 8524 59239 30274
1497C0274n0710L2766m058j4751j00961Q1030L0998l2313j6L1520k7114j0630
$$ 30274 -20436 12330 8272 -6479 -107440 -26410 4588 -27725 -27741 3779 -23335 -33965
1485c3965m0060m493M1839j05545R0281M4902o1135M890n7003L9557p8577l6306
$$ -33965 -74025 -78518 -36679 -142224 -51943 -7041 -68176 -63286 -120289 -80732 -159309 -195615
1473a95615J09850J25831Q3566o2988J03800j40673j4288q7679K3779O6034n744
$$ -195615 -85765 40066 123632 60644 164444 23771 9483 -78196 -54417 11617 5873
1462E873P3853n2284p1711J668l3429M4947K15401j2654l596K5473j27043N7575
$$ 5873 79726 27442 -44269 -42601 -76030 -31083 184318 171664 168068 193541 66498 124073
1450A24073J9228l9453p9931J3030J3220L2200n5895n7451k6478k6714L2346j1106
$$ 124073 143301 103848 23917 36947 50167 82367 26472 -30979 -57457 -84171 -51825 -62931
1438f2931O8990j1120m6797l1536j8887J50436o9845O9955J9010J19345M6248
$$ -62931 6059 -5061 -51858 -83394 -102281 48155 -21690 48265 67275 186620 232868
1427B32868o0058j10766r9701M9020l5487K2746O0426j0778n4028r2169k8385
$$ 232868 172810 62044 -37657 11363 -24124 -1378 59048 48270 -5758 -97927 -126312
1416a26312N7073K9063J9078n1923P3405J74345r1645N2656M7136j88549m4169
$$ -126312 -69239 -40176 -21098 -73021 384 174729 83084 135740 182876 -5673 -49842
1405d9842O1455j7594P5307M6140j26840p3914M3326J64251j997K0746M1856j30776
$$ -49842 11613 -5981 69326 115466 -11374 -85288 -41962 122289 120292 141038 182894 52118
1393E2118o9409p9615p5990J55406q024K1351N9615n9803j28769P5298j0885L0830
$$ 52118 -17291 -96906 -172896 -17490 -25514 -4163 55452 -4351 -133120 -57822 -68707 -37877
1381c7877n6168N0098J6709n631j32287L6761J04494n3315Q0023m9697l5038P518
$$ -37877 -94045 -43947 -27238 -32869 -165156 -128395 -23901 -77216 2807 -46890 -81928 -74410
1369g4410J2882n4530L6294k4727j0153J6504L4674L8223n7749J10949k102j1607
$$ -74410 -61528 -116058 -79764 -104491 -114644 -98140 -63466 -25243 -82992 27957 25855 14248
1357A4248j540j2719L9685N5099j38725M232j52900k6148J07431N8684o0088J14810
$$ 14248 12708 -11 39674 94773 -43952 -39720 -192620 -218768 -111337 -52653 -112741 2069
1345B069K8911j48451O3969J1481q4842K2637M9018P9243M1199L8178J8659j5773
$$ 2069 30980 -117471 -53502 -42021 -126863 -104226 -55208 24035 65234 103412 122071 106298
1333A06298o573M3783k1463p2917l4361o249J17279j25621n2764k96J1416p1601
$$ 106298 99725 143508 122045 49128 14767 8518 125797 176 -52588 -52884 -41468 -113069
1321a13069M4106j4583j4327N5580K3437n402m0568l0960O4309j32497R3388N7267
$$ -113069 -68963 -83546 -97873 -42293 -18856 -24258 -64826 -95786 -31477 -163974 -70586 -13319
1309a3319m2643N1421J2433P05K4885m1627o8689n6219N1650k8949L3181O701
$$ -13319 -55962 -4541 7892 8597 33482 -8145 -76834 -133053 -81403 -110352 -77171 -70470
1297g0470M7513J848R2685m5300j0415j03382Q6k2468p142J43883P7012j77099
$$ -70470 -22957 -21109 71576 26276 15861 -87521 -87435 -109903 -117045 26838 103850 -73249
1285g3249P248M8173P881n5363j01244Q37K5964J20514o9350k2827J00117J7116
$$ -73249 -66001 -17828 -9947 -65310 -166554 -165717 -139753 -19239 -88589 -111416 -11299 5817
1273E817j03486k4323L7467o6823M3829J503M6465j1607j23991Q8554J8286J177
$$ 5817 -97669 -121992 -84525 -151348 -107519 -106016 -59551 -71158 -195149 -106595 -88309 -87132
1261h7132Q578P5919J3698N7275M0691r9792l5525J8257j33945k5571M7427J29031
$$ -87132 -78554 -2635 11063 68338 109029 9237 -26288 -8031 -141976 -167547 -120120 8911
1249H911J13302j8160j53301r616l8940L860N7619Q2781L6226j6398j32206l3813
$$ 8911 122213 104053 -49248 -58864 -97804 -93944 -36325 46456 82682 66284 -65922 -99735
1237i9735P0655J36878m5195k620q3268L9180j3909q7838m653M9127M5368N4644
$$ -99735 -29080 107798 62603 59983 -23285 15895 1986 -85852 -90505 -41378 3990 58634
1225E8634n1327L1883R7541O775J7860j25274j02441l5241J07078l2222j26779
$$ 58634 7307 39190 136731 143506 161366 36092 -66349 -101590 5488 -26734 -153513
1214a53513N8159P4836l2707m9349L6437R819l2726j3584R6418K4709J0646j1366
$$ -153513 -95354 -20518 -53225 -102574 -66137 -56318 -89044 -102628 -6210 18499 29145 17779
1202A7779M252l0172J60400L2863j87559l4278n2560N9772n0602k340O9318l6425
$$ 17779 22031 -8141 152259 185122 -2437 -36715 -89275 -29503 -80105 -82445 -13127 -49552
1190d9552Q8573k2866P211K4720j05821o8174J9601J7942Q3880R8966m2380k7432
$$ -49552 39021 16155 23366 48086 -57735 -125909 -106308 -88366 -4486 94480 52100 24668
1178B4668o016j0737N9364M80j0102K0366k6005L3943L1414J853r9436J03977
$$ 24668 18652 7915 67279 67759 57657 78023 52018 85961 117375 119228 19792 123769
1166A23769J05522j04333j38848q9816J08889j9428q9015J41867O0172Q0399j01135
$$ 123769 229291 124958 -13890 -103706 5183 -14245 -103260 38607 98779 179178 78043
1155G8043q5585o957J25111M6226K989m3602n660M3178q1763q6433J154J27959
$$ 78043 -7542 -14499 110612 156838 159827 116225 110565 153743 71980 -14453 -13299 114660
1143A14660P4309k2771k04401M4030l8832O179o5022K7596J61313l9244M6580
$$ 114660 188969 166198 -38203 5827 -33005 -26826 -91848 -64252 97061 57817 104397
1132A04397o9419m6486J5624N0602J1980j13317o3593O4872j09007k2239K9300
$$ 104397 34978 -11508 4116 54718 66698 -46619 -110212 -45340 -154347 -176586 -147286
1121a47286N9501J9282J15316P8409l4108n6263J3328j00951N7628o4260n9029
$$ -147286 -87785 -68503 46813 125222 91114 34851 48179 -52772 4856 -59404 -118433
1110a18433L1256k2997M1957P0943n1522m689Q9986K9899P916J2522o5202r0979
$$ -118433 -87177 -110174 -68217 2726 -48796 -53485 36501 66400 74316 86838 21636 -69343
1098f9343R5767l6518j71677L7290J09125P9053N3310J1863k9937j36206k2026
$$ -69343 26424 -10094 -181771 -144481 -35356 43697 97007 108870 78933 -57273 -79299
1087g9299J35357k2793J4325k1948J44J00856j37823q7579N7472j1570p5299J00242
$$ -79299 56058 33265 47590 25642 25786 126642 -11181 -98760 -41288 -52858 -128157 -27915
1075b7915Q8609K8511M6068r7339L3435L1104j35995n2884q814P6333K8045o6254
$$ -27915 60694 89205 135273 37934 71369 102473 -33522 -86406 -95220 -18887 9158 -57096
1063e7096J6559M4820l2030P5984k1466o3068M1914n0108q9388N4725J29374L8788
$$ -57096 -40537 4283 -27747 48237 26771 -36297 5617 -44491 -133879 -79154 50220 89008
1051H9008K0746J81128n0430j48913o365m7530l9213p2488L7405Q2010m4247m4882
$$ 89008 109754 290882 240452 91539 85174 37644 -1569 -74057 -36652 45358 1111 -43771
1039d3771K2581l5710l594J51137j3795n5528k9320j18958O9199J28610n4163
$$ -43771 -21190 -56900 -60494 90643 76848 21320 -8000 -126958 -57759 70851 16688
1028A6688M7711k6562J01096r3143j44243O1148O0763j49236p0754J78467J15946
$$ 16688 64399 37837 138933 45790 -98453 -37305 23458 -125778 -196532 -18065 97881
1017I7881N3391m1467n4078p80j20035K886q803k1K575P3750O967m6681N413q6227
$$ 97881 151272 109805 55727 54947 -65088 -62202 -71005 -71026 -68451 5299 12266 -34415 -29002 -115229
1003a15229o0268M6426J07527l113n2142J44560j43977J62103J00847k02785o5404
$$ -115229 -175497 -129071 -21544 -24657 -76799 67761 -76216 85887 186734 -16051 -81455
992h1455N8053m5047l6020J11243J48107j18980n1991j10455k354J88746j17233
$$ -81455 -23402 -68449 -104469 6774 154881 35901 -16090 -126545 -128899 59847 -57386
981e7386K553n4718J21370k2972n2491Q0176k2701J0760l0726l989k2357K1926
$$ -57386 -54833 -109551 11819 -11153 -63644 16532 -6169 4591 -26135 -30124 -52481 -30555
969c0555m7416m4953O9716J9616K5195p075J09945m9985P1366P5309M7628j46650
$$ -30555 -77971 -122924 -53208 -33592 -8397 -15472 94473 44488 115854 191163 238791 92141
957I2141j20714k9455K23259n3029k13992J7521l8121L1642k5682p376Q4288l6181
$$ 92141 -28573 -58028 165231 112202 -101790 -84269 -122390 -90748 -116430 -123806 -39518 -75699
945g5699j79524J08346J61352M6500j5073r2360J905j01992J961N2450Q6016m6049
$$ -75699 -255223 -146877 14475 60975 45902 -46458 -44553 -146545 -144584 -92134 -6118 -52167
933e2167m6961j3951J45181o0498O3699N2117M561l4441n7891R5605k6011J712
$$ -52167 -99128 -113079 32102 -28396 35303 87420 91981 57540 -351 95254 69243 70955
921G0955Q7551j30186k0654m8865L5612o1718j2481L2025M8447l670q4560N5829
$$ 70955 158506 28320 7666 -41199 -5587 -67305 -79786 -47761 686 -2984 -87544 -31715
909c1715J8239l5618n1268P8855L0128l3625k1455M3957K4509j5584j00229j1605
$$ -31715 -13476 -49094 -100362 -21507 8621 -25004 -46459 -2502 22007 6423 -93806 -105411
897a05411M1232N5862J05958J1743j70167j20931Q675J39236Q412k9239k6032
$$ -105411 -64179 -8317 97641 109384 -60783 -181714 -173039 -33803 -25391 -54630 -80662
886h0662J41081M2742j58577R756J2647o6016M2980j3976J00764M1557l2657P9112
$$ -80662 60419 103161 -55416 -45660 -33013 -99029 -56049 -70025 30739 72296 39639 118751
874A18751j59710m3183J3514l4865N5021J14823K3182j57518l7011p6922N1276
$$ 118751 -40959 -84142 -70628 -105493 -50472 64351 87533 -69985 -106996 -183918 -132642
863a32642N0356L3238O783J06845k1986R606J00855p7410m3298K1128l5610N6780
$$ -132642 -82286 -49048 -42265 64580 42594 52200 153055 75645 32347 53475 17865 74645
851G4645r3699j7123j84450R030K12615J00890j87855J9485R4231l1061O3031
$$ 74645 -19054 -36177 -220627 -211597 1018 101908 -85947 -66462 27769 -3292 59739
840E9739P1995j14249O0413m1248k6656K0584n8224K6290Q832l7038n8968J41811
$$ 59739 131734 17485 77898 36650 9994 30578 -27646 -1356 7476 -29562 -88530 53281
828E3281j17440j18628R4961m1473L378K02294J8555k6452j9434p2176R1884M1404
$$ 53281 -64159 -182787 -87826 -129299 -125921 76373 94928 68476 49042 -23134 68750 110154
816A10154j26609p0716L3661P328J3558N7188m6504M9613p7383K314K6052J19635
$$ 110154 -16455 -87171 -53510 -46182 -32624 24564 -21940 27673 -49710 -47396 -21344 98291
804I8291Q3103j16384J5361P7899m9586Q1167j44130Q665l0029L8838j0707J1147
$$ 98291 181394 65010 80371 158270 108684 189851 45721 54386 24357 63195 52488 63635
792F3635L9531l1785j14284n3564J3546O3140J79696n9164p1120k881r7569q9059
$$ 63635 103166 71381 -42903 -96467 -82921 -19781 159915 100751 29631 26750 -70819 -159878
780a59878J05013P8333p9091Q6264M5058l5303J920r9020q5525J81537R7214j81808
$$ -159878 -54865 23468 -55623 30641 75699 40396 42316 -56704 -142229 39308 136522 -45286
768d5286L9370J00175p8994r9412K2969R5592j7619N0038M0764p6188j00510K9520
$$ -45286 -5916 94259 15265 -84147 -61178 34414 16795 66833 107597 31409 -69101 -39581
756c9581J9O1041P2531K2242L4991o3229n9727o0867j5861P0187Q7471n4968J0582
$$ -39581 -39562 21479 94010 116252 151243 88014 28287 -32580 -48441 21746 109217 54249 64831
743F4831O6757k1506p2621N7842N6527m4890k2450n8698R8522M8161j20786j60898
$$ 64831 131588 110082 37461 95303 151830 106940 84490 25792 124314 172475 51689 -109209
731a09209J7359N0544N333N4873q3336J26455j4673P1739r1331j40144o6059R4987
$$ -109209 -91850 -41306 -35973 18900 -64436 62019 47346 119085 27754 -112390 -178449 -83462
719h3462P0387j16798R535J08594R9682J1037p2029M5483K0584j11362l8082k7418
$$ -83462 -13075 -129873 -120338 -11744 87938 98975 26946 72429 93013 -18349 -56431 -83849
707h3849q270J43527J02833N650n5396n9845q6752J19444P9730q5975j47053O290
$$ -83849 -92119 51408 154241 159891 104495 44650 -42102 77342 157072 71097 -75956 -69666
695f9666l9681J5904J29604l7817M0736R819r055m0582J0581Q271j26614P5289
$$ -69666 -109347 -93443 36161 -1656 39080 48899 39844 -738 9843 18114 -108500 -33211
683c3211O5926p7628J74338j2749m7987R7139j12323o481O5064Q6540j39706j31649
$$ -33211 32715 -44913 129425 116676 68689 165828 53505 47024 112088 198628 58922 -72727
671g2727J22469R0532K6639j07446j9417J11209r5627M1879p0032m7076O3475
$$ -72727 49742 140274 166913 59467 40050 151259 55632 97511 27479 -19597 43878
660D3878j66369n0101J04732Q6116p5516p6383m0428O9257J41415l1791j51646
$$ 43878 -122491 -172592 -67860 18256 -57260 -133643 -174071 -104814 36601 4810 -146836
649a46836J59709l5251j7455J127o7610P7366K9797q9376J2414J01564K9815l9466
$$ -146836 12873 -22378 -39833 -38706 -106316 -28950 847 -88529 -76115 25449 55264 15798
637A5798j4239j9813m7472k6317J68747K5502O6342r9999j41493n842N8868O4017
$$ 15798 1559 -18254 -65726 -92043 76704 102206 168548 68549 -72944 -78786 -19918 44099
625D4099P3319j00770R140q0182K4140Q3332m6267L1433P6128q8810r1650L2419
$$ 44099 117418 16648 25788 -54394 -30254 53078 6811 38244 114372 25562 -66088 -33669
613c3669J14o2909n8017N1704J30560k2178O7421l9447l3458J2222m1710K7391
$$ -33669 -33555 -96464 -154481 -102777 27783 5605 73026 33579 121 12343 -29367 -1976
601a976M8958k0942j08700J93849M3959j38831q5201q207J6769M9366k7213O8873
$$ -1976 46982 26040 -82660 111189 155148 16317 -68884 -77091 -60322 -10956 -38169 30704
589C0704Q163Q6185j014O17R3711M9665j34835j62548r3919n921J80576j692o8618
$$ 30704 38867 125052 124038 124655 218366 268031 133196 -29352 -123271 -129192 51384 49692 -18926
576a8926J29023k05326j00406Q6134J26153Q1251K541j5805j04265N292L9203
$$ -18926 110097 -95229 -195635 -109501 16652 97903 100444 84639 -19626 -14334 24869
565B4869N3248L0767j13458Q9894j09075J4006J9736q7547k3405O6174j25903
$$ 24869 78117 108884 -4574 85320 -23755 -9749 9987 -77560 -100965 -34791 -160694
554a60694k6328N5864J5523L0434L0131N7328n2160P6043K4895r6252Q5597o1369
$$ -160694 -187022 -131158 -115635 -85201 -55070 2258 -49902 26141 51036 -45216 40381 -20988
542b0988j47249J01067j3375M8522n9631O4414P2833m3677Q8482n0524Q6052K8843
$$ -20988 -168237 -67170 -80545 -32023 -91654 -27240 45593 1916 90398 39874 125926 154769
530A54769o0699M5M1463j43989j857L2586j0256j15176R5972J06685l4574j72889
$$ 154769 94070 94115 135578 -8411 -10268 22318 12062 -103114 -7142 99543 64969 -107920
518a07920k0518J75601j63445m4641q1682J58357M8906p7084Q985K4838P4665
$$ -107920 -128438 47163 -116282 -160923 -242605 -84248 -35342 -112426 -103441 -78603 -3938
507c938K9964R5418M1742j13252N852j13074M3703j3717q5300J9211q4881Q1401
$$ -3938 26026 121444 163186 49934 55786 -57288 -13585 -27302 -112602 -93391 -178272 -96871
495i6871L559P4546J9463M272o6170j4798R9906K2796O5476p1946J0474j53639
$$ -96871 -93312 -18766 697 4969 -61201 -75999 23907 46703 112179 40233 50707 -102932
483a02932P4164j3448Q1103r9721J7128o3450q4289Q7315J35984M0765N4588p187
$$ -102932 -28768 -42216 38887 -60834 -43706 -107156 -191445 -104130 31854 72619 127207 120020
471A20020l1160o4654j6869K7300L8959O8019r5206k877P3039p4082m3352o5591
$$ 120020 88860 24206 7337 34637 73596 141615 46409 43532 116571 42489 -863 -66454
459f6454k8294J70123j101j25053k3003N9575j3934J29214n1875n6764j05217
$$ -66454 -94748 75375 74274 -50779 -73782 -14207 -28141 101073 49198 -7566 -112783
448a12783p400L2360K0000k3210P590K6272J22689m5725l064Q3620M3245q5436
$$ -112783 -120183 -87823 -67823 -91033 -83443 -57171 65518 19793 16729 100349 143594 58158
436E8158q4973J5804R5536K9293j57331O9587L4866q5575J34354J2590j28313
$$ 58158 -26815 -11011 84525 113818 -43513 26074 60940 -24635 109719 122309 -6004
425f004Q9522q9295n9679N7551L5900K6987N3683j00876M6491L5243n6010K1806
$$ -6004 83518 -5777 -65456 -7905 27995 54982 108665 7789 54280 89523 33513 55319
413E5319o8268q8426J29842l662N4627m8260p6724L5538j16543J88466M4998q0663
$$ 55319 -12949 -101375 28467 24805 79432 31172 -45552 -10014 -126557 61909 106907 26244
401B6244m614o9597N643O8290r4903K49285K6213n3127L8998m7833k0743l0671
$$ 26244 21630 -47967 -42324 25966 -68937 180348 206561 153434 192432 144599 123856 93185
389I3185l2984M4224l3382j46688j5637P5617J5144J66355O608j08279J474o7801
$$ 93185 60201 104425 71043 -75645 -91282 -15665 -521 165834 172442 64163 65637 -2164
377b164n2095P1861J0646l3851P6018m6959p8845K3562K8435o7036J93760j27760
$$ -2164 -54259 17602 28248 -5603 70415 23456 -55389 -31827 -3392 -70428 123332 -4428
365d428k8333J01806q2501o849Q3938l1868J06614p1241q8739J75397l5539J10516
$$ -4428 -32761 69045 -13456 -20305 63633 31765 138379 67138 -21601 153796 118257 228773
353B28773K3759j51141m5097Q3658p0673q8575k7222R205R7548K2064r682j4699
$$ 228773 252532 101391 56294 139952 69279 -19296 -46518 -37313 60235 82299 72617 57918
341E7918o8769J8342P5110R0570n6566K0865n3118p0577M0168r9303J1726L5839
$$ 57918 -10851 7491 82601 173171 116605 137470 84352 13775 53943 -45360 -33634 2205
329B205r1058J3973L0533J05807l58r3178l0317M5280j2560L0909L759N7449K7622
$$ 2205 -88853 -74880 -44347 61460 61102 -32076 -62393 -17113 -29673 1236 4995 62444 90066
316I0066l4140j2992L4258L5592j30245L6708L3261N2109j83773M2818J57943
$$ 90066 55926 42934 77192 112784 -17461 19247 52508 104617 -79156 -36338 121605
305A21605k0468k8529j6008m8184k0013O508j7919O4166K045n7411J38087L4864
$$ 121605 101137 72608 56600 8416 -11597 -5089 -23008 41158 43203 -14208 123879 158743
293A58743q6626q7714n5941N3672m1581O1430J05834o6081P5678M4462q7570j4051
$$ 158743 72117 -15597 -71538 -17866 -59447 1983 107817 41736 117414 161876 74306 60255
281F0255j41660n171j237J22787q2132j6855N8618Q490Q8031L7972o4804N1498
$$ 60255 -81405 -86576 -87813 34974 -47158 -64013 -5395 3095 91126 129098 64294 115792
269A15792L1730j09681J0364J6046N790q2682J5170L0865P8783k4850l4687j4289
$$ 115792 147522 37841 48205 64251 70041 -12641 2529 33394 112177 87327 52640 38351
257C8351q592j2261M1454J8934m719j6564n0045L4770K3956R714o9056n8984k8349
$$ 38351 29759 17498 58952 77886 73167 56603 6558 41328 65284 74998 5942 -53042 -81391
244h1391K992j6909L8656L1370J13208O3888L0221q0148p4071R8533J09338j2285
$$ -81391 -78399 -95308 -56652 -25282 87926 151814 182035 101887 27816 126349 235687 223402
232B23402j29088j52045J2573P1390q0236O799O8622P4296J5629J7448K7301n1500
$$ 223402 94314 -57731 -45158 26232 -54004 -47205 21417 95713 111342 128790 156091 104591
220A04591j01613K0536J9169J26465j23493r1276m1090J64709l6102n3282p3330
$$ 104591 2978 23514 42683 169148 45655 -45621 -86711 77998 41896 -11386 -84716
209h4716k7785q5571l8856M6922J10279R0477k4631J3383J8377K3221N2742L7645
$$ -84716 -112501 -198072 -236928 -190006 -79727 10750 -13881 -498 17879 41100 93842 131487
197A31487j28881p6512J76365P8002k3757l4559P492J59035j68854J8480j60840
$$ 131487 2606 -73906 102459 180461 156704 122145 129637 288672 119818 138298 -22542
186b2542L7833K0152q6443n5843n6309k9429O9965M6854J12946M2691Q4011j46741
$$ -22542 15291 35443 -51000 -106843 -163152 -192581 -122616 -75762 37184 79875 163886 17145
174A7145r8951J53474O345o8222p9022O7058j1202P6539m0491L2507j04424j34403
$$ 17145 -81806 71668 78013 9791 -69231 -2173 -13375 63164 22673 55180 -49244 -183647
162a83647Q1720J45118J5677j3865K6792N8869m5773m2350N996j3223L4000n1594
$$ -183647 -101927 43191 58868 45003 71795 130664 84891 42541 48537 35314 69314 17720
150A7720J10262j0066j68573P5556k3517N2109k5410n6701J49352p0206p0884
$$ 17720 127982 117916 -50657 24899 1382 53491 28081 -28620 120732 50526 -20358
139b0358o4394R3469K3452j4937P1631j2816r1819O863J4102o4602n644O7111
$$ -20358 -84752 8717 32169 17232 88863 76047 -15772 -8909 5193 -59409 -65053 2058
127B058L9045j4629m2069m0666P7987N0613q164Q5382m7194r9173m653O1937Q5545
$$ 2058 41103 26474 -15595 -56261 21726 72339 64175 149557 102363 3190 -1463 60474 146019
114A46019o8365o0148q1504l3558Q3445M5692j6466k0913R9420K8424p241l0129
$$ 146019 77654 17506 -63998 -97556 -14111 31581 15115 -5798 93622 122046 114805 84676
102H4676j0391M4604j04363p5931J2871l4523N3304J6734P2036P2274n2521j09215
$$ 84676 74285 118889 14526 -61405 -48534 -83057 -29753 -13019 59017 131291 78770 -30445
90c0445P5549R3007n9564q9678M8796O0836m0100m6373L7801k6814k4378J4445
$$ -30445 45104 138111 78547 -11131 37665 98501 58401 12028 49829 23015 -1363 13082
78A3082j7784K2451P824N2759m1958m6038R5103P546m8840m8396q485O5484l4514
$$ 13082 -4702 17749 25573 78332 36374 -9664 85439 92985 44145 -4251 -12736 52748 18234
65A8234r2198N3466p5632r9839R0374Q3619N0573N8985p230m2829P5993r2461
$$ 18234 -73964 -20498 -96130 -195969 -105595 -21976 28597 87582 80352 37523 113516 21055
53B1055k6060J077j2602l8433P2917p6096K1541L1627j7369M8458L7514n9443
$$ 21055 -5005 -3928 -16530 -54963 17954 -58142 -36601 -4974 -22343 26115 63629 4186
41D186q8616O4247j5294J22789O2920j56869N3941J1700N4176j10764l4568J8686
$$ 4186 -84430 -20183 -35477 87312 150232 -6637 47304 59004 113180 2416 -32152 -13466
29a3466p3932K5256M9004J5604r6648N4440P0994O8296k9043L615m4967p8737
$$ -13466 -87398 -62142 -13138 2466 -94182 -39742 31252 99548 70505 74120 29153 -49584
17d9584L2628R2656m8341q7621n5107P9306Q1266J0917k1325N5229O3804r9919
$$ -49584 -16956 75700 27359 -60262 -115369 -36063 45203 56120 34795 90024 153828 53909
5E3909r696j3891l3573J5114l477
$$ 53909 44213 30322 -3251 11863 8386
0H386
$$ 8386
$$ Imaginary data points
##PAGE= N=2
##DATA TABLE= (X++(I..I)), XYDATA
16383b734546P0462J28402M7662M2984L675k8281P3027J15077n7974K361P226
$$ -2734546 -2664084 -2535682 -2488020 -2445036 -2441361 -2469642 -2396615 -2281538 -2339512 -2337151 -2329925
16372b329925L5467K0257P7350O1064k6224Q301M7181J49625O9033K0658L8916
$$ -2329925 -2294458 -2274201 -2196851 -2135787 -2162011 -2153710 -2106529 -1956904 -1887871 -1867213 -1828297
16361a828297L5778K9106k9507P0398j312j021L9764J1858O4051L9462N802R5109
$$ -1828297 -1792519 -1763413 -1792920 -1722522 -1723834 -1724855 -1685091 -1673233 -1609182 -1569720 -1563918 -1468809
16349a468809M1567L0648P1979m20P8803j2614L4559O3828J37255O3556q6425
$$ -1468809 -1427242 -1396594 -1324615 -1325035 -1246232 -1258846 -1224287 -1160459 -1023204 -959648 -1046073
16338a046073k7248N4614K9792N8257J00562P5666k3044O5410j4871q1967R0706
$$ -1046073 -1073321 -1018707 -988915 -930658 -830096 -754430 -777474 -712064 -726935 -808902 -718196
16327g18196L697K9045J6603J73J51356J11013N3633q3196L9987Q1147n5317j4964
$$ -718196 -714499 -685454 -668851 -668678 -517322 -406309 -352676 -435872 -395885 -314738 -370055 -385019
16315c85019l2720Q2439J05506o6637j0440M6996J13348R3419M8385K740j1081
$$ -385019 -417739 -335300 -229794 -296431 -306871 -259875 -146527 -53108 -4723 -1983 -13064
16304a3064j8078Q3337k9373k4447N0482M9883O4032J33544J19094M5518j52259
$$ -13064 -31142 52195 22822 -1625 48857 98740 162772 296316 415410 460928 308669
16293C08669J0148j440m7667J35661o3361O7504J44058n5323M9312n726m5902
$$ 308669 318817 317377 269710 405371 342010 409514 553572 498249 547561 541835 495933
16282D95933P1509J28314O2085o0387L4702l4250L1789j5876J20448K5877j7220
$$ 495933 567442 695756 757841 697454 732156 697906 729695 713819 834267 860144 842924
16271H42924K4545K7113J28647N6281Q7646k5989k8017r3557J4088N9233K5678
$$ 842924 867469 894582 1023229 1079510 1167156 1141167 1113150 1019593 1033681 1092914 1118592
16260A118592o2363J2439J40223j7917n1369l3863R4259Q5881R3627k5809P035
$$ 1118592 1056229 1068668 1208891 1190974 1139605 1105742 1200001 1285882 1379509 1353700 1360735
16249A360735M771M3856Q2733m6670m4002N8072M0614O5255k3042Q5502l9372
$$ 1360735 1365506 1409362 1492095 1445425 1401423 1459495 1500109 1565364 1542322 1627824 1588452
16238A588452m9599L9772M719P9542N4751k5679q863M7591J24275o737o7104J12622
$$ 1588452 1538853 1578625 1583344 1662886 1717637 1691958 1683095 1730686 1854961 1848224 1781120 1893742
16226A893742J45215k1358p6975N2902p3463J4398R7595o3555M4349l2332r2090
$$ 1893742 2038957 2017599 1940624 1993526 1920063 1934461 2032056 1968501 2012850 1980518 1888428
$$ [...]
##END NTUPLES=NMR SPECTRUM
##END=
