##TITLE=1H_TG-2412-X1
 200.13Hz, DMSO+CCl4.
 8 sc
10.8.2026
##JCAMPDX= 6.0         $$ Bruker NMR JCAMP-DX V2.0
##DATA TYPE= NMR SPECTRUM
##DATA CLASS= NTUPLES
##ORIGIN= UXNMR, Bruker Analytische Messtechnik GmbH
##OWNER= pz
$$ XWIN-NMR		Version 3.5
$$ Mon Aug 10 13:42:11 2026 Russian Standard Time (UT+4h)  she@DPX200
##.OBSERVE FREQUENCY= 200.1313
##.OBSERVE NUCLEUS= ^1H
##.ACQUISITION MODE= SIMULTANEOUS
##.ACQUISITION SCHEME= undefined
##.AVERAGES= 8
##.DIGITISER RES= 18
##SPECTROMETER/DATA SYSTEM= spect
##.PULSE SEQUENCE= zg30
##.SOLVENT NAME= DMSO
##.SHIFT REFERENCE= (INTERNAL, DMSO, 0, 15.5067)
##AUDIT TRAIL= $$ (NUMBER, WHEN, WHO, WHERE, WHAT)
$$ ##TITLE= Audit trail, XWIN-NMR		Version 3.5
$$ ##JCAMPDX= 5.01
$$ ##ORIGIN= Bruker BioSpin GmbH
$$ ##OWNER= she
$$ F:/spectra/data/she/nmr/H-C/1/pdata/1/auditp.txt
$$ ##AUDIT TRAIL=  $$ (NUMBER, WHEN, WHO, WHERE, WHAT)
(   1,<2026-08-10 13:40:31.46 +0400>,<she>,<DPX200>,
      <created by zg, POWCHK disabled, PULCHK disabled
       configuration hash MD5:
       00 E9 B6 7A A2 85 ED C7 34 08 36 98 17 FE 4E 26
       data hash MD5: 16K
       BA E2 EE 93 3B 8B 73 59 68 AB 4A 1E C0 C4 2F 34>)
(   2,<2026-08-10 13:40:37.96 +0400>,<she>,<DPX200>,
      <Start of raw data processing
       efp BC_mod = 2 LB = 0.25 FT_mod = 6 PKNL = 1 PHC0 = -4217.216 PHC1 = 9.7923 SI = 16K 
       data hash MD5: 16K
       3C 87 7B 5F 3D 4E D6 F9 D4 A0 72 02 53 DE E7 A4>)
(   3,<2026-08-10 13:40:54.37 +0400>,<she>,<DPX200>,
      <pk PHC0 = -3.933082 PHC1 = 3.8 
       data hash MD5: 16K
       72 6A 47 12 6C AF 1A D8 40 E0 C7 F0 99 36 54 83>)
(   4,<2026-08-10 13:40:58.03 +0400>,<she>,<DPX200>,
      <abs ABSG = 5 
       data hash MD5: 16K
       1F 3B 0C B3 AF A6 0F C0 80 5D 8C 88 01 F8 07 7A>)
$$ ##END=
$$ 
$$ hash MD5
$$ 9F 21 AE 8E A5 B8 CC 0B 6E 41 40 61 0C A9 D7 AC
##$RELAX= 
##$RELAX= 
##$RELAX= 
##$RELAX= 
##$RELAX= 
##$RELAX= 
$$ Bruker specific parameters
$$ --------------------------
##$DU= <F:/spectra>
##$EXPNO= 1
##$NAME= <H-C>
##$PROCNO= 1
##$TYPE= <nmr>
##$USER= <she>
##$AMP= (0..31)
100 100 100 100 100 100 100 100 100 100 100 100 100 100 100 100 100 100 
100 100 100 100 100 100 100 100 100 100 100 100 100 100 
##$AQSEQ= 0
##$AQ_mod= 1
##$AUNM= <au_zg>
##$AUTOPOS= <>
##$BF1= 200.13
##$BF2= 200.13
##$BF3= 200.13
##$BF4= 200.13
##$BF5= 200.13
##$BF6= 200.13
##$BF7= 200.13
##$BF8= 200.13
##$BYTORDA= 1
##$CFDGTYP= 0
##$CFRGTYP= 5
##$CHEMSTR= <none>
##$CNST= (0..31)
1 1 145 1 1 1 1 1 1 1 1 1 1 1 1 1 1 1 1 1 1 1 1 1 1 1 1 1 1 1 1 1 
##$CPDPRG= <>
##$CPDPRG1= <>
##$CPDPRG2= <>
##$CPDPRG3= <>
##$CPDPRG4= <mlev>
##$CPDPRG5= <mlev>
##$CPDPRG6= <mlev>
##$CPDPRG7= <mlev>
##$CPDPRG8= <mlev>
##$CPDPRGB= <>
##$CPDPRGT= <>
##$D= (0..31)
0 0.7 0 0 0 0 0 0 0 0 0 0.03 0 0 0 0 0 0 0 0 0 0 0 0 0 0 0 0 0 0 0 0 
##$DATE= 1786354830
##$DBL= (0..7)
120 120 120 120 120 120 120 120 
##$DBP= (0..7)
150 150 150 150 150 150 150 150 
##$DBP07= 0
##$DBPNAM0= <>
##$DBPNAM1= <>
##$DBPNAM2= <>
##$DBPNAM3= <>
##$DBPNAM4= <>
##$DBPNAM5= <>
$$ [...]
##$SUBNAM3= <"">
##$SUBNAM4= <"">
##$SUBNAM5= <"">
##$SUBNAM6= <"">
##$SUBNAM7= <"">
##$SUBNAM8= <"">
##$SUBNAM9= <"">
##$SW= 18.0517328524113
##$SWIBOX= (0..15)
0 0 2 0 0 0 0 0 0 0 0 0 0 0 0 0 
##$SW_h= 3612.71676300578
##$TD= 16384
##$TD0= 1
##$TE= 0
##$TE2= 300
##$TE3= 300
##$TEG= 300
##$TL= (0..7)
0 120 120 120 120 120 120 120 
##$TP= (0..7)
150 150 150 150 150 150 150 150 
##$TP07= 0
##$TPNAME0= <>
##$TPNAME1= <>
##$TPNAME2= <>
##$TPNAME3= <>
##$TPNAME4= <>
##$TPNAME5= <>
##$TPNAME6= <>
##$TPNAME7= <>
##$TPOAL= (0..7)
0.5 0.5 0.5 0.5 0.5 0.5 0.5 0.5 
##$TPOFFS= (0..7)
0 0 0 0 0 0 0 0 
##$TUNHIN= 0
##$TUNHOUT= 0
##$TUNXOUT= 0
##$USERA1= <user>
##$USERA2= <user>
##$USERA3= <user>
##$USERA4= <user>
##$USERA5= <user>
##$V9= 5
##$VALIST= <valist>
##$VCLIST= <CCCCCCCCCCCCCCC>
##$VD= 0
##$VDLIST= <DDDDDDDDDDDDDDD>
##$VPLIST= <PPPPPPPPPPPPPPP>
##$VTLIST= <TTTTTTTTTTTTTTT>
##$WBST= 1024
##$WBSW= 4
##$XGAIN= (0..3)
0 0 0 0 
##$XL= 0
##$YL= 0
##$YMAX_a= 139845
##$YMIN_a= -145736
##$ZGOPTNS= <>
##$ZL1= 120
##$ZL2= 120
##$ZL3= 120
##$ZL4= 120
##$ABSF1= 15.54196
##$ABSF2= -2.509892
##$ABSG= 5
##$ABSL= 3
##$ALPHA= 0
##$AQORDER= 0
##$ASSFAC= 0
##$ASSFACI= 0
##$ASSFACX= 0
##$ASSWID= 0
##$AUNMP= <proc_1d>
##$AZFE= 0.1
##$AZFW= 0.1
##$BCFW= 0
##$BC_mod= 2
##$BYTORDP= 0
##$COROFFS= 0
##$CY= -3
##$DATMOD= 1
##$DC= 0
##$DFILT= <>
##$DTYPP= 0
##$F1P= 0
##$F2P= 0
##$FCOR= 1
##$FTSIZE= 16384
##$FT_mod= 6
##$GAMMA= 0
##$GB= 0
##$INTBC= 1
##$INTSCL= 3.241238e-09
##$ISEN= 128
##$LB= 0.25
##$LEV0= 0
##$LPBIN= 0
##$MAXI= 10000
##$MC2= 0
##$MEAN= 0
##$ME_mod= 0
##$MI= 1.114404
##$NCOEF= 0
##$NC_proc= -7
##$NLEV= 6
##$NOISF1= 3.799351
##$NOISF2= 2.8
##$NSP= 0
##$NTH_PI= 0
##$NZP= 0
##$OFFSET= 15.5067
##$PC= 1
##$PHC0= -4221.149
##$PHC1= 13.5923
##$PH_mod= 1
##$PKNL= yes
##$PPARMOD= 0
##$PSCAL= 0
##$PSIGN= 0
##$REVERSE= no
##$SF= 200.130003003616
##$SI= 16384
##$SIGF1= 3
##$SIGF2= 2
##$SINO= 0.751879
##$SIOLD= 32768
##$SREGLST= <19F.Aceton>
##$SSB= 0
##$STSI= 16384
##$STSR= 0
##$SW_p= 3612.71676300578
##$SYMM= 0
##$S_DEV= 0
##$TDeff= 16384
##$TDoff= 0
##$TI= <>
##$TILT= no
##$TM1= 0
##$TM2= 0
##$TOPLEV= 0
##$USERP1= <user>
##$USERP2= <user>
##$USERP3= <user>
##$USERP4= <user>
##$USERP5= <user>
##$WDW= 1
##$XDIM= 16384
##$YMAX_p= 298509967
##$YMIN_p= -710277
$$ End of Bruker specific parameters
$$ ---------------------------------
##NTUPLES= NMR SPECTRUM
##VAR_NAME=  FREQUENCY,     SPECTRUM/REAL,   SPECTRUM/IMAG
##SYMBOL=    X,             R,               I
##VAR_TYPE=  INDEPENDENT,   DEPENDENT,       DEPENDENT
##VAR_FORM=  AFFN,          ASDF,            ASDF
##VAR_DIM=   16384,         16384,           16384
##UNITS=     HZ,            ARBITRARY UNITS, ARBITRARY UNITS
##FACTOR=    0.220516191357247, 1,           1
##FIRST=     3103.35582993379, 0,            0
##LAST=      -509.360933071989, 0,           0
##MIN=       -509.360933071989, -710277,     0
##MAX=       3103.35582993379, 298509967,    0
$$ Real data points
##PAGE= N=1
##DATA TABLE= (X++(R..R)), XYDATA
$$ [...]
5981E19816n5389K08433n0072n4671o3272J31355K3487l23391L87701J82832l4190
5970H72639j92408l43757N7461J98010j75293k20279J91321J24623P7835j81888
5960D08264m282j09340J09575L15599o7831j44516O3232j03534j48145R4172J8464
5949D31658P7028j0871K63296o9111j58544l2361n5743K32799k4644K2961J9007
5938F95475j67253P6814J28279q6163l32106K5279r7577K17235L7282n6476Q2053
5927E22842o3881J43952n0897J71714j90044m0328O9019J8203K82863j78605J67980
5916H52818N1222o1422j15762N9979K28925j01202k05920j60463j13204J5395
5906D50366O6282J22981J75000Q2445J61210j6628l17302J1693j69627l3192M2957
$$ y = [519816, 464427, 672860, 622788, 568117, 504845, 636200, 659687, 336296, 723997, 906829, 872639, 680231, 336474, 393935, 591945, 416652, 196373, 387694, 512317, 590152, 408264, 403982, 294642, 404217, 719816, 651985, 507469, 570701, 467167, 319022, 413194, 431658, 508686, 497815, 761111, 692000, 533456, 501095, 445352, 678151, 653507, 676468, 695475, 528222, 605036, 733315, 647152, 315046, 340325, 242748, 459983, 497265, 440789, 522842, 458961, 602913, 552016, 723730, 533686, 493358, 562377, 580580, 863443, 684838, 852818, 904040, 842618, 726856, 786835, 1015760, 914558, 708638, 548175, 434971, 450366, 516648, 639629, 814629, 897074, 1058284, 1041656, 724354, 736047, 566420, 533228, 576185]
5895E76185K88766J43578j30843j77832k01921M09179J52738j00761k83156j15911
5885E60022L074M24807k47271J75228j65246J28896j6386J7367J09994k21265
5875G69220K08474L23312O1966l77229l89348K13392K35504p7830J50253j76396
5865I41318J5M9601J64002j35463K31092K09462J07860J5073J64109K7933j75852
5854A599150R2142K545L3629l3422m0476L26599k6856Q8948r8893j34499J19714
5843A928581n4848k09094j8469J12847p1271k08667Q9290J53549J9582R9827j75910
5832A665417j42809J22717L38010J38614m78273K47367R7404j18782J40764L89743
5822B400172j44238l14204L41843R5369k53207M6268L73685j5449K38196m7666
$$ y = [576185, 864951, 1008529, 877686, 699854, 497933, 907112, 1059850, 959089, 675933, 560022, 563096, 987903, 740632, 915860, 750614, 879510, 863124, 880491, 990485, 769220, 977694, 1301006, 1362972, 985743, 596395, 809787, 1045291, 967461, 1117714, 941318, 941333, 990934, 1154936, 1019473, 1250565, 1460027, 1567887, 1582960, 1747069, 1775002, 1599150, 1691292, 1693837, 1727466, 1694044, 1653568, 1980167, 1953311, 2042259, 1943366, 1808867, 1928581, 1873733, 1664639, 1646170, 1759017, 1687746, 1479079, 1568369, 1721918, 1741500, 1841327, 1665417, 1522608, 1645325, 1983335, 2121949, 1643676, 1891043, 1988447, 1869665, 2010429, 2400172, 2255934, 1941730, 2283573, 2378942, 2125735, 2172003, 2545688, 2530239, 2768435, 2720769]
5812B720769R9999j79617k47737k53469J32325K89593n6387j63571M5917J20202
5802B508024J54740J76956m0924l16388m2876J45839L55051J7279r5858K54702
5792C116545K96597M3993K59217p8233r6882J22336q4152j33568P9572M61424
5782C986849N0779j18327J94190L4484K05529L71041k6366K62583L39185J78798
5772E478745K33021P45506N37497J72905N08967J067996Q17782R11963J375249
5763A1849631J777402K457352L745417N867479Q361143J1136841J3542704J1572752
5755G0310721M420016j016217l655659m761638n167078n972970p016551p488355
5747C9652269o656753n686771m921122l523721j629981j194772j004438r45592
$$ y = [2720769, 2820768, 2641151, 2393414, 2139945, 2272270, 2561863, 2505476, 2341905, 2387822, 2508024, 2662764, 2839720, 2798796, 2482408, 2439532, 2585371, 2940422, 2957701, 2861843, 3116545, 3413142, 3457135, 3716352, 3638119, 3541237, 3663573, 3579421, 3445853, 3525425, 3986849, 4037628, 3919301, 4113491, 4147975, 4353504, 4724545, 4698179, 4960762, 5299947, 5478745, 5711766, 6457272, 6994769, 7167674, 7676641, 8744637, 9562419, 10474382, 11849631, 13627033, 16084385, 19829802, 25697281, 34058424, 45195265, 58737969, 70310721, 74730737, 73714520, 70058861, 65297223, 60130145, 54157175, 47140624, 39652269, 32995516, 27308745, 22387623, 18863902, 17233921, 16039149, 15034711, 14089119]
5739A4089119l01308k26775l44644r9934J76480J77739k9132M78815K19924K94829
5729A4435113O08369N16314K56900N11267P54409P28111P42569P37626J062717
5720B0353395J250274J386039J078459J150141J284455J204310J750770J278133
5712C0735976J633919J539825J718892J762690J439624J511931J180906J113511
5704D2637274J186487J211494J012312Q66984M25834K79234M58397O3437m6984
5695D8094469j03660o29385n30484r02908j214908j082120q57456j013913j541457
5686D0218178j619941j447851j903786j609349j499623j771103j594521j334799
5678B7437205j658250j703943j330598j410028j204043r84168j151791j033148
$$ y = [14089119, 13787811, 13561036, 13216392, 13116458, 13292938, 13470677, 13441545, 13920360, 14140284, 14435113, 15043482, 15559796, 15816696, 16327963, 17082372, 17810483, 18553052, 19290678, 20353395, 21603669, 22989708, 24068167, 25218308, 26502763, 27707073, 29457843, 30735976, 32369895, 33909720, 35628612, 37391302, 38830926, 40342857, 41523763, 42637274, 43823761, 45035255, 46047567, 46914551, 47340385, 47619619, 48078016, 48141453, 48094469, 47990809, 47361424, 46830940, 45928032, 44713124, 43631004, 42773548, 41759635, 40218178, 38598237, 37150386, 35246600, 33637251, 32137628, 30366525, 28772004, 27437205, 25778955, 24075012, 22744414, 21334386, 20130343, 19146175, 17994384, 16961236]
5670A6961236j096052r99285r08288r78643q58881n26508n67518o76088p59514
5661I590459m27737k46855p91669l13453j39773m47627p51464o18635k25550p0796
5651E556900l90401o7433k10927m46816k54172J464j72174k58471Q699q0669K1471
5640C707471k07082l03094j71624J95670j88336r7204j9372q3266l05140k48323
5630B279700j52842K67319j09021J03632n08622j84561M35550l14809M0503R9086
5620A955935j36019k42527J37654q350k44893K62430Q9524j51153N4180j78661
5610A538120J14203N076j70404O7396l14926l25036K81246K27215j5688j42637
5600A264565j00682J13064K63306p8780j43938L478P3968N7987k90207p4610J88068
$$ y = [16961236, 15865184, 14865899, 13957611, 12978968, 12120087, 11593579, 11026061, 10349973, 9590459, 9162722, 8915867, 8124198, 7810745, 7670972, 7223345, 6471881, 5853246, 5627696, 5556900, 5166499, 5099066, 4888139, 4441323, 4187151, 4188615, 4016441, 3757970, 3766669, 3686000, 3707471, 3500389, 3197295, 3025671, 3221341, 3033005, 2935801, 2916429, 2833163, 2528023, 2279700, 2126858, 2394177, 2285156, 2388788, 1880166, 1695605, 2131155, 1816346, 1856849, 1955935, 1819916, 1577389, 1715043, 1706693, 1461800, 1724230, 1813754, 1662601, 1716781, 1538120, 1652323, 1657399, 1486995, 1554391, 1239465, 914429, 1195675, 1422890, 1407202, 1264565, 1163883, 1276947, 1540253, 1461473, 1317535, 1321013, 1394981, 1452968, 1162761, 1088151, 1276219]
5589A276219j28328p9302j4170J28380L8846j57505j46255p9510M1401L71285
5579A251061J12157M6022j27185k33774j38559q6356O8799J03662j53371J7173
5569H59629k9319m0803L29572J85003l29441K19680J43825l45876j79443j41654
5559F71173N3327R6399R6644L8304p9661K72695M6186k8192J9752j7773l14093
5548H54761J51856L00452j11796k72788K2456J58977N1682K6170o961j34885j89492
5537H50432l31803J82335K74939J13462k5695m0357R3405r0542k85041K6204L14867
5526A082206l22802k566J76495j10684k01191K38495Q0127m9907N5895j76969
5516G69099J42652k13592j54206J9007l696K88580o4915O1888L8898l6499k70851
$$ y = [1276219, 1147891, 1068589, 1054419, 1182799, 1221645, 1064140, 917885, 838375, 879776, 1251061, 1363218, 1409240, 1282055, 1048281, 909722, 823366, 892165, 995827, 842456, 859629, 830310, 789507, 1119079, 1304082, 974641, 1194321, 1338146, 992270, 812827, 671173, 724500, 820899, 917543, 955847, 876186, 1148881, 1195067, 1166875, 1186627, 1168854, 854761, 1006617, 1307069, 1195273, 922485, 944941, 1103918, 1155600, 1181770, 1174809, 1039924, 850432, 518629, 700964, 975903, 1089365, 1063670, 1023313, 1116718, 1026176, 741135, 767339, 1082206, 759404, 756838, 933333, 822649, 621458, 859953, 940080, 890173, 946068, 769099, 911751, 698159, 543953, 562960, 559264, 847844, 782929, 844817, 883715, 847216, 576365]
5505E76365M00894J47244j48902p9350j52463K13802n7065N2141J92147n758K4181
5494A163236q6242o1098Q1974M88243p8657k42264K68602n6387l18764Q0342k11699
5483A027286J05541J54144M0801j63427k91294M8394K29173J24253J35006J02536
5473A512413J5383k56131N7479K54482K0471k95633j18976L09766Q0855N0622
5463A630731M2750k18649P2402Q7822j86395j09038L21470K63030j024k11420
5453A691679k32820K46161L08560J13393k42771k25231K87819j61926k08757K60188
5443A836295q8793k39980M85334M9451l47218Q5157L9941p9192L4823J02542M0781
5432A919141K7685j43902M30108R4987l06626J18061J86546j59209j6269n5796
$$ y = [576365, 977259, 1124503, 975601, 896251, 743788, 957590, 900525, 952666, 1144813, 1139055, 1163236, 1076994, 1015896, 1097870, 1586113, 1507456, 1265192, 1533794, 1477407, 1158643, 1238985, 1027286, 1132827, 1286971, 1327772, 1164345, 873051, 921445, 1150618, 1274871, 1409877, 1512413, 1527796, 1271665, 1329144, 1583626, 1604097, 1308464, 1189488, 1499254, 1580109, 1630731, 1673481, 1454832, 1527234, 1615056, 1428661, 1319623, 1641093, 1904123, 1903099, 1691679, 1458859, 1705020, 2013580, 2126973, 1884202, 1658971, 1946790, 1784864, 1576107, 1836295, 1747502, 1507522, 1992856, 2042307, 1695089, 1780246, 1820187, 1740995, 1775818, 1878360, 1919141, 1946826, 1802924, 2233032, 2328019, 2021393, 2139454, 2326000, 2166791, 2150522, 2094726]
5422B094726j33823K43641n6901K49883K61042k40480k76928k8889K78512J99242
5412B590025R9462m94065j99056M38322J43566K14870R0027q9337N5533q8454
5402B760893K38686j7875j04297o6641m3820k8592L90319J27312n65616L6443
5392B726812K05912J40473J03154k85187j1895Q8818K54835l3041J36335k40073
5382C086143J30223p9042J8267J64051o1591j82019K42508K07127M7816k06395
5372C367088R5312L58558K25032M7170o5509M8800J85160n4774O1052J13232j17999
5361D263122K76437M8794j03451m6063j83188K34956J35388Q5025L73618k33252
5351D851386j40964R0076l8211J08996M72926r4679N038K47769J32471j93169
$$ y = [2094726, 1960903, 2204544, 2147643, 2397526, 2658568, 2418088, 2141160, 2112271, 2390783, 2590025, 2689487, 2195422, 1996366, 2434688, 2578254, 2793124, 2883151, 2793814, 2849347, 2760893, 2999579, 2981704, 2877407, 2810766, 2766946, 2738354, 3128673, 3255985, 2690369, 2726812, 2932724, 3073197, 3176351, 2891164, 2879269, 2968087, 3222922, 3189881, 3326216, 3086143, 3216366, 3137324, 3155591, 3319642, 3258051, 3076032, 3318540, 3525667, 3573483, 3367088, 3462400, 3820958, 4045990, 4093160, 4027651, 4076451, 4261611, 4206837, 4267889, 4381121, 4263122, 4539559, 4588353, 4484902, 4438839, 4255651, 4490607, 4625995, 4711020, 5084638, 4851386, 4710422, 4800498, 4762287, 4871283, 5344209, 5249530, 5254568, 5502337, 5634808, 5441639]
5341E441639R1772J65543l7945Q6934J89365L4802K17300k29934j08326L50095
5331F201245J0469J04000J08598L2105K25737M4749J73849P2913J78712m5705
5321G106672M6657R419L77499J96597K01882L54287R1405J82488r8620J66489
5311H634775K28773K25361L21382L71177M56912N80545P35671N61750M15393J083361
5301A3615100J303731J685497J655718J966804K484195K125035K175147J497604
5293B8508831J249212O06717J37396K92538R63880K105078K657907L016063L163317
5284D2700939K511447R36782K9713p83932j862488k558415k675173k462152j732969
5275C4103752r96468r12558o44712n21379r10331j197792j401054j684405j788053
$$ y = [5441639, 5533411, 5698954, 5661009, 5747943, 5937308, 5972110, 6189410, 5959476, 5851150, 6201245, 6211714, 6315714, 6424312, 6456417, 6682154, 6726903, 6900752, 6973665, 7152377, 7106672, 7153329, 7162748, 7540247, 7736844, 7938726, 8293013, 8384418, 8566906, 8468286, 8634775, 8863548, 9088909, 9410291, 9781468, 10238380, 10818925, 11554596, 12116346, 12531739, 13615100, 14918831, 16604328, 18260046, 20226850, 22711045, 24836080, 27011227, 28508831, 29758043, 30364760, 30502156, 30794694, 31758574, 33863652, 36521559, 39537622, 42700939, 45212386, 46149168, 46178881, 45394949, 43532461, 40974046, 38298873, 35836721, 34103752, 33107284, 32194726, 31550014, 31028635, 30118304, 28920512, 27519458, 25835053, 24047000]
5266B4047000k317160j521073j147649j370366r94367p46120n80321O5807j05997
5257A5329754m74907j88861j31624j10001J16706K53859J77701j7255K07519K16334
5247A5379225j44194o0834J68677L64566L00087J8166K76366N11660K23571M15120
5237A7452410L05988K04157J13248L33421L88932J67863K50982L66449M21822
5228B0005272O81754K84117L91763O16330L07885K87057P25192P91897M79132
5219B4570399K80056M00795L77366O90528Q20997R14568N07845O13799Q16381
5210B9992734R46289P69988O13978R20860J038844R12286J287619J020141J053800
5201C8556539J357088J114072J646845J451025J490929J521679J709871J830145
$$ y = [24047000, 21729840, 20208767, 19061118, 17690752, 16696385, 15950265, 15369944, 15435751, 15329754, 14854847, 14665986, 14534362, 14424361, 14541067, 14794926, 14972627, 14955372, 15162891, 15379225, 15235031, 15174197, 15342874, 15707440, 16007527, 16025693, 16302059, 16813719, 17037290, 17452410, 17758398, 17962555, 18075803, 18409224, 18798156, 18966019, 19217001, 19583450, 20005272, 20687026, 20971143, 21362906, 21979236, 22287121, 22574178, 23299370, 24091267, 24570399, 24850455, 25251250, 25628616, 26319144, 27140141, 28054709, 28562554, 29176353, 29992734, 30939023, 31709011, 32322989, 33243849, 34282693, 35194979, 36482598, 37502739, 38556539, 39913627, 41027699, 42674544, 44125569, 45616498, 47138177, 48848048, 50678193]
5193E0678193J722205J864918K458798K237531K251553K302706K725696K783209
5185F9024809K987856L109483L147833L573836L640822L640045L924816M166692
5177I7216192M015391M613736M564770M594644M474657M892026M882321M835834
5169A34089571M241286L990730L947738L780837K967574K792993K766648J408860
5161A59986237L29596M08154K10491j206618j838244k275743k569360l330350
5153A49714163m071505m142701m288278m953967n217934n125870m808754m696230
5145A12408924m700422m641352m460884m490027m217890m029613l824170l427521
5137G8617045l504416l009882l255357l194080k663273k615353k328931k515172
$$ y = [50678193, 52400398, 54265316, 56724114, 58961645, 61213198, 63515904, 66241600, 69024809, 72012665, 75122148, 78269981, 81843817, 85484639, 89124684, 93049500, 97216192, 101231583, 105845319, 110410089, 115004733, 119479390, 124371416, 129253737, 134089571, 138330857, 142321587, 146269325, 150050162, 153017736, 155810729, 158577377, 159986237, 160315833, 160723987, 160934478, 159727860, 157889616, 155613873, 153044513, 149714163, 145642658, 141499957, 137211679, 132257712, 127039778, 121913908, 117105154, 112408924, 107708502, 103067150, 98606266, 94116239, 89898349, 85868736, 82044566, 78617045, 75112629, 72102747, 68847390, 65653310, 62990037, 60374684, 58045753, 55530581]
5129E5530581j917988k080798j831591j828733k074749j587904j240579j425506
5121D1542733j610561j251884j613289j362590r46040j055951q51971j255066
5113C1595381j227284r55739p65005j000873r93543q06414p66690r37050o93908
5104B3448875l37719o34194l54455p36059o46550m39887o55753o14776l21505
5095A8707977m87723n41033n92413l95147l46428m12381l16520k04743m48530
5086A4963059n68647m58362j50714l72042k11345l64157o02413n6637l30363k25263
5076A1623116j38060j99750m24222k15883k76345k72276j82520q3522j2953n08799
5066I308786q4586j02379k88310J35784k70352k24246j50545k97208k94997J30171
$$ y = [55530581, 53612593, 51531795, 49700204, 47871471, 45796722, 44208818, 42968239, 41542733, 39932172, 38680288, 37066999, 35704409, 34758369, 33702418, 32850447, 31595381, 30368097, 29412358, 28647353, 27646480, 26652937, 25846523, 25079833, 24142783, 23448875, 23111156, 22476962, 22122507, 21386448, 20739898, 20300011, 19644258, 19029482, 18707977, 18220254, 17679221, 17086808, 16691661, 16345233, 15932852, 15616332, 15411589, 14963059, 14394412, 13936050, 13785336, 13413294, 13201949, 12837792, 12235379, 12178742, 11848379, 11623116, 11485056, 11285306, 10861084, 10645201, 10368856, 10096580, 9914060, 9830538, 9817585, 9308786, 9224200, 9121821, 8833511, 8969295, 8698943, 8474697, 8324152, 8026944, 7731947, 7862118]
5056G862118J13316j51996K1315k04977m55392m46234j0397j50657j39426p7422
5046F360248M5083j66292k55147n907k55852K34409p546M712K29343m14214j58895
5035E609942Q8394j32417l02697q7372o6810k15169K1533j11286j43191J5672
5025D676599j55068K6131L9994M0870k9785p9413l60998j96760Q7864q1160j00433
5014C867841j41431j6918m5697J53078k48641o9941m3437J70050J828O4891j50763
5003C540860l50067K50911J7352M9147J84140J30536l3351r0217j38933N2829
4993C613207Q01598L77604j98978J10992M26534L083n3379l57633k73813k79467
4983D169748m4269n42501l17442j0272k1437j89682k36164J39762k97601J24562
$$ y = [7862118, 7975434, 7823438, 7844753, 7639776, 7184384, 6738150, 6727753, 6577096, 6437670, 6360248, 6405331, 6239039, 5983892, 5977985, 5722133, 5956542, 5948996, 5953708, 6183051, 5768837, 5609942, 5698336, 5565919, 5263222, 5175850, 5109040, 4893871, 4915404, 4804118, 4660927, 4676599, 4521531, 4547662, 4587656, 4628526, 4598741, 4519328, 4158330, 3961570, 4049434, 3968274, 3867841, 3726410, 3709492, 3663795, 3816873, 3568232, 3498291, 3454854, 3624904, 3626732, 3691623, 3540860, 3190793, 3441704, 3459056, 3508203, 3692343, 3822879, 3789528, 3699311, 3560378, 3613207, 4414805, 4792409, 4593431, 4704423, 5130957, 5134040, 5080661, 4723028, 4449215, 4169748, 4125479, 3582978, 3265536, 3255264, 3233827, 3044145, 2807981, 2947743, 2650142, 2774704]
4973B774704r7042j84098K4464J38075K8215l5576l01232N6959j2278m0755k44810
4962B106626K34123n2360k76724J02892J98400k68908J52129j1030l21010J9748
4952A883886p114P5566K51525j70178k39070k737K54805j42441k53563l8336l384
4941A608959M6356m0955K56857O2546m4828j65134j74460K21134L63818k70766
4931A863527m0027J5718J00962m839m82444j9683J12711J4884n5953o3646p3632
4920A367578k385M27258j91008j21041J51698J43590j28241j85368Q277J70934
4910A641292L63797m11840Q6702Q8779J19895o4617k44626j41856l1075P7079
4900A483530J83511K99057m88438J47175j2674j24122O418n1284j47436K85796
$$ y = [2774704, 2677662, 2493564, 2518028, 2656103, 2684318, 2648742, 2347510, 2404469, 2392191, 2351436, 2106626, 2340749, 2288389, 2011665, 2114557, 2312957, 2044049, 2196178, 2185148, 1864138, 1883886, 1876772, 1952338, 2203863, 2033685, 1794615, 1791878, 2046683, 1904242, 1650679, 1612343, 1608959, 1655315, 1614360, 1871217, 1933763, 1888935, 1723801, 1549341, 1770475, 2134293, 1863527, 1823500, 1839218, 1940180, 1935341, 1452897, 1433214, 1545925, 1560809, 1504856, 1441210, 1367578, 1365193, 1792451, 1601443, 1480402, 1632100, 1775690, 1647449, 1462081, 1470358, 1641292, 2005089, 1593249, 1679951, 1768730, 1888625, 1824008, 1579382, 1437526, 1406451, 1483530, 1667041, 1966098, 1477660, 1624835, 1612161, 1488039, 1494457, 1443173, 1295737, 1581533]
4890A581533n8691m7950K51514k19146l8794k036M1443L2830k00899q1805Q2542
4879A340541n4370m2259K05277J6672j51138k62045J41787K94040l2872j08373
4869A347260K87929k3187j66311K1084r246r2505j30558P1221K1718J47641l0150
4858A444896L51583k04078l7966K52509L80387R8929j59246L25362P8414K94712
4848B825502K36923L39931J98292N08520N4881j96517O1695k04222j62680j41450
4838C520875J87938n8919M9613k72093K13095M06138L86815J09723K16119O46883
4828E406187P57266J026502J688357J605330L110921M593400O510952Q332081
4820C3030996Q669000O376119J171935j345082k758776k844332l365208l763689
$$ y = [1581533, 1522842, 1474892, 1726406, 1507260, 1468466, 1466430, 1507873, 1540703, 1339804, 1257999, 1340541, 1286171, 1243912, 1449189, 1465861, 1314723, 1052678, 1194465, 1488505, 1455633, 1347260, 1635189, 1612002, 1445691, 1466775, 1457529, 1365024, 1234466, 1305687, 1327405, 1475046, 1444896, 1796479, 1592401, 1554435, 1806944, 2187331, 2286260, 2127014, 2452376, 2530790, 2825502, 3062425, 3402356, 3600648, 4109168, 4164049, 3967532, 4029227, 3825005, 3662325, 3520875, 3708813, 3649894, 3699507, 3427414, 3640509, 4046647, 4433462, 4543185, 4759304, 5406187, 6163453, 7189955, 8878312, 10483642, 13594563, 18187963, 24698915, 33030996, 41699996, 48076115, 49248050, 47902968, 45144192, 42299860, 38934652, 35170963]
4812C5170963m827458n423979m801074m090360l309027k580364j509244q79543
4804G749914p44458o69947p54619m63913k39972m89049m12375k2545n33377l17721
4794C101938Q5236k02379k15761j68043l3875k14894O2558J89526j07987k76621
4784B219698j5169Q2029j38534n6480n5828M4643k80860p5974K3442K9397r9122
4773A677242J6050k2356j58158J33801P1607j99367k27506J77816j8939k13050
4763A237140K7798J29967m5030M1200k28375j02405K35174P3385k2258j99239
4753A147357k61600J3422M07305j19598j91382L24284L4338k57325l68800J46017
4743H74018L29383j65205j55193J52496R8715j03563j67552k7964N0645L89395
$$ y = [35170963, 30343505, 24919526, 20118452, 16028092, 12719065, 10138701, 8629457, 7749914, 7005456, 6335509, 5580890, 5116977, 4877005, 4387956, 3975581, 3953036, 3419659, 3101938, 3187174, 2984795, 2769034, 2600991, 2567116, 2352222, 2414780, 2604306, 2496319, 2219698, 2204529, 2286558, 2148024, 2091544, 2035716, 2080359, 1799499, 1723525, 1746967, 1776364, 1677242, 1693292, 1670936, 1512778, 1646579, 1718186, 1518819, 1291313, 1469129, 1450190, 1237140, 1264938, 1394905, 1349875, 1391075, 1162700, 1060295, 1295469, 1368854, 1346596, 1147357, 885757, 899179, 1306484, 1186886, 995504, 1319788, 1354126, 1096801, 728001, 874018, 1203401, 1038196, 883003, 1035499, 1134214, 1030651, 863099, 835135, 885780, 1275175]
4733A275175n6274j49508K02321N5622m4654k83734J31626M6163j60225l8478
4723I78034L60188k31874m49764K98912K50386j7157J62200J47624l50362J40212
4713A288399m12463p6985K81561o6112r35J92311J33642j96385L33387J62229
4703A638649k36073J05449k2628q6523k64007l7207O1234L07084n2120k12721
4693A201137j52519K09915j23575k42276J06601R4764N097J40344J85288Q8035
4683A512811k32335q6827J9950J36226J10699j25079J89483k79174l50359J73184
4673A068579J57848O3092P26l94902O7112M86862k6047j08045J86949l814J36117
4662A634477J10955k09896J50794J83849r8688l6784J23438q290k88068M15119
$$ y = [1275175, 1218901, 1069393, 1271714, 1327336, 1282682, 998948, 1130574, 1176737, 1016512, 978034, 1338222, 1106348, 656584, 955496, 1205882, 1188725, 1350925, 1498549, 1148187, 1288399, 875936, 798951, 1080512, 1014400, 1013465, 1205776, 1339418, 1143033, 1476420, 1638649, 1402576, 1508025, 1485397, 1398874, 1134867, 1097660, 1158894, 1465978, 1413858, 1201137, 1048618, 1258533, 1134958, 892682, 999283, 1094047, 1099144, 1239488, 1424776, 1512811, 1280476, 1193649, 1213599, 1349825, 1460524, 1335445, 1524928, 1245754, 895395, 1068579, 1226427, 1289519, 1290245, 895343, 962455, 1449317, 1423270, 1315225, 1502174, 1498360, 1634477, 1745432, 1535536, 1686330, 1870179, 1771491, 1734707, 1858145, 1849855, 1561787, 1976906]
4652A976906j04223P207Q6333J50127J93932j51963p5564P9975o896K47978j65447
4641B238365m4700L98403J29676Q0063O52646L709L31133L61711N6805J84227
4631D392038O91583J344451J586087K307082K710934L083828J867570M84490n06135
4622A7961928j205855j161943j086921j315631j477184r40754r26516o39269O7702
4613I275557P7405P62119J356132J704548J606800J316987J053716R08341J224898
4604A9286503J324836J767746K471561K686156K495564J597162J092525J226441
4596C3948494O95457J085048J762467K231777K219841J272077j30243p52862p58836
4587D1573220j020814p27510p31230p03068n23028j061261j530762k130377k438221
$$ y = [1976906, 1872683, 1879890, 1966223, 2116350, 2310282, 2158319, 2082755, 2162730, 2155834, 2403812, 2238365, 2193665, 2592068, 2721744, 2801807, 3454453, 3458162, 3789295, 4151006, 4207811, 4392038, 5083621, 6428072, 8014159, 10321241, 13032175, 16116003, 17983573, 18468063, 17961928, 16756073, 15594130, 14507209, 13191578, 11714394, 10773640, 9847124, 9207855, 9275557, 9352962, 10115081, 11471213, 13175761, 14782561, 16099548, 17153264, 18061605, 19286503, 20611339, 22379085, 24850646, 27536802, 30032366, 31629528, 32722053, 33948494, 34643951, 35728999, 37491466, 39723243, 41943084, 43215161, 43084918, 42332056, 41573220, 40552406, 39824896, 39093666, 38390598, 37867570, 36806309, 35275547, 33145170, 30706949]
4578C0706949k154720j722811j563200j439448j362768j519717j776660k012541
4570A7155084j964710j469715j641400j358548j388214j104712j073164n33176
4562F621445n39540p75557j83091n18088j68435k00067l23414k30915R3407n79463
4552C196282m37216o5841P1246k35398L04035K3004J2481j77620l55722l2036
4542B303215J24296o2316q8820j44399R4975j97625m54745L66713J11554l23342
4532A729506j3975P5582r0479Q5326k35793k18637K63576j91324J59699j86469
4522A377012j25749K4411K12590k88294j80725J12419k4541L34429j63458j97075
4512A081019K31703m0847j91359l789J48420J0684P1661j8537Q2045j3754k96752
$$ y = [30706949, 28552229, 26829418, 25266218, 23826770, 22464002, 20944285, 19167625, 17155084, 15190374, 13720659, 12079259, 10720711, 9332497, 8227785, 7154621, 6621445, 6081905, 5306348, 5123257, 4605169, 4436734, 4236667, 3913253, 3682338, 3775745, 3196282, 2759066, 2693225, 2764471, 2529073, 2833108, 2856112, 2868593, 2690973, 2335251, 2303215, 2427511, 2365195, 2276375, 2131976, 2226951, 2029326, 1574581, 1941294, 2052848, 1729506, 1715531, 1791113, 1700634, 1785960, 1550167, 1331530, 1595106, 1403782, 1563481, 1377012, 1251263, 1275674, 1488264, 1199970, 1019245, 1131664, 1107123, 1441552, 1278094, 1081019, 1312722, 1271875, 1080516, 1076727, 1225147, 1235831, 1307492, 1288955, 1371000, 1357246, 1060494]
4501A060494l1692N2170J99603j56351K3300j28773L54204j88003n62878M68J38080
4490G60622J90705J77914J32792j92394j21181k74153J09683L03273k34620j51914
4480G00727q0147N0389K1404L88430l65976j734K51859M8046j05281J76566l17870
4469G66413r9747L35030m10673q1869K68531k69130L17958Q562K3728J11108N8034
4458A027945l23940r8188J18405k43067J66324J3348K36912k64910n8986l3095
4448E40748l2907K47748q3434j23342j15969P7548J9221M61044L0200k79919M60816
4437A201754r8932k74523j7906Q7411l2314J82405Q5061l25397p2388J66177Q5700
4426I87048K5683n167j34981M10243J02946k34651k03R0921k5440J67561o9826
$$ y = [1060494, 1028802, 1080972, 1280575, 1124224, 1147524, 1018751, 1372955, 1184952, 622074, 622542, 760622, 951327, 1129241, 1262033, 1069639, 948458, 674305, 783988, 1087261, 852641, 700727, 620580, 670969, 692373, 1080803, 714827, 713093, 964952, 1012998, 907717, 1084283, 766413, 666666, 1001696, 591023, 509154, 777685, 508555, 826513, 835075, 858803, 969911, 1027945, 704005, 605817, 724222, 481155, 647479, 660827, 897739, 632829, 573843, 540748, 507841, 755589, 672155, 548813, 432844, 510392, 529613, 990657, 1020857, 740938, 1201754, 1102822, 828299, 810393, 897804, 865490, 1047895, 1132956, 807559, 735171, 901348, 987048, 1012731, 1007564, 872583, 1282826, 1385772, 1151121, 1150918, 1241839, 1216399, 1383960, 1314134]
4415A314134m8373J78891K92068k8939o60480K91947N2116n8778q1363k93024
4405I58199J64859M48310J6147J3142j08510P8574m1682J57123J47937k29600
4395A604499o5992K35943L06591K15577k47920j30990R8674J3931K38816K12934
4385B482063j99716m3130L27621J62961j07996M64699L7557J20176M62017P9357
4375C785609J91828m4451L29942L66609J47817L01383O10913Q4003J53354M72634
4365F399641N32100O07763L14654L28214N44816L87608K78214O06563N70416O81692
4355A1251681O99420N59794O41607O87836Q00350N02645M94746O38562M94644
4346A6771285M36315M2000j4657O35880O46749L66620K48576K67686P95716P11757
$$ y = [1314134, 1265761, 1444652, 1736720, 1707781, 1047301, 1339248, 1391364, 1332586, 1251223, 958199, 1123058, 1571368, 1587515, 1600657, 1492147, 1570721, 1529039, 1686162, 1834099, 1604499, 1538507, 1774450, 2081041, 2296618, 2048698, 1917708, 2016382, 2030313, 2269129, 2482063, 2282347, 2239217, 2566838, 2729799, 2621803, 3086502, 3124059, 3244235, 3706252, 3785609, 3977437, 3932986, 4262928, 4629537, 4777354, 5078737, 5689650, 5773653, 5927007, 6399641, 6931741, 7539504, 7854158, 8182372, 8727188, 9114796, 9393010, 9999573, 10569989, 11251681, 11951101, 12510895, 13152502, 13840338, 14640688, 15143333, 15638079, 16276641, 16771285, 17207600, 17249600, 17234943, 17870823, 18517572, 18884192, 19132768, 19400454, 20196170, 20907927]
4336B0907927K86982L99683L4453l0074Q390K40929k19545m09603k87937n21639
4326B0409566j68063l30222k71755k14414j07724j99696q31500l26980l37056
4317A7622156o51256r79407m57767l98164q57095l26137r72052o71189k20873
4308A2088216n64628r41658k87826l15850p16039m09343l84406l74551m25397
4299G668518j76770m85746o27214m44988l29682l84468m10004j02831k72121l12343
4289D122351k42920l05m06095l12948j51472k18395K6580l72288L72157k43734
4279B572931j77209K78437l24286m08209p0880K8525k8039K13785j57561k7335
4269A900159j32455k63586m8187R3755N5207J67311o0752j71755j37792N464j71546
$$ y = [20907927, 21194909, 21594592, 21629045, 21598971, 21607361, 21848290, 21628745, 21219142, 20931205, 20409566, 20241503, 19911281, 19639526, 19425112, 19317388, 19117692, 18286192, 17959212, 17622156, 16970900, 15991493, 15533726, 15135562, 14278467, 13952330, 12980278, 12309089, 12088216, 11523588, 10581930, 10294104, 9978254, 9262215, 8852872, 8468466, 8093915, 7668518, 7491748, 7006002, 6378788, 5933800, 5604118, 5219650, 4809646, 4706815, 4434694, 4122351, 3879431, 3879126, 3473031, 3160083, 3008611, 2790216, 2816796, 2444508, 2816665, 2572931, 2395722, 2674159, 2349873, 1941664, 1870784, 1899309, 1871270, 2085055, 1927494, 1900159, 1767704, 1504118, 1455931, 1549686, 1604893, 1772204, 1711452, 1539697, 1401905, 1407369, 1235823]
4258A235823L57502o9919Q0105R1892k17403N1474k6166p8321o5930n7831j95978
4247A105248K03397k45872P3816L76483o4487l6175j83930Q0776K34606k68373
4237A275489o6422M08345J07528k73678J65418J29923K49831J38750L07753j0993
4227B431944M03991P36078J294425J565689J784143K141087J247759M11479l62405
4218A1654190q76726m87911m98567j034182j492188j299455q63909j059623q96207
4209C145422n14911k28843j51851l15153k50769j11019N9196O3444q2792l53468
4199A259256o1814j51308o3862Q6764j35005R7476o3111N4102j57780m13900J60342
4188F11160O0384K644J90312L3937j02609j81480R7097L02418j84162l43643L85123
$$ y = [1235823, 1593325, 1523406, 1603511, 1695403, 1478000, 1529474, 1503308, 1424987, 1359057, 1301226, 1105248, 1308645, 1062773, 1136589, 1513072, 1448585, 1412410, 1228480, 1309256, 1543862, 1275489, 1209067, 1617412, 1724940, 1451262, 1616680, 1746603, 1996434, 2135184, 2442937, 2431944, 2835935, 3572013, 4866438, 6432127, 8216270, 10357357, 11605116, 12016595, 11654190, 10777464, 10289553, 9790986, 8756804, 7264616, 5965161, 5101252, 4041629, 3145422, 2630511, 2401668, 2249817, 1934664, 1683895, 1572876, 1632072, 1695516, 1612724, 1259256, 1197442, 1046134, 982272, 1069036, 934031, 1031507, 968396, 1022498, 864718, 450818, 611160, 671544, 674188, 864500, 898437, 795828, 614348, 711445, 1013863, 829701, 486058, 871181]
4177H71181R0180r6575q3603J99071l5224J06230l86889l10407J34689q8656N7779
4166D57776R8440K41352j91138n6424j44852L2468L86452J06465j06773j88524
4156F35242J9097R1867j04643Q9208j43640l7050R3673k1990K34934J71022j4726
4145A012994j40534K8904Q1409k03081r8647J20696o1011p3352L2612K2805j7908
4134G04887J32738p0764o5243j83393L95724K98143l4927j82057r6015o0050j6099
4123H22944N6991l2995J05277J7802J16404K20832j80949j2157k68046K65757
4113A111860L3052j3449J62503J76382k07644k16584K09109l08905K31373K14556
4103A392253J17429N0888P409k22538j19842J21200j31948J48463K98695m34126
$$ y = [871181, 961361, 864786, 781183, 980254, 945030, 1051260, 664371, 353964, 488653, 399997, 457776, 556216, 797568, 606430, 550006, 405154, 437622, 824074, 930539, 823766, 635242, 654339, 746206, 641563, 730771, 587131, 550081, 643754, 621764, 856698, 1027720, 1012994, 872460, 901364, 982773, 779692, 681045, 801741, 740730, 667378, 699990, 722795, 704887, 837625, 766861, 701618, 518225, 913949, 1212092, 1177165, 995108, 899093, 839043, 822944, 879935, 846940, 952217, 970019, 1086423, 1307255, 1126306, 1114149, 846103, 1111860, 1144912, 1131463, 1293966, 1470348, 1262704, 1046120, 1255229, 946324, 1177697, 1392253, 1509682, 1560570, 1567979, 1345441, 1225599, 1346799, 1214851, 1363314, 1662009, 1227883]
4093A227883r1866M0105K30802L6402J15139m1427j09881m9969m6415N9161L58055
4082A727989L07548j43129O2902j13324j62519K43292R6595r8911k0266L3916
4072A934093J02208K66312j76220m22131K32438K36995P3471J27744L04293r6995
4062B582208K44071J43486k11686Q7290Q8389K79265J07061P1354J73521M76992
4052D041951N75158M41699L87789R21791J597700J794695J675451O39866K89786
4043A2365886o5320m78406p64470q29113m45107q23758q71634q83428o21799j76834
4033F406017l63617o05927J1154L46046j84458k96272N9499j00220k24456K76871
4023E324637M37119l07107k02743K32213K46344l78326l39011J30932k23461J32929
$$ y = [1227883, 1136017, 1176122, 1406924, 1443326, 1558465, 1517038, 1407157, 1357188, 1310773, 1369934, 1727989, 2035537, 1892408, 1955310, 1841986, 1679467, 1922759, 2019354, 1920443, 1900177, 1934093, 2036301, 2302613, 2126393, 1704262, 1936700, 2173695, 2247166, 2374910, 2679203, 2582208, 2826279, 2969765, 2758079, 2845369, 2933758, 3213023, 3320084, 3391438, 3564959, 4041951, 4617109, 5058808, 5446597, 6368388, 7966088, 9760783, 11436234, 12076100, 12365886, 12300566, 11822160, 11057690, 10228577, 9783470, 8959712, 8088078, 7204650, 6582851, 6406017, 6042400, 5436473, 5447627, 5793673, 5609215, 5312943, 5372442, 5272222, 5047766, 5324637, 5761756, 5454649, 5251906, 5484119, 5730463, 5352137, 5013126, 5144058, 4920597, 5053526]
4013E053526K67311j16520j50977M8273L31064n6370j96769K6940L22939J81609
4003E711026K53209j93576K2359L63143K10206j893J20745L64764K32683P6836
3993G159502j26532J15528J11161J88113M07913K73437K76069L41326N44298K65585
3983I556400L11312O15673M73937Q23880O00140Q60966M96904J116678R50139
3974A5806029J140633J581293J714137K123994K243767K320028K263445L008921
3966C2202247L331013K892295K861496K826310K810744K731701J811118J237462
3958E2704386J111036P43176M77166M8912K25839J8350k67056M0664k581J08253
3948E5208145j9849j0494O6912N56691K17037p53607j277876j954860k550410
$$ y = [5053526, 5320837, 5204317, 5053340, 5101613, 5432677, 5376307, 5179538, 5206478, 5529417, 5711026, 5964235, 5770659, 5793018, 6156161, 6366367, 6364474, 6485219, 6849983, 7082666, 7159502, 7032970, 7148498, 7259659, 7447772, 7855685, 8129122, 8405191, 8746517, 9290815, 9556400, 9867712, 10483385, 10957322, 11781202, 12381342, 13242308, 13739212, 14855890, 15806029, 16946662, 18527955, 20242092, 22366086, 24609853, 26929881, 29193326, 32202247, 35533260, 38425555, 41287051, 44113361, 46924105, 49655806, 51466924, 52704386, 53815422, 54558598, 55035764, 55084676, 55310515, 55328865, 55061809, 55102473, 55099892, 55208145, 55188296, 55177802, 55244714, 55801405, 56018442, 55264835, 53986959, 52032099, 49481689]
3939D9481689l133838l674541l229321l191403l617352l512664k786908k593264
3931B3742398k276377j682007j613827j664966j119770j033942r72731q22893
3923A2555885r21256l2696m23729o24890m21542j03390j81871J07780M26396R05687
3913A1286374J008237Q53320Q99845J78380o10386o73515o03757p25395p66078
3904A0847025q99729o91193n19103r64128p75367n20543k68768o4038l16653k55386
3894E572117P1413K91022n69957n48303J51085K98210K2300j04654k65256K3799
3884D941776O6231k29698j1161L6228k0483O5645L3051k50338m1822K33749R0079
3873D913257k99435j58673J96222J23991k14693r639O43783o2270m6149P3309
$$ y = [49481689, 46347851, 42673310, 39443989, 36252586, 32635234, 29122570, 26335662, 23742398, 21466021, 19784014, 18170187, 16505221, 15385451, 14351509, 13378778, 12555885, 11634629, 11601933, 11178204, 10553314, 10131772, 10028382, 9846511, 9954291, 10380687, 11286374, 12294611, 13147931, 14047776, 14226156, 13615770, 12942255, 12338498, 11613103, 10847025, 9947296, 9256103, 8737000, 7772872, 6997505, 6476962, 6208194, 6144156, 5827503, 5572117, 5643530, 5934552, 5364595, 4816292, 4967377, 5265587, 5287887, 5183233, 4917977, 4941776, 5008007, 4778309, 4767148, 4803376, 4782893, 4848538, 4881589, 4631251, 4589429, 4823178, 4913257, 4613822, 4455149, 4651371, 4775362, 4560669, 4551030, 5194813, 5132543, 5086394, 5159703]
3863E159703j12479p1757n6273k36982K49027M10096L2808O9579j07157K27996
3853E564561K2015L7731n7169K99709K91224K7768J96971q0138J04773L00404
3843F707849K1194N5333K26877L53157J65708M26153L53790L88107L49389L93493
3833I441050M03159K40851O96886Q41975O66683O55813J041744R25105R70323
3824A5883589R05564K84461L16205N96883N68468J24540n84628l43506l46335
3815A7405241m09262o33512o59939n78187p2061m36502n78945n61084N0439q2165
3805A3444023j27700K4999n2449J83672J43555k80091J66105N74500M57000K89853
3795A4823467J65036M66995N48768N66746R20796N64779O32304J384466J155485
$$ y = [5159703, 5047224, 4975467, 4919194, 4682212, 4931239, 5341335, 5374143, 5443722, 5336565, 5564561, 5586576, 5624307, 5567138, 5866847, 6158071, 6185839, 6382810, 6302672, 6407445, 6707849, 6729043, 6784376, 7011253, 7364410, 7530118, 7956271, 8310061, 8698168, 9047557, 9441050, 9844209, 10085060, 10781946, 11623921, 12290604, 12946417, 13988161, 14913266, 15883589, 16789153, 17073614, 17389819, 17986702, 18555170, 18679710, 18095082, 17751576, 17405241, 16995979, 16362467, 15702528, 15124341, 15052280, 14615778, 14036833, 13475749, 13526188, 13444023, 13316323, 13341322, 13288873, 13472545, 13616100, 13336009, 13502114, 14076614, 14533614, 14823467, 14988503, 15455498, 16004266, 16571012, 17491808, 18056587, 18688891, 20073357, 21228842]
3786B1228842J193740J287056J709473J902636K318557K911220L143672L299592
3778C8994788L588070M391545M658418M671893M706645M972342M903647M282750
3770G5170098L748194L243219K940275K119406J089588M13105j96659m34197n77982
3761H7515047r45001o77460o25767n53893o12401q98071p66495p29756p12682
3752H0993521q34125j149460j467147k466701j957061k623034k928880l212312
3744F4354801l520156l539995l662023l849709l771658l679316l505083l023272
3736C5803589k825583k815458k314599k268885j803378k030172j574046j187765
3728A8983703j294616j121965j052968n40046o80949p78697o62771j18889m41234
$$ y = [21228842, 22422582, 23709638, 25419111, 27321747, 29640304, 32551524, 35695196, 38994788, 42582858, 46974403, 51632821, 56304714, 61011359, 65983701, 70887348, 75170098, 78918292, 82161511, 85101786, 87221192, 88310780, 88723885, 88527226, 88093029, 87515047, 86570046, 85892586, 85266819, 84712926, 84100525, 83202454, 82435959, 81706203, 80993521, 80159396, 79009936, 77542789, 75076088, 73119027, 70495993, 67567113, 64354801, 60834645, 57294650, 53632627, 49782918, 46011260, 42331944, 38826861, 35803589, 32978006, 30162548, 27847949, 25579064, 23775686, 21745514, 20171468, 18983703, 17689087, 16567122, 15514154, 14974108, 14293159, 13514462, 12851691, 12732802, 12291568]
3719A2291568m94985m23056k88309k43776o4982j6838k24593J29663M47210q2906
3709A1028996j02584J94377M03059L01315L23987M60967N25405L87748L95793
3700A3919063K72591l5273K86266K89744J81396j37093l13033n45694n00437k84628
3690A3132902l22686q44382q44403m56399o78020l86947m39646n97859l50734
3681H211826m01085n90243m79919J08817o4319m06873j22001Q4283r066l15135
3671F016285k57097Q9860L23616N1651l05639j72851j70814j54610R0957o7765
3661E443593j67874p4940J75073k25408K74442M68642k67162k46682K6157j52115
3651E253726N97330j92029J21855J0497J2881K51271p8532J37628j88806J81066
$$ y = [12291568, 11796583, 11373527, 11085218, 10841442, 10776460, 10759622, 10535029, 10664692, 11111902, 11028996, 10926412, 11120789, 11523848, 11825163, 12149150, 12610117, 13135522, 13523270, 13919063, 14191654, 14156381, 14442647, 14732391, 14913787, 14776694, 14463661, 13917967, 13417530, 13132902, 12810216, 11965834, 11121431, 10665032, 9987012, 9600065, 9160419, 8562560, 8211826, 7810741, 7220498, 6740579, 6849396, 6785077, 6378204, 6256203, 6340486, 6331420, 6016285, 5759188, 5849048, 6172664, 6224315, 5918676, 5745825, 5575011, 5420401, 5511358, 5443593, 5275719, 5200779, 5375852, 5150444, 5424886, 5893528, 5626366, 5379684, 5405841, 5253726, 5851056, 5659027, 5780882, 5791379, 5804260, 6055531, 5976999, 6114627, 5925821, 6106887]
3641F106887L04049J56583K28634O01910M26427j18578K67744M98924N52752P21794
3631I747126M84604N22771J054326R09475N81355O40656P66505M88358M89063
3622A5684239O85621L45763L29295q7172L79019N07189n641L4987K42162P8825
3612A8194287j9395n1326q1468k95964J54514l31629m83869k49586j85249n75374
3602A6074941o45628m73060o04896l48819m33313o54505n10172p4144j67415l37739
3592A1825250m1911J23425P8387k06169J75702K64798L39612N86104N42074O99779
3582A4387051P35932R32308R29564J073149J075996J623427J882682J865978J872416
3573B6378503J890820K255660K368605K072875K075252K125323J746816J729358
$$ y = [6106887, 6410936, 6567519, 6796153, 7398063, 7824490, 7705912, 7973656, 8472580, 9025332, 9747126, 10231730, 10754501, 11808827, 12718302, 13299657, 13940313, 14706818, 15195176, 15684239, 16369860, 16715623, 17044918, 16957746, 17336765, 17843954, 17838313, 17873300, 18115462, 18194287, 18174892, 18123566, 18042098, 17746134, 17900648, 17569019, 17085150, 16835564, 16650315, 16074941, 15429313, 14956253, 14351357, 14002538, 13569225, 12914720, 12404548, 12330404, 12162989, 11825250, 11783339, 11906764, 11985151, 11778982, 11954684, 12219482, 12559094, 13145198, 13687272, 14387051, 15122983, 16055291, 16984855, 18058004, 19134000, 20757427, 22640109, 24506087, 26378503, 28269323, 30524983, 32893588, 34966463, 37041715, 39167038, 40913854, 42643212]
3565D2643212J815661R11046J065127R88106R76343M15758P4976J16867J04911
3556D9112007O446j39204k56686n91753n40169r50898j223999j151752r72484
3547D3291508j727913j890589j647309j632212j609203j856880j508432j205849
3539C0213121j610506q41866o55825j03154j96773j66735K29390O95681Q80017
3530B8443350Q48270J394978J517621J510473J743841J742118J524651J500554
3522D0225856J577785J410719J353874R56952J284098Q68975K97699O97216K63252
3513D8936426K06813J2346l46587m06791k35821n86852j285000j073789j025507
3504D4195238j328822j566393k004820k108372j903933k122056k180715j727917
$$ y = [42643212, 44458873, 45369919, 46435046, 47423152, 48399495, 48815253, 48890229, 49007096, 49112007, 49118453, 48979249, 48722563, 48130810, 47590641, 46639743, 45415744, 44263992, 43291508, 41563595, 39673006, 38025697, 36393485, 34784282, 32927402, 31418970, 30213121, 28602615, 27760749, 27104924, 27001770, 26804997, 26638262, 26867652, 27563333, 28443350, 29291620, 30686598, 32204219, 33714692, 35458533, 37200651, 38725302, 40225856, 41803641, 43214360, 44568234, 45525186, 46809284, 47678259, 47975958, 48673174, 48936426, 49143239, 49155585, 48808998, 48402207, 48166386, 47579534, 46294534, 45220745, 44195238, 42866416, 41300023, 39295203, 37186831, 35282898, 33160842, 30980127, 29252210]
3496B9252210j934751j910012j926435j660734j657587j598458j053506o38644
3488A6872083p81284j043854o63031o52201n39415n46953j37028r9161j75416
3479A2233740j06373k94191j11755N2917O87818Q25645L59996J12660O69339M26863
3469A4856659M56676N47173N99686N00344P76435Q94450J96361K52298N88201
3460A9668283J96674L66884M65013K94841M6968L19896k9775J38307L62500O3589
3450B1893180k79704l11674j83592n24373m15722l56307o47176q84235o26081
3441A7664316o57368p64213o48036p43857q24661k26571n40675p31070m58400
3432A2069465n60867k49694m04665n69574j97574j06635K4699K9909r9135J56285
$$ y = [29252210, 27317459, 25407447, 23481012, 21820278, 20162691, 18564233, 17510727, 16872083, 16090799, 15046945, 14383914, 13731713, 13192298, 12645345, 12508317, 12409156, 12233740, 12127367, 11833176, 11721421, 11774338, 12462156, 13287801, 13647797, 13760457, 14429796, 14856659, 15313335, 15860508, 16460194, 16960538, 17736973, 18631423, 18827784, 19080082, 19668283, 19864957, 20231841, 20696854, 20991695, 21038663, 21358559, 21328784, 21467091, 21829591, 21893180, 21613476, 21301802, 21118210, 20593837, 20178115, 19821808, 19174632, 18290397, 17664316, 17006948, 16242735, 15594699, 14850842, 14026181, 13799610, 13258935, 12527865, 12069465, 11508598, 11258904, 10854239, 10284665, 10087091, 9980456, 10005155, 10035064, 9935929, 10092214]
3422A0092214J94849j77556R3149j2493Q7927P9212R0773q2011L66868P1801K60117
3411A1064850M17835J63093K92035O09983M39239N84814Q24009P69067J453846
3402A6618771J377123J190448J326631J764906K216083K033627K211514J578932
3394C0318035J899695K332298K253439K410294K242486J856199J408634J921662
3386D6642742J644277J625009J019657J340302P97120L81721M35870L09596K90507
3377E4486801r9465o34267n55540j128013j427254j928976k007493k619756k751314
3368D1334723k371175k985301k601368k684461k624255k400465k469814k121515
3360B1076369j581945j655202j671618j226206j037015p24002r60532j090899
$$ y = [10092214, 10287063, 10109507, 10202656, 10190163, 10278090, 10357302, 10448075, 10366064, 10732932, 10804733, 11064850, 11482685, 11645778, 11937813, 12547796, 12987035, 13571849, 14395858, 15164925, 16618771, 17995894, 19186342, 20512973, 22277879, 24493962, 26527589, 28739103, 30318035, 32217730, 34550028, 36803467, 39213761, 41456247, 43312446, 44721080, 46642742, 48287019, 49912028, 50931685, 52271987, 53069107, 53450828, 53886698, 54196294, 54486801, 54387336, 53753069, 53197529, 52069516, 50642262, 48713286, 46705793, 44086037, 41334723, 38963548, 35978247, 33376879, 30692418, 28068163, 25667698, 23197884, 21076369, 19494424, 17839222, 16167604, 14941398, 13904383, 13180381, 12219849, 11128950]
3352A1128950o52577r38604m60441m15055m81894l76398l10956k43410p676m49905
3342F792034m21446l21395J5500r6958j33481l00293j10728J82484o1205j05668
3332E438844j63585k11662L39913L32426J49207J41316N32797P9851j89948N38262
3322F987421K72770J27416J27430o167k43146K14151q8982O8991k69142m75827
3312F714915k24762O0885P6830m63582m43355m58886k22717o9467l53593k23195
3302D393073p9780k94382j22594j94868n070J27056j35170R8755p1757j15320
3292C599943K05445R0220j54578P8006L454k7300J89502k16843m43392Q3648q2412
3281C325693m6030j05465R5231K64638L09105r8294j97619Q2789J94397J06360
$$ y = [11128950, 10476373, 9537769, 9077328, 8662273, 8180379, 7803981, 7493025, 7249615, 7241939, 6792034, 6370588, 6049193, 6064693, 5967735, 5834254, 5533961, 5423233, 5605717, 5544512, 5438844, 5275259, 5063597, 5403510, 5735936, 5885143, 6026459, 6559256, 6639107, 6449159, 6987421, 7260191, 7387607, 7515037, 7508870, 7265724, 7479875, 7390893, 7459884, 7190742, 6714915, 6490153, 6551038, 6627868, 6164286, 5720931, 5262045, 5039328, 4969861, 4616268, 4393073, 4313293, 4018911, 3896317, 3701449, 3696379, 3823435, 3688265, 3787020, 3715263, 3599943, 3805388, 3895608, 3741030, 3819036, 3822490, 3795190, 3984692, 3767849, 3324457, 3408105, 3325693, 3279663, 3174198, 3269429, 3534067, 3843172, 3744878, 3547259, 3630048, 3824445, 3930805]
3271C930805l36142j18016j96405O5330L6330P1301q2882R3128J1129J00029J88795
3260C763402j38709L664K07434r9829L91834k19243p5613J31528j03098R3552
3250C954922J067L41293q3963j07181J78473K5684j31566K23173L0697j23556
3240D309043K9081N8386J61419L7501j31690L85352K76072K06329K5003k22768
3230E133728L795K28431L27708J78569k0543l2595J5710J01618j24634J9168J07735
3219E938690N8260K09790J73773r4326L16152J41766K28289J48399K94758M7974
3209G463525K89895L24152p0352K0132k1419P86826j7893l35429J91726L72760
3199I003923K90224K90577J21387N2875M42089J94540L1240K37113N83179L01801
$$ y = [3930805, 3594663, 3476647, 3280242, 3345572, 3381902, 3453203, 3370321, 3463449, 3474578, 3574607, 3763402, 3624693, 3628357, 3835791, 3735962, 4127796, 3908553, 3832940, 3964468, 3861370, 3954922, 3955989, 4297282, 4213319, 4106138, 4284611, 4310295, 4178729, 4401902, 4432599, 4309043, 4338124, 4396510, 4557929, 4595430, 4463740, 4849092, 5125164, 5331493, 5356496, 5133728, 5137523, 5365954, 5693662, 5872231, 5851688, 5819093, 5834803, 5936421, 5811787, 5830955, 5938690, 5996950, 6206740, 6380513, 6286187, 6602339, 6744105, 6972394, 7120793, 7415551, 7463525, 7753420, 8077572, 8007220, 8027352, 8005933, 8792759, 8774866, 8439437, 8631163, 9003923, 9294147, 9584724, 9706111, 9758986, 10201075, 10395615, 10426855, 10663968, 11247147, 11548948]
3189A1548948R3810M30778M30912K13256J19460L95361L72267N63245M02960O68981
3179A5239978M89448J19850L65494P09272P16050N09455O44135N37655Q85148
3170B0216485R24064Q53937J044387J264931J308178J063561J230921J692334
3162B9598798J523842J535816K081662K499000K553170K885209L445208L959124
3154E0081829M619980N422956O625280Q038372Q941211J1081647J3676425J6239577
3146A24727277K0006232K3690963K6964230K8621907K7724246K2945737J5964887
3139B90645479P864488m76445p409330j2628469j8031424k1777157k3379516k3831130
3131A90976496k3470637k0886418j8592067j6179859j3410153j1684397r810360
$$ y = [11548948, 11642758, 12073536, 12504448, 12717704, 12837164, 13232525, 13604792, 14168037, 14570997, 15239978, 15729426, 15849276, 16214770, 16924042, 17640092, 18149547, 18793682, 19331337, 20216485, 21140549, 21994486, 23038873, 24303804, 25611982, 26675543, 27906464, 29598798, 31122640, 32658456, 34740118, 37239118, 39792288, 42677497, 46122705, 50081829, 54701809, 60124765, 66750045, 74788417, 83729628, 94811275, 108487700, 124727277, 144733509, 168424472, 195388702, 224010609, 251734855, 274680592, 290645479, 298509967, 298033522, 290624192, 277995723, 259964299, 238187142, 214807626, 190976496, 167505859, 146619441, 128027374, 111847515, 98437362, 86752965, 76942605]
3124G6942605q347142o844495o168449n597060m590743m301316l516327l006859
3116C4570214k921028k194758j912773j918707j731271j478867j303088j039427
3108B0070295r98664q50369r50754j062412p75577q08807p09214o67069n06485
3099A2740944l14230o23611m63887o00313n25850l26830l28691k22257j87945
3090I147330l3235l92703m66150l64964l17196j20835j64048j96710k90721j41413
3080F659355m19629K3156l62710n4974p0210k97127o1119k42586j41197m0375
3070D992584l29465j28952r1811k12851J84223l33567k25835q6158L7473J37231
3060C942872k60380j72751N3386k0317j18760j87124k40310J03128j78013l5759
$$ y = [76942605, 68595463, 61750968, 55582519, 49985459, 45394716, 41093400, 37577073, 34570214, 31649186, 29454428, 27541655, 25622948, 23891677, 22412810, 21109722, 20070295, 19071631, 18221262, 17270508, 16208096, 15432519, 14623712, 13914498, 13247429, 12740944, 12426714, 11803103, 11339216, 10738903, 10213053, 9886223, 9557532, 9335275, 9147330, 9114095, 8721392, 8255242, 7890278, 7573082, 7452247, 7288199, 7091489, 6800768, 6659355, 6239726, 6262882, 5900172, 5845198, 5774988, 5477861, 5416742, 5174156, 5032959, 4992584, 4663119, 4534167, 4442356, 4229505, 4413728, 4080161, 3854326, 3768168, 3805641, 3942872, 3682492, 3509741, 3563127, 3542810, 3424050, 3236926, 2996616, 3099744, 2921731, 2885972]
3050B885972k15530j42920N6337j30195J23575k39826J27918J83992k68739k38958
3040B141626J55059k06030J2749J34871l92751m1982M6075K00430j41576R9594
3030B008065k87106J3627L4285R6332J70839k24038J27955J31991r3705m23609
3020A554636O125l3522R4416p2365j60209M06527J95494m3064j72295j13477L01922
3009A964188R721o29661k48836k15985J10504J27283k31206j33858Q0262L62714
2999A195126k50739m2507M3427k03750N7421P1581j32635k983o1722K8846m7154
2988F54911k5611m8771K20578M9969k1897P2694P5366p9965k58440M0955J07458
2977G87247j15053P5338j43955j41902l1193L59995o9471r0645j20939J50566
$$ y = [2885972, 2670442, 2527522, 2583859, 2453664, 2577239, 2337413, 2465331, 2649323, 2380584, 2141626, 2296685, 2090655, 2103404, 2238275, 1845524, 1803542, 1849617, 2050047, 1908471, 2008065, 1720959, 1734586, 1768871, 1865203, 2036042, 1812004, 1939959, 2071950, 1978245, 1554636, 1560761, 1527239, 1621655, 1549290, 1389081, 1795608, 1991102, 1948038, 1775743, 1662266, 1964188, 1973909, 1344248, 1095412, 879427, 989931, 1117214, 886008, 752150, 832412, 1195126, 944387, 901880, 945307, 741557, 798978, 870559, 737924, 734941, 673219, 702065, 654911, 629300, 580529, 801107, 851076, 829179, 901873, 977239, 897274, 638834, 679789, 787247, 672194, 747532, 603577, 461675, 430482, 790477, 721006, 630361, 509422, 659988]
2967F59988K7875k93839K4304K37584J97444j69279j79376J03688J05891k82142
2957D32138P399K9327j54788o0026Q6724r1296K21791j0303P7921J16558k7498
2946F27947J67914m58670J1287K32725O6314j4070k9865l96269P8574K07850n0452
2935D43285K86608k04114j8467R6894j38012j15082J39582j87343J23631q5305
2925C41677K1186J03010k41990O5792K66203K08428j88716L3414n5981J21570
2915F74593J7905k26432P107l0175l259j27181J4765Q8910J65501m5780j60357
2904C75597l5920L38749j15045m6502r0973k57543o0842L87728l5145j49694j161
2893C09249l2435q2574K73102j07740o3694J60412l79845j182K05966N8041K28922
$$ y = [659988, 687863, 394024, 418328, 655912, 853356, 684077, 504701, 608389, 714280, 432138, 439537, 468864, 314076, 254050, 340774, 249478, 471269, 460966, 538887, 655445, 627947, 795861, 337191, 348478, 581203, 647517, 633447, 603582, 207313, 285887, 493737, 443285, 729893, 525779, 507312, 604206, 466194, 351112, 490694, 303351, 426982, 341677, 362863, 465873, 223883, 289675, 555878, 764306, 575590, 609004, 553023, 674593, 692498, 466066, 473173, 442998, 439739, 312558, 327323, 416233, 581734, 535954, 375597, 339677, 678426, 563381, 516879, 425906, 168363, 107521, 495249, 460104, 310410, 309249, 276814, 194240, 467342, 359602, 295908, 456320, 76475, 75293, 281259, 339300, 568222]
2882E68222N3093k2947m54128j68846L31787o0976j77614j51878N34893J81037
2872F32643p4292p51j6768L4226J25725P2190m595l758k42728L80951j47591n4521
2860G00731K77164L4275L73560J33327m01193Q9039K46365Q5204j70629j44779
2850A223064K82425k86277m06637j27114J90779j43290J53397j32825k16123j90471
2840C46928k21889k23838K45875L59509q4406J82429J7048l58952k30365Q2658
2830A14997L09999n8230K00485j64049l82708j58147L62061Q549p0932J83178
2820C45203K90101j14769m29637n4364N4504k0045L3j97535q4568L36016j35692
2809a0753P5440p2143j05819L29034J73531j1641J16367j59572k82051o4160j7608
$$ y = [568222, 621315, 598368, 144240, -24606, 307181, 246205, 68591, -83287, 451606, 632643, 558351, 557600, 540832, 575058, 700783, 772973, 768378, 764620, 521892, 902843, 755252, 700731, 977895, 1012170, 1385730, 1519057, 1117864, 1206903, 1453268, 1538472, 1367843, 1223064, 1505489, 1219212, 812575, 685461, 876240, 732950, 886347, 753522, 537399, 346928, 125039, -98799, 147076, 506585, 422179, 604608, 621656, 262704, 32339, 114997, 424996, 366766, 567251, 403202, 20494, -137653, 224408, 232957, 162025, 345203, 635304, 520535, 90898, 36534, 91038, 70993, 71026, -126509, -211077, 124939, -10753, 64687, -7456, -113275, 215759, 389290, 377649, 494016, 334444, 52393, -11767, -29375]
2798b9375L3814O1656r8566L18942r222l04235J77542K74979J54335j29958k93241
2787A56671J60276N0633n5797J93662j50451R3240R3408k13980k31265j53894
2777e7497J27057m4070N9608J76764k83016L758K7933J73895O1926k01732L28590
2766C73216q0569m42504o7978J46298L67083R2764L5530j45417j10318j90864
2756b2759J9388Q5173j44874K222M52025J52930l57801l9344k11217J09382O2031
2745A07156P6625J14408q1898l19521K38858j00835N417J27599n0226J0646q8311
2734C9918K3818J98604N7817K5662K54727j43161p4817O76k84507j91331L93228
2723C00634j12192N561R5761p9614q6312N7280p9430k05079N5927J63640k25084
$$ y = [-29375, 4439, 66095, -32471, 286471, 277249, -26986, 150556, 425535, 579870, 449912, 156671, 316947, 367580, 311783, 505445, 354994, 448234, 541642, 327662, 96397, -57497, 69560, 25490, 85098, 261862, -21154, -17396, 10537, 184432, 246358, 44626, 373216, 292647, -149857, -217835, -71537, 295546, 388310, 423840, 278423, 168105, -22759, -3371, 81802, -63072, -60850, 391175, 544105, 186304, 146960, -64257, 45125, 107156, 183781, 298189, 216291, -103230, 135628, 34793, 40210, 167809, 117583, 128229, 39918, 63736, 262340, 320157, 345819, 600546, 457385, 382568, 383244, 98737, -92594, 300634, 188442, 194003, 289764, 210150, 123838, 181118, 101688, -103391, -47464, 116176, -108908]
2712a08908m6915J45915l98124K86571J26169P8820M0802r7640j46112K27760
2702A08338M9091l68177J11728M86378k38185K18844k46949j20981J20882K08973
2692C29942n1785j19175J14769k74622k8190l3230L3570j4745K04312M2442l77886
2681a74598m2573L18113k5911K47027p1930L45j10552n2049k94779l6443L20095
2670G6745p4373L49409Q878m19337m3953J67762O3849j8629J11305j13089j94915
2659h6348j30620J31471l9529K03203J75970k25172k62326j19722Q2435N1945
2649b18693K50172J47552r5737J05018j0167k01389k5909P8822L4794p8456p2085
2638h6078J91951J9831J5188J89351J20467k67363k3937K12467j34576l57369
$$ y = [-108908, -155823, -9908, -408032, -121461, 4708, 83528, 124330, 26690, -119422, 108338, 157429, -210748, -99020, 387358, 149173, 368017, 121068, 87, 120969, 329942, 278157, 158982, 273751, -871, -29061, -62291, -28721, -43466, 160846, 203288, -174598, -217171, 100942, 75031, 322058, 250128, 250473, 139921, 87872, -206907, -243350, 76745, 2372, 351781, 360659, -58678, -102631, 65131, 128980, 110351, 221656, 108567, -86348, -216968, -85497, -125026, 78177, 254147, 28975, -233351, -353073, -270638, -218693, 31479, 179031, 83294, 188312, 178145, -23244, -49153, 29669, 64463, -13993, -86078, 105873, 125704, 140892, 330243, 450710, 183347, 159410, 371877, 237301, -120068]
2628a20068R5175R2674O1566Q3892J34962O8696j23720k03758m9879k4819Q7130
2617A01851K05728k66063L9963j51110L6451J21924j23099K2157j2839N4888J38463
2606A68314k5329k13848l86326O4557L88930O4205J19077l25601o9149L47977
2596A32807n164O7485j77837j21144L68060l25152M0418m0991J4611M79010j7392
2585D14711k99508k10422L60981M80107J84774J48695m9845L13563K64327j48114
2575A459269Q8894M2924J9069m55471k0938j20621l26092J0265l0584k18989o4874
2564C82852j02751o1111J99829p2047k76069L54296J11896j52028K2996J54722
2554E62585J06273l42456q6355M1329l03894R9202l6757J115Q8848J48317N3046
$$ y = [-120068, -24893, 67781, 129347, 213239, 348201, 416897, 293177, 89419, 39540, 14721, 101851, 307579, 41516, 81479, -69631, -33180, 88744, -34355, -12198, -25037, 29851, 168314, 142985, -70863, -457189, -392632, -3702, 60503, 179580, -146021, -215170, 132807, 127643, 195128, 17291, -103853, 264207, -60945, -20527, -61518, -46907, 432103, 414711, 115203, -95219, 265762, 745869, 930643, 1079338, 1029493, 1343056, 1607383, 1459269, 1548163, 1591087, 1610156, 1154685, 1133747, 1013126, 687034, 697299, 666715, 447726, 382852, 280101, 218990, 418819, 346772, 70703, 424999, 536895, 384867, 407863, 562585, 668858, 326402, 240047, 281376, -22518, 76684, 39927, 41042, 129890, 278207, 331253]
2543C31253J21619m5005j45650j28862M2843J35000j14897L17227j1844J6731
2533E18415l53735k33515K60558k39458J18188K24539k64619k42838k3288J18272
2523a17481L44979k4992N4704J49700l12540k73234N1534j5722K64337K03276
2513C24561k18405Q3246M6874K38816p4372k01217J92333j66832j87689J54883
2503A92198N5679j34772J25229N2956K6947L5936j60410r0747l7792k74729J00202
2492a09303O90424K54433l20763k75763j54918o7051K64450J7164L61312O3115
2482G23100p4893l27479J28079J30790k06480N2957J38429k67401J64645L58578
2472H20325k43400l11411K20720M17144k70987j39335R4300k41036m0945K48181
$$ y = [331253, 452872, 407867, 262217, 133355, 176198, 311198, 196301, 513528, 501684, 518415, 164680, -68835, 191723, -47735, 70453, 294992, 30373, -212465, -235753, -117481, 227498, 202506, 257210, 406910, 94370, -178864, -127330, -143052, 121285, 324561, 106156, 189402, 236276, 475092, 400720, 199503, 391836, 225004, 37315, 192198, 247877, 113105, 238334, 291290, 318237, 354173, 193763, 103016, 65224, -209505, -109303, 581121, 835554, 514791, 239028, 84110, 17059, 281509, 298673, 659985, 723100, 648207, 320728, 448807, 579597, 373117, 426074, 564503, 297102, 461747, 820325, 576925, 265514, 486234, 903378, 632391, 493056, 587356, 346320, 305375, 553556]
2462E53556l8531L16499l8105l35930L55300j38659j15717K10673o2940k17704
2452D88442J80270p7319j70242K46292J13225j90805J12431L41594k66387K7443
2442H04944k01188j40058J30004J08886j8547J10094j13284L4033k89943J1054
2432D35995m599K7213K96342J72451j47290l64710J4073k0192J62140K68091J14149
2421I53663N1236J3470j34941k71364K30455K41102J80392m9851r3982M4826k12095
2410I52911k2470K26474K07501n9401l15036M21474K2424k9784Q1443M3339P2603
2399A601478R932J75805L1843p3550j14438K29995J19856k66646j03977M9090
2389A659388p6154J57585K75245J51349r4886l2216k17614K84024K34201L61334
$$ y = [553556, 515025, 831524, 793419, 457489, 812789, 674130, 558413, 769086, 706146, 488442, 668712, 591393, 421151, 667443, 780668, 589863, 702294, 1043888, 777501, 804944, 603756, 463698, 593702, 702588, 684041, 794135, 680851, 714884, 424941, 435995, 431396, 458609, 754951, 927402, 780112, 415402, 429475, 409283, 571423, 839514, 953663, 1004899, 1018369, 883428, 612064, 842519, 1083621, 1264013, 1214162, 1120180, 1165006, 952911, 930441, 1156915, 1364416, 1305015, 989979, 1411453, 1433877, 1404093, 1485536, 1528875, 1601478, 1611410, 1787215, 1819058, 1745508, 1631070, 1861065, 1980921, 1714275, 1610298, 1659388, 1583234, 1740819, 2016064, 2167413, 2072527, 2040311, 1822697, 2106721, 2340922, 2702256]
2379B702256k0936j86721q0721J08066J92534J91643j25933J4542M8577o0108
2369B783199O3072N5921J20440K54101j63504J5871J95468J39618k44078L08563
2359C528671o785J16599k22911J03415O7137L48680K72396j21349K49441L77773
2349D713067j1675N7507m2546r8777M2767M22477P891o0221O16028J48992K69527
2338F065037M05184K51316M04816L69501L23583O02075O70447Q60374J245267
2329A1197600J822722J737854K046996K216472K276798J578402K106436K484792
2321B7468072L259427M012092M938019O262239R204341J5273604K4259670L2931744
2313A27609208M4815755N1426074M2331653J6027502m618599j5617697j4099851
$$ y = [2702256, 2681320, 2494599, 2413878, 2521944, 2714478, 2906121, 2780188, 2794730, 2843307, 2783199, 2846271, 2902192, 3022632, 3276733, 3113229, 3129100, 3324568, 3464186, 3220108, 3528671, 3521886, 3638485, 3415574, 3518989, 3586126, 3934806, 4207202, 4085853, 4335294, 4713067, 4701392, 4758899, 4716353, 4617576, 4660343, 5082820, 5090711, 5030490, 5646518, 5795510, 6065037, 6470221, 6721537, 7126353, 7495854, 7819437, 8421512, 9091959, 9952333, 11197600, 13020322, 14758176, 16805172, 19021644, 21298442, 22876844, 24983280, 27468072, 30727499, 34739591, 39677610, 45939849, 55144190, 70417794, 94677464, 127609208, 172424963, 223851037, 266182690, 282210192, 277591593, 261973896, 247874045]
2306B47874045j5413571k1678798k6711144l1232906k7886522k4245996k0827898
2299G9877210j4897362r280658o308636m126399m188837m176716l588081k860648
2291C0449873k662133k775973k887816j948504j711979j408623j236442r34906
2283A4883497j060961q00895j012588q16221o48730l40021l51629k09431m74368
2274I168653m83083n20500k19307m89694j62265j48924K2179m93196k49538k26717
2264F197608j87347m7709K3948n48458k4381k92824m18072l16907m1858K59429
2254D603429k32959j22819k16360l52267J71822m07455m21813j5628R3478p1871
2244C027557j53080k06478k17154K18137j45359l65814j49775J30923j40507j16777
$$ y = [247874045, 232460474, 210781676, 184070532, 152837626, 124951104, 100705108, 79877210, 64979848, 55699190, 49390554, 45264155, 41075318, 36898602, 33310521, 30449873, 27787740, 25011767, 22123951, 20175447, 18463468, 17054845, 15818403, 14883497, 13822536, 13021641, 12009053, 11192832, 10544102, 10204081, 9852452, 9643021, 9168653, 8685570, 8165070, 7945763, 7456069, 7293804, 7144880, 7167059, 6673863, 6424325, 6197608, 6010261, 5962552, 5986500, 5438042, 5413661, 5120837, 4702765, 4385858, 4344000, 4603429, 4370470, 4247651, 4031291, 3679024, 3850846, 3443391, 3021578, 3005950, 3099428, 3027557, 2874477, 2667999, 2450845, 2668982, 2523623, 2157809, 2008034, 2138957, 1998450, 1881673]
2234A881673N175j7283L64222K68134l58007K0243J38631K97174j91870l03331
2224B104761j74605r2893P4855j46347k05568L1994j98049L1448p61l04602K01
2213A120434M23655r2658k33516J46677o0912J8990l5730j6276j25368l39940
2203H05356J94685j53787L27358P9716o2531P0943k07747j27266J55725N1092
2193A133544j24966J8986j1365j24759l61075J13987K41108j29111N6256L67131
2183A179736n8904j11463k22528M392L08192j293j18595j62813l0123q9432j09059
2172E88110J0862Q7522j40305m0390J12389j74131j43463j73171M17901J02664
2162F47988j61891j99732j34073M5955j75123K54185J82999m5611J18561J66445
$$ y = [1881673, 1886848, 1869565, 2233787, 2501921, 2143914, 2164157, 2302788, 2599962, 2408092, 2104761, 1930156, 1837263, 1912118, 1765771, 1560203, 1592197, 1394148, 1425596, 1424835, 1120233, 1120434, 1544089, 1451431, 1217915, 1364592, 1303680, 1322670, 1286940, 1270664, 1145296, 805356, 1000041, 846254, 1173612, 1253328, 1190797, 1261740, 1053993, 926727, 1082452, 1133544, 1008578, 1027564, 1016199, 891440, 530365, 644352, 885460, 756349, 812605, 1179736, 1120832, 1009369, 786841, 791233, 1099425, 1098132, 979537, 816724, 786601, 697169, 588110, 598972, 686494, 546189, 505799, 618188, 444057, 300594, 127423, 545324, 647988, 486097, 286365, 152292, 198247, 23124, 277309, 460308, 414697, 533258, 699703]
2152F99703j57374k50811k1010j0612O3070N994k6401j3579l4307L07156j49012
2141D12817q619J14626l7108j01722m21290J46731J4293m15499L840P2530K21971
2130B570J18883O5718K52161J42221p2740l37129q4209j31388J05241K14914K62049
2119E38291K2410l37357P4307j81181J06149n1829j62036j75514K81749N41595
2109F56584j09099k49302j71363l39652K61261j14395R2595L40536k87743O7451
2099A46873J9346m8950j18432j7360N5815Q4404K6777J11056J15816J55145M4746
2088E75236l63561N609j62059n8314k10768N9598L28279Q892J58990k37979j92915
2077h8992K72115K24057l4352j73981j57556L1158O9841M48j7833o8539J47190
$$ y = [699703, 542329, 291518, 270508, 259896, 322966, 328960, 302559, 288980, 254673, 561829, 412817, 404198, 518824, 481716, 379994, -41296, 105435, 119728, -295771, -291931, -219401, 2570, 121453, 187171, 439332, 581553, 508813, 171684, 87475, -43913, 61328, 276242, 538291, 560701, 223344, 297651, 116470, 222619, 170790, 8754, -166760, 114989, 656584, 547485, 298183, 126820, -212832, 48429, -65966, 26629, 367165, 79422, 146873, 166219, 117269, -1163, -18523, 37292, 121696, 148473, 259529, 375345, 530490, 575236, 211675, 217284, 55225, -3089, -213857, -154259, 174020, 182912, 341902, 103923, -88992, 183123, 407180, 372828, 198847, 41291, 72449, 142290, 142738, 124905, 56366, 203556]
2066B03556K90630k10925k78156l5617K45122j52029J44317P0510J0549k36445
2056E1512j8701r745J56542Q4824J60972j59229r0774j76915M9196M06481J826
2045D55989J49779Q4253M39815K5628j5007J50619J81088j09222O4403j37331
2035A290014m69298j58388j4581k69256j08059J61815m8087j12002J4985j84851
2025A02292k15682J16716J0013M12498j24303J66993L1107l54705k63227j74274
2015b92572J18895L46185j15632j21730n6011k25178N24370J25986j70237l00308
2005a66232j5899K00817J92301q4092p0552m7505N5164J09570J33968J35999j24252
1994C19287j7486j4755o9896q1203l51464N8073j47408k81859L14193N02328J06970
$$ y = [203556, 494186, 283261, 5105, -30512, 214610, 62581, 206898, 277408, 287957, 51512, 32811, 23066, 179608, 264432, 425404, 266175, 175401, -1514, 47682, 454163, 455989, 605768, 690021, 1129836, 1155464, 1140457, 1291076, 1472164, 1362942, 1427345, 1290014, 820716, 662328, 647747, 378491, 270432, 432247, 384160, 272158, 287143, 102292, -113390, 3326, 13339, 425837, 301534, 468527, 499634, 144929, -118298, -292572, -173677, 172508, 56876, -64854, -120865, -346043, 178327, 304313, 134076, -166232, -182131, 18686, 210987, 126895, 56343, 8838, 64002, 173572, 307540, 443539, 319287, 301801, 287046, 217150, 135947, -215517, -157444, -304852, -586711, -272518, 229810, 336780]
1983C36780k94250j41629K11981j34008M5505K12012k96553J72042l6601K86555
1973C61834K1636l75312L2915J14804M4050J17696r853n2587m1664k46296L7158
1962D381M42752K01800k32879k45516k73698M7064K14088O5542J65178j66257
1952B22455j62670p6459l7702L3585Q86L28913L77546m56522n91562K52748K9121
1941g9661J11131P0248k49699K52788M08799m12607k87855K04376K55088Q053
1931B80661J04762l5388m64401N5428J80809N1194J24220j73686m7092j91257
1921a14750P7911l8488j96869M03594P7599j10894o4383k860J842P3947j01283
1910E366n1858N2386l7111K7587N4698R1104j42413J44283K41670J6308k37922
$$ y = [336780, 42530, -99099, 112882, -21126, 24379, 236391, -60162, 111880, 75279, 361834, 383470, 8158, 41073, 155877, 199927, 317623, 307770, 255183, 213519, -32777, 4381, 447133, 648933, 416054, 170538, -103160, -56096, 157992, 223534, 388712, 222455, 59785, -16674, -54376, -20791, -19905, 309008, 686554, 230032, -361530, -108782, -79661, 31470, 101718, -147981, 104807, 513606, 100999, -186856, 17520, 272608, 280661, 385423, 350035, -114366, -58938, 121871, 173065, 297285, 123599, 76507, -114750, -36839, -75327, -272196, 131398, 208997, 98103, 33720, 30860, 32702, 106649, 5366, -46492, 5894, -31217, -3630, 51068, 142172, -241, 144042, 385712, 402020, 164098]
1899A64098M8281j67643l35507J49542J75760K2599J72334j93989l9942Q5375
1889H0908J9110k63950n2115N74335p5671j16008k86544k0120J37849M3172L33043
1878C74009o2053k78121k92613J14052k0624J10251L31927P6085N2055j77650
1868B27318j85498j01838j17140J1139K98207R6847j13802j38965R2799R2798
1858A61865k58229P0396k2930O3271R58J53915j69561o9112J34568m4498J20437
1847A41080J43025k10530k33729K17649j19672o0436j07449J46682J56094N8378
1837A31092j77476j59741J74196K9614l87053L01181J13508j92648K6421l57413
1827d98319P0936K73696j919k2940j71493k05978L74965O58427k73294m73012
$$ y = [164098, 212379, 44736, -290771, -141229, 34531, 57130, 229464, 35475, -4467, 80908, 100018, -163932, -216047, 358288, 282617, 166609, -119935, -140055, -2206, 40966, 374009, 311956, 33835, -258778, -144726, -165350, -55099, 276828, 352913, 404968, 227318, 41820, -60018, -177158, -166019, 132188, 229035, 115233, -23732, 69067, 161865, -96364, -25968, -48898, 14373, 15331, 169246, -315, -69427, 65141, 20643, 141080, 284105, 73575, -160154, 57495, -62177, -122613, -230062, -83380, 72714, 131092, -46384, -206125, -31929, -2315, -389368, -88187, 25321, -167327, -140906, -498319, -427383, -153687, -155606, -178546, -350039, -556017, -181052, 477375, 204081, -268931]
1817b68931L61594J59750k14283L3401J7309K56528r7560n6333j27169J3295R6510
1806A74111N5139k28131l1746J8370Q1826K63270j46263k12732j03347k23259
1796c52762L628N8082M5451k1933K86430j13416j25255j2335N4175p9653N8454
1785a99134J69893k13822J89622J17816r2780k04628p826k7979K98560Q0502n0499
1774E9725J135J32045m08411K18883L58829k91891p5360q0812O7427j01169J90425
1763G0826K4067o5104Q4397j17536j34520M408R6181j24671J16050j51716L20479
1752A22861j18654m78281K61971l734N23778j25329j98945k3625L1022p2341l44765
1741d26042J08780K38353m4280K50001K7363p4618O9113l11105q3814L8557J00694
$$ y = [-268931, 92663, 252413, 38130, 71531, 88840, 345368, 247808, 191475, 64306, 77601, 174111, 229250, 1119, -30627, -12257, 69569, 332839, 186576, -26156, -129503, -352762, -349134, -291052, -245601, -267534, 18896, -94520, -219775, -232110, -177935, -257588, -199134, -29241, -243063, -53441, 64375, -28405, -233033, -240859, -268838, 29722, 110224, 59725, 60860, 192905, -215506, 3377, 362206, 70315, -5045, -85857, -18430, -119599, 70826, 94893, 29789, 114186, -3350, -137870, -133462, -37281, -161952, -45902, -197618, 122861, 4207, -474074, -212103, -215837, 307941, 182612, -16333, -39958, -8936, -81277, -426042, -317262, -78909, -123189, 126812, 154175, 79557, 148670, -162435, -246249, -207692, -106998]
1730a06998k4275K31150j25648k52255N0920M6004r572K90023m5393Q4k06576
1719a52536L7302j78542J4929J49638J54982Q6229Q604j90916K5799J05136l3651
1708B6974J31270R3310k45881J94402k36476l37743L18254L59582k9479m83367
1698b09154k91543K94616J37733M5115J06456Q870p320j26280l53320J04224o693
1687b97296m2452K41488j67126q5360J1710K56522k16113K98124K25310j68133
1677E6674k1349j38660r907J90615j72070r8849K53381j12410j32972K12297k7252
1666e02l04383O3302K30406m1356m9899J95524j9529l7377o6057M7438p3242j54663
1654b10338K93654o4324k78905k63613K21637O1335m7874J22545J58658J50169
$$ y = [-106998, -131273, 99877, -25771, -278026, -227106, -181102, -190674, 99349, 53956, 54040, -152536, -115234, -293776, -278847, -129209, 25773, 112002, 120606, -70310, -44511, 60625, 26974, 158244, 251554, 5673, 200075, -36401, -374144, -55890, 303692, 274213, -209154, -500697, -206081, -68348, -23233, 83223, 92093, 84773, -41507, -394827, -290603, -297296, -339748, -98260, -265386, -350746, -339036, -82514, -298627, -503, 224807, 56674, 35325, -103335, -113242, 77373, -94697, -193546, 59835, -52575, -185547, 26750, -502, -304885, -241583, -11177, -52533, -102432, 93092, 73563, 36186, -29871, 17567, -55675, -210338, 83316, 18992, -259913, -523526, -301889, -240554, -288428, -165883, -7225, 142944]
1644A42944o1473l21116j50243K22456R5770k62778k47099J18513K78546k76311
1634d60791K97617r9518L65472K22288l00825k09120L75264K0717j41272N0174
1624A20006j67132Q2934Q4004K5364j39387k5421L0737L30858j58765l86954n9531
1613b63287J60951K51076n1919k4676K60042j48108l89667j04882q0422J23091
1603b67801L13071R0487j96169J2428k23163J67997J05008j12080R1641Q8683
1593G0102N3743j24306j93637J16119J20195K03039k18047l70185K14721L85961
1583B57705M7252l29407J30704j80518j7854J18976P5017J12722O3378k75071
1573B904N4155q3937n0505j42091J14875Q6556l79213K56598J16947j55009j20562
$$ y = [142944, 81471, -239645, -389888, -167432, -71662, -334440, -581539, -463026, -184480, -460791, -163174, -262692, 102780, 325068, 24243, -184877, 190387, 211104, 69832, 120006, -47126, 35808, 119812, 145176, 5789, -19632, 11105, 341963, 183198, -203756, -263287, -102336, 148740, 96821, 72145, 332187, 184079, -205588, -310470, -390892, -267801, 45270, 135757, -60412, -47984, -271147, -103150, 1858, -110222, -18581, 70102, 123845, -461, -194098, -77979, 42216, 245255, 27208, -342977, -128256, 257705, 304957, -24450, 106254, -74264, -92118, 26858, 101875, 214597, 277975, 2904, 57059, -26878, -77383, -219474, -104599, -18043, -397256, -140658, -23711, -178720, -299282]
1562b99282J03312J06814r9177M3056J53619n7723k97604K80759K00650l1774
1552A02650l44353M7844K03428r6667k63542M6104K09820O7321L8340k02753J72151
1541a9657J36055l18610m7844J37922O4350j04438l73028O8296O8472J59333K21781
1530g368j3866J64170j20015J0637L08905J19012m39646J47130p8087j22841k6149
1519e8118Q458j06240j28933j8796K98357J49745J02031k4104m22238R2403K1914
1508h5521P7798L4605L2533m5897L627j61149k18314j00974K42241N2495j69227
1497c37783K25033j60358J53080J59952l4975N2222j19717J9143j70147N8944
1487a54606R2903J98102Q4989O2730k2453n3618j39281j56033j69624j0793J28794
$$ y = [-299282, -195970, -89156, -188333, -145277, 8342, -49381, -346985, -66226, 134424, 102650, -241703, -193859, 9569, -87098, -350640, -304536, -94716, -27395, 10945, -191808, -19657, 116398, -202212, -250056, -112134, -47784, -152222, -525250, -456954, -388482, -229149, -7368, -21234, 142936, 22921, 33558, 342463, 461475, 21829, 168959, 90872, -31969, -58118, -49660, -155900, -284833, -303629, -5272, 144473, 246504, 222400, -199838, -107435, -85521, -7723, 26882, 59415, 13518, 17145, -144004, -362318, -463292, -221051, -168556, -337783, -112750, -273108, -120028, 39924, 4949, 57171, -62546, -43403, -213550, -154606, -61703, 136399, 221388, 284118, 261665, 208047, 68766, -87267, -256891, -267684, -138890]
1476a38890K8358n0416j5938L2324R3622L9822l1785J35583j15258j63296M4468
1465a41406j96174J75478L92810l30877j00879K23549N3545j25936J75589L0952
1455A56651k42540q9504K93898n7627l05896o5198j2190K95912Q7986k32637K8300
1444a42845L89260K9956k96087R1947J02073j08576l04892j47713K64201l5189
1434a57865L58008m16741P8085N021K85337J3771k38532k21898R5303L56069l5403
1423A21155k35812q828q1856l1882K66768r0837j871J57928N8356o2696q4208
1412F217k01732J06399J47184J80335J59349r1203k56967k33543J08141K48360
1402A72540j14954K17774l09086j75564Q162P1978j16261K23775J08531J96522
$$ y = [-138890, -110532, -160948, -176886, -144562, -50940, -11118, -42903, 92680, -22578, -185874, -141406, -337580, -162102, 230708, -100169, -201048, 22501, 76046, -49890, 125699, 156651, -85889, -175393, 118505, 60878, -245018, -310216, -322406, -26494, 61492, -171145, -142845, 246415, 276371, -19716, 72231, 174304, 65728, -239164, -386877, -122676, -157865, 200143, -216598, -138513, -133492, 151845, 165616, -72916, -294814, -199511, 156558, 121155, -114657, -123485, -205341, -237223, 29545, -61292, -63163, 94765, 153121, 90425, 6217, -195515, -89116, 58068, 238403, 397752, 306549, 49582, -183961, -75820, 172540, 57586, 275360, -33726, -209290, -201128, -129150, -245411, -21636, 86895, 283417]
1392B83417k01742k53332J12977k23684K82559J2868p5599M46505o7922n11980
1382a95933k6915K43023K05j29931J02867Q3694k69436Q8105l3956K66583j19072
1371I234l9990J15486q0214k72908k74661L94900K47652o521k80060K43175j07901
1360e1808m1698J76799q9491k6356J55843p7848m81914O6761J71262r829K34533
1349B6254O6481j33852j49117J68708q8786K9067l639j24891L06804o2884p2250
1338c8105m5099O4295r8445P3610L03342k58077J08964K4685N6312k17511j26579
1327a52608K60752j19688Q8133r48k2144J53495j84495j82269k56873J18519J69350
1316a28776k9011j76638j5083J66886K76305q7242l2567K15635q0935k85051k90301
$$ y = [283417, 81675, -171657, -58680, -282364, 195, 13063, -62536, 383969, 316047, -195933, -222848, 20175, 20380, -109551, -6684, 77010, -192426, -104321, -138277, 128306, 9234, -30756, 84730, 4516, -268392, -543053, -148153, 99499, 92978, -187082, 56093, -51808, -93506, 83293, -6198, -32554, 123289, 45441, -436473, -369712, -198450, -208279, 26254, 92735, -41117, -190234, -21526, -110312, -81245, -84884, -209775, 97029, 34145, -38105, -83204, -18909, -117354, -43744, 259598, 1521, 110485, 135170, 191482, -26029, -152608, 108144, -11544, 76589, 75641, 53497, 206992, 22497, -159772, -416645, -298126, -128776, -157787, -334425, -349508, -182622, 93683, 6441, -26126, 189509, 108574, -176477, -466778]
1305d66778J65552J34138K3392J53126L3792l55112J47368P8768m234J28801j22778
1294h3965j55442J68758m7535m7790L17040J89759k06128Q8449M2517j80327J6019
1283A01355k7537N9566Q1946K0124J56709k30938q2114l07040k5951L54044q8647
1272A1517k58553m8616J71633J6066P6168Q7449J81267k42497l4974n141m2664
1261h8345J8157P8152r4445K12114p39k88861K47188K79731k01554k28619Q7192
1250A9971K016K43056l69812m8319R7981J9341l33988J88350J71931j92581K53741
1239E1687k74655R0509P326J08056j06776j89292K98294l6780n9727M5500k60806
1228c26664J77388K49662n06932l3062L87951K01744k34538L9036K3214j68927
$$ y = [-466778, -301226, -167088, -143696, 9430, 43222, -311890, -164522, -85754, -89988, 38813, -83965, -239407, -70649, -118184, -165974, 151066, 340825, 134697, 223146, 265663, 85336, 101355, 73818, 133384, 215330, 235454, 392163, 161225, 79111, -227929, -253880, 100164, 11517, -247036, -295652, -124019, -107953, -31785, 55664, 236931, -5566, -40540, -45681, -88345, -70188, 7964, -86481, 125633, 124894, -163967, 83221, 362952, 161398, -67221, 19971, 21987, 265043, -104769, -153088, -55107, -35766, -369754, -181404, -9473, -202054, 51687, -222968, -132459, -125133, -17077, -123853, -313145, -14851, -51631, -111358, -65858, -326664, -149276, 100386, -406546, -439608, -51657, 150087, -84451, -45415, -22201, -191128]
1218a91128K75376q5733j0768O430m5005n1502J02299N4269j45474J06322J14367
1207A29453J49784k20628J42168k90251r4046M20349k57458o6275J59142L0926
1197A03164j81629K15650K09106K8964j24448k27351K2679J96100l34588m5189
1187a37542J56429k16648J96985K25193p1839k09847J67806J38707l13968J48270
1177H3546K4713j00258l9389j87539J51982N2715k14458J86558O154J21340k15503
1166a30139j75212J23818K20329m048o1681p4153l47389L70195K35608o2107N1924
1155A47145J48085j14116j44185J42321n398j63183j46274J64023o8657m7524
1145h7763p0308O7916n0980o9163J97861m5508j712k16970K23848K69699r8313
$$ y = [-191128, 84248, -1485, -12253, -5823, -50828, -102330, -31, 54238, -91236, 15086, 129453, 279237, 58609, 200777, -89474, -183520, 236829, -20629, -86904, 72238, 103164, -78465, 137185, 346291, 375255, 250807, 23456, 46135, 242235, -92353, -137542, 18887, -197761, -776, 224417, 152578, -57269, 110537, 249244, -64724, 83546, 108259, 8001, -31388, -218927, -66945, -14230, -228688, -42130, -35976, 85364, -130139, -305351, -181533, 38796, 34748, -26933, -101086, -448475, -78280, 157328, 95221, 147145, 295230, 181114, 36929, 179250, 173852, 10669, -135605, 28418, -40239, -87763, -158071, -90155, -141135, -210298, -12437, -57945, -59657, -276627, -52779, 216920, 118607]
1134A18607J6339m9057m66489r7325L16243L654M1756j812J06561m7966K4736
1123c4753p3116J58364p8301o9022n3227K03967k6351j79083k1966P8013J47353
1112E1878M265J19531l46980O7627R997M2228j67479M8938o9821N2965L86568
1101A99717j7743j27263j17403P0093j92718M1097J21637j55868M3855J8768m859
1090a20687J6014J20684k47000J83493k8013O3984K0996J21515r0661o8463Q1631
1079E3493N5598P5592j51866j72565K01399q0347j30657K2393L34005j51332j34591
1068g8878K71336q2397j17352n8466K21493P2850l67917N7741j6931j71865K54764
1057a5622J93796n6936J98892k27093o3603J50055k92509O0284l7174J22240l80779
$$ y = [118607, 134946, 85889, -380600, -477925, -161682, -158028, -116272, -118084, -11523, -59489, -34753, -107869, 50495, -27806, -96828, -150055, 53912, 27561, -151522, -173488, -95475, 51878, 56143, 175674, -171306, -103679, -93682, -51454, -218933, -169995, -239816, -186851, 199717, 181974, 54711, -62692, 7401, -185317, -144220, -22583, -178451, -134596, -115828, -120687, -104673, 16011, -230989, -47496, -75509, -11525, 9471, 130986, 40325, -28138, 53493, 109091, 184683, 32817, -139748, 61651, -18696, -149353, -126960, 207045, 55713, -78878, 192458, 110061, -7291, -65757, 155736, 228586, -139331, -81590, -98521, -270386, -15622, 178174, 121238, 320130, 93037, 29434, 179489, -113020, -52736, -89910, 32330, -348449]
1046c48449o6127K30676K4470R4775J94551k76607l3159O0544M36887j42155k3029
1035A52377m2561l52394J92249l6771r4256J08431j10474K61633j36354j17568
1025a75688j50437K62012K16913m4616j41900J1831K26047p5871q6860r0223P3178
1014B4386J36571N3446k51788K36851J939k44580j81272K03845q16p237k199j51098
1002a81952L16790K03273k38085j04149K0449m3381p5684K80015j0862j27000
992C9414r9437j41433j49011J36282L2379j71662J64641M71151p0475j60945k76135
981b25231J9532K13661L0213q5491m2119J68707l11863r1286L43981J82051l02730
970a00575N5732j75533Q9008K40535p7770j6889r6601J62241o3114o1344j5381
$$ y = [-348449, -414576, -183900, -159430, -64655, 129896, -146711, -179870, -119326, 317561, 175406, 152377, 109816, -242578, -50329, -87100, -181356, -72925, -183399, 78234, -58120, -175688, -326125, -64113, 152800, 108184, -33716, -21885, 204162, 128291, 41431, -48792, 24386, 160957, 214403, -37385, 199466, 201405, -43175, -224447, -20602, -21418, -28655, -30854, -181952, 134838, 338111, 100026, -4123, 16326, -27055, -102739, 177276, 166414, 39414, -60023, -201456, -350467, -214185, -181806, -353468, -188827, 282324, 211849, 50904, -225231, -205699, 7962, 38175, -47316, -89435, 79272, -232591, -323877, 20104, 202155, -100575, -44843, -220376, -131368, 109167, 31397, 14508, -82093, 80148, 17034, -44310, -59691]
959e9691Q2398O6858J30934K04447j93869K15007l53331j20884M5902L2349j63346
948a13226R1973R4532l63668j5460P9819J13212P2354J14238J30202K13258J05668
937E22902l25065j87184k88749N345M04168J85187k37681m754J2758p2069J29271
926A44129J43517l8872k04628k70449K08291j33342M9637L90161m8804L6660k700
915B73600j71447l26501N8312p3394K34560M472N1262j26449J35563l14669J63961
904i0730N50344q2416r1106k04839j42496n7692N1612j01484L52000M11767k86503
893C08457m07743j27750K13850j87147J64848J58704j26841K05590j4210l92417
883b04659j20189K81010O0200n6773O9949N2121q4521k19909J60476n75o1850
$$ y = [-59691, 22707, 89565, 220499, 424946, 231077, 446084, 92753, -28131, 17771, 50120, -113226, -21253, 73279, -290389, -305849, -226030, -112818, -40464, 73774, 203976, 417234, 522902, 197837, 10653, -278096, -272751, 131417, 316604, 78923, 74169, 86927, 14858, 144129, 287646, 248774, 44146, -226303, -18012, -151354, -101717, 288444, 239640, 276300, 273600, 102153, -224348, -166036, -239430, -4870, -398, 50864, -75585, 59978, -254691, -90730, 459614, 377198, 286092, 81253, -61243, -118935, -67323, -168807, 183193, 594960, 308457, -99286, -227036, -13186, -200333, -35485, 123219, -3622, 201968, 187758, -204659, -324848, -43838, 16362, -40411, 29538, 81659, -2862, -222771, -62295, -62870, -124720]
872a24720P8136K19651j35080k94868m9660J10302J83616J04129M7291o8146m55907
861c85256J8140J37781j76066J74231P295K08358j46027L3284m9154L9536j02423
850b40301j10706L22961J55055j87634k27053J62329J89693N7157J61632j09163
840A73970k09562J67156j25813j14988n411K39096n8554k00102K23201K16217
830C05210j91824l56780J61051K0903m6772M9103k34650m16518K85195N36263
820A11181j668k44200j61148J37474Q2406j58428R9118L55243K45178l24687m08376
809b67907j65976J58322Q7422L75393j79460k57059K88423l9615J82766k0736
799A61573L0391n6697L8057j29391k2046J29718m44166J94102J84527J65599j85353
$$ y = [-124720, -46584, 173067, 37987, -256881, -306541, -196239, -12623, 91506, 138797, 70651, -385256, -367116, -229335, -405401, -231170, -223875, -15517, -161544, -128260, -177414, -137878, -240301, -351007, -28046, 127009, -60625, -287678, -125349, 64344, 121501, 283133, 173970, -35592, 131564, 5751, -109237, -114648, 124448, 65894, -134208, 88993, 305210, 113386, -243394, -82343, -61440, -108212, -59109, -293759, -710277, -425082, 111181, 109513, -134687, -295835, -158361, -75955, -234383, -135265, 219978, 465156, 140469, -267907, -433883, -275561, -188139, 187254, 7794, -249265, 39158, -457, 182309, 161573, 191964, 135267, 173324, 43933, 21887, 151605, -292561, -98459, 86068, 251667, 66314]
788F6314L2706J74021J6839q5612M4691q9435j71578j4302j69509K37946p3652
777c1571j51491k7915K13239r2093J20662J99055j89296j33508K23493L28627
767D59202m41048R6250l6954J01810J37699l67663K5426J9321K00943k17272M6661
756B4375P6135m60176J38727j2389J17676L51963j05114k23969J36938l6741k99270
745b91845K16669j1469M1913l76231J17567K95904o9366j1170J00542R8036n0962
734E9588j94420k03274L3820K75472k09604J22280j07525J99788O370L9230o8906
723d7181k85868L01797j4306K18060k05621Q6871J22420j87638M5092m2262r5843
712a04479j29820R095J51565J59416K51821k98084J36379k88705j77126J58238
$$ y = [66314, 99020, 273041, 289880, 204268, 248959, 159524, -12054, -26356, -195865, 42081, -31571, -183062, -210977, 2262, -89831, 30831, 229886, 40590, -92918, 130575, 459202, 18154, 114404, 77450, 179260, 316959, -50704, -25278, -5957, 194986, -22286, 24375, 100510, -359666, -220939, -233328, -115652, 236311, 131197, -92772, 44166, 7425, -291845, -75176, -86645, -44732, -420963, -303396, -7492, -76858, -88028, 12514, 110550, 59588, -134832, -338106, -304286, -28814, -238418, -116138, -223663, -23875, -17505, 21725, -47181, -333049, -31252, -45558, 172502, -33119, 53752, 176172, -11466, 33626, -8636, -104479, -234299, -225204, -73639, 85777, 337598, 39514, 175893, -112812, -289938, -131700]
702a31700J39560J2520J16089k14047m26093L18499M57068j47028q0873K10669
692B54664j63591m4262k16039k0957n4700K70208J63074p7485o4262k16510J05480
681f4380K44536o4521J2315j26256j1962j37668l2652P7173J43282J40878k4903
670A55842k00446j02076K96910o0649N2614K34012j77735j51951N3396J01163
660B01080k00627l35392l8654J39478N7813q2046K63789M36774k74954m11505
650b44244J66383J4501l0913k30120P7666j3895J50833L8129K59554k3805O4818
639B28907o619p6024q0913k3782L7571J28606r2541o7463k870m2213n4460J47074
627I5273J01564k2254k14861J30868K81720l31828J0779J87402j03521K6955n6223
$$ y = [-131700, 7860, 20380, 136469, -77578, -503671, -185172, 271896, 124868, 43995, 254664, 91073, 46811, -169228, -190185, -244885, 25323, 188397, 110912, 46650, -169860, -64380, 180156, 115635, 127950, 1694, -10268, -147936, -180588, -103415, 39867, 180745, 155842, -44604, -146680, 150230, 89581, 142195, 376207, 198472, 46521, 99917, 201080, 453, -334939, -373593, -234115, -176302, -258348, 5441, 442215, 167261, -244244, -77861, -63360, -94273, -324393, -246727, -260622, -109789, -71660, 187894, 164089, 228907, 222288, 146264, 65351, 41569, 79140, 207746, 115205, 47742, 44872, 2659, -51801, 95273, 196837, 174583, -40278, 90590, 372310, 40482, 51261, 238663, 135142, 162097, 105874]
616A05874l40440K26101J83207M0669j56727M7385j58121K3178l1817j4406j67921
605b43018P839O7840J48767j05150k72752P5338K43316J63566j71710O212L57770
594B78018l127m1020j16382L366J2387L49394q4065k79116O2002r2154m6788J15929
582A58444k6708r3663O8895l46039l21902M39011L00276m3009q6600l54590J51741
571a54144K82009o3660k02128j51905K27586L29130l4375l31198Q6265j16119
561a28539P7874j88667K49805J3589Q584p2557j10187L23689j26114M7857j07781
550a2447K5023J98238m11453p0259J94989O4420J58466j70347Q5190k18805K85203
539A28218k59141j66966M43753J38699l72790j34302k39172J38889J03512p0118
$$ y = [105874, -234566, -8465, 174742, 215411, 58684, 106069, -52052, -28874, -60691, -75097, -243018, -235179, -167339, -18572, -123722, -396474, -321136, -77820, 85746, -85964, -79752, 278018, 274891, 233871, 117489, 120855, 133242, 482636, 398571, 119455, 181457, 89303, 42515, 158444, 131736, 38073, 106968, -239071, -560973, -121962, 178314, 135305, 48705, -305885, -154144, 127865, 64205, -137923, -289828, -62242, 266888, 232513, -98685, -12420, -128539, -50665, -239332, 10473, 24062, 32646, -39911, -150098, 173591, 47477, 95334, -12447, 12576, 210814, -200639, -270898, -75909, -11489, 146977, -23370, 61820, -156985, 128218, -130923, -297889, 145864, 284563, -88227, -222529, -461701, -322812, -219300, -289418]
529b89418J84663K4871J66436J84053j88652Q8246m08531Q1229j08741J78625
519h7219K13297J30486j54888j30660K55649k12712R1015q6412J04993k71340
509a47791j6037M229J90083K9259k22451j05205J97758J55266k98211L60112P1657
498B18669r5179J99297l25301N7792J62533j15155p571R8957R7809k45014j67675
487a20838K57208J94096p5365j01875K34485j11478l19925n0637r6509J07001
477h3837J89479O0650j60075k24627l0770K54583p8753L8585J08770j44277J37854
466F7582R1690O4611J08526r7472l16693K74732l7515m0735J30773k61956R3898
455G7441J84127j421k72641j47997M35055j11969l84233O7428p5807K87161K11589
$$ y = [-289418, -104755, -79884, 86552, 270605, 81953, 170199, -238332, -157103, -265844, -87219, 126078, 256564, 101676, -28984, 226665, 13953, 104968, 18556, 123549, -147791, -163828, -159599, 30484, 59743, -162708, -267913, -70155, 85111, -213100, 147012, 218669, 123490, 322787, -2514, 55278, 217811, 102656, 95085, 194042, 291851, 46837, -120838, 136370, 330466, 255101, 153226, 387711, 276233, -43692, -94329, -190838, -83837, 105642, 166292, 6217, -218410, -249180, 5403, -73350, -34765, 74005, -70272, 67582, 159272, 223883, 332409, 234937, -81756, 192976, 155461, 114726, 245499, -16457, 77441, 261568, 260147, -12494, -160491, 274564, 162595, -221638, -154210, -230017, 57144, 268733]
444B68733q7586o1530K5028j75451j11466J91537j28288j28753K4964J66931J27246
433A11365R1917Q4707j82750J69127j04442k91995j42116J34246P4487K6393K56945
422B27884k64804L44832R251j18834k30449J88115k61598K01101J09686k85700
412h0516K25135r7242l07056J11216K33468k42700J3571N11J54435r4580J23787
401D0029o6680J27972L15442j40412q6888k44831N4773J20271P8377Q5912m5623
390B38342J71116p3807m8269k77962k20923J20023m8352L41323K07746l61131
380D8106j73963L67617Q6755r9142p6973P8681P3212l00347J53214O8204j11265
369A14099l4042j79740J1394L00519O1661K9114k72280L130Q0133K8523o3874
$$ y = [268733, 181147, 119617, 144645, -30806, -142272, 49265, -79023, -207776, -182812, -15881, 111365, 203282, 287989, 105239, 274366, 169924, -122071, -264187, -129941, -55454, -29061, 227884, -36920, 307912, 317163, 198329, -32120, 155995, -105603, 95498, 205184, -80516, 144619, 47377, -259679, -148463, 85005, -157695, -144124, -143613, 10822, -83758, 40029, -26651, 101321, 416763, 276351, 189463, -55368, -595, 119676, 198053, 283965, 238342, 409458, 335651, 287382, 9420, -211503, -91480, -139832, 201491, 409237, 48106, -125857, 241760, 328515, 229373, 152400, 231081, 304293, 3946, 157160, 225364, 114099, 80057, -99683, -88289, 212230, 273891, 303005, 30725, 33855, 113988, 142511, 78637]
358G8637n8419k3676j08063L5567J04992r7905K00039j2800o4452q082K7884k42679
346a68957k11103R3034K05580N12844k17250J05029J44808k55627q4071R1886
336B16173j28848K4498j43153p9144K42991K63545o4495k512k58961o3722N6839
325F3211k09377r5694K39358K88887P0259l1341j54678o68171J06458J98411L00690
314A08013L9347j69231R313J20105K51761p3724K11768q7856k46819j01288J89607
303B50996k55705J14972J21626J66084l03985r3936J7470l9118O2262N8245j14231
292a5320K14322k11639j74752R0181O0415N3923K89935M8393j84779J02499l64160
281i0982M327K68785q6889J36220k66307p2177J309m5917q2350K75471J70198
$$ y = [78637, 20218, -3458, -111521, -75954, 29038, -68867, 131172, 118372, 53920, 45838, 73722, -168957, -380060, -287026, -81446, 431398, 214148, 319177, 463985, 208358, 124287, 216173, 87325, 111823, -31330, -110474, 132517, 396062, 331567, 329055, 70094, 6372, 63211, -146166, -241860, -2502, 286385, 356644, 325303, 170625, -497546, -391088, -192677, 108013, 147360, -21871, -12558, 107547, 359308, 285584, 497352, 409496, 162677, 61389, 250996, -4709, 110263, 231889, 397973, 93988, 52, 17522, -21596, 40666, 98911, -15320, 199002, -12637, -187389, -97208, -36793, 17130, 307065, 355458, 170679, 273178, -90982, -86655, 182130, 95241, 231461, -34846, -107023, -105714, -151631, -233981, 41490, 211688]
270B11688j93020J01232j63961j37291J71917J73268p9943j93858l0638J74041
260C3435M6430j93970K41031j06848k31292K11813R6583J72351k00438J67053
250B36148J01676J26724j71103j08845p4496K58520k00392r6687K32684p3121
240B31108M42l28850J63257L05392l00652k26700K18956L11584K4460o9906k03843
229A25248J73198j00232q7339m7186k72581J96852R7091R313N303m48538L33687
218a5184J20714l978l610k230J53325K9813L447j13027j47488J207J47642J80999
206C51630K3413k7328K768K6243r1171l30160j40817K88203Q5260j51309J4554
195E1286N50661o6406n63922k78510K66990M08083J90961k00274l15523J24635
$$ y = [211688, 18668, 119900, -44061, -181352, -9435, 163833, 83890, -109968, -140606, 33435, 79865, -114105, 126926, 20078, -211214, 599, 97182, 269533, 69095, 236148, 337824, 464548, 293445, 184600, 110104, 368624, 168232, 71545, 304229, 231108, 231550, -97300, 65957, 371349, 70697, -156003, 62953, 374537, 398997, 329091, 125248, 298446, 198214, 110875, 63689, -208892, -12040, 85051, 94364, 99667, -348871, -15184, 105530, 101552, 97942, 95712, 249037, 278850, 282297, 169270, 21782, 22989, 170631, 351630, 375043, 347715, 350483, 376726, 285555, -44605, -185422, 102781, 188041, 36732, 51286, 601947, 535541, -28381, -306891, -39901, 368182, 559143, 358869, 43346, 167981]
185A67981M1145K8260M4381m994K13360L3755l40821l74271j64687L80523N0792
174G5424k33206n1588K56072q6072J20409J85796q4106j89998J04226j52004m9374
163a04421k3197P7558K5977K45076j02014J31288m3131N397K32632j95767P5470
152C24868j67192n0997j23768l1436j45137K2922L09881k3103l6540q1432L0545
141B8611j08053R2058J4396K00197J07712k05163o5175J68542K93317j03679k95747
130A27016q5075L6721j05141K5722K90346k02307J2583N6146p9291Q188o6623
119A8285P0508K45519L8728j23806L1859j12898R635q9860n1413j0455p8612J50964
107I8454j15095l7630K24218P5324J30881q1165j98927m1893J88139j3505k07657
$$ y = [167981, 209126, 237386, 281767, 276773, 490133, 523888, 183067, -191204, -355891, 24632, 75424, -157782, -209370, 46702, -39370, 81039, 266835, 182729, -7269, 96957, -55047, -104421, -127618, -50060, -24083, 220993, 118979, 250267, 207136, 212533, 445165, 249398, 324868, 157676, 106679, -17089, -48525, -193662, -170740, 139141, 116038, 79498, -1934, 28611, -79442, 12616, 27012, 227209, 334921, 129758, 64583, 233125, 526442, 422763, 127016, 41941, 78662, -26479, -757, 289589, 87282, 99865, 156011, 76720, 84908, 18285, 88793, 334312, 373040, 249234, 281093, 168195, 177830, 87970, 36557, 26102, -52510, 98454, -16641, -54271, 169947, 245271, 376152, 294987, 96060, 54167, 242306, 228801, 21144]
96B1144J15725K02559l9445j90472K18310M631j70313q0003k77848J60652M6828
85A1768J3106L0195K34747m1856O0814l69404J48921M7731j05543J22104j3803
74A38780K898j01796O4943l9651N6583q7266M1579k0362M4621j02173M9320J40632
62A88108p2124q7172K29964R6253j68355j26424o0370K13473K9995O4155j96426
51A11077o5206J48426k4635N3691p7218k789r1103L23232j96954j60214J51556
40A69863k18979J59428l2247j0936J13938J92008l9569k81122j07914O5164K1547
$$ y = [21144, 136869, 339428, 299983, 109511, 327821, 332452, 162139, 82136, -195712, -35060, 11768, 24874, 55069, 289816, 247960, 308774, -60630, 88291, 136022, 30479, 152583, 138780, 141678, 39882, 104825, 65174, 121757, 34491, 76070, 55708, 100329, -1844, 47476, 188108, 115984, 28812, 258776, 355029, 186674, 60250, -120, 213353, 243348, 307503, 111077, 45871, 194297, 169662, 223353, 146135, 143346, 52243, 375475, 178521, 18307, 169863, -49116, 110312, 78065, 67129, 181067, 373075, 333506, 52384, -55530, 9634, 31181]
$$ [...]
##END NTUPLES=NMR SPECTRUM
##END=
