##TITLE=1H_TG-2413-A3
 200.13Hz,DMSO_CCl4.
 8 sc
 24.8.2026
##JCAMPDX= 6.0         $$ Bruker NMR JCAMP-DX V2.0
##DATA TYPE= NMR SPECTRUM
##DATA CLASS= NTUPLES
##ORIGIN= UXNMR, Bruker Analytische Messtechnik GmbH
##OWNER= pz
$$ XWIN-NMR		Version 3.5
$$ Mon Aug 24 13:28:02 2026 Russian Standard Time (UT+4h)  she@DPX200
##.OBSERVE FREQUENCY= 200.1313
##.OBSERVE NUCLEUS= ^1H
##.ACQUISITION MODE= SIMULTANEOUS
##.ACQUISITION SCHEME= undefined
##.AVERAGES= 8
##.DIGITISER RES= 18
##SPECTROMETER/DATA SYSTEM= spect
##.PULSE SEQUENCE= zg30
##.SOLVENT NAME= DMSO
##.SHIFT REFERENCE= (INTERNAL, DMSO, 0, 15.5122)
##AUDIT TRAIL= $$ (NUMBER, WHEN, WHO, WHERE, WHAT)
$$ ##TITLE= Audit trail, XWIN-NMR		Version 3.5
$$ ##JCAMPDX= 5.01
$$ ##ORIGIN= Bruker BioSpin GmbH
$$ ##OWNER= she
$$ F:/spectra/data/she/nmr/H-C/1/pdata/1/auditp.txt
$$ ##AUDIT TRAIL=  $$ (NUMBER, WHEN, WHO, WHERE, WHAT)
(   1,<2026-08-24 13:26:38.57 +0400>,<she>,<DPX200>,
      <created by zg, POWCHK disabled, PULCHK disabled
       configuration hash MD5:
       00 E9 B6 7A A2 85 ED C7 34 08 36 98 17 FE 4E 26
       data hash MD5: 16K
       57 92 28 46 2D 56 26 34 42 DB C4 E7 33 CB 46 08>)
(   2,<2026-08-24 13:26:41.40 +0400>,<she>,<DPX200>,
      <Start of raw data processing
       efp BC_mod = 2 LB = 0.25 FT_mod = 6 PKNL = 1 PHC0 = -4568.092 PHC1 = -4.407701 SI = 16K 
       data hash MD5: 16K
       26 9B 79 56 52 5F 70 63 32 C4 CD 4D 06 6F F4 7F>)
(   3,<2026-08-24 13:27:10.48 +0400>,<she>,<DPX200>,
      <pk PHC0 = -17.10713 PHC1 = 22.2 
       data hash MD5: 16K
       AE 47 FA 02 B4 AD 6B DC A0 A5 84 A2 BC 16 5E 04>)
(   4,<2026-08-24 13:27:15.53 +0400>,<she>,<DPX200>,
      <abs ABSG = 5 
       data hash MD5: 16K
       5D 16 5F BD A3 62 99 7C 4F DE 21 67 5A 74 3C 29>)
$$ ##END=
$$ 
$$ hash MD5
$$ 71 7A 98 74 D3 53 49 E4 BA 5A 9B C0 B5 03 E4 A1
##$RELAX= 
##$RELAX= 
##$RELAX= 
##$RELAX= 
##$RELAX= 
##$RELAX= 
$$ Bruker specific parameters
$$ --------------------------
##$DU= <F:/spectra>
##$EXPNO= 1
##$NAME= <H-C>
##$PROCNO= 1
##$TYPE= <nmr>
##$USER= <she>
##$AMP= (0..31)
100 100 100 100 100 100 100 100 100 100 100 100 100 100 100 100 100 100 
100 100 100 100 100 100 100 100 100 100 100 100 100 100 
##$AQSEQ= 0
##$AQ_mod= 1
##$AUNM= <au_zg>
##$AUTOPOS= <>
##$BF1= 200.13
##$BF2= 200.13
##$BF3= 200.13
##$BF4= 200.13
##$BF5= 200.13
##$BF6= 200.13
##$BF7= 200.13
##$BF8= 200.13
##$BYTORDA= 1
##$CFDGTYP= 0
##$CFRGTYP= 5
##$CHEMSTR= <none>
##$CNST= (0..31)
1 1 145 1 1 1 1 1 1 1 1 1 1 1 1 1 1 1 1 1 1 1 1 1 1 1 1 1 1 1 1 1 
##$CPDPRG= <>
##$CPDPRG1= <>
##$CPDPRG2= <>
##$CPDPRG3= <>
##$CPDPRG4= <mlev>
##$CPDPRG5= <mlev>
##$CPDPRG6= <mlev>
##$CPDPRG7= <mlev>
##$CPDPRG8= <mlev>
##$CPDPRGB= <>
##$CPDPRGT= <>
##$D= (0..31)
0 0.7 0 0 0 0 0 0 0 0 0 0.03 0 0 0 0 0 0 0 0 0 0 0 0 0 0 0 0 0 0 0 0 
##$DATE= 1787563598
##$DBL= (0..7)
120 120 120 120 120 120 120 120 
##$DBP= (0..7)
150 150 150 150 150 150 150 150 
##$DBP07= 0
##$DBPNAM0= <>
##$DBPNAM1= <>
##$DBPNAM2= <>
##$DBPNAM3= <>
##$DBPNAM4= <>
$$ [...]
##$SUBNAM3= <"">
##$SUBNAM4= <"">
##$SUBNAM5= <"">
##$SUBNAM6= <"">
##$SUBNAM7= <"">
##$SUBNAM8= <"">
##$SUBNAM9= <"">
##$SW= 18.0517328524113
##$SWIBOX= (0..15)
0 0 2 0 0 0 0 0 0 0 0 0 0 0 0 0 
##$SW_h= 3612.71676300578
##$TD= 16384
##$TD0= 1
##$TE= 0
##$TE2= 300
##$TE3= 300
##$TEG= 300
##$TL= (0..7)
0 120 120 120 120 120 120 120 
##$TP= (0..7)
150 150 150 150 150 150 150 150 
##$TP07= 0
##$TPNAME0= <>
##$TPNAME1= <>
##$TPNAME2= <>
##$TPNAME3= <>
##$TPNAME4= <>
##$TPNAME5= <>
##$TPNAME6= <>
##$TPNAME7= <>
##$TPOAL= (0..7)
0.5 0.5 0.5 0.5 0.5 0.5 0.5 0.5 
##$TPOFFS= (0..7)
0 0 0 0 0 0 0 0 
##$TUNHIN= 0
##$TUNHOUT= 0
##$TUNXOUT= 0
##$USERA1= <user>
##$USERA2= <user>
##$USERA3= <user>
##$USERA4= <user>
##$USERA5= <user>
##$V9= 5
##$VALIST= <valist>
##$VCLIST= <CCCCCCCCCCCCCCC>
##$VD= 0
##$VDLIST= <DDDDDDDDDDDDDDD>
##$VPLIST= <PPPPPPPPPPPPPPP>
##$VTLIST= <TTTTTTTTTTTTTTT>
##$WBST= 1024
##$WBSW= 4
##$XGAIN= (0..3)
0 0 0 0 
##$XL= 0
##$YL= 0
##$YMAX_a= 400922
##$YMIN_a= -409732
##$ZGOPTNS= <>
##$ZL1= 120
##$ZL2= 120
##$ZL3= 120
##$ZL4= 120
##$ABSF1= 15.49237
##$ABSF2= -2.55948
##$ABSG= 5
##$ABSL= 3
##$ALPHA= 0
##$AQORDER= 0
##$ASSFAC= 0
##$ASSFACI= 0
##$ASSFACX= 0
##$ASSWID= 0
##$AUNMP= <proc_1d>
##$AZFE= 0.1
##$AZFW= 0.1
##$BCFW= 0
##$BC_mod= 2
##$BYTORDP= 0
##$COROFFS= 0
##$CY= -3
##$DATMOD= 1
##$DC= 0
##$DFILT= <>
##$DTYPP= 0
##$F1P= 0
##$F2P= 0
##$FCOR= 1
##$FTSIZE= 16384
##$FT_mod= 6
##$GAMMA= 0
##$GB= 0
##$INTBC= 1
##$INTSCL= 3.241238e-09
##$ISEN= 128
##$LB= 0.25
##$LEV0= 0
##$LPBIN= 0
##$MAXI= 10000
##$MC2= 0
##$MEAN= 0
##$ME_mod= 0
##$MI= 1.114404
##$NCOEF= 0
##$NC_proc= -7
##$NLEV= 6
##$NOISF1= 3.799351
##$NOISF2= 2.8
##$NSP= 0
##$NTH_PI= 0
##$NZP= 0
##$OFFSET= 15.51221
##$PC= 1
##$PHC0= -4585.199
##$PHC1= 17.7923
##$PH_mod= 1
##$PKNL= yes
##$PPARMOD= 0
##$PSCAL= 0
##$PSIGN= 0
##$REVERSE= no
##$SF= 200.130001899786
##$SI= 16384
##$SIGF1= 3
##$SIGF2= 2
##$SINO= 0.751879
##$SIOLD= 32768
##$SREGLST= <19F.Aceton>
##$SSB= 0
##$STSI= 16384
##$STSR= 0
##$SW_p= 3612.71676300578
##$SYMM= 0
##$S_DEV= 0
##$TDeff= 16384
##$TDoff= 0
##$TI= <>
##$TILT= no
##$TM1= 0
##$TM2= 0
##$TOPLEV= 0
##$USERP1= <user>
##$USERP2= <user>
##$USERP3= <user>
##$USERP4= <user>
##$USERP5= <user>
##$WDW= 1
##$XDIM= 16384
##$YMAX_p= 438118445
##$YMIN_p= -1107712
$$ End of Bruker specific parameters
$$ ---------------------------------
##NTUPLES= NMR SPECTRUM
##VAR_NAME=  FREQUENCY,     SPECTRUM/REAL,   SPECTRUM/IMAG
##SYMBOL=    X,             R,               I
##VAR_TYPE=  INDEPENDENT,   DEPENDENT,       DEPENDENT
##VAR_FORM=  AFFN,          ASDF,            ASDF
##VAR_DIM=   16384,         16384,           16384
##UNITS=     HZ,            ARBITRARY UNITS, ARBITRARY UNITS
##FACTOR=    0.220516191357247, 1,           1
##FIRST=     3104.45859521046, 0,            0
##LAST=      -508.258167795315, 0,           0
##MIN=       -508.258167795315, -1107712,    0
##MAX=       3104.45859521046, 438118445,    0
$$ Real data points
##PAGE= N=1
##DATA TABLE= (X++(R..R)), XYDATA
$$ [...]
12593a40066j30568R4264N1202Q2758j06950k7917K6546L3771o0806M5784j1708
12582a43690r6808K18414j39295L1367j9310R2389o0784J85975J73881n95531
12572c53392l3812K44171J56863l0567Q6302Q6378k12678l8651l2016L0671k21131
12561c17862j17608K90663n4144J85104p1924j88755L066L47702j91061j04186
12551b19005m3648K36909J56688n6154k57395p5520K18394J2653R6941p6882m7938
12540e4957J62240j02411J14798j36925r7167J35153L2802k0644J18781j13863
12530C7807r6552q1801n0721j58815K08671k6761L1066n0551K2902P4322k21099
12519c11532j40898L1435L90292j33284j63623j24045K42237N5197p2595q8892
$$ y = [-140066, -270634, -176370, -125168, -42410, -149360, -177277, -150731, -116960, -177766, -131982, -143690, -240498, -22084, -161379, -130012, -149322, -56933, -117717, 68258, 242139, -353392, -387204, -143033, 13830, -16737, 69565, 155943, -56735, -95386, -127402, -96731, -317862, -435470, -144807, -198951, -13847, -85771, -274526, -271460, 76242, -114819, -219005, -262653, -25744, 130944, 74790, -182605, -258125, -39731, -27078, 69863, -7019, -54957, 107283, 4872, 119670, -17255, -114422, 20731, 53533, 32889, 151670, 37807, -58745, -140546, -191267, -350082, -141411, -168172, -137106, -187657, -164755, -90433, -311532, -452430, -420995, -30703, -163987, -327610, -451655, -209418, -154221, -226816, -315708]
12509c15708J53780K1801j13358J65275R7328j27800J33446J32736j5744j58512
12499b6756J09642K6326j57834l0385j71368J49811J35076k42456j09628J60900
12489a56672J52047k3650n1338J05572l4051j1181K12449j27434j8085j40159
12479i2502k77701J83987L23180j43124k72540J07960J6881l1912O7762J0795
12469a07214O5597N9318k4180l76348Q4758J58765k50347j00340J80438N0658
12459b58895J88791j292P7440J65857J57967k52566n1522Q7564j78545p0951J26463
12448i689K34392l62994J14590j4619m1584M0135L1483K73464J26599j42171j80474
12437F9132l2919j40095N5525K26930q1479r2952J67132k11343J25166p116m5531
$$ y = [-315708, -161928, -140127, -253485, -88210, 9118, -118682, 14764, 147500, 131756, -26756, 82886, 109212, -48622, -79007, -250375, -100564, 34512, -207944, -317572, -156672, -4625, -28275, -79613, 25959, -8092, -19273, 193176, 65742, 47657, -92502, -370203, -186216, 136964, -6160, -278700, -170740, -153859, -185771, -118009, -107214, -41617, 17701, -6479, -382827, -298069, -139304, -389651, -489991, -309553, -258895, -70104, -71396, 6044, 171901, 329868, 77302, 25780, 113344, -65201, -136152, -9689, 224703, -138291, -23701, -38320, -79904, -39769, -8286, 265178, 391777, 249606, 69132, 36213, -103882, -48357, 178573, 97094, 4142, 171274, -40069, 85097, 77981, 32450]
12426C2450J80490M1187K41091k45625m2039q2718j80222P175O9407m1965k00643
12415b21412Q6736J79897j1510m3690m6596r9220M785j7821K12383J29088k19181
12404d6541J33769j381K7377M8424O3705l2910R0226J0105r3504k34505q5780
12393a21015K38772n4564O0621O1785j55768Q2164o0723J72349N2952l0135j00924
12382A45514L5516J0263J5326j15605k09323J77894o9143j18839q559J60074R5367
12371A18485j2916J3632J66163n19941J28021K77732j31651m0982O8642J67350
12361B34535p9685J6597J79102r1840R2752j5580k9354o6309P7264J94980j47235
12350C65227n4860r5638k65526P9755J01964q4720R5736J03795m0405P8668p9633
$$ y = [32450, 212940, 254127, 495218, 249593, 207554, 124836, -55386, -48211, 21196, -20769, -221412, -134676, 45221, 33711, -9979, -56575, -155795, -151010, -168831, 43552, 172640, -46541, 87228, 85847, 113224, 161648, 225353, 192443, 282669, 292774, 199270, -35235, -121015, 117757, 63193, 123814, 185599, 29831, 111995, 51272, 223621, 276573, 246438, 145514, 181030, 191293, 206619, 91014, -118309, 59585, -9558, -128397, -136956, 23118, 118485, 105569, 119201, 285364, -234577, -106556, 171176, 39525, -1457, 67185, 234535, 154850, 171447, 350549, 258709, 351461, 335881, 306527, 240218, 317482, 512462, 365227, 310367, 214729, -50797, 28958, 130922, 46202, 141938, 245733, 205328, 283996, 204363]
12339B04363j4977J45338q9699j18617K46750Q1249k30790q0951J58313M19996
12329G20975r1584k67188P3001J86861j88750j37249J32085P8820O9974k1484
12319E55461k20729N6801K67538O4190j91931l1412l2805j15783J9862K63411
12309F34603R1048k85400j54648R2545l2972K11388N4094J30922n9547l4395J46794
12298G94432j12029J47013j54832J00449k3936q5210J8255m6378K05326J06107
12288I49197j23021q87O0514k11816M1371J86407P8774o6580k32511J51888P1751
12277I05087J55289J48221P2126N198q7401j56835J66103K45038l09901j79985
12267I62940n1560J25201J16925J42074j18059k9339K601L96755J39738k57216
$$ y = [204363, 189386, 334724, 245025, 126408, 373158, 454407, 223617, 142666, 300979, 720975, 629391, 362203, 435204, 622065, 433315, 296066, 428151, 506971, 576945, 555461, 334732, 391533, 659071, 723261, 531330, 499918, 467113, 351330, 371192, 634603, 725651, 440251, 285603, 378148, 345176, 556564, 610658, 741580, 682033, 647638, 794432, 682403, 829416, 674584, 775033, 751097, 665887, 684142, 637764, 843090, 949197, 826176, 825289, 885803, 673987, 715358, 901765, 980539, 913959, 681448, 833336, 905087, 1060376, 1208597, 1280723, 1285921, 1198520, 1041685, 1207788, 1452826, 1142925, 962940, 911380, 1036581, 1153506, 1295580, 1177521, 1148182, 1150783, 1547538, 1687276, 1430060]
12257A430060J48760j25282j01425L12375J74938j04444J17495j4529N9841J48176
12247B045965j41423M5730j1376l6332Q0253K41878j21090J65086J62385k18808
12237B212268J64099J00254K1140k1421R9121J42161J46968o7759M8207P7598
12227B922636K89002K73134K1706o6707J99654J87086N7691L0055L28045j47893
12217D094409k35411L44147j74493j14922n626j62343J7578Q8239j77442k90416
12207C383720k8964j77741o61814k3197r512j21800k38251J04122l8791p0796
12197B116976j9735J10623L1390l07828n8378J45292P1209l15269k45766J60356
12187A688870J44190k04150n3634k27070L4677K9920m0474j3892K80997o0641
$$ y = [1430060, 1578820, 1453538, 1352113, 1664488, 1839426, 1734982, 1852477, 1837948, 1897789, 2045965, 1904542, 1950272, 1938896, 1902564, 1982817, 2224695, 2103605, 2268691, 2431076, 2212268, 2376367, 2476621, 2497761, 2476340, 2575461, 2717622, 2864590, 2796831, 2845038, 2922636, 3211638, 3484772, 3506478, 3439771, 3639425, 3826511, 3884202, 3914257, 4242302, 4094409, 3858998, 4203145, 4028652, 3913730, 3908104, 3745761, 3763339, 3851578, 3674136, 3383720, 3354756, 3177015, 2515201, 2492004, 2482492, 2360692, 2122441, 2226563, 2187772, 2116976, 2097241, 2207864, 2239254, 1931426, 1873048, 2018340, 2089549, 1774280, 1528514, 1688870, 1833060, 1628910, 1575276, 1348206, 1382883, 1412803, 1372329, 1358437, 1639434, 1578793]
12177A578793k62543J26463n5154j46009n9533N29k15971J77975p4280j49361
12167I20909K2843Q89L3262K78710j11202q6280N0033j33445p2164k18099K97349
12156I82805j08286j19904k57826p2955N2369R7819k743L41739N4915m7112r3032
12145H27789J20306j91366j26194K80226l60575q5070l5460p7133J91402Q8527
12135F32452k4519o3371q591R4189j10344J51817j98968o5724l4463r7503j8390
12124B56585l6485J61273r1324r4897Q0177K22783K9471l23140J91098K45518
12114F41059L0179q752k4497K07509Q3958k00131q4296l0167r2679M8781j10957
12103D60007o640n2911K4886L008o4323K6655j19759K15820J36703M1290m6121
$$ y = [1578793, 1316250, 1442713, 1387559, 1241550, 1182017, 1182546, 966575, 1144550, 1070270, 920909, 943752, 944641, 977903, 1256613, 1145411, 1059131, 1109164, 975719, 903555, 685456, 982805, 874519, 754615, 496789, 423834, 476203, 574022, 571279, 913018, 967933, 920821, 827789, 948095, 756729, 630535, 910761, 550186, 465116, 429656, 352523, 543925, 632452, 607933, 544562, 535971, 630160, 519816, 671633, 472665, 406941, 372478, 274975, 256585, 220100, 381373, 290049, 195152, 275329, 498112, 527583, 204443, 395541, 641059, 671238, 662486, 637989, 845498, 929456, 729325, 645029, 614862, 522183, 570964, 460007, 453367, 400456, 425342, 428350, 364027, 390682, 270923, 486743, 623446, 664736, 618615]
12092F18615j02428J06156l4395n3661r3366O4737m7575k08155p4768J90490q1001
12081B84649P3678k06749j74122J39256O4364K51977J28531q2135m25346l36686
12071b82583K07277J16310J79227O7317j83206p7643Q8356J26782j25559J83297
12061B99575J7748K35476k93043k12868l15811J30173K14292M5747J25167j39369
12051A07087Q5153n9276O8736O8268k38236k82838m0619m4450K7400J12564L4411
12040a61800J91020k30430J39828J94854j05632p0103J6034j56477n5045L3500
12030b04251j19753J1909Q5152q1197j41119J53616J44716j31418o3727j3342
12020c59414l770J27705R008j26367l9532M5867L0182Q0719j44694J76587K7495
$$ y = [618615, 516187, 622343, 587948, 534287, 440921, 505658, 458083, 249928, 175160, 365650, 284649, 358327, 151578, -22544, 116712, 181076, 433053, 561584, 479449, 54103, -282583, -75306, 41004, 220231, 287548, 104342, 26699, 115055, 241837, 116278, 299575, 317323, 552799, 259756, 46888, -268923, -138750, 75542, 121289, 246456, 107087, 192240, 132964, 201700, 269968, 31732, -251106, -291725, -336175, -308775, -196211, -161800, 29220, -201210, -61382, 133472, 27840, -42263, -26229, -182706, -237751, -204251, -324004, -312095, -226943, -308140, -449259, -295643, -150927, -282345, -346072, -359414, -363184, -235479, -226471, -352838, -392370, -346503, -316321, -235602, -380296, -203709, -176214]
12009a76214J79271j04841p2321J59412j20330p2178R7668l3233j31116O4099
11999b09783j04545r853K26865J31657j59915O4484K3370r7150j65114p8068L3691
11988c44361k420M9672J48425o793m4821k02769r0322K46313J16680m0254M4448
11977a26202J66133j12225O6582k06159q5234J14290o4541l1234j17803J15017
11967b81376K10160l4873O7688n7688M3352j71547J00365J99817p5507j20504
11957a20113Q0109j19877J07639J85229m3639J6455k33309k22247K178n0547J75175
11946b22947J12987k64378j51586K06121J06767l2997J5926P8245k42595Q2393
11936c12064J17320l08937j38580J96448K74902N3454n9144j50944J08607N5997
$$ y = [-176214, 3057, -101784, -174105, -14693, -135023, -207201, -109533, -142766, -273882, -209783, -314328, -324181, -97316, 34341, -125574, -61090, -37720, -134870, -299984, -378052, -344361, -346781, -297109, -148684, -155477, -200298, -403067, -493389, -247076, -130396, -170650, -126202, 39931, -72294, -5712, -211871, -297105, -182815, -247356, -278590, -396393, -281376, -71216, -106089, -38401, -96089, -52737, -224284, -123919, 75898, 391, -120113, -40004, -159881, -52242, 132987, 89348, 105803, -127506, -349753, -347575, -398122, -222947, -109960, -374338, -525924, -319803, -213036, -246033, -230107, -151862, -394457, -312064, -194744, -503681, -642261, -445813, -170911, -117457, -176601, -327545, -218938, -162941]
11926a62941R4069j87813J96889l1862k54380k00282K04568K06851k25339j7981
11916c78221R9437J61401m9125j35893k33246K55522j2025K2278J23907k62901
11906d08866j6151J90380m5631j41520J21718m2489o5767L8623K74725J6549j50412
11895b28841k8120J7904j6491L477j68427K84633J28824j97566J00340q5653j17734
11884c07654J84956o6514k65350K13816m7879k30403J65540J93892K37736q3040
11874d900j35331L084Q3439m3324k74635J08594m49J12342j00110q9729K45755
11863i5264m5533j43864j84330k55880J88881J93893j98858m7769O2932J98822
11853c26970P5598k04787J88528R7246q0940J31946j00022L701j76788K22482
$$ y = [-162941, -68872, -256685, -59796, -91658, -346038, -546320, -341752, -134901, -360240, -378221, -278784, -117383, -166508, -302401, -535647, -280125, -292150, -269872, -145965, -408866, -425017, -234637, -280268, -421788, -300070, -342559, -408326, -369703, -94978, -78429, -228841, -256961, -239057, -255548, -252071, -420498, -135865, -7041, -204607, -104267, -189920, -307654, -122698, -189212, -454562, -240746, -288625, -519028, -353488, -159596, 78140, -4900, -140231, -137147, -53708, -97032, -371667, -263073, -263522, -151180, -251290, -341019, -95264, -140797, -284661, -468991, -724871, -535990, -342097, -540955, -588724, -525792, -326970, -251372, -456159, -267631, -170385, -251325, -119379, -219401, -215700, -392488, -170006]
11843a70006q2778L8458J75172j38638J48951p9810l17710p8133M0617m2335m2550
11832e48762J69163J4389k11088N7628J81085R9297J05192J65436K1184o4037
11822a0513J3915j26686J05065j52857k86800J02874q8123J58650J28837j36606
11812b92244J21683m1248j90103j19260L04652K42264k04945o7749J93045J867
11802e2038j74559J0842R2975Q1845p7433j56687k15197J51415K89455K0863k84476
11791c12995O7716j77711J63273k07125L21979o1036j97928O3108j49844J78649
11781c11914N0619J02799j86857K77359p4641k25751m1946K2243N5281P2775M786
11770b55247J04385R6667o0897O4936M194j15550k27725K8342J83751J6319k1473
$$ y = [-170006, -252784, -214326, -39154, -177792, -28841, -108651, -426361, -504494, -463877, -506212, -548762, -379599, -365210, -576298, -518670, -337585, -238288, -133096, 32340, 53524, -10513, 3402, -123284, -18219, -171076, -457876, -355002, -443125, -284475, -155638, -292244, -170561, -211809, -401912, -521172, -216520, 25744, -179201, -246950, -53905, -52038, -226597, -215755, -122780, -40935, -118368, -275055, -490252, -338837, -49382, -28519, -312995, -245279, -422990, -259717, -466842, -144863, -205899, -403827, -340719, -490563, -311914, -261295, -158496, -345353, -67994, -142635, -368386, -410332, -388089, -332808, -260033, -255247, -150862, -54195, -115092, -50156, -45962, -161512, -389237, -360895, -177144, -160825, -182298]
11759a82298J4472j02241O9467O3669P477L4970K8782k26222j32920k13964j65262
11748h04070L73901K5607q9887K17675n341k08671N4021J72857o4462J24424N9480
11737a44466p8605K77511j42760j04951j02083J87929J9241j09154K54456q1685
11727b4567p0820Q9827l4763k77742j05899q100k4815J16517m8022M9215j45939
11716d85108R4236j10306P6991J33029p4701J48724N5208P9972k58025r6468J08926
11705c27522P5539p6448j5663m9078K9422j44704Q2376J78288m4184L2243j03769
11694c63500L46221p5221l44081K51564l35649N3217N0045r6357L2307j25595
11684f07049J54900k05285m3455K75784O8831P3878O2527j12183k14245p4977
$$ y = [-182298, -167826, -270067, -200600, -136931, -129454, -94484, -65702, -291924, -424844, -638808, -804070, -430169, -404562, -494449, -276774, -282115, -490786, -436765, -263908, -328370, -203946, -144466, -223071, 54440, -88320, -193271, -295354, -107425, -88184, -197338, 57118, -24567, -95387, -5560, -40323, -318065, -423964, -432064, -456879, -340362, -388384, -339169, -485108, -390872, -501178, -424187, -291158, -365859, -217135, -161927, -81955, -339980, -436448, -327522, -251983, -328431, -344094, -393172, -363750, -508454, -426078, -247790, -291974, -259731, -363500, -17279, -92500, -436581, -185017, -520666, -467449, -417404, -513761, -481454, -607049, -452149, -657434, -700889, -425105, -356274, -282396, -219869, -332052, -546297, -621274]
11674f21274l9089L0434M1478K08358N6675L4532j46559q3784J04484Q6753J8465
11663c09527k95853K76345N8810J17326q667r7574Q9622j9219n1341j3110k00142
11652d53330N4420O7955k2224Q2924J75186q8800p3031j28538j93202k03518j67440
11641i49598J97024j3902K79566L09327j31712j39217Q059M2449j23872J13437
11631d08439J8188j95749K49530r7184k83896r8046q6682K40788L72730k3492
11621c12252k65885M9493O5902j48301M14510p0217p2810j16698j10515k8239
11611e95012j92087J67526j13639L44188J49152k81333M9614J90179J66376k32278
11601c47314J07070K97486j79802l69296m0222R4825Q0240J26858m03307n5647
$$ y = [-621274, -660363, -629929, -588451, -380093, -323418, -288886, -435445, -519229, -414745, -327992, -309527, -605380, -329035, -270225, -152899, -161566, -259140, -169518, -188737, -240078, -253188, -453330, -398910, -330955, -353179, -270255, -95069, -183869, -256900, -385438, -578640, -782158, -949598, -752574, -766476, -486910, -177583, -309295, -448512, -440453, -398004, -521876, -408439, -390251, -586000, -336470, -433654, -717550, -815596, -902278, -661490, -288760, -312252, -578137, -528644, -462742, -611043, -196533, -266750, -339560, -456258, -566773, -595012, -787099, -619573, -733212, -389024, -239872, -521205, -471591, -281412, -115036, -347314, -240244, 57242, -122560, -491856, -532078, -437253, -357013, -230155, -633462, -689109]
11591f89109K47248k2278J71210N4251j44825j88274L21027J3454j76669J31787
11581b82178l14075K3741P4946J49182K00154k37791n7401k38742J75007R6463
11571d10694r5041m7691J03446R3620p7903k4173j50754J71659j04295L43895
11561a97931j5156K0356J11575J1341j28230j45490n814j89636Q6717j33088n3002
11550f38358m699k64140R8632J80635J63564J5083J9759m4261p1743j08877O3731
11539e90674J05611M2610j5536J66448O4433k79683J23893q6253K60349L0576
11529a78226k08568K4202j5150P0442j1083o8628K1684J07385M7360o8741j16167
11518c95490j03550J30406k57864k01105J24670K92242p9724o3938O693j0880
$$ y = [-689109, -441861, -464139, -292929, -238678, -383503, -571777, -250750, -237296, -413965, -282178, -596253, -572512, -497566, -348384, -148230, -386021, -443422, -682164, -507157, -410694, -505735, -553426, -449980, -356360, -434263, -458436, -609190, -437531, -541826, -197931, -213087, -192731, -81156, -69815, -198045, -343535, -349349, -538985, -452268, -585356, -638358, -643057, -907197, -808565, -627930, -464366, -449283, -429524, -473785, -545528, -654405, -590674, -485063, -442453, -457989, -291541, -227108, -506791, -382898, -469151, -208802, -178226, -386794, -362592, -377742, -307300, -318383, -387011, -365327, -257942, -210582, -279323, -395490, -499040, -368634, -626498, -827603, -702933, -410691, -490415, -554353, -547660, -558540]
11508e58540j65144J00191J09212j88277L4579K15550J79288K082j51571m2080
11498d64710M098p5390K60539j34390l3222K61483j63301k76973K78308Q4969
11488b58589j98194k5507J68937O9562p4298k08205j16733J78163P9340j19968
11478e05492K606M7243p1036l5933P8139P5308J34762l9303l3707O7266j71390
11467d51537j45599L4310L9758k983J20049m7542j32300k947J25738L9090O5907
11456c58056P8574k08456j0450K36190k17891l6962M8442J1123J02521j51172
11446e06137k01174L7286P8086k1917m0189j30821Q933J4028N3271J78332J56005
11435c74297j39946K492m0592k42259Q4880J04202P2995N3187L4968J25631P6437
$$ y = [-558540, -723684, -623493, -514281, -702558, -667979, -452429, -273141, -271059, -422630, -464710, -460612, -536002, -275463, -409853, -443075, -181592, -344893, -621866, -343558, -258589, -456783, -482290, -313353, -243791, -318089, -526294, -643027, -464864, -385524, -505492, -502886, -455643, -526679, -562612, -484473, -409165, -274403, -313706, -347413, -280147, -451537, -597136, -562826, -523068, -526051, -406002, -453544, -585844, -588791, -463053, -423963, -358056, -279482, -487938, -498388, -262198, -480089, -517051, -468609, -457486, -354965, -506137, -707311, -670025, -591939, -613856, -654045, -784866, -775933, -761905, -708634, -530302, -374297, -514243, -511751, -552343, -794602, -709722, -605520, -532525, -479338, -444370, -318739, -242302]
11424b42302J22824n5338p7733k83868j03679k52302L4797M01302O4073m7792
11414d40018j2062P1356j29580k40543J49302J8580P3395J08052J77827k9057
11404b52748j29878l4560j7572q0689k73984L25138J55887p7756L3611o4906k70490
11393f87947J45296K2562L0238j69441r5500r831L77477m247K04040j19401l00533
11382f07287l1085l0367J871j09513J66842k07507P8105K04671K52639J40289
11372a41342k4392r7729j21546j54861L5390p3386K6126J60919r7114J86730r6752
11361c97957m4992K47126k6473L37307k77624k40793J88552K2645k57029J01327
11351c47911l0437J31090j2431k77828p0697j86797j41249L49180N6838j72561
$$ y = [-242302, -119478, -174816, -252549, -536417, -640096, -892398, -857601, -456299, -392226, -440018, -452080, -380724, -510304, -750847, -601545, -582965, -509570, -401518, -223691, -252748, -382626, -417186, -434758, -515447, -789431, -464293, -308406, -386162, -352551, -417457, -687947, -542651, -520089, -489851, -659292, -754792, -764623, -387146, -391393, -187353, -306754, -607287, -638372, -668739, -666868, -776381, -609539, -817046, -738941, -534270, -281631, -141342, -165734, -263463, -385009, -539870, -504480, -577866, -551740, -390821, -487935, -301205, -397957, -442949, -195823, -222296, 115011, -162613, -403406, -214854, -192209, -449238, -347911, -378348, -247258, -259689, -537517, -608214, -795011, -936260, -587080, -530242, -702803]
11341g02803K05399k0356K22106n3935J9088L1925j09283K39096q7739l81063
11331f37565k8677J33344j22554J53488O3302k60645O7010J19334k1961J15209
11321d19715J03152l4333l5192j20528L5055K03464l3575M4485j75521j60469
11311e93177N7328L8091K13182j93936j58522J34248K34365l643j1179k3365r8602
11300d05210j65845P7825J0585k552K78537p7384r3338J05923n0234J8712K7277
11289b75704j17862j22895M2971K9967j23923R9667l0277m0890j5459J42940k2077
11278d33542j60091L1645J80602m1361j40933O8691l86968J28750J15130L56547
11268b81530k8770k1963M6453k63944R4482j03026J84739J6573k26965k06252
$$ y = [-702803, -497404, -517760, -295654, -349589, -330501, -298576, -407859, -168763, -256502, -637565, -666242, -532898, -655452, -501964, -438662, -699307, -632297, -512963, -534924, -419715, -316563, -350896, -386088, -506616, -471561, -268097, -301672, -257187, -432708, -593177, -535849, -497758, -284576, -478512, -637034, -502786, -268421, -272064, -283243, -306608, -405210, -571055, -493230, -482645, -485197, -206660, -284044, -377382, -271459, -321693, -302981, -275704, -393566, -516461, -473490, -443523, -567446, -467779, -498056, -538946, -554405, -411465, -433542, -593633, -561988, -381386, -422747, -563680, -494989, -881957, -753207, -638077, -281530, -310300, -332263, -285810, -549754, -455272, -558298, -373559, -356986, -583951, -790203]
11258g90203o7510K63815K24448l2901j8094j0899j69605K07297o4444n5007j34864
11247f47967j01524J44078q3954L74L35315J08367l8425L69115j72570k47747
11237c34938j19780J41107j4900J70169j47710k10933n406Q2957m4715k0209N7077
11226d47281M6545K51638j55576m29753m0734R7961l7109J64522R9499J97875
11216b52413l02292J55662L2570p5801M5296j89522K93208J59338k00774q0609
11206d15337j62340J18682J78858Q6478o953j84043J58127k23604J81564J28275
11196a40293l72810N1442n2997J56613O4612p8149L22880k07452j08771l2854
11186c97779n3217M830l871K4621j23002J37868j26968j73086L10755K43000p9561
$$ y = [-790203, -857713, -593898, -369450, -402351, -420445, -431344, -600949, -393652, -458096, -513103, -647967, -749491, -605413, -689367, -688993, -353678, -245311, -283736, 85379, -87191, -334938, -454718, -313611, -328511, -158342, -306052, -516985, -522391, -439434, -484149, -504358, -447281, -400736, -149098, -304674, -734427, -775161, -677200, -714309, -549787, -450288, -252413, -554705, -399043, -366473, -442274, -396978, -586500, -293292, -133954, -334728, -415337, -577677, -458995, -280137, -193659, -200612, -384655, -226528, -450132, -268568, -140293, -513103, -461661, -514658, -358045, -293433, -371582, -48702, -256154, -364925, -397779, -450996, -446166, -450037, -425416, -548418, -410550, -537518, -710604, -399849, -156849, -236410]
11175b36410k16373k24813J36357J81653N0386m0245Q174M8304o8311p9638M2114
11164c98802k29168k9468O6278J48697k31438R7860m1492j51971K09638J79742
11154c80124J36059j70528j60132k16035J45826K2293J12120J06690P1424k63845
11144e96252J14987L9341j45362J43940J20740P5793k01194m33178J3630P0411
11134g97144L26003M0018K21930k95276n1971J39241j36508l15135J34379J46631
11124e87832R8284K70471n7118j41740j23578J53087J10339j86639j75530j52258
11114g92514J77870P044k02029L8677M3540Q1568J14919j01343P9138R1252j33396
11103e95274J04166n4501L2061Q7584J42342l31852o7187O5199N89m3306K98214
$$ y = [-236410, -452783, -677596, -541239, -359586, -309200, -349445, -341271, -292967, -361278, -440916, -398802, -627970, -657438, -591160, -442463, -673901, -576041, -617533, -769504, -559866, -380124, -244065, -414593, -574725, -790760, -644934, -622641, -510521, -403831, -332407, -596252, -481265, -441924, -587286, -443346, -322606, -246813, -448007, -881185, -867555, -797144, -471141, -431123, -209193, -504469, -556440, -417199, -553707, -868842, -734463, -587832, -489548, -219077, -276195, -417935, -541513, -388426, -278087, -464726, -640256, -792514, -614644, -607600, -809629, -770952, -727412, -645844, -530925, -632268, -553130, -461878, -595274, -491108, -545609, -513548, -425964, -283622, -615474, -682661, -617462, -616873, -660179, -361965]
11092c61965p3249k737o0985L6581l06868N249L07417k4293j57127N1617q4524
11081f70884K24220j84669J9474n8190j83476L73306j32281R9992J78617J16779
11071b17112k8680k44225l2306J45826J19265k59383n5175J8532j16304K5834
11061f43728J25015N4594K6436j60689n0602o605K35708K32523P574q4064j21786
11050c85624j54051K14161j17966r6877K39087M3923j04377r0155j34827l5616
11040f22322K4078J53389j47136j96633N757O4165R5398k35030J18822J59422
11030e80090j21157J71266J08622j32649N4292L3129m4463k17979K31467K45833
11020b51729j45885o7453L02274j99398J39935k47355k02664J93004J64042j53516
$$ y = [-361965, -435214, -437951, -498936, -462355, -769223, -763974, -456557, -480850, -637977, -586360, -670884, -446664, -631333, -611859, -670049, -853525, -480219, -612500, -512508, -333891, -217112, -245792, -490017, -522323, -376497, -257232, -516615, -571790, -553258, -669562, -643728, -518713, -464119, -437683, -598372, -648974, -655579, -419871, -187348, -179774, -263838, -385624, -539675, -325514, -443480, -540357, -301270, -257347, -361724, -451879, -586706, -622322, -598244, -444855, -591991, -788624, -782867, -718702, -623304, -858334, -739512, -580090, -701247, -529981, -421359, -554008, -499716, -466587, -511050, -729029, -497562, -251729, -397614, -465067, -162793, -362191, -222256, -469611, -672275, -479271, -315229, -468745]
11010d68745K59912j64943j30091q3177O4819J04448O0341j02135j07243R7522
11000d69292N9066j49297j41242K64028J51110j03178j31393j20885Q7301j23319
10990f77101J73229L3239j18041M29150j85451R4342j8628o0448L0146l06329
10980f05892J39341K41676J8919j40715j84978Q7920J18455r8383k32176J46516
10970e09317p2773M5025J58249p6816j65747j19389k20430J61983K22346k16642
10960g93511L89365j65273p8915J21891J3018Q8527j90001j9947L0444M2346O8118
10949d93938K0182q8832r5691L22342J78092P6519k19723K9536m2507k91466j97630
10938h03116K40158K00653L3146J03999j35272o9811J13660j06263k7974Q0215
$$ y = [-468745, -208833, -373776, -503867, -587044, -522225, -417777, -357436, -459571, -566814, -469292, -410226, -559523, -700765, -436737, -285627, -388805, -520198, -641083, -553782, -677101, -503872, -470633, -588674, -159524, -344975, -250633, -269261, -329709, -299563, -605892, -466551, -224875, -205956, -346671, -531649, -443729, -325274, -423657, -655833, -509317, -582090, -537065, -378816, -455632, -621379, -740768, -961198, -799215, -576869, -793511, -404146, -569419, -648334, -526443, -513425, -424898, -614899, -634846, -604402, -562056, -493938, -473756, -562588, -658279, -335937, -157845, -81326, -301049, -271513, -314020, -605486, -803116, -562958, -362305, -329159, -225160, -360432, -430243, -316583, -422846, -450820, -370605]
10928c70605j74392q1166p9323K86211L1068J49312J25018j09889j62192O295
10918c79663j0089J39290j60733L5219j89400r8949J42931j8528r3365l0636O9722
10907e94201K38944L4517J84432m5196J6285j29447o8281j6206J20968j44413
10897d02598J06672j03257j96423J38869J4673j20041J726J46331k09460K80863
10887c42645P973k31798J87181P3954j58109r1884J86478K512p8900j43378O7152
10876e21464l6182r81R6130k16176m7302O9511K71416l03869N4459J86243j41623
10865e89838K0402O7721R6851m4476J6039J56826m2404p7548j38985j10457m5904
10854f91773K57149Q2022K5460k5651M8694j0860p4648k293r509j67674J92339
$$ y = [-370605, -544997, -626163, -705486, -419275, -388207, -238895, -113877, -223766, -385958, -379663, -389752, -250462, -411195, -375976, -565376, -664325, -521394, -539922, -633287, -663923, -594201, -355257, -320740, -136308, -181504, -165219, -294666, -362947, -379153, -258185, -402598, -295926, -399183, -595606, -456737, -442064, -562105, -560379, -414048, -623508, -342645, -334672, -566470, -379289, -305335, -463444, -555328, -368850, -366338, -445238, -588616, -521464, -557646, -558627, -462497, -678673, -725975, -656464, -385048, -688917, -634458, -448215, -589838, -569436, -501715, -404864, -449340, -433301, -276475, -318879, -396427, -535412, -645869, -691773, -434624, -352602, -327142, -352793, -304099, -314959, -389607, -391900, -401409, -569083, -376744]
10843c76744O0818Q5527j14128j18737K86612k06449N6304j9913J40166M7636
10833a58908o0546j31851j29312n7925j6521m4302J08249L05903j46962J09968
10823b22207p7084L3038J45613J02203k65359k57863j7151l1696K27328J71918
10813a91260j05226j91973O4529O2169K82087N2398k96901j19071J85198K9375
10803b28675j01900K73100K674j56109j04717k7720J93477M593k45662O5040M558
10792c21341J74891O4374j78850j22804J56868J2463j5446o6686l6974P181p8245
10781d04569J24848k3442K04931J19791l60867k83577p0016P8720O5485L1175
10771e17521M2267J92787o1992k02805j30035K06782P0243O5260L95617k72462
$$ y = [-376744, -315926, -230399, -344527, -463264, -176652, -383101, -326797, -346710, -206544, -158908, -219454, -351305, -480617, -538542, -555063, -599365, -491116, -185213, -332175, -222207, -299291, -266253, -120640, -18437, -283796, -541659, -558810, -590506, -363178, -191260, -296486, -488459, -423930, -361761, -79674, -27276, -324177, -443248, -258050, -228675, -330575, -57475, -54801, -210910, -315627, -343347, -149870, -145277, -390939, -325899, -321341, -146450, -82076, -260926, -383730, -226862, -214399, -229845, -296531, -333505, -326324, -404569, -279721, -303163, -98232, 21559, -339308, -622885, -692901, -614181, -548696, -517521, -475254, -282467, -344459, -547264, -677299, -470517, -400274, -335014, 60603, -211859]
10761b11859o784q0085O021P0073l49708J29624K8905j0609q4510N2657J89615
10750b66660k76775L7169K03339q9471J30160K01850J20316j59751k01633m1645
10740c43101j63274M5323L2989N2060l8975J26233J05854k29074R4047K8520l09820
10729e99218J28595Q7107j32129m3953M2190Q1419K7715P3148J60762j89448k11022
10718e74834J5872K28816j6042k01682K02457K11560k48097n5593P085L44629
10708h5829M5494j78030m4301L403n3154j70507J09547K58284j5247J78184o3642
10697a5798m6643p3872o6654j17486J11613J17408j80232r2617j54773K55329
10687b63725k577k51200J74092l0623M7070j8992j76043O2376Q1321J13576k46326
$$ y = [-211859, -218643, -298728, -292707, -222634, -572342, -442718, -413813, -424422, -508932, -456275, -266660, -543435, -506266, -302927, -392398, -262238, -60388, 59928, -99823, -301456, -343101, -506375, -461052, -428063, -376003, -414978, -288745, -182891, -411965, -317918, -289398, -599218, -470623, -383516, -515645, -559598, -517408, -435989, -408274, -335126, -174364, -363812, -574834, -558962, -330146, -346188, -547870, -345413, -133853, -381950, -437543, -430458, -85829, -40335, -218365, -262666, -259263, -312417, -482924, -373377, -115093, -130340, 47844, -15798, -62441, -136313, -202967, -320453, -208840, -91432, -271664, -364281, -519054, -263725, -266302, -517502, -343410, -374033, -326963, -345955, -521998, -459622, -378301, -264725, -511051]
10676e11051J05534R8490L23294k80028j23676P5570k58963j00213J75750K10168
10666b85125l8406P9457j60397k12350K41325J7395J96342j41017j99897P8848
10656d23825O6716P4213j51095J20185k24236o7029L23554J14640J14068l49703
10646d02512k42939L98515j19886q5080k04427L1685K62121J41873J28570k36406
10636c28486k5824K41046j6412j06331l8785j92957j95263J20515L22279L6137
10626a84081n2764j33767J53789K32093o3948p9300n3497L32338O4180l92910
10616a77867k49029K97009q5747j04911R3771P7981J5783K25489k07279k75446
10606c90246J13907k74213Q3206J33945L08824r6352J04976n2036Q2940k31595
$$ y = [-511051, -405517, -307027, 16267, -263761, -387437, -311867, -570830, -671043, -495293, -285125, -323531, -244074, -404471, -616821, -375496, -358101, -161759, -302776, -502673, -423825, -357109, -282896, -433991, -313806, -538042, -605071, -281517, -166877, -52809, -402512, -645451, -246936, -366822, -451902, -656329, -624644, -362523, -220650, -92080, -328486, -354310, -113264, -129676, -236007, -274792, -467749, -663012, -542497, -220218, -184081, -236845, -370612, -216823, 15270, -48678, -127978, -181475, 150863, 215043, -177867, -426896, -129887, -215634, -320545, -226774, -148793, -133010, 92479, -114800, -390246, -276339, -550552, -467346, -333401, -24577, -120929, -15953, -67989, 14951, -216644]
10596b16644m3392J43031M6734j26273j38686j15187N4953P8416j1340J15241
10586b13147N1959N2348l37432J70727Q5448J53487O8690M8790j35836k11238
10576b66204m1947J9869k02860K46002J07198m13453J33631K63217J37559q3574
10566a00562J58636L03822k79731m3914k44508o3474J05011J10846p9621j12946
10556b46441J53500J58600j58618k81416J76161J0842r4139p1516Q1905J68394
10546a02728j135k88540K62748J2129O9472K09651K339j89210j44793Q8007J23031
10535D0971k58550L65284L6046l39216l9435L22229J2706j10705O4337p9046Q6063
10524A00684k0914n6414k07864L2187K95599j19091p6043K29671j78670n8584
$$ y = [-216644, -260036, -117005, -70271, -196544, -335230, -450417, -395464, -317048, -328388, -213147, -161188, -108840, -446272, -275545, -190097, -36610, 32080, 80870, -54966, -266204, -308151, -288282, -491142, -245140, -137942, -551395, -417764, -154547, -16988, -100562, 58074, 361896, 82165, 38251, -206257, -269731, -164720, -53874, -133495, -246441, -92941, 65659, -92959, -374375, -198214, -187372, -281511, -353027, -271122, -102728, -103863, -392403, -129655, -117526, -48054, 161597, 163936, -25274, -170067, -82060, 40971, -217579, 147705, 183751, -155465, -194900, 127329, 140035, 29330, 93667, 14621, 100684, 79770, 23356, -184508, -152321, 143278, 24187, -51856, 177815, -855, -59439]
10514e9439K20757K7607j96690R2755J29882m6363k65244R0138L2865o1256K31644
10503A96656K44039k00010o8847L1009j28680j69903L344K89753K9445l762k49894
10492b6850j62619K63542K59026p8052j6054q6500k3708J69167o7791j29840j45420
10481d5099P0494J98968o3924l6662J46825M813l5642K83591L6214j66705n3848
10470C39025o0427j55999j10263L01645J33076Q3692k59261j37153L5300K01988
10460C71623q3459p2467k2511J71096l22911J25698O3868k66173K5057K23818
10450B13639J9735j49484L8899Q3117k11255M9095k8411M6192K16394J09481o9007
10439C18395J85421J07862k94648J3254j30815J2418q9077L4899k8034k4635P5911
$$ y = [-59439, 161318, 188925, -7765, 84990, 214872, 168509, -96735, -6597, 26268, -34988, 196656, 440695, 240685, 171838, 202847, 74167, -95736, -92392, 197361, 226806, 223044, -26850, -189469, 74073, 333099, 255047, 238993, 152493, 128785, 297952, 230161, 100321, -45099, 25395, 224363, 160439, 123777, 270602, 275415, 239773, 523364, 559578, 392873, 339025, 278598, 122599, 12336, 313981, 447057, 530749, 271488, 134335, 169635, 371623, 288164, 215697, 193186, 364282, 41371, 167069, 230937, -35236, -10179, 213639, 233374, 83890, 122789, 205906, -5349, 43746, 15335, 61527, 277921, 387402, 318395, 503816, 611678, 317030, 330284, 199469, 211887, 122810, 157709, 129675, 105040, 180951]
10428A80951J72055L9946k38284J98809Q5924k75704m8459o3971J30120l01924
10418a20537K6873K49364N1115k70099R9868K09313J56626o6702j36888K15242
10408D14175j22829j0843m8695j8379j00353K3988k432l1955L10497k07472k18737
10397a3035p2606R0722K16887p2700j01622K00707j93606o7035o3942j43778J91794
10386b8214K2476P6013n8409j4444K31298k57230j38040K61015J00438k00923
10376f020Q3342O963r5212o7250J63974J37195J18884o2998J03924q6650k8729
10365B67423J75704j21390k51498P6552P1303j14045j23901j30676M94665j24915
10355B19222m4980R0324J73845o6306k98672L01695P4600Q917j34405j05114M5549
$$ y = [180951, 353006, 392952, 154668, 353477, 439401, 163697, 115238, 51267, 181387, -120537, -93664, 155700, 206815, -63284, 36584, 245897, 402523, 335821, 198933, 414175, 291346, 280503, 231808, 213429, 113076, 137064, 134632, 102677, 413174, 205702, -13035, -85641, 5081, 221968, 149268, 47646, 248353, 54747, -12288, -76230, -220008, -28214, -5738, 70275, 11866, -2578, 228720, -28510, -166550, 94465, 194903, -6020, 77322, 84285, -10927, -78177, 85797, 222992, 341876, 278878, 382802, 296152, 267423, 443127, 321737, 70239, 146791, 218094, 104049, -19852, -150528, 344137, 219222, 174242, 264566, 438411, 372105, 73433, 375128, 449728, 458645, 324240, 219126, 264675]
10344B64675N7226k12669N0316n8955R2500K4855k0523j40902j31240L33210J12166
10333C70659J68919p0939p6358J69603Q0314k23158k76796N7143K02129n2026
10323C49490J16394j73669p008J76633k0612k52894k6640J80945M9745j92015
10313B00369R5421R1678r3236j39468L2134K74046J04051k35346M2469j5631j37196
10302B19291K14026r9145j20052J36015R4072P4967j32071j98044Q3805j29036
10292A43828J03875j28194J19344J45607Q0922q959M3614J05168j40648m6795
10282D17762M7457L32543J1453N4631l62684k54433J20792J49286L8660R3979
10272F49446m9761O6931n8847k5487r6064J28817R6030N8417L3894p1388L854
$$ y = [264675, 321901, 109232, 159548, 100593, 193093, 217948, 197425, 56523, -74717, 258493, 370659, 539578, 468639, 392281, 561884, 642198, 419040, 142244, 199387, 401516, 349490, 465884, 292215, 285207, 461840, 441228, 188334, 161694, 342639, 392384, 200369, 295790, 387468, 294232, 154764, 186898, 460944, 564995, 329649, 372118, 356487, 219291, 433317, 334172, 214120, 350135, 444207, 519174, 387103, 189059, 272864, 143828, 247703, 119509, 238853, 384460, 465382, 456423, 500037, 605205, 464557, 417762, 465219, 797762, 809215, 863846, 501162, 246729, 367521, 516807, 555467, 649446, 599685, 666616, 607769, 582282, 486218, 615035, 711065, 769482, 803376, 731988, 735842]
10261G35842J93111R3712l09551k77920R266K06103M4215M5698Q2728J50706l06716
10250F67194r6830L27458K22540q5226j18595o774l3076M0822j98795j28712q8935
10239E01071J52235K49440k28724O7498K68490J07073O8081k3071j48867n8662
10229I54564K1384r9207q3469j65891k5532K48306K35459m2604o8585l7236P5044
10218A012233n3859O7416J28266J04238k76206j83399J03141J65949n8076k49900
10208G59803J03168J43890m7923m3402K02796j64713j74627J91498j2838M338
10198I61990Q2720l9118K20490N0421L9285j72499J2020j91353p0635K92089k73457
10187I11953O226J12565l3748m8194P483J91396j12867j58142Q985L85549j8263
$$ y = [735842, 928953, 1022665, 713114, 435194, 444460, 650563, 694778, 740476, 823204, 973910, 667194, 570364, 897822, 1120362, 1035136, 916541, 909767, 876691, 917513, 718718, 590006, 501071, 653306, 902746, 674022, 741520, 1010010, 1117083, 1185164, 1162093, 1013226, 954564, 975948, 876741, 793272, 627381, 601849, 850155, 1085614, 1043010, 974425, 937189, 1012233, 958374, 1025790, 1154056, 1258294, 982088, 798689, 901830, 1067779, 1009703, 759803, 862971, 1006861, 958938, 915536, 1118332, 953619, 778992, 970490, 957652, 961990, 1044710, 1005592, 1226082, 1276503, 1315788, 1143289, 1155309, 963956, 893321, 1185410, 911953, 918179, 1030744, 996996, 948802, 956285, 1147681, 1034814, 876672, 885657, 1271206, 1252943]
10176A252943J53748M0956L3841j65665l45173k8621j1734j57993J96973j8859
10166I50416J02550J79785n8150j72295J29597j40126k20317K30677M5003j7998
10156A029142p8911J16667j68812O6245J23127o3213O9127k14667R7934j05691
10146H70948J7088J28978k385K73599j22121k52782j72536l2567K38432j30679
10136H15975M8798J34770p5119N3701r9040j10335k3347J27144J58531N9906N3443
10125A144427J49810j99460q6769K1138J26350j23186o0227Q3912J99010n8190
10115A196815K87155k0954l08820K80273J19588k21419J11733J17672j70701J12176
10105A503518M1034L19264L95595K48183J78819l3249J06097K66205j42334L4961
$$ y = [1252943, 1406691, 1447647, 1481488, 1315823, 970650, 942029, 930295, 772302, 969275, 950416, 1052966, 1232751, 1174601, 1002306, 1131903, 991777, 771460, 1002137, 1047140, 1029142, 950231, 1066898, 898086, 964331, 1087458, 1024245, 1093372, 878705, 976639, 870948, 888036, 1017014, 1014629, 1288228, 1166107, 913325, 740789, 708222, 946654, 815975, 864773, 999543, 924424, 978125, 879085, 768750, 745403, 872547, 1031078, 1090984, 1144427, 1294237, 1094777, 1008008, 1029146, 1155496, 1032310, 972083, 1055995, 1255005, 1196815, 1483970, 1463016, 1154196, 1434469, 1554057, 1332638, 1444371, 1562043, 1391342, 1503518, 1544552, 1863816, 2259411, 2507594, 2686413, 2653164, 2759261, 3025466, 2883132, 2918093]
10095B918093K52039O8868j8059j64000N8206l43252l15220n9243m0639j65953
10085B190840k18474j20067k37244L8732J82344o7305J0078k55155l18152J1106
10075A216703N5174l5822L3344l5797O6089q1116k31483K0966l1337J21911K06234
10064A304866j50386Q3580J5173r6067K25825k28987o8345J43679l9889m2465
10054A146984J61911j5168P7867J63836J81181j29938j75333m6524o6388L16060
10044A614488l00265l1118Q5084r8757r4949p2140L20767J9692k4159j84871K2757
10033A256529l4320n5089R1946J1323K0494J88835K07189n01764J38986J96004
10023A520133r4451J11896K5487N4053J10973l40610n0979k5441Q1630r7784J36287
$$ y = [2918093, 3170132, 3239000, 3220941, 3056941, 3115147, 2771895, 2456675, 2397432, 2356793, 2190840, 1972366, 1852299, 1615055, 1653787, 1836131, 1768826, 1778904, 1523749, 1205597, 1216703, 1271877, 1236055, 1269399, 1233602, 1299691, 1218575, 987092, 1008058, 976721, 1098632, 1304866, 1154480, 1238060, 1253233, 1157166, 1382991, 1154004, 1085659, 1229338, 1189449, 1146984, 1308895, 1293727, 1371594, 1535430, 1716611, 1586673, 1411340, 1364816, 1298428, 1614488, 1314223, 1283105, 1368189, 1269432, 1174483, 1102343, 1423110, 1442802, 1418643, 1233772, 1256529, 1222209, 1167120, 1259066, 1270389, 1290883, 1479718, 1686907, 1185143, 1324129, 1520133, 1425682, 1537578, 1563065, 1617118, 1728091, 1387481, 1336502, 1311061, 1392691, 1294907, 1431194]
10012A431194K03460K2963l8280k08747J40321r5134k44297j549J0012L3574J3945
10001A267462Q4857J63493k07006O8226j64939K14627P0695J8912M8585k27447
9991A337465J19462J37479k07695j9638J47247j31102J32026J49970K30397p4440
9981A821171j37707j35237L37724K07515l33569K6055Q0702J41609o6082r8881
9971A843300j59525j1903K7198n2313R0010J19978j69748j43277l2512L4722j7887
9960A528043M5338R6902J23662J47344q9107l02794j81963j99114L24360K3099
9950A515770J3550j50219J96695J86650J50827k72303j83202K6745l018K71417
9940A752912j50485J5710j76287K25908J34649K39571K45607j01956l8670l31020
$$ y = [1431194, 1634654, 1657617, 1619337, 1410590, 1550911, 1455777, 1211480, 1209931, 1219943, 1253517, 1267462, 1352319, 1515812, 1308806, 1377032, 1212093, 1426720, 1497415, 1516327, 1564912, 1337465, 1456927, 1594406, 1386711, 1367073, 1514320, 1383218, 1515244, 1665214, 1895611, 1821171, 1683464, 1548227, 1885951, 2093466, 1759897, 1785952, 1866654, 2008263, 1942181, 1843300, 1683775, 1671872, 1699070, 1646757, 1736767, 1856745, 1686997, 1543720, 1511208, 1545930, 1528043, 1573381, 1670283, 1793945, 1941289, 1852182, 1549388, 1367425, 1168311, 1492671, 1515770, 1529320, 1379101, 1575796, 1762446, 1913273, 1640970, 1457768, 1484513, 1481495, 1752912, 1602427, 1618137, 1441850, 1667758, 1802407, 2041978, 2287585, 2185629, 2146959, 1815939]
9930A815939n283o2723j19883N095K11810K10828l6497n2035l2730j22595J45729
9919A957655o2991L5706M8621j64348M33055k14728j31854Q2652J62940r118l2472
9908B105118J21820K073k34791q691J12046j10441J17948J01600q0610J34860
9898B260932n8613j27757K57966K40865r7377j89497L7931J11213j22790J17572
9888B430445J48337j35462K61562m3959J6107N3044j06107p1266M8387J01835
9878B702923q8087J30523j06072K31722Q4833j29346o7420j14048Q7998K6113
9868B759139k67615K81972J04539J0008o0339N2293j12894j34711J16088K5023
9858B773503j0787R6673j20314J18486L05578j80998j83373K24835K69420o4947
$$ y = [1815939, 1810656, 1747933, 1628050, 1633145, 1844955, 2055783, 2019286, 1967251, 1934521, 1811926, 1957655, 1894664, 1930370, 1978991, 1814643, 2247698, 2032970, 1901116, 1983768, 2146708, 2137590, 2105118, 2226938, 2229011, 1994220, 1985529, 2097575, 1987134, 2105082, 2206682, 2126072, 2260932, 2202319, 2074562, 2332528, 2573393, 2476016, 2286519, 2324450, 2435663, 2312873, 2430445, 2578782, 2443320, 2704882, 2660923, 2677030, 2730074, 2623967, 2552701, 2601088, 2702923, 2614836, 2745359, 2639287, 2871009, 2955842, 2826496, 2759076, 2645028, 2733026, 2759139, 2491524, 2773496, 2878035, 2888043, 2827704, 2879997, 2767103, 2632392, 2748480, 2773503, 2762716, 2859389, 2739075, 2857561, 3163139, 2982141, 2798768, 3023603, 3293023, 3228076]
9848C228076n0225k06652J97063L49924j22712l40141R2189p2825L41523K10946
9838C627166p8550k4309P7749K2936J14167P1447K55207j76424p0388J44268j08623
9827C854646O5492j75064R6385J4788l8801k54184K33876J13522K4724J03526
9817D038910n4353M6014J32985Q6242L25682l0295Q1625K52279j1252J97986K27447
9806E293270J02669j23772R0749N7340J18389k9353k15867J28672K43946j91717
9796E474326O6708L68300K04490j62705J67871M6991k52298J03178p8801J66846
9786F104906J34839q7726p579Q0661M30107n882m1677J06411Q1813J83419J7828
9775F997120K4726K58017J58866R7367K50442O2045j57274J68744J61159K32881
$$ y = [3228076, 3177851, 2971199, 3168262, 3518186, 3395474, 3055333, 3147522, 3074697, 3416220, 3627166, 3548616, 3524307, 3602056, 3624992, 3739159, 3810606, 4065813, 3889389, 3819001, 3963269, 3854646, 3920138, 3745074, 3841459, 3856247, 3817446, 3563262, 3797138, 3910660, 3935384, 4038910, 3984557, 4030571, 4163556, 4249798, 4575480, 4545185, 4626810, 4879089, 4867837, 5065823, 5293270, 5395939, 5272167, 5362916, 5420256, 5538645, 5509292, 5293425, 5422097, 5666043, 5474326, 5541034, 5909334, 6113824, 5951119, 6118990, 6165981, 5913683, 6016861, 5938060, 6104906, 6239745, 6152019, 6144440, 6225101, 6655208, 6649326, 6607649, 6714060, 6795873, 6979292, 6997120, 7021846, 7279863, 7438729, 7536096, 7786538, 7848583, 7691309, 7860053, 8021212, 8254093]
9765H254093J68106K34375K005r0187M27662R6386J23369J33770K32942N178R0401
9754I678100L20434N2037j0580R5868J2428J02904K81275J25935K61023o0970
9744A0858454n467K98396K09493j9450P523M58181K42560J53268N0281K77009
9734A2530248J49851k7868K17942P0746L58592L1596n6882L67307R9528M9854
9724A3790914l021J65763L17434J32363J23596Q1124O7356K19510J28541K07259
9714A5230839l21446J64945J32486j07626J90982m5897K67093J32113J93082p3028
9704A5763543j13205l4702L240J78464r2439j98950N1961J44820L24611m2010
9694A5985333K14033K00820R5451O7690L18619J67511k26182M93495J0457k91808
$$ y = [8254093, 8422199, 8656574, 8658579, 8568392, 8996054, 9092440, 9215809, 9349579, 9582521, 9587699, 9678100, 9998534, 10050571, 10039991, 10135859, 10148287, 10251191, 10532466, 10658401, 10919424, 10858454, 10852987, 11151383, 11360876, 11341426, 11348949, 11807130, 12049690, 12202958, 12253239, 12530248, 12680099, 12652231, 12870173, 12940919, 13299511, 13331107, 13274225, 13641532, 13741060, 13790914, 13787893, 13953656, 14271090, 14403453, 14527049, 14608173, 14675529, 14895039, 15023580, 15230839, 14909393, 15074338, 15206824, 15099198, 15290180, 15244283, 15511376, 15643489, 15836571, 15763543, 15650338, 15615636, 15618876, 15797340, 15704901, 15505951, 15557912, 15702732, 16027343, 15985333, 16199366, 16400186, 16495637, 16563327, 16881946, 17049457, 16823275, 17316770, 17327227, 17035419]
9684A7035419K82994K43542M036n2338J59554j95538K26944K06253j21911k3297
9674A7765658Q4576K78007j18296P5748K6432M28935K21180K57521J39162R4948
9664A9253871J38320J47638L37780O30925L99084j50993M15812O02888M02545
9655B2177870K16836P58570N80144K91116P08922R03658O74214O13865R19958
9646B7845153R56922Q63870Q62209J204118J343886J187147J504967J564978J491945
9637C8825195J502415J787197J880871K511611K360878K933959L038771L494972
9629E8335869M033255M286626N031260N276751O423118P415844P989296R580193
9621A08372212J0944653J2806162J5563768J8800467K2860493K7738132L2653662
$$ y = [17035419, 17318413, 17561955, 17565991, 17513653, 17673207, 17477669, 17704613, 17910866, 17788955, 17765658, 17850234, 18128241, 18009945, 18085693, 18112125, 18541060, 18762240, 19019761, 19158923, 19253871, 19392191, 19539829, 19877609, 20508534, 20907618, 20756625, 21172437, 21775325, 22177870, 22394706, 23153276, 23733420, 24024536, 24733458, 25637116, 26311330, 26925195, 27845153, 28802075, 29665945, 30528154, 31732272, 33076158, 34263305, 35768272, 37333250, 38825195, 40327610, 42114807, 43995678, 46507289, 48868167, 51802126, 54840897, 58335869, 62369124, 66655750, 71687010, 76963761, 83386879, 90802723, 98792019, 108372212, 119316865, 132123027, 147686795, 166487262, 189347755, 217085887, 249739549]
9614B49739549L6457900L8271540L7279358L2735123K4317675J4829268M488032
9607D38118445l641775j0504056j7072176k3165424k8238659l2447227l4703183
9600B88345945l4827436l2751177k9743285k5690628k1904764j8501159j5408506
9593A09518990j2834237j1123210r533472q134115o986082o077917n092636m244666
9585D5492655m019019l361328k868939k601649k413796j837667j768527j372592
9577B5249138j494494j532749j114508q23569o95740j154279p51403n68811o52318
9568A6461267o46231l98067m95014m91675m40751n46657k13568j36167n28723
9559A2564414l24065n20609l63754k39052l53013j87061m70144l64890j35330
$$ y = [249739549, 286197449, 324468989, 361748347, 394483470, 418801145, 433630413, 438118445, 434476670, 423972614, 406900438, 383735014, 355496355, 323049128, 288345945, 253518509, 220767332, 191024047, 165333419, 143428655, 124927496, 109518990, 96684753, 85561543, 76028071, 67893956, 60907874, 54829957, 49737321, 45492655, 41473636, 38112308, 35243369, 32641720, 30227924, 28390257, 26621730, 25249138, 23754644, 22221895, 21107387, 20283818, 19588078, 18433799, 17682396, 17113585, 16461267, 15815036, 15416969, 14921955, 14430280, 13989529, 13442872, 13229304, 13093137, 12564414, 12240349, 11719740, 11355986, 11116934, 10763921, 10576860, 10106716, 9741826, 9606496]
9550I606496k15121j25537k25266j13601k37308l33486m19035j45717k08131m43975
9540G139319J1336l43516k52476j71678M498j58483r2479j69658J04452n5072
9530F016243K00469L31456L29117Q7294K33060R2430j5140j67914J68928r0048
9520G185895l80272j05857m59279k88934l59907k09112k97493m40227m11143k70215
9510C963456j18390n71482k13234l3259Q5675l42364j68798q7496Q7925J34048
9500B736081J99844l95524j92322K5670o5342l6973L43740J64967o0025J45784
9490B865900q6196K50267j73956K0595J69789K8443j003K35609j46323K52737
9480C415862L4988l43517m7304K92055P2106L4414k46706p4449Q9849j12704k90127
$$ y = [9606496, 9391375, 9265838, 9040572, 8926971, 8689663, 8356177, 7937142, 7791425, 7583294, 7139319, 7150655, 6807139, 6554663, 6382985, 6387483, 6229000, 6136521, 5966863, 6071315, 6016243, 6216712, 6548168, 6877285, 6964579, 7197639, 7290069, 7274929, 7107015, 7275943, 7185895, 6805623, 6699766, 6240487, 5951553, 5591646, 5382534, 5085041, 4644814, 4233671, 3963456, 3845066, 3273584, 3060350, 3027091, 3112766, 2770402, 2601604, 2514108, 2602033, 2736081, 2935925, 2540401, 2348079, 2373749, 2308407, 2271434, 2615174, 2780141, 2720116, 2865900, 2779704, 3029971, 2856015, 2876610, 3046399, 3074842, 3073839, 3309448, 3163125, 3415862, 3450850, 3107333, 3060029, 3352084, 3424190, 3458604, 3211898, 3137449, 3227298, 3114594, 2824467]
9469B824467j55532Q9818K650k84569j51946p2271j37518j31946J12924k01039
9459A895038l03763J9192o2832m74446k40291J42835j0114Q8452j0811k98336
9449G44924J1204O2250J49933O9607k9368k79624m64J55458J64618o5822j94453
9438G88263L76410O8160k12561J62838O0443n7671N6239j20557m9596R2136M7308
9427A211412j07838j32512K4614K61910j18476l8049k89485K18412j4918m460
9417A010610q8982m7631k50520K53762j0595m3064Q5654o408L15537m550j75297
9406A038516J79235J88185k33049M7454O4059R0930J09868n5118j16554Q6637
9396A400163R1521R441o3710M7894J13945R9706n8142O2811k3769J70542o1785
$$ y = [2824467, 2668935, 2758753, 2761403, 2476834, 2324888, 2252617, 2115099, 1983153, 2096077, 1895038, 1591275, 1610467, 1547635, 1073189, 832898, 975733, 965619, 1054071, 1043260, 744924, 756128, 818378, 968311, 1037918, 1008550, 728926, 728462, 883920, 1048538, 982716, 788263, 1164673, 1232833, 1020272, 1183110, 1243553, 1185882, 1242121, 1121564, 1071968, 1164104, 1211412, 1103574, 971062, 995676, 1257586, 1139110, 1101061, 811576, 1029988, 1015070, 1010610, 921628, 873997, 623477, 877239, 866644, 823580, 909234, 902826, 1218363, 1213813, 1038516, 1217751, 1405936, 1172887, 1220341, 1284400, 1375330, 1485198, 1430080, 1313526, 1400163, 1491684, 1501125, 1437415, 1485309, 1599254, 1698960, 1640818, 1703629, 1679860, 1850402, 1788617]
9385A788617L9469Q8218j47504m1548k41772m9427J46873K39374Q6031j15604
9375A792727J85165r8860J55172r5058O5035M2919J010k74663k26602k7735j38213
9364A380897J4253Q892k199j68268k15311K92719J69182j37956o6342Q658k07642
9353A076883j95909J39268k18135k4594J25326j938L3914j00114r2990J19914
9343H61625k15844k76136p1963J90514o6432J56390O218k42367Q3327l6294N3589
9332D42627j59757j01361J36452J15448l44332k5081o8929P2846N6696J69617
9322B94226P2731r06k65602j55048J96733k61737K0457Q7257L7417J2796J09233
9311A47557K63757R8238k47170j25995R728J49278J85750m24251j89559K33758
$$ y = [1788617, 1828086, 1916304, 1768800, 1727252, 1485480, 1436053, 1582926, 1822300, 1908331, 1792727, 1977892, 1879032, 2034204, 1939146, 2004181, 2047100, 2048110, 1773447, 1546845, 1519110, 1380897, 1395150, 1404042, 1401843, 1233575, 1018264, 1310983, 1480165, 1342209, 1275867, 1284525, 1076883, 880974, 1020242, 802107, 777513, 902839, 900901, 934815, 834701, 741711, 861625, 645781, 369645, 297682, 488196, 421764, 578154, 584372, 342005, 425332, 389038, 442627, 282870, 181509, 317961, 433409, 89077, 63996, -4933, 67913, 124609, 294226, 366957, 366051, 100449, -54599, 142134, -119603, -99146, -11889, 25528, 38324, 147557, 411314, 509552, 262382, 136387, 146115, 295393, 481143, 56892, -132667, 101091]
9301A01091l14644K32855J66460j48493j37086N3561k7523J4943P664N4874j04047
9290a00345K88243L0447j15093L5289r5710r5810j15405K03551Q3761l5661R2739
9279A76006j69666l9304K41003L3573k25431O7803K86584j58960L73818k38223
9269C47203l34771J93978p8674p2800K30225O9717k97708J60566j14847j45965
9259d3076J66239M1090J22290J11812k522j62242j70058o5193k07765K65457P9679
9248A35711J15124J10012q9042j30948O0441j9703m5812O0337J05800j76944k11254
9237h6278K02619Q3608P3388L9088j48709k93622R0639K00205O1544k1317J28559
9226C29724p3267p1626J14046r7277J74702K00354j91037j92892L0808K58704
$$ y = [101091, -213553, 19302, 185762, 37269, -99817, -46256, -73779, -58836, -51172, 3702, -100345, 187898, 218345, 103252, 138541, 42831, -52979, -168384, 35167, 118928, 83267, 176006, 6340, -32964, 208039, 241612, 16181, 83984, 370568, 211608, 585426, 347203, 12432, 206410, 127736, 54936, 285161, 354878, 57170, 217736, 102889, -43076, 123163, 164253, 286543, 398355, 395833, 233591, 63533, -1660, -209425, 56032, 135711, 250835, 360847, 271805, 140857, 201298, 181595, 135783, 196120, 301920, 124976, -86278, 116341, 199949, 273337, 312425, 163716, -129906, -39267, 160938, 222482, 201165, 329724, 256457, 184831, 298877, 201600, 376302, 576656, 385619, 192727, 223535, 482239]
9216D82239k1997j78507k18344N1961M64341k13285l04523Q3382O9252q1424p2448
9205F0647l0209k23987J53172j74787K63705L36277l26119j00415J2552P4821
9195D5657K1865K95169j03804j37097M1571J66455N9154P807j65033k69206j297
9184c8759L9295p9717O4225K39066j64000J9120J5498J09351j44933J36136j02318
9173I2964k52704o1672K2347p5633j70042j03853L39839Q4781J24565Q5472p5201
9162A0863l9555P7958k54719j88361L7009N6129p2868j1223J21643J08390k7482
9151a82216O0680Q4900j40920Q1559J14070l4010L39J1072l128J16192k03443
9140i4905l3998K92373j11350m6574Q3916k6318j66159n9755J89215J01030L15511
$$ y = [482239, 460242, 281735, 63391, 115352, 579693, 366408, 61885, 145267, 214519, 133095, 60647, 30438, -193549, -40377, -215164, 48541, 384818, 58699, -41716, -29164, 45657, 67522, 362691, 258887, 121790, 163361, 329816, 388970, 396777, 231744, -37462, -38759, 536, -79181, -14956, 224110, 60110, 79230, 94728, 204079, 59146, 195282, 92964, -159740, -221412, -199065, -274698, -444740, -548593, -208754, -123973, 592, 86064, 10863, -28692, 49266, -205453, -393814, -356805, -300676, -373544, -384767, -263124, -154734, -182216, -121536, -36636, -177556, -95997, 18073, -15937, -15598, -4526, -7654, 108538, -94905, -128903, 163470, 52120, 5546, 89462, 63144, -103015, -162770, 26445, 127475, 442986]
9129D42986j34845k0826k90114L56062K45012o3468Q0045K1370L43259K93362
9119A272843K83100n913L47549J43951n3714k59573L2964n2553n3071J92164l33167
9108A514580j09302j53179l70873k37492r3127K984K92009q641k94043q2198q7022
9097C73696k40860k41856K80356K11364p2585M3433o1053Q8037L2174J47987k53880
9086C06813J9151N0487q0867n2662P7357j54166K40695j90088l2155N7532q107
9075B33990J13997j15321n6475K2010J42869K55361r9337k20812j6899j8505P1420
9064C12298j45832K5674p0580o1974k4298p5004J76173J62956J24462j36074k4099
9053B63702K06600j270Q443j79450J72061l25159k6423Q6809N2690L2296R2760
$$ y = [442986, 308141, 287315, -2799, 353263, 598275, 534807, 614852, 636222, 979481, 1272843, 1555943, 1550030, 1897579, 2041530, 1987816, 1728243, 1761207, 1708654, 1655583, 1847747, 1514580, 1405278, 1252099, 881226, 643734, 550607, 553591, 845600, 836959, 542916, 460718, 373696, 132836, -109020, 171336, 382700, 310115, 353548, 292495, 380532, 412706, 560693, 306813, 325964, 376451, 295584, 242922, 320279, 166113, 406808, 216720, 184565, 242097, 233990, 347987, 232666, 176191, 198201, 341070, 596431, 497094, 276282, 259383, 240878, 312298, 166466, 192140, 121560, 59586, 35288, -39716, 136457, 299413, 423875, 287801, 263702, 470302, 469032, 477475, 298025, 470086, 144927, 118504, 205313, 258003, 290299, 383059]
9042C83059k08593k28222J86915M8145q785j56393j33996P1141K05226N8383K272
9031B19152n879Q341L3687K1K36685J63958L3864m35598j83030j41075J23811
9020E3937M9969k20399J78506L04616J30776k20250j60883R8627P0986L7743J1753
9009C35381j8203k4292M0044P5869j14291J89424J30416j82180k71878q8486J80040
8998B51844J75848K13215M5038k78540J07328n0476k03306k2550L8631J82588
8988D59620J53610j2991q4309k30812Q2120j79778K53718j15083j76490J98812
8978C48417R9346j30472K671J9371k31815N0257J61921j63765Q4914Q2275O4779
8967C87899o9131l55057Q5235m8639J14693J1328j5957K3552K95919K61367j72495
$$ y = [383059, 174466, -53756, 133159, 181304, 172519, 16126, -117870, -46729, 158497, 216880, 219152, 213273, 221614, 255301, 255322, 492007, 655965, 689829, 254231, 71201, -69874, 53937, 103906, -116493, 62013, 366629, 497405, 277155, 116272, 214899, 285885, 323628, 335381, 317178, 292886, 332930, 408799, 294508, 483932, 614348, 432168, 160290, 71804, 251844, 427692, 640907, 685945, 407405, 514733, 464257, 260951, 238401, 277032, 459620, 613230, 600239, 515930, 285118, 367238, 187460, 441178, 326095, 149605, 348417, 447763, 317291, 319962, 339333, 107518, 157775, 319696, 155931, 240845, 323120, 387899, 318768, -36289, 48946, 307, 115000, 126328, 110371, 133923, 429842, 691209, 518714]
8956E18714j33866j76290J42295J90429n804j28157l2738J92885n5039J26033
8946F38462N575n4615r3284j90358n1793n0474K68474M10109k0106J26932j44750
8935H44172j87974K28036K60703l63588j4330Q5603J70353n4725J66979l31309
8925H03920o2134J56343L3422K35074K58187P8395k6412q690k80333J06308Q2085
8914A376165k2755J12861R5866l30367K39994K1534k1009k67161j40294r724N0846
8903A105956L4375J999L7407k94239P0202J27046J6829J82657m2408p4039j31843
8892A033942l14801J63102r569j69671j02315K03972q4166k97991K25614J85552
8882H33669k01966K9148l00559j5120j42570j11954R3866j69368N3053J47496
$$ y = [518714, 384848, 208558, 350853, 541282, 535478, 407321, 374583, 567468, 512429, 638462, 644037, 589422, 496138, 305780, 253987, 203513, 471987, 882096, 861990, 988922, 844172, 656198, 884234, 1144937, 781349, 767019, 852622, 1022975, 968250, 1135229, 803920, 741786, 898129, 931551, 1166625, 1424812, 1503207, 1476795, 1468105, 1187772, 1294080, 1376165, 1353410, 1466271, 1562137, 1231770, 1471764, 1493298, 1472289, 1205128, 1064834, 1055110, 1105956, 1140331, 1142330, 1179737, 885498, 955700, 1082746, 1099575, 1282232, 1239824, 1165785, 1033942, 719141, 882243, 872674, 703003, 600688, 804660, 720494, 422503, 648117, 833669, 631703, 660851, 360292, 345172, 202602, 90648, 184514, 15146, 68199, 215695]
8872B15695K71129q0928k57013q682J08851j25723J11639j76406l4114R6734R0950
8861B12132k6718L191o7601j40881q8514j66913o2312m1322j17972q1553L80773
8850a97690K35803j1348m740k43766L12125k29059k8175j79152k55712K31834
8840c69880k4163j26788m1006L8735J1857L01369Q7800L8352O3991j08146l28858
8829d56737k3716j08282o2110L10919j06257L09687J74707k77138k90344q8866
8819f18137J53846J4165k03793J15501j09599j10904P9712L02426J28985k37708
8809d85506R0488k12531k6279J70484r790L31341K24539k14935j38913O7346k36814
8798d40570M8434P4116k63012O7922J35394K69864m57386l2951J67518o5336j0862
$$ y = [215695, 486824, 405896, 148883, 140201, 249052, 123329, 234968, 58562, 24448, 121182, 212132, 185414, 188605, 121004, -19877, -108391, -275304, -337616, -378938, -496910, -578463, -197690, 38113, 26765, 22025, -221741, 90384, -138675, -166850, -346002, -601714, -369880, -394043, -520831, -561837, -523102, -511245, -209876, -122076, -83724, -19733, -127879, -456737, -480453, -588735, -650845, -339926, -446183, -136496, 38211, -238927, -529271, -618137, -464291, -450126, -653919, -538418, -648017, -758921, -679209, -376783, -247798, -485506, -395018, -607549, -633828, -463344, -473134, -141793, 82746, -132189, -271102, -203756, -440570, -392136, -318020, -581032, -513110, -377716, -107852, -565238, -598189, -430671, -496007, -506869]
8787e06869j50862J8138K05085k0557o9894J63172N3767l6614m7067J18922J01615
8776a71164j44551q5461K5462j32148M0429j9680R1505j04085k50628N9539M9484
8765f41298K34636Q8292j52174R0992r2342J07393M6726l11003k1134K31700p5624
8754d93836m2125K38831m223l8615m1395m6079j08462J45672K32230q910j25768
8743b92680j1147J6311k0286J35355p2845j06040J47497m6104j29482m08263j620
8732g89304J52134m1739L2577J60776O2528j98996j8485J60012R733M9603p1882
8721d93043P0343P3015k45384j68604J7498O9508L70163J66478r5604j42607r0901
8710d69138k09887K59850J42096l86325L8767j07449K08046j36338j50570K09912
$$ y = [-506869, -657731, -639593, -434508, -455065, -524959, -361787, -308020, -344634, -391701, -272779, -171164, -315715, -401176, -375714, -507862, -467433, -487113, -395608, -499693, -750321, -690782, -641298, -406662, -318370, -470544, -379552, -471894, -364501, -317775, -628778, -649912, -418212, -493836, -535961, -297130, -301353, -339968, -381363, -427442, -535904, -390232, -158002, -166912, -292680, -303827, -287516, -307802, -172447, -245292, -351332, -203835, -249939, -379421, -787684, -789304, -637170, -678909, -646332, -485556, -423028, -622024, -640509, -480497, -470764, -421161, -493043, -422700, -349685, -595069, -763673, -746175, -676667, -306504, -140026, -235630, -378237, -469138, -679025, -419175, -277079, -663404, -624637, -732086, -524040, -660378, -810948, -601036]
8700f01036K5356j87494L9477L71955j26532k24763n4861O1087L16021R3142k15720
8689e03368r0023M2521L270K33529J89689l22121o5990J13269J09123l43666p2039
8678g05806j07515L12601m1671j10715J80086j99289R7246P1937R4003P7097p8463
8667d10489m2626O9487o1679L7555J51107j87256K0758J73231q1613j19942j797
8656d53264J13984R5327o1841j8858n8457k85235m5722J20511P5687j21227L16730
8645c22365O0404n561m57628n4884P7841J49775n2316o0046n1869L62159l7935
8634c92425j6966J54348j39488j38987J5391Q7648J49806k94788j93335J37499
8624f31297J23907Q0633j75856K43439J67533j50681j60128j45735j65904j227
$$ y = [-601036, -575680, -763174, -723697, -351742, -478274, -703037, -757898, -696811, -380790, -287648, -503368, -593391, -550870, -547600, -314071, -124382, -446503, -512493, -399224, -290101, -633767, -705806, -813321, -500720, -542391, -653106, -473020, -672309, -575063, -503126, -409123, -332026, -410489, -453115, -383628, -445307, -407752, -256645, -443901, -423143, -249912, -331525, -451467, -453264, -339280, -243953, -305794, -324652, -383109, -668344, -714066, -593555, -517868, -639095, -322365, -261961, -267522, -725150, -780034, -702193, -552418, -604734, -664780, -716649, -354490, -392425, -409391, -255043, -394531, -533518, -518127, -430479, -280673, -575461, -768796, -631297, -507390, -426757, -602613, -359174, -191641, -342322, -502450, -648185, -814089, -815316]
8614h15316K12215K46115M3158q3841j6436K3583j4391J04873M0992J93180j76730
8603b42598j68510R8099L02200r3807o0715l495K58207n770l29496m0084N9647
8592b26322J95123N380M2825P9698l426m1389K30948J85895j08796J67015L06771
8581H33722j00157j56808Q0543L22989K00083L28034L53505K3701M59893N12904
8571B858409N48142O87489Q93049P47282P02017R88798J119395O89089M05801
8562I639471j13795j8777l76902j18375k75570j037190r37305o58860o36586p18640
8552D747471j029251j002501j47450m87297k96228j97026l56222n99232p8778
8543E53486k5265p5505K983j16219q9669k2194j39999J73280k45461m3463n3924
$$ y = [-815316, -603101, -356986, -313828, -397669, -414105, -390522, -404913, -300040, -259048, -65868, -242598, -411108, -313009, -10809, -104616, -165331, -168826, 89381, 83611, -245885, -285969, -226322, -31199, -25819, 17006, 96704, 93278, 51889, 282837, 468732, 359936, 526951, 833722, 733565, 576757, 657300, 980289, 1180372, 1508406, 1861911, 1885612, 2345505, 2858409, 3406551, 4094040, 4987089, 5734371, 6436388, 7425186, 8544581, 9233670, 9639471, 9525676, 9506899, 9129997, 9011622, 8736052, 7698862, 6761557, 6102697, 5466111, 4747471, 3718220, 2715719, 2568269, 2080972, 1784744, 1587718, 1231496, 632264, 553486, 528221, 452716, 455699, 339480, 249811, 227617, 87618, 260898, 15437, -28026, -81950]
8532h1950l60250M1672J25809O8058k63300P9806Q8051j51145j86127o5084M6065
8521f58395K02091J79040k99303J27656K17474k01140m4926j70037L56911R3893
8511a96736R92J03693k38285l02836l383j24J86322J92459j11350q2397r273o7032
8499e27950l8188R305o2772m1778p836o5786O4597J86650P3479j74896O3976k0128
8487e41327k44709K66235K50081j66057j34712j03006j22814n8334J96865j7682
8477f75460m5461J36582J68093k07531M86347j60207l95856J50091j72528J72299
8467e43631j17982N3172Q6868k93482n4288L03745k10046J06533J4929k51510
8457i05692o0348R1497J83298K5571N6180j03856N9596K18574O4768j12329q948
$$ y = [-81950, -442200, -400528, -274719, -206661, -469961, -390155, -302104, -453249, -639376, -704460, -658395, -456304, -277264, -576567, -448911, -231437, -432577, -477503, -647540, -290629, -196736, -195744, -92051, -330336, -633172, -636555, -636679, -450357, -257898, -369248, -451645, -460918, -527950, -566138, -556833, -619605, -661383, -669219, -735005, -670408, -483758, -410279, -585175, -521199, -541327, -786036, -519801, -269720, -435777, -570489, -673495, -796309, -854643, -657778, -675460, -720921, -584339, -416246, -623777, -137430, -297637, -693493, -543402, -715930, -543631, -661613, -608441, -521573, -815055, -869343, -565598, -775644, -669111, -654182, -905692, -966040, -874543, -691245, -665674, -609494, -713350, -653754, -435180, -370412, -482741, -491689]
8446d91689M7292J20742q2956o0345K847j87585l4530l5647J18103K5501j88822
8435g67089J78587J47763m1480r1366k08347J46855j988o8945R8131R3073k2931
8424e37737k954j77159K1920J92918p9241j43128j37392J9416N9574J18405k89388
8413i54766L6527L78534k28768j8573K8263j6057j51197Q0877K99406m8759n7999
8402f52512j09721k75393K11186J53538K77540k79572m6144K52613n4742r1960
8392f15167J55974R3754j02312j1035J5005k29667j41272j67584J20880L5043
8382h46381p3955k181K59909J08336O280j89869J35177K36191Q56K25464j62112
8371c02285n6756j75992j07723J92109K2511l46729K34981K32051j233j57695
$$ y = [-491689, -444397, -323655, -406611, -466956, -464109, -651694, -686224, -721871, -603768, -578267, -767089, -588502, -440739, -482219, -573585, -781932, -635077, -637065, -706010, -607879, -514806, -537737, -540691, -717850, -695930, -503012, -582253, -725381, -862773, -843357, -783783, -665378, -954766, -918239, -539705, -768473, -787046, -758783, -774840, -926037, -845160, -545754, -594513, -652512, -762233, -1037626, -826440, -672902, -395362, -674934, -721078, -468465, -523207, -615167, -459193, -365439, -467751, -478786, -463781, -693448, -834720, -1002304, -881424, -846381, -920336, -922517, -662608, -554272, -547992, -737861, -602684, -366493, -365637, -140173, -302285, -359041, -535033, -642756, -450647, -428136, -774865, -539884, -307833, -309066, -466761]
8361d66761k36247J01210K1387k42228j03899j61141J74317K55812k9405j27212
8351h14167j5355K56116P2985L7587L1152j19967L21965k12389k3651N964j25276
8340e85036j62198J41645q8054P695K36145j842k25418j99097Q974k40526J46933
8329i60779K76587l07712L49916J02465l1519l350J86796Q0669M3223j39238l64732
8318g67674L1462l9455l3362K23568J34866k04984j06665l2118n1666J86300J95641
8307d64087k50162l9781J74071Q6962j45781N2134K25663K7130l60637J74682
8297e19806K28754k94656r8788O8709N1179r067l38976R7582J38609j98216K76100
8286e98576L35149l35966j19454K2635J35290N4740m8508R1216J6500j6659N9373
$$ y = [-466761, -703008, -601798, -580411, -822639, -926538, -1087679, -913362, -657550, -686955, -814167, -829522, -573406, -500421, -462834, -431682, -551649, -229684, -442073, -465724, -459760, -585036, -747234, -605589, -693643, -685948, -449803, -451645, -677063, -876160, -867186, -1107712, -960779, -684192, -991904, -641988, -539523, -571042, -574392, -387596, -306927, -263704, -402942, -767674, -736212, -775667, -809029, -585461, -450595, -655579, -762244, -794362, -846028, -659728, -464087, -714249, -754030, -579959, -492997, -638778, -586644, -360981, -333851, -694488, -519806, -291052, -585708, -684496, -615787, -564608, -573675, -912651, -815069, -676460, -874676, -598576, -263427, -599393, -718847, -696212, -560922, -506182, -554690, -463474, -446974, -463633, -404260]
8275d04260m00330p6257O9055M5997L5414P3815M8904J14657j8321L2809J12020
8264c66497m2006R2869J00222j37016r9329O7439K01096k68892k09942L8630j36806
8253g60232J71871J07291l8923l9935m996r5789J47050N9686M7722l01129K22835
8242d84549K43304J3291k43752n6446J40695K07876m02008J23325O2531j46757
8232e42490J60010k02900m32J37250K8160o58J44820K6306j95968J81597k1666
8221b85971l36750J73619J16907q1182N3043Q3421j02606j78167J72012p5568
8211d61242J41448J13422q1141R2670l10313j63129J66748j68829K93919M2367
8201c34080N7558R8181j29834L4007j77860Q888q2506N8653M55135L088709j485990
$$ y = [-404260, -804590, -880847, -811792, -765795, -730381, -656566, -607662, -493005, -511326, -478517, -366497, -408503, -315634, -215412, -352428, -451757, -384318, -183222, -452114, -662056, -623426, -760232, -588361, -481070, -519993, -559928, -564924, -660713, -513663, -453977, -406255, -707384, -484549, -241245, -227954, -471706, -528152, -387457, -179581, -581589, -458264, -395733, -542490, -382480, -585380, -585812, -448562, -420402, -421060, -276240, -249934, -445902, -264305, -285971, -622721, -449102, -332195, -413377, -360334, -276913, -379519, -557686, -385674, -461242, -319794, -206372, -287513, -194843, -505156, -668285, -501537, -670366, -376447, -334080, -276522, -178341, -308175, -274168, -452028, -443140, -525646, -466993, -11858, 3076851, 1590861]
8190A590861j477605K0895j83322P2586k63818R7231j38863Q4297n5017j0209
8180b62964j71164K08283Q8309J76947P6373o2489j61852J14279M5906j30671
8170g9043R8340K53465L788l2468l39760n0187k47012l1274k6776K49931K6139
8159a74857K10207r3614j28849j09262K64975L2575j4119m0507k46627Q5616p8663
8148b93125k674j5832l5151n352J59784k70841j78805J45966M72K66291K4643
8137b04624J50328j6695r5350k40554J4943L21757m0405L7015j49691k722q0503
8126c06501R3467J89098K05718r9193k94592J47836O1973k41098k7005P8507l8364
8115b30154P791O2822q3428Q8042j98392J12222K70994O6199o5885J4140P1785
$$ y = [1590861, 113256, 134151, -49171, 23415, -240403, -143172, -282035, -197738, -252755, -262964, -434128, -225845, -137536, 39411, 115784, 53295, -108557, 5722, 51628, -79043, 19297, 272762, 276550, 244082, -95678, -145865, -392877, -424151, -450927, -200996, -174857, 35350, -58264, -187113, -296375, -31400, 1175, -12944, -53451, -300078, -214462, -293125, -295799, -311631, -346782, -352134, -192350, -463191, -641996, -496030, -495558, -229267, -204624, -54296, -70991, -166341, -406895, -391952, -70195, -110600, -73585, -223276, -225998, -306501, -213034, -23936, 181782, 82589, -212003, -64167, -2194, -243292, -270297, -191790, -230154, -222363, -159541, -242969, -154927, -353319, -241097, 29897, 96096, 30211, 44351, 116136]
8104A16136K4109r7607j90988J52821L1400r7361j27142N8745K3164M9080O3088
8093E445j35279K1597K44535o0864j90654O9687J89045j32114j50580p0287J78613
8082c0856p3018j7703M466L18103j08403j73754O0975j014m0259k2269J27240
8071D3508J52785j63071k37221K13301r9540j0517J90140L14871j00496r7450
8061B06310j38508J8102q1809K72545L0898j41781R5569J98909j11466j54605
8051A94164O4774r6972k08166o0325J61364M385J37214J3929j8483k00362l0487
8040c8965Q8687k70960p0396J36701j68229L3733K13021M7849K6143p0704K36547
8029A63427j07320r119p845K9346L7578J04162J26818k3263j8873k84718J26433
$$ y = [116136, 140245, 42638, -148350, 4471, 35871, -61490, -188632, -129887, -106723, -57643, 5445, -129834, -108237, 136298, 75434, -115220, -45533, 143512, 11398, -139182, -209469, -30856, -103874, -121577, -117111, 200992, 92589, -81165, -20190, -21204, -61463, -83732, 43508, 196293, 33222, -203999, 9302, -90238, -100755, 89385, 404256, 303760, 206310, 67802, 85904, 4095, 276640, 307538, 165757, 261326, 460235, 348769, 194164, 258938, 161966, -46200, -106525, 54839, 59224, 196438, 210367, 191884, -8478, -38965, 49722, -221238, -291634, -154933, -323162, -289429, -76408, -28559, -2416, -73120, 163427, 56107, 46988, 39143, 68489, 106067, 210229, 337047, 313784, 294911, 10193, 136626]
8018A36626J389l4415J94902L2769j62050j14969r2015l5606r6495p9094K58781
8007I823K04522j8849J97522k05405r1333Q0518m2391J79960N2347r9255p5093
7996A92366k58550L9480J69237R2558j69912K72279K11012l39505k9283M0299
7986B19981j9370M2263j86849J24968J31711l74836J45909r739J50594J07307
7976C31939O149l3907p8202l2502n6455J68613p4247J9062N2727n2113J39869
7965C90933K400p6005m5036P7014l0417J9109J11843Q3118K73678j0958l32740
7954D62939J74159J45314k75133K2945N0639j23471J18469l0419m0266q3685J61440
7943E82931N66j64867m4929Q6621o6477k7248N720j00829M7133j3485j14068J75532
$$ y = [136626, 138015, 103600, 298502, 331271, 169221, 54252, -37763, -73369, -169864, -248958, 9823, 214345, 195496, 393018, 187613, 96280, 176798, 134407, 314367, 366714, 267459, 192366, -66184, -26704, 142533, 235091, 65179, 337458, 548470, 208965, 179682, 219981, 200611, 242874, 56025, 180993, 312704, -62132, 83777, 74038, 224632, 331939, 338088, 304181, 225979, 193477, 137022, 305635, 231388, 250450, 303177, 251064, 390933, 393333, 317328, 272292, 349306, 318889, 337998, 449841, 532959, 806637, 795679, 462939, 637098, 782412, 507279, 530224, 580863, 457392, 575861, 545442, 505176, 421491, 582931, 583497, 418630, 373701, 460322, 393845, 366597, 372317, 271488, 318621, 305136, 191068, 366600]
7931C66600K07304j49354K9225M354J21680r6815N1994P1948k82643J49531J85747
7920F59571K9795l2949J7591J32532r1356o3672R4442j88271j09097j19417l2435
7909B96734L65118N6895m8681j35782J01714j39582J74461j04693n7320P5874
7899E84738K70520J25121k24779k61792Q0982K28676r5135j01429L9672J1246
7889F57820K58081J64798k21063q4252J82456j04774j80054R0400J5988n1165
7879G28235q9678R7607J15429K72452k70833N5154J62549n1810M1376J50360k60711
7868I50130N4261J25009q2282K30426M6822j16237M111j33761m126p4724j18016
7857H81613L6529k3124k26395L38532j24757j87314K05719j7523P5896j04574
$$ y = [366600, 573904, 424550, 453775, 458129, 579809, 482994, 534988, 606936, 324293, 473824, 659571, 689366, 656417, 674008, 806540, 715184, 651512, 745954, 557683, 448586, 329169, 296734, 661852, 718747, 670066, 534284, 635998, 496416, 670877, 566184, 508864, 584738, 855258, 980379, 755600, 493808, 574790, 803466, 708331, 606902, 646574, 657820, 915901, 1080699, 859636, 775384, 957840, 853066, 673012, 763412, 779400, 728235, 638557, 736164, 851593, 1124045, 853212, 908366, 1070915, 1019105, 1060481, 1210841, 950130, 1004391, 1129400, 1047118, 1277544, 1324366, 1208129, 1212240, 1078479, 1074353, 999629, 881613, 918142, 895018, 668623, 1007155, 882398, 695084, 900803, 883280, 959176, 854602]
7847H54602J1817L1992P4009j5857N568m37006k5806L60678k36567J29553J92595
7836I45578j08591P8497j56670j63901J71629J69752j63665R8784P4928k45471
7826G00870K02542N5693K6445o4229o1064j9099q4726J92033J84170J97740k43134
7815A087241j79416J1755P4208J32459K84745O341k12983k20316L3776o2086N7422
7804A013146n4263J53796j79356K37002k58788l72227M20423k1377q8888J19021
7794I68489o0235K3117M0294j68871q64J65996J50073j37385J23487K21170P3122
7783A398393k09155K172j1239O7285K8332K1867J40164K36398j2762j1689q9513
7772A560253M6346j39034k1528K41646l0001J8309n4808k17945O2555j00613j20533
$$ y = [854602, 866419, 898411, 972420, 956563, 962131, 525125, 499319, 859997, 623430, 752983, 945578, 836987, 915484, 758814, 594913, 766542, 936294, 772629, 871413, 946341, 700870, 903412, 959105, 985550, 921321, 860257, 841158, 756432, 948465, 1132635, 1330375, 1087241, 907825, 919580, 993788, 1126247, 1410992, 1417333, 1204350, 984034, 1017810, 955724, 1013146, 958883, 1112679, 933323, 1170325, 911537, 539310, 959733, 938356, 849468, 968489, 908254, 931371, 971665, 802794, 801930, 967926, 1117999, 980614, 1104101, 1325271, 1398393, 1189238, 1191410, 1180171, 1247456, 1275788, 1297655, 1437819, 1674217, 1661455, 1649766, 1560253, 1606599, 1467565, 1446037, 1687683, 1657682, 1675991, 1621183, 1403238, 1465793, 1365180, 1244647]
7761A244647J46710l7550K4984K06564J4560k9424j78542k42309K08914n9500
7751A299054j13431K70697J26648m3760J8272p4799j18858M34599K1022J35430
7741A954874K50423K33572j67551J4648j6251k00618o3589n4334R7445k91223
7731A757396r0165j45710O5902L4136k30135P9466j83370N4920k5283j2376R5066
7720A399847k35070J33990j0455M3224j54139K32408M03564k37715J38624M16918
7710B131196P030O1477J6882r8030j20337k38049K2445k54639J7881P1278p0387
7699A546747j47075j77788o1262J29558J86104l67222m30994k4074p1817L3040
7689F15217K64991p1303m3738j07821K75691M7449k91842N0420K28322J57859
$$ y = [1244647, 1391357, 1353807, 1378791, 1585355, 1599915, 1570491, 1391949, 1149640, 1358554, 1299054, 1185623, 1456320, 1582968, 1539208, 1557480, 1482681, 1363823, 1798422, 1819444, 1954874, 2205297, 2438869, 2271318, 2285966, 2269715, 2069097, 2005508, 1951174, 2048619, 1757396, 1667231, 1521521, 1587423, 1621559, 1391424, 1470890, 1287520, 1342440, 1317157, 1304781, 1399847, 1164777, 1298767, 1288312, 1331536, 1177397, 1409805, 1813369, 1575654, 1714278, 2131196, 2138226, 2199703, 2216585, 2118555, 1998218, 1760169, 1782614, 1527975, 1545856, 1617134, 1546747, 1399672, 1221884, 1160622, 1290180, 1476284, 1109062, 678068, 653994, 582177, 615217, 880208, 808905, 765167, 657346, 933037, 980486, 688644, 739064, 967386, 1125245]
7679A125245J13067j45293K1410j54133M4975m2294l40295L4866M16354j25224
7669I48678k53726j00695P4878j65859M553j7565J34842r353k71456J06286K77087
7658G27670j17296r0876P6720J7501L9149J00453P7413J27844k10553k32319m4294
7647D71412j01231J14934N8852J48688j49840k6143L3695Q8557k06233J52829
7637E85520O2899J76752P0873l00209k73580M7571L47251j27197m2526J17812
7627F65166j76962r6142j67901r7286R7345J09728j7092Q7575K6182j04838J56452
7616D82227m7391k25772J07875o3407L6854J48973P3071j19407l64113j1383L29087
7605C46614J60537N2926j11175R457L2146j14957q975J13697J47876J72691j26223
$$ y = [1125245, 1238312, 1093019, 1114429, 960296, 1005271, 962977, 622682, 657548, 1073902, 948678, 694952, 594257, 669135, 503276, 507829, 490264, 625106, 615753, 344297, 450583, 727670, 610374, 519498, 596218, 613719, 652868, 753321, 830734, 958578, 748025, 515706, 471412, 370181, 485115, 543967, 692655, 542815, 516672, 550367, 638924, 432691, 585520, 648419, 825171, 896044, 595835, 322255, 369826, 717077, 589880, 547354, 665166, 488204, 392062, 224161, 126875, 224220, 333948, 316856, 404431, 430613, 325775, 482227, 434836, 209064, 316939, 253532, 290386, 439359, 512430, 393023, 28910, 17527, 346614, 507151, 560077, 448902, 458359, 490505, 375548, 366573, 480270, 628146, 800837, 674614]
7594F74614k6067j42097p3836l1344j4892p9403J48046K28887L8421j6234M1962
7583G48057m8044j67683Q3000J83623N9728m5630k04774j62976k2366j63578J11437
7572C70794o7549r361j24773J20308j59898j5445R6239K46813L69519j87680o9511
7561E69456K02563J65847p047l52965j20693M2483P7964j40710M5200J3334p7639
7550D17793J14283J30578J94764l8506j79936m7779Q1188k07376J36406K34112
7540H35527n6481q1644n1623J11572j45j09857J42301j01124n7239Q3581k7508
7529F87360L853q4886N2812J34539J8657L6196j3381j30k86582Q537K51931J15608
7517I24514j00387k66243k4989Q9035J46410M7863l05649P4994K36891J17591
$$ y = [674614, 648547, 506450, 432614, 401270, 386378, 306975, 455021, 683908, 722329, 706095, 748057, 700013, 532330, 615330, 798953, 858681, 813051, 608277, 445301, 422935, 259357, 370794, 303245, 293884, 169111, 289419, 129521, 114076, 210315, 457128, 826647, 638967, 569456, 772019, 937866, 930819, 577854, 457161, 499644, 577608, 436898, 482098, 495432, 417793, 532076, 662654, 857418, 818912, 638976, 591197, 672385, 465009, 601415, 835527, 779046, 697402, 645779, 757351, 757206, 647349, 789650, 688526, 631287, 714868, 687360, 691213, 606327, 659139, 793678, 812335, 848531, 835150, 835020, 548438, 556975, 808906, 924514, 824127, 557884, 532895, 621930, 768340, 816203, 510554, 585548, 822439, 940030]
7507I40030r4803p4857p4892n1176N9370M8710r9998Q9554J35919k495J30528
7496A005890k22143J41673O569L1934l27914r7887L59834K47703r6479o7178j95329
7485G86673j96038K00118j64634M6890K09344J17682j57537j10287J81318j02733
7475H10796J00694j46146m7062L7257K23238L12301k66372l1213J33120j70785
7465I55828q8479q4520l3824O8543j06879O8288m6538J58986K60039q7246p1143
7454I93055J16323o450j30685P0120n3703l68501K50940j8170n1474k9641K43839
7443A015653k0207m9400j42033J27369K65818k24093k30563J09331P9875K7771
7433I59521N8639R5849R9632j45041l33999n7568J96520p3140N4469j50214J94854
$$ y = [940030, 845227, 770370, 695478, 644302, 703672, 752382, 652384, 741938, 877857, 875362, 1005890, 783747, 925420, 931989, 963923, 636009, 538122, 897956, 1145659, 1049180, 982002, 786673, 590635, 790753, 626119, 673009, 882353, 1000035, 842498, 732211, 913529, 810796, 911490, 765344, 718282, 755539, 978777, 1291078, 1024706, 993493, 1126613, 955828, 867349, 782829, 749005, 817548, 710669, 778957, 732419, 891405, 1151444, 1064198, 993055, 1109378, 1102928, 972243, 1042363, 988660, 620159, 871099, 852929, 801455, 771814, 1015653, 995446, 946046, 804013, 931382, 1197200, 973107, 742544, 851875, 931750, 959521, 1018160, 1114009, 1213641, 1068600, 734601, 677033, 873553, 800413, 854882, 704668, 899522]
7422H99522O2578q0669k52646o2166J16799N7566Q6101o968j77349L26166j96
7411I68738M6034k48037m1708L73640k56143k40121N1467J7170J03437L8019J69173
7400I81669k9567L2944j21090n7712J03441j8284Q1450j81534k09690l389J88385
7389G66623L231q8220k55591p046l5393M4191K08205N9914j2037j24710o6980
7378D92187J5206J36457q7682J27538J38182O8732k45075l6932K03395k31886
7368E80122Q1891J50562j05434J09190q8292K0669K48589l13972n1589m2915O2239
7357F51060N0066J31465R157n9717J50144J82493j57127k26529k65284K19793
7347F85521R9886M3406N379j42331J57843J3610J56687k634j7397k70250L6435
$$ y = [899522, 962100, 881431, 628785, 566619, 683418, 740984, 827085, 820117, 642768, 968934, 968738, 1014772, 766735, 725027, 1098667, 842524, 602403, 653870, 671040, 774477, 812496, 981669, 952102, 985046, 863956, 806244, 909685, 891401, 972851, 791317, 581627, 578238, 766623, 769854, 681634, 426043, 418997, 383604, 427795, 636000, 695914, 683877, 559167, 492187, 507393, 643850, 556168, 683706, 821888, 890620, 645545, 608613, 812008, 580122, 662013, 812575, 707141, 816331, 728039, 748708, 997297, 683325, 631736, 588821, 651060, 701126, 832591, 841748, 782031, 932175, 1114668, 957541, 731012, 465728, 685521, 785407, 828813, 834192, 691861, 849704, 863314, 1020001, 1017367, 999970, 729720, 766155]
7336G66155M70903l76686k60933J22840J29013j3848j634j03056K88019P7651
7326A098424j44305J38934q7627j47960l7389J977K50568k08496n9900o0037J41124
7315H85313J40541j20365O1110J99949J86185m4736m2012o9318O16957J44505
7305A958129j57717k44517r5680j09572O1247L7801j68972O6592J00728p7799
7295A370240p6207j10329j28304j17997L08229l684l26691J34948n1901Q4721
7285A083025J69850J26636j43455j66081k59833K02159j09107O2245K98330O5073
7275A328842j15874m59920P6953J089j33767J29099L92647q3074j46952o858j25581
7264H56604J48416J05334r3283Q4794r5871K98538p6755k3293K0617k49638K82689
$$ y = [766155, 1237058, 860372, 599439, 722279, 851292, 837444, 835810, 732754, 1020773, 1098424, 954119, 1093053, 1005426, 857466, 820077, 822054, 1072622, 864126, 804226, 744189, 885313, 1025854, 905489, 966599, 1166548, 1352733, 1307997, 1265985, 1196667, 1813624, 1958129, 1800412, 1555895, 1460215, 1350643, 1411890, 1449691, 1280719, 1347311, 1448039, 1370240, 1294033, 1183704, 1055400, 937403, 1245632, 1241948, 915257, 1050205, 998304, 1083025, 1252875, 1379511, 1236056, 1069975, 810142, 1012301, 903194, 965439, 1263769, 1328842, 1212968, 753048, 830001, 831090, 697323, 826422, 1219069, 1135995, 989043, 982185, 856604, 1005020, 1110354, 1017071, 1101865, 1005994, 1304532, 1227777, 1204484, 1225101, 975463, 1258152]
7253A258152j40892p3410K45772O2494m3534k26872K34334N7549j84233o875m0360
7242A142125j47108Q4471j1325k01393M1877j29521K4892o5582J29658M3226R2190
7231A003510J08313J0558j36510o0533Q5434j8943M03847p8727k71403m7855J24523
7220A122214K84946J6191k83205j61258j16121L33863o734j51220K517K27227
7210A268420J8515k71442J85155L91309p6205j14402J19873j60836K4835Q8078
7200A473300j62398k1611l6706K24180L15111j21849L578m271J4075j88160j15984
7189A379265M8950K28210K10441k43107k99274k6818J12497k0225O7301J5850
7179A473090q5345K28642L9877l82216m6497K048K02243l5382K22756r0968l25137
$$ y = [1258152, 1117260, 1043850, 1289622, 1352116, 1308582, 1081710, 1316044, 1373593, 1189360, 1182485, 1142125, 995017, 1079488, 1068163, 866770, 908647, 779126, 804018, 738436, 868094, 911320, 1003510, 1111823, 1122381, 985871, 925338, 1010772, 991829, 1395676, 1316949, 1045546, 997691, 1122214, 1407160, 1423351, 1140146, 978888, 862767, 1196630, 1189896, 1038676, 1041193, 1268420, 1286935, 1015493, 1200648, 1591957, 1515752, 1401350, 1521223, 1360387, 1385222, 1473300, 1310902, 1289291, 1252585, 1476765, 1791876, 1670027, 1673605, 1669334, 1683409, 1495249, 1379265, 1428215, 1656425, 1866866, 1623759, 1324485, 1297667, 1410164, 1389939, 1457240, 1473090, 1387745, 1616387, 1656264, 1274048, 1227551, 1229599, 1431842, 1396460, 1619216, 1528248, 1203111]
7168A203111J72090O340k3574J79496M4625k33831L1587R3167r4586R1742N6741
7157A526908j81484m0852J164k8338m2475K23118R9971P5186j88108j92523j36368
7146A116199J25978K6648K0851J31533o4114K7562M32635q4599k32307J42653
7136A643039N0977r5655q569j27046J01200k940K27485j61653m6724O7295K6774
7125A674183J70522J88086l34824j03358J60851J52719L48480j54059q1943k1443
7115A999214j26527J69027j64143j62288J56898q7537k6900J18172J44397J17584
7105B137897R9552j68774p0418k8980p2286R9299M5058J4669N9062J08254n1182
7094B172151k222K0018j83770k58329m9629L11537J38881j23833j75979j19907
$$ y = [1203111, 1375201, 1381541, 1357967, 1537463, 1582088, 1348257, 1379844, 1473011, 1378425, 1470167, 1526908, 1345424, 1304572, 1305736, 1277398, 1234923, 1458041, 1558012, 1633198, 1445090, 1252567, 1116199, 1242177, 1268825, 1289676, 1421209, 1357095, 1384657, 1817292, 1732693, 1500386, 1643039, 1694016, 1598361, 1589792, 1462746, 1563946, 1561006, 1788491, 1626838, 1580114, 1647409, 1674183, 1844705, 2032791, 1697967, 1594609, 1755460, 1908179, 2256659, 2102600, 2020657, 1999214, 1872687, 2041714, 1877571, 1715283, 1872181, 1784644, 1757744, 1875916, 2020313, 2137897, 2237449, 2068675, 1998257, 1969277, 1896991, 1996290, 2041348, 2056017, 2115079, 2223333, 2172151, 2169929, 2189947, 2006177, 1747848, 1698219, 2009756, 2148637, 2024804, 1848825, 1728918]
7084A728918M2325N4478J23647J77842n6625l3169k10710P3848L1886J34880q3021
7073A984299l0245J10454j02889p9468K03016l6787p3256k1177j1142r2764j1567
7062A838474n7257J70947k09188n6869J35807l35326o3000K97644L53871P3988
7052B149091k47902j10775j3653J46987j41616n3850K57104M191j54347l3979
7042A801251J17419K7137Q3910P2104O5350l13096O1204J0641N0013P4796J10900
7031B161629n3005r826r1261r6002j44622p9909K58810q0901J00244j37944n7297
7020A769916j46593K52156L61122j57965l4494J87679O5313n6876l06416M4693
7010A978535J21678P1399j34233n6208J04646J36688N6475P750J92648j84697
$$ y = [1728918, 1771243, 1825721, 1949368, 2127210, 2070585, 2037416, 1826706, 1900554, 1932440, 2067320, 1984299, 1954054, 2064508, 1961619, 1882151, 2085167, 2048380, 1975124, 1953947, 1942805, 1850041, 1838474, 1781217, 1952164, 1742976, 1686107, 1821914, 1486588, 1423588, 1721232, 2075103, 2149091, 1901189, 1790414, 1776761, 1923748, 1782132, 1728282, 1985386, 1989577, 1835230, 1801251, 1918670, 1945807, 2029717, 2101821, 2167171, 1854075, 1915279, 1925920, 1975933, 2050729, 2161629, 2108624, 2098798, 2007537, 1911535, 1766913, 1687004, 1945814, 1864913, 1965157, 1827213, 1769916, 1623323, 1875479, 2236601, 2078636, 2044142, 2231821, 2297134, 2240258, 1933842, 1978535, 2100213, 2171612, 2037379, 1981171, 2085817, 2222505, 2278980, 2286730, 2479378, 2294681]
7000B294681M6339J25488k37546J29832K8772J99300j60619j31115r0207j79819
6990B025106L09249K50707j57219o0234R2514n9886P9319K57065j41986j66762
6980B427873n7413k41545K28863n3155J41541j43628n2836N3646k5100M3478J8019
6969B339743Q1501L8497K12345o834O2278R7212j28381k56182J56410l9234R5844
6958B653199r8348j0860K45299j21991n3553n8337K09665j47886p9617K9251j42841
6947B423981j25944K1269k4360J51827r1770j41807j21760L68174L46823l69872
6937B436561L7863J87422l00957J65795J55995J24372j61033J44185j2927j63452
6927B613824l23370R1873J12298o2509k1386O8625k14294J52939J40375K46492
$$ y = [2294681, 2341020, 2466508, 2228962, 2358794, 2387566, 2586866, 2426247, 2295132, 2204925, 2025106, 2334355, 2585062, 2427843, 2367609, 2460123, 2400237, 2479556, 2736621, 2594635, 2427873, 2370460, 2128915, 2357778, 2304623, 2446164, 2302536, 2249700, 2303346, 2278246, 2321724, 2339743, 2421244, 2459741, 2672086, 2665252, 2727530, 2824742, 2696361, 2440179, 2596589, 2557355, 2653199, 2554851, 2543991, 2789290, 2667299, 2613746, 2555409, 2765074, 2617188, 2537571, 2566822, 2423981, 2298037, 2319306, 2294946, 2446773, 2355003, 2213196, 2091436, 2459610, 2806433, 2436561, 2474424, 2661846, 2360889, 2526684, 2682679, 2807051, 2646018, 2790203, 2777276, 2613824, 2290454, 2382327, 2494625, 2432116, 2410730, 2479355, 2265061, 2418000, 2558375, 2804867]
6917B804867J99857o8924l94101K3728k10648M7573J35743q1875q8280m0936J91392
6906B518396j53722m54L1625J00427J97864r6021K11243p1558k91278j00461k0165
6895B325896L04777k07258K4050l06565K14174K65596J33168j3537j57622n6482
6885B526197J43750Q2263r1246k98135Q2911J04696j42835R3451N4615J78379
6875B734046N8237k56040K54206J0843J0432l1646k5209n3922k3267k23315k78339
6864B176026k05655M11166J76027K28589k35386K0856l10530K31095M6600k3259
6854B515529J99269P580J75297k72353r6722q6276K2246J51938Q9205Q2356J18283
6843B906352j50929j60552J07619k0464J6307m5278P2320L4064m3898j58646j5476
$$ y = [2804867, 3004724, 2935800, 2541699, 2565427, 2354779, 2402352, 2538095, 2456220, 2367940, 2327004, 2518396, 2364674, 2364220, 2395845, 2496272, 2694136, 2598115, 2809358, 2737800, 2446522, 2346061, 2325896, 2630673, 2423415, 2447465, 2140900, 2355074, 2620670, 2753838, 2740301, 2582679, 2526197, 2669947, 2752210, 2660964, 2362829, 2445740, 2550436, 2407601, 2501052, 2555667, 2734046, 2792283, 2536243, 2790449, 2801292, 2811724, 2780078, 2754869, 2700947, 2677680, 2454365, 2176026, 1970371, 2381537, 2557564, 2786153, 2550767, 2571623, 2261093, 2492188, 2538788, 2515529, 2714798, 2722378, 2897675, 2625322, 2528600, 2442324, 2464570, 2616508, 2705713, 2788069, 2906352, 2755423, 2594871, 2702490, 2682026, 2698333, 2653055, 2725375, 2759439, 2715541, 2556895, 2541419]
6832B541419K01189Q5085q2263n6551J07000j09148j59252R631L17107J64113
6822C018330m4415P4246K1042j68348J13441m4293K2535k2258J60566j62577k60859
6811B707410J77195J59989J20290K2521j14869k00549j70950j5208m3364J60919
6801B803384K7288Q6869J24162R5434Q0397n3689j91467l671J80274M7964O0226
6790C257171L06574k6386k88680l3168K12713k31211O8651k33719L3595J02506
6780C168046n4562J65140K11386o2453J39717O283j51449J36605J37853k4463
6770C672103n3458j70501j3438L4497N9973k07606j55170M1806J50633J44266
6760C503105R0574k48895J70218J93962r7198j79673N6997J18497R48j65218o5848
$$ y = [2541419, 2742608, 2827693, 2745430, 2688879, 2795879, 2686731, 2527479, 2537110, 2854217, 3018330, 2973915, 3048161, 3069203, 2900855, 3014296, 2970003, 2992538, 2970280, 3130846, 2968269, 2707410, 2884605, 3044594, 3164884, 3187405, 3072536, 2871987, 2701037, 2685829, 2642465, 2803384, 2830672, 2917541, 3041703, 3137137, 3217534, 3163845, 2972378, 2968707, 3148981, 3196945, 3257171, 3563745, 3537359, 3248679, 3215511, 3428224, 3197013, 3265664, 3031945, 3065540, 3168046, 3113484, 3278624, 3490010, 3427557, 3567274, 3573557, 3422108, 3558713, 3696566, 3672103, 3618645, 3448144, 3434706, 3469203, 3529176, 3321570, 3166400, 3208206, 3358839, 3503105, 3593679, 3344784, 3515002, 3708964, 3611766, 3432093, 3489090, 3607587, 3608535, 3443317, 3377469]
6749C377469J69055j72908L81019l179j85421l53458K04753J2631m4021O9675
6739C455615N9988p75l7709j24652K15349R8573M2664j08194J43057n8307m3702
6728C641907J91218o8900O9910P2729j10228K277k43556R8092K91224j05539P3316
6717C912450k0700J01858J90802j01864M3297K57605n5807k91909K16080K2179
6707D273991N8328J2024J70198q238J6070j659l39367k970m1510K47824k7661
6696D357030K28889J41531R9179q1106q4859r2585J37450J8092j44019M2256K328
6685D624186p3927L80211m45l3636J69063k85304k63893k50452J17365K20511
6675D603679R8387J31169q7340m8229o8931J88545k89840p7561M30122J84530
$$ y = [3377469, 3546524, 3373616, 3754635, 3751456, 3566035, 3212577, 3417330, 3429961, 3385940, 3455615, 3515603, 3514828, 3477119, 3352467, 3567816, 3666389, 3709053, 3600859, 3743916, 3685609, 3641907, 3833125, 3764225, 3834135, 3906864, 3796636, 3798913, 3555357, 3653449, 3944673, 3839134, 3912450, 3891750, 3993608, 4184410, 4082546, 4125843, 4383448, 4327641, 4035732, 4251812, 4273991, 4332319, 4344343, 4514541, 4506303, 4522373, 4520714, 4181347, 4178377, 4136867, 4384691, 4357030, 4585919, 4727450, 4826629, 4745523, 4660664, 4568079, 4705529, 4723621, 4579602, 4621858, 4624186, 4550259, 4930470, 4930025, 4896389, 5065452, 4780148, 4516255, 4265803, 4383168, 4603679, 4702066, 4833235, 4745895, 4697666, 4628735, 4817280, 4527440, 4449879, 4880001, 5064531]
6665E064531p5493j46353O3621n2045k0693O5549J78229K55474j72993J27774
6655E287601n406j80581J43161R5270J83846j33038k3216o5389M6591l3805J85204
6644E500238K5673N9376J37441j45612L11538J0847l79392j3134M91180Q1834
6634F079989l6275L388q412j43127K07862O9322k59824K9652l0051J1101J43904
6623F067529Q3703k3650J26463m6075n1022l3209J40409R2912m8237l08086K11402
6612F212139P0469J23250j84194J34237L25611O9591r8380J04241p0622j05005
6602F581337l62349J7213K76973K41166J9022j13429Q5672j77814q4930J68790
6592F651651m1978r7412j3966K0811M713k13634J51639J50286r579J19032j70106
$$ y = [5064531, 4989038, 4842685, 4906306, 4854261, 4833568, 4899117, 5077346, 5332820, 5159827, 5287601, 5282195, 5101614, 5244775, 5340045, 5523891, 5390853, 5367637, 5302248, 5348839, 5315034, 5500238, 5525911, 5585287, 5722728, 5577116, 5888654, 5899501, 5520109, 5506975, 5998155, 6079989, 6043714, 6047102, 6038690, 5895563, 6103425, 6172747, 5912923, 5942575, 5912524, 5923625, 6067529, 6151232, 6127582, 6254045, 6207970, 6156948, 6123739, 6264148, 6357060, 6308823, 6000737, 6212139, 6282608, 6405858, 6221664, 6355901, 6681512, 6751103, 6652723, 6756964, 6686342, 6581337, 6218988, 6236201, 6513174, 6754340, 6773362, 6659933, 6745605, 6567791, 6482861, 6651651, 6609673, 6512261, 6498295, 6519106, 6523819, 6310185, 6461824, 6612110, 6602531, 6721563, 6551457]
6581F551457J00673j21130J66099P1997L1879J23644j35496J86826R98m5747o0849
6570F870351J25523o5017P7591q3859K6499j11219P2982k58656k6383J54279j2688
6559F769403j55435L6110j1031K25810k0988J48250o288l7203l0649o3620j79650
6548F674709O8034L16893J85234j10399l31346M4245k71278K3263L38288M7274
$$ y = [6551457, 6652130, 6531000, 6697099, 6769096, 6800975, 6924619, 6789123, 6975949, 6976947, 6931200, 6870351, 6995874, 6930857, 7008448, 6924589, 6951088, 6839869, 6912851, 6654195, 6627812, 6782091, 6769403, 6613968, 6650078, 6639047, 6864857, 6843869, 6992119, 6985831, 6948628, 6917979, 6854359, 6674709, 6742743, 7059636, 7244870, 7134471, 6803125, 6847370, 6576092, 6599355, 6937643, 6984917]
$$ [...]
##END NTUPLES=NMR SPECTRUM
##END=
