##TITLE=1H_TG-2413-A2
 200.13Hz,CDCl3.
 8 sc
 24.8.2026
##JCAMPDX= 6.0         $$ Bruker NMR JCAMP-DX V2.0
##DATA TYPE= NMR SPECTRUM
##DATA CLASS= NTUPLES
##ORIGIN= UXNMR, Bruker Analytische Messtechnik GmbH
##OWNER= pz
$$ XWIN-NMR		Version 3.5
$$ Mon Aug 24 13:12:08 2026 Russian Standard Time (UT+4h)  she@DPX200
##.OBSERVE FREQUENCY= 200.1313
##.OBSERVE NUCLEUS= ^1H
##.ACQUISITION MODE= SIMULTANEOUS
##.ACQUISITION SCHEME= undefined
##.AVERAGES= 8
##.DIGITISER RES= 18
##SPECTROMETER/DATA SYSTEM= spect
##.PULSE SEQUENCE= zg30
##.SOLVENT NAME= CDCl3
##.SHIFT REFERENCE= (INTERNAL, CDCl3, 0, 15.4924)
##AUDIT TRAIL= $$ (NUMBER, WHEN, WHO, WHERE, WHAT)
$$ ##TITLE= Audit trail, XWIN-NMR		Version 3.5
$$ ##JCAMPDX= 5.01
$$ ##ORIGIN= Bruker BioSpin GmbH
$$ ##OWNER= she
$$ F:/spectra/data/she/nmr/H-C/1/pdata/1/auditp.txt
$$ ##AUDIT TRAIL=  $$ (NUMBER, WHEN, WHO, WHERE, WHAT)
(   1,<2026-08-24 13:09:56.73 +0400>,<she>,<DPX200>,
      <created by zg, POWCHK disabled, PULCHK disabled
       configuration hash MD5:
       00 E9 B6 7A A2 85 ED C7 34 08 36 98 17 FE 4E 26
       data hash MD5: 16K
       4B 3B 88 49 4C 7D AB 78 A1 8B 07 F0 5F 92 29 90>)
(   2,<2026-08-24 13:09:59.25 +0400>,<she>,<DPX200>,
      <Start of raw data processing
       efp BC_mod = 2 LB = 0.25 FT_mod = 6 PKNL = 1 PHC0 = -4578.702 PHC1 = 8.392296 SI = 16K 
       data hash MD5: 16K
       31 5B 03 12 04 90 FC 5A D7 DF 16 4B 80 7F 1C 0F>)
(   3,<2026-08-24 13:10:27.34 +0400>,<she>,<DPX200>,
      <pk PHC0 = 1.222322 PHC1 = 0 
       data hash MD5: 16K
       F8 9E 9B FF 65 B0 AC 48 72 2B 7F 95 96 7A EC 0D>)
(   4,<2026-08-24 13:10:31.29 +0400>,<she>,<DPX200>,
      <abs ABSG = 5 
       data hash MD5: 16K
       5C 35 20 40 36 ED EB DD BF F9 96 2A 8F E5 31 5D>)
(   5,<2026-08-24 13:11:04.95 +0400>,<she>,<DPX200>,
      <pk PHC0 = -5.372512 PHC1 = 14.8 
       data hash MD5: 16K
       81 5B 9B E0 02 69 CF 59 01 E2 20 85 93 07 33 E6>)
(   6,<2026-08-24 13:11:29.78 +0400>,<she>,<DPX200>,
      <pk PHC0 = 14.76098 PHC1 = -27.6 
       data hash MD5: 16K
       38 ED 34 88 2A 88 05 66 15 A7 DB 42 1F 8F DA 99>)
(   7,<2026-08-24 13:11:34.06 +0400>,<she>,<DPX200>,
      <abs ABSG = 5 
       data hash MD5: 16K
       DC 85 C2 0E 0F 88 C4 15 29 1F BA 46 BA E7 73 50>)
$$ ##END=
$$ 
$$ hash MD5
$$ 22 06 7D 25 15 5A F4 08 9A 3A 7C 1B 7E 30 F1 04
##$RELAX= 
##$RELAX= 
##$RELAX= 
##$RELAX= 
##$RELAX= 
##$RELAX= 
$$ Bruker specific parameters
$$ --------------------------
##$DU= <F:/spectra>
##$EXPNO= 1
##$NAME= <H-C>
##$PROCNO= 1
##$TYPE= <nmr>
##$USER= <she>
##$AMP= (0..31)
100 100 100 100 100 100 100 100 100 100 100 100 100 100 100 100 100 100 
100 100 100 100 100 100 100 100 100 100 100 100 100 100 
##$AQSEQ= 0
##$AQ_mod= 1
##$AUNM= <au_zg>
##$AUTOPOS= <>
##$BF1= 200.13
##$BF2= 200.13
##$BF3= 200.13
##$BF4= 200.13
##$BF5= 200.13
##$BF6= 200.13
##$BF7= 200.13
##$BF8= 200.13
##$BYTORDA= 1
##$CFDGTYP= 0
##$CFRGTYP= 5
##$CHEMSTR= <none>
##$CNST= (0..31)
$$ [...]
##$SUBNAM3= <"">
##$SUBNAM4= <"">
##$SUBNAM5= <"">
##$SUBNAM6= <"">
##$SUBNAM7= <"">
##$SUBNAM8= <"">
##$SUBNAM9= <"">
##$SW= 18.0517328524113
##$SWIBOX= (0..15)
0 0 2 0 0 0 0 0 0 0 0 0 0 0 0 0 
##$SW_h= 3612.71676300578
##$TD= 16384
##$TD0= 1
##$TE= 0
##$TE2= 300
##$TE3= 300
##$TEG= 300
##$TL= (0..7)
0 120 120 120 120 120 120 120 
##$TP= (0..7)
150 150 150 150 150 150 150 150 
##$TP07= 0
##$TPNAME0= <>
##$TPNAME1= <>
##$TPNAME2= <>
##$TPNAME3= <>
##$TPNAME4= <>
##$TPNAME5= <>
##$TPNAME6= <>
##$TPNAME7= <>
##$TPOAL= (0..7)
0.5 0.5 0.5 0.5 0.5 0.5 0.5 0.5 
##$TPOFFS= (0..7)
0 0 0 0 0 0 0 0 
##$TUNHIN= 0
##$TUNHOUT= 0
##$TUNXOUT= 0
##$USERA1= <user>
##$USERA2= <user>
##$USERA3= <user>
##$USERA4= <user>
##$USERA5= <user>
##$V9= 5
##$VALIST= <valist>
##$VCLIST= <CCCCCCCCCCCCCCC>
##$VD= 0
##$VDLIST= <DDDDDDDDDDDDDDD>
##$VPLIST= <PPPPPPPPPPPPPPP>
##$VTLIST= <TTTTTTTTTTTTTTT>
##$WBST= 1024
##$WBSW= 4
##$XGAIN= (0..3)
0 0 0 0 
##$XL= 0
##$YL= 0
##$YMAX_a= 361493
##$YMIN_a= -369291
##$ZGOPTNS= <>
##$ZL1= 120
##$ZL2= 120
##$ZL3= 120
##$ZL4= 120
##$ABSF1= 15.49237
##$ABSF2= -2.55948
##$ABSG= 5
##$ABSL= 3
##$ALPHA= 0
##$AQORDER= 0
##$ASSFAC= 0
##$ASSFACI= 0
##$ASSFACX= 0
##$ASSWID= 0
##$AUNMP= <proc_1d>
##$AZFE= 0.1
##$AZFW= 0.1
##$BCFW= 0
##$BC_mod= 2
##$BYTORDP= 0
##$COROFFS= 0
##$CY= -3
##$DATMOD= 1
##$DC= 0
##$DFILT= <>
##$DTYPP= 0
##$F1P= 0
##$F2P= 0
##$FCOR= 1
##$FTSIZE= 16384
##$FT_mod= 6
##$GAMMA= 0
##$GB= 0
##$INTBC= 1
##$INTSCL= 3.241238e-09
##$ISEN= 128
##$LB= 0.25
##$LEV0= 0
##$LPBIN= 0
##$MAXI= 10000
##$MC2= 0
##$MEAN= 0
##$ME_mod= 0
##$MI= 1.114404
##$NCOEF= 0
##$NC_proc= -7
##$NLEV= 6
##$NOISF1= 3.799351
##$NOISF2= 2.8
##$NSP= 0
##$NTH_PI= 0
##$NZP= 0
##$OFFSET= 15.49237
##$PC= 1
##$PHC0= -4568.092
##$PHC1= -4.4077
##$PH_mod= 1
##$PKNL= yes
##$PPARMOD= 0
##$PSCAL= 0
##$PSIGN= 0
##$REVERSE= no
##$SF= 200.130005869722
##$SI= 16384
##$SIGF1= 3
##$SIGF2= 2
##$SINO= 0.751879
##$SIOLD= 32768
##$SREGLST= <19F.Aceton>
##$SSB= 0
##$STSI= 16384
##$STSR= 0
##$SW_p= 3612.71676300578
##$SYMM= 0
##$S_DEV= 0
##$TDeff= 16384
##$TDoff= 0
##$TI= <>
##$TILT= no
##$TM1= 0
##$TM2= 0
##$TOPLEV= 0
##$USERP1= <user>
##$USERP2= <user>
##$USERP3= <user>
##$USERP4= <user>
##$USERP5= <user>
##$WDW= 1
##$XDIM= 16384
##$YMAX_p= 385808153
##$YMIN_p= -1591130
$$ End of Bruker specific parameters
$$ ---------------------------------
##NTUPLES= NMR SPECTRUM
##VAR_NAME=  FREQUENCY,     SPECTRUM/REAL,   SPECTRUM/IMAG
##SYMBOL=    X,             R,               I
##VAR_TYPE=  INDEPENDENT,   DEPENDENT,       DEPENDENT
##VAR_FORM=  AFFN,          ASDF,            ASDF
##VAR_DIM=   16384,         16384,           16384
##UNITS=     HZ,            ARBITRARY UNITS, ARBITRARY UNITS
##FACTOR=    0.220516191357247, 1,           1
##FIRST=     3100.48802934952, 0,            0
##LAST=      -512.228733656257, 0,           0
##MIN=       -512.228733656257, -1591130,    0
##MAX=       3100.48802934952, 385808153,    0
$$ Real data points
##PAGE= N=1
##DATA TABLE= (X++(R..R)), XYDATA
$$ [...]
5819E5239993Q811286Q780479M362894o95660k959268m234912n149035m874819
5811E9280958m124946l761437l516141l475271l339875l158506k489400j861244
5803C3554138j257968o10031K84715N87201M88417N5494o49765q38570n95359
5794C1018272p06711n43322l26554K44510L45458K32848R5471o53380r61775j175558
5784B7569259p15411j227923j198826q36847p50237o72537p69688n40040j44338
5775B0713412k0427J18934J73137J4604K87122J71459L36029N57923L68170J60033
5765B2880396M87897P92130J271977J363565K329928M396566O393564Q460107
5757D8376130J1280393J1098473M839142n67697k740671m113846m919085m890281
$$ plain form
5819 55239993 64051279 72831758 77194652 76498992 73539724 69304812 64155777 59280958
5811 59280958 55156012 51394575 47878434 44403163 41063288 37904782 35415382 33554138
5803 33554138 32296170 31686139 31970854 32558055 33046472 33101966 32452201 31613631 31018272
5794 31018272 30311561 29768239 29441685 29686195 30031653 30264501 30359972 29706592 28744817 27569259
5784 27569259 26853848 25625925 24427099 23590252 22840015 22167478 21397790 20857750 20713412
5775 20713412 20692985 20811919 20985056 20999660 21286782 21458241 21794270 22352193 22720363 22880396
5765 22880396 23368293 24160423 25432400 26795965 29125893 33522459 39916023 48376130
5757 48376130 59656523 70754996 75594138 75026441 72285770 68171924 63252839 58362558
5749E8362558m454672l226040k730319j722621p01197R19033K940635N158647
5741E4546024Q071518J2356201J7495346K1786530K5258906K2839376J1423830
5734A73777731m28128p666429j2237827j5125851j6203688j5195825j4157447
5727I2762536j3854885j2449828j0351433q190489n733847m458397l075850k360098
5719C2287709j658091j330130r12377p13778J80769O55539J098495O30757J37658
5710C0376551k33843p16467j117218j218062j231164j320465q57145o11902p83471
5701B2286814q42021m28620o43605q65550r94759q96051p05660p85330o20871
5692A5504347p72771r36912n00538m67606m33587m11630m65635l40573j90537
$$ plain form
5749 58362558 53907886 50681846 47951527 46228906 45527709 46446742 49387377 54546024
5741 54546024 62617542 74973743 92469089 114255619 139514525 162353901 173777731
5734 173777731 173349603 165683174 153445347 138319496 122115808 106919983 92762536
5727 92762536 78907651 66457823 56106390 47915901 42182054 37723657 34647807 32287709
5719 32287709 30629618 29299488 28387111 27673333 27854102 28509641 29608136 30238893 30376551
5710 30376551 30142708 29426241 28309023 27090961 25859797 24539332 23682187 23070285 22286814
5701 22286814 21444793 21016173 20372568 19507018 18512259 17616208 16910548 16125218 15504347
5692 15504347 14731576 13794664 13294126 12826520 12392933 11981303 11515668 11175095 10984558
5683A0984558K0771n6734k63473J34869j59235l45564L2579O1214j71906K09460
5673A0446539K2997j65470K36414L03981J47130K22762J11051M78990K13375J33952
5663A2151721M94072M81991P14638R04907J072840J410807J574423J018225M17931
5654B0241555m16672o42199n00743q02078o03176p18544j101778j095108j329666
5645A3031591r45222q96759r26570o23079m88545p25324m87307l9813m74052l47353
5635G077567l11099j25651k99911n03906J35598K8450j80022l39781N6885j0871
5625E527259k89599j88549k46622m8746j08887k61233K42080J27524l29546J6722
5615D440403q5736M4364J42312r7060J10759J18503K15908L31925O5043l07862
$$ plain form
5683 10984558 11005329 10948595 10685122 10819991 10660756 10315192 10347771 10408985 10237079 10446539
5673 10446539 10469536 10304066 10540480 10844461 10991591 11214353 11325404 11804394 12017769 12151721
5663 12151721 12645793 13127784 13842422 14747329 15820169 17230976 18805399 19823624 20241555
5654 20241555 19824883 19182684 18681941 17879863 17276687 16558143 15456365 14361257 13031591
5645 13031591 12086369 11189610 10263040 9639961 9151416 8426092 7938785 7898972 7424920 7077567
5635 7077567 6766468 6640817 6340906 5837000 5972598 6001048 5821026 5481245 5538130 5527259
5625 5527259 5237660 5049111 4802489 4753743 4644856 4383623 4625703 4753227 4423681 4440403
5615 4440403 4354667 4399031 4541343 4444283 4555042 4673545 4889453 5221378 5286421 4978559
5605D978559m95442J52028J55305l61276j20312Q0460J1075J41829o7858j08110
5595D366258j18395j17788j67864J8125O4662J20506j4982j88454k34805j27409
5585C599854K4673K05833o7984m46498j60455k8931r3260J19482J84266J38263
5575C475243j13325l8351k13819j48916K80620k22104j1787j39571N1378j89724
5565B729644l817L06335L8807k45495J09960J24677K6373N7262M7583K31278J7607
5554C440214J74218j01760J56915K99369o2375n6048M72273M17663K41588o6508
5544D915549j52541j52070M9975k96522o7400Q0532j39478j40622k90611J2457
5534C819269M1885k5615j14433j98334m27972k06850j22618p0597J03438q8854
$$ plain form
5605 4978559 4483117 4635145 4790450 4429174 4308862 4389322 4400397 4542226 4474368 4366258
5595 4366258 4247863 4130075 3962211 3980336 4044998 4165504 4150522 3962068 3727263 3599854
5585 3599854 3624527 3830360 3762376 3315878 3155423 3126492 3033232 3152714 3336980 3475243
5575 3475243 3361918 3323567 3109748 2960832 3241452 3019348 3007561 2867990 2919368 2729644
5565 2729644 2725827 3032162 3070969 2825474 2935434 3060111 3086484 3143746 3191329 3422607 3440214
5554 3440214 3614432 3512672 3669587 3968956 3906581 3850533 4322806 4740469 4982057 4915549
5544 4915549 4763008 4610938 4660913 4364391 4296991 4377523 4238045 4097423 3806812 3819269
5534 3819269 3861154 3835539 3721106 3522772 3094800 2887950 2765332 2694735 2798173 2709319
5524B709319J36039k8770J78435L26020j73921J60662J16377K2606k6674k02253
5514C217840P5429J08438j22647J69250L7007j2314l05899j02072P8131L3801
5504C176964p3115k24561l8518j57754j05497J55980j41496r7248J38961J06586
5494B740302j97189K19715L725o9826J05980j1417k44921J48707P4372k30892
5484B538556n3391j55664j64682j57229J55711K14459k04179k08350l25950P9813
5474A719094o2967K56497L39211k34171L58171j07551n71386L465J26453P5772
5464A902588K76383j04730M20209k69028N1366K3381l17371L5491q0149j09704
5454A828436R9504k2870K09542j4609J11447p9096j61091K34696j2791J21204
$$ plain form
5524 2709319 2845358 2816588 2995023 3321043 3147122 3307784 3424161 3446767 3420093 3217840
5514 3217840 3293269 3401707 3279060 3448310 3485317 3473003 3167104 3065032 3143163 3176964
5504 3176964 3103849 2879288 2840770 2683016 2577519 2733499 2592003 2494755 2633716 2740302
5494 2740302 2543113 2762828 2766553 2696727 2802707 2791290 2546369 2695076 2769448 2538556
5484 2538556 2485165 2329501 2164819 2007590 2163301 2377760 2173581 1965231 1639281 1719094
5474 1719094 1656127 1912624 2251835 2017664 2375835 2268284 1696898 1700363 1826816 1902588
5464 1902588 2178971 2074241 2494450 2225422 2276788 2300169 1982798 2018289 1938140 1828436
5454 1828436 1927940 1905070 2114612 2100003 2211450 2132354 1971263 2205959 2193168 2314372
5444B314372k5065J55766J2457K03752N1886J16914J96522K08310N88561N84249
5434D407724P74193N70364J144721J324401J289126J040695L00137K73209j35857
5425A0988713n86556l23972m52657J82371K52042L94582N36939L31326J37754
5416A1460542l00891p20086q79106p90254q62466n02337j041305j212760q41365
5407D309972k72477j24619j80060n04127l08986j84540J8192k57989j75525n9630
5397B260211q8962k03555j29608J14210k26810j26449L16951l56716n18873p219
5387A033180K95813N9056k18949L2807k32623R7407j38577K8322k14361j51804
5377E90271J81533L46982M9753n7900r2728j87927k6467m2146l9089j61231K8224
$$ plain form
5444 2314372 2289307 2445073 2457530 2661282 2713168 2830082 3026604 3234914 3823475 4407724
5434 4407724 5181917 5752281 6897002 8221403 9510529 10551224 10851361 11124570 10988713
5425 10988713 10402157 10078185 9625528 9807899 10059941 10454523 10991462 11322788 11460542
5416 11460542 11159651 10439565 9560459 8770205 7907739 7405402 6364097 5151337 4309972
5407 4309972 4037495 3912876 3732816 3228689 2919703 2735163 2753355 2495366 2319841 2260211
5397 2260211 2171249 1967694 1838086 1952296 1725486 1599037 1915988 1559272 1040399 1033180
5387 1033180 1328993 1388049 1169100 1201907 969284 1066691 928114 956436 742075 590271
5377 590271 771804 1118786 1168539 1110639 1017911 829984 803517 761371 722282 561051 589275
5366E89275Q2521K2829Q2773M1962j98263j9696O8860J07550O0403k09890J52937
5355G81261K3285j02828j83879k62144K47781M7587P3567Q1056m6203j23548q3058
5344D52877K8184j64893N6512M56377j9319J12267J32370j60131k6867k36623
5334F30754L5813K6709R4880J00582j59842q3429L7680J22332O0757k11997P804
5323F62043o2378k33962M7491Q4947j20546j34507J36671n6947J3939j7400N6467
5312C75818N0033k7740J16470k47629k8153k7184o6133K22464o3129k928j34046
5301A67843N6882L4240L7810M468j41808r8715J21910Q3385m18116J41363L62353
5290C51615m8019J11167j80045j10044j32351J22424J33865p7769n8475K08246
$$ plain form
5366 589275 671796 694625 777398 819360 621097 601401 670261 777811 838214 628324 781261
5355 781261 804546 701718 517839 255695 503476 551063 624630 705686 659483 535935 452877
5344 452877 481061 316168 372680 829057 809738 922005 1054375 894244 867377 630754
5334 630754 666567 693276 788156 888738 728896 645467 683147 805479 866236 654239 662043
5323 662043 599665 365703 413194 498141 377595 243088 379759 322812 336751 319351 375818
5312 375818 425851 398111 514581 266952 238799 211615 145482 367946 304817 301889 167843
5301 167843 224725 258965 296775 301243 159435 60720 182630 266015 -152101 -10738 351615
5290 351615 303596 414763 234718 124674 -7677 114747 248612 170843 112368 320614
5280C20614J89364j88088Q8845O7496m9972o8484Q0324k3222K21632K09209l07541
5269E40177l80296j56586J77152J89675N1217l16140j21781L35751J04576j5466
5259D08279m898K7589j37502j42656L23240J33068k16874P0985P242J99224j1147
5248F56550q1733l840J44509j90014J1541P2938o934j22711j97015J25965J49782
5237E59038K23791j32692j50585k189r4930R3733L3538J43221M1927j16829q0999
5226E17024r7957J34193M4361l87257j549J14990r1392K004N4757J20654J81769
5215E91597J40387l8164j74069J4308K35182p2537K1244o6396L8835L4202J08445
5204H33034o2463l31793K39752K08282k70003l5808N6690l0474k40909J08882
$$ plain form
5280 320614 509978 321890 410735 478231 428259 359775 440099 416877 638509 847718 540177
5269 540177 159881 3295 180447 370122 421339 105199 -16582 319169 423745 408279
5259 408279 403381 430970 293468 150812 474052 607120 390246 461231 468473 667697 656550
5248 656550 574817 570977 715486 525472 537013 609951 603017 480306 283291 409256 559038
5237 559038 782829 650137 499552 497363 402433 496166 529704 672925 714852 598023 517024
5226 517024 419067 553260 597621 210364 208815 323805 232413 234417 289174 409828 591597
5215 591597 731984 693820 519751 534059 769241 696704 717948 651552 690387 724589 833034
5204 833034 770571 438778 678530 886812 616809 581001 637691 607217 366308 475190
5194D75190K36824L0777Q3018k08563q6958R0907j11635P0051K87449k4961J77047
5183A019146J86161j03852K62203J7357M2430k30800l31363K99267J7427j47482
5173A030494m7387l6447L45716j18486n5732J17273Q1644R4756k8310j52559l0944
5162A200018l5515l4602l0684J51511K01750J33354J33318k11265J27599Q5990
5152A721474P1685k07915l73052K70991J20559L87117J24358m0013J9799J93349
5142B288352L88197K06730j15362k22325k9537n6107k2547j89937M2255Q7349
5132B377068K76395p9286R3402L00623K84787J71064K3421P7640L77181J37433
5122D039728M0531L47327L68307L86714L95226N63784N38295N34569P00148N20962
$$ plain form
5194 475190 712014 742791 825809 617246 530288 621195 509560 579611 867060 842099 1019146
5183 1019146 1205307 1101455 1363658 1381015 1423445 1192645 861282 1160549 1177976 1030494
5173 1030494 983107 946660 1292376 1173890 1118158 1235431 1317075 1411831 1383521 1230962 1200018
5162 1200018 1164503 1129901 1099217 1250728 1452478 1585832 1719150 1507885 1635484 1721474
5152 1721474 1793159 1585244 1212192 1483183 1603742 1990859 2115217 2075204 2095003 2288352
5142 2288352 2676549 2883279 2767917 2545592 2516055 2459948 2437401 2247464 2289719 2377068
5132 2377068 2653463 2574177 2667579 2968202 3252989 3424053 3447474 3525114 3902295 4039728
5122 4039728 4080259 4427586 4795893 5182607 5577833 6141617 6679912 7214481 7914629 8435591
5112H435591M20836J09777j78659r2261j80855m31042l04405k85711l58273j03433
5102G031565K4403r0614O6115m00686j42821R3584L94274K31561J29309L25410
5092G662100N14771O22202P70961Q20627N22568R76504J270864P58703L48059
5083A4267359K19682q1703j16694p42241p89599p36142p35897o86360o70838n06938
5073I420629o55595m66749m48645j57016P0517K2251l61780N9650M91604m9139
5063G925727J58415K98218L70329L12222L54627L02145O10644L58369j82005l64632
5053A0144059m58203l08728l76829o38320n42522n44011l93958n01704l69490
5044F010294j72790j92516o0738J65060j29588l81244m2140j39747k74003m172
$$ plain form
5112 8435591 8856427 8966204 8787545 8695284 8514429 8083387 7778982 7493271 7134998 7031565
5102 7031565 7055968 6965354 7031469 6630783 6487962 6581546 6975820 7207381 7336690 7662100
5092 7662100 8176871 8799073 9570034 10390661 10913229 11889733 13160597 13919300 14267359
5083 14267359 14487041 14405338 14288644 13546403 12756804 12020662 11284765 10598405 9927567 9420629
5073 9420629 8765034 8298285 7849640 7692624 7763141 7785392 7423612 7483262 7974866 7925727
5063 7925727 8084142 8382360 8752689 9064911 9419538 9721683 10332327 10690696 10508691 10144059
5053 10144059 9685856 9377128 9000299 8361979 7819457 7275446 6881488 6379784 6010294
5044 6010294 5837504 5644988 5584250 5749310 5619722 5238478 5196338 5056591 4782588 4778416
5034D778416j27759k267p4380o1366j94416r7381P9435j75376k48032J97582n4742
5023D019714K05911j47614k2878m6468k28526K84103k05203j71384M7264R598
5013C744517p1445k7688j8124J50031p1252J25645J25517q3016q4321j56505O6134
5002C699493J57357k69991K3894R5488o8913j93319N6052J00782K4116J57601
4992C782560K7064J70357m2729r6965n6996P7619j31006L10537J05464m51813
4982C694092J41914Q0772R7429M7101J13196k1138L0554J18617N0734J27808J71922
4971D653001k31442j38683K04674J63991M3832j16216l5022K21162J10195J65937
4961E041429l82617J16299L44629J03026p4374L6340J66158Q0679J77929K50407
$$ plain form
5034 4778416 4650657 4648390 4574010 4512644 4318228 4220847 4300282 4124906 3876874 4074456 4019714
5023 4019714 4225625 4078011 4055133 4008665 3780139 4064242 3859039 3687655 3734919 3744517
5013 3744517 3673072 3645384 3627260 3777291 3706039 3831684 3957201 3874185 3789864 3633359 3699493
5002 3699493 3856850 3586859 3610753 3706241 3637328 3444009 3500061 3600843 3624959 3782560
4992 3782560 3809624 3979981 3937252 3840287 3783291 3860910 3729904 4040441 4145905 3694092
4982 3694092 3836006 3916778 4014207 4061308 4174504 4153366 4183920 4302537 4353271 4481079 4653001
4971 4653001 4421559 4282876 4487550 4651541 4695373 4579157 4544135 4765297 4875492 5041429
4961 5041429 4658812 4775111 5119740 5222766 5148392 5184732 5350890 5431569 5609498 5859905
4951E859905Q2017j55873J98887j15933Q1153J38620j66566O3241L89174j46426
4941F228199K5376J28121P3779N6808J11970J45376J9364O4120l6673J75512J95097
4930G187049J31965P9657Q8105J63070L1514L22004J52150k97603J78393K16139
4920H252443L6567j55170J54744K75858r835K28708L68471Q5425l708L39741K42878
4909I816122K6470J72175L89409L37722O2945J57835L10543M11591L77365L36564
4899A2398741L79758J48455J55396N16436O54885J79513K94716M12624N25563
4890A5666087M36526O28781Q84466P45371P26775O31365N08587Q14410J304023
4881B2346391P33417R01409R97087Q22557O77196R64128J418189P24693Q17567
$$ plain form
4951 5859905 5941922 5786049 5984936 5869003 5950156 6088776 5922210 5985451 6374625 6228199
4941 6228199 6253575 6381696 6455475 6512283 6624253 6769629 6788993 6853113 6816440 6991952 7187049
4930 7187049 7319014 7398671 7486776 7649846 7681360 8003364 8155514 7857911 8036304 8252443
4920 8252443 8289010 8133840 8288584 8564442 8554607 8783315 9151786 9237211 9233503 9573244 9816122
4909 9816122 9842592 10014767 10404176 10741898 10804843 10962678 11273221 11684812 12062177 12398741
4899 12398741 12778499 12926954 13082350 13598786 14253671 14433184 14727900 15140524 15666087
4890 15666087 16102613 16731394 17615860 18361231 19088006 19719371 20227958 21042368 22346391
4881 22346391 23079808 23981217 24978304 25800861 26478057 27442185 28860374 29585067 30402634
4872C0402634J100567P80162N13571Q83749J122736O20854P86375N77599O88017
4863C7476264Q63229R01669R79394O77191O13645R16012J334123J296101J476183
4854D6533811J257213J515426J381630J439291J481250J227870J162028J517529
4846E7516048J137693J141409P06593M52028M80381J14895L46742O5368m85493
4837F1475664o21250l39151k03524m02950o15962m56376m98450k29031n39045
4828E7569925m37743q4185j70522o1831Q951l21227k76412m75215m8469K42122
4818E5945394j95765m42590k29428r9383l85234m91073r0445o6460O9728q7699
4808E3927045n8713M73654R7839J57831O43079N35122N13654M37297O44889O66514
$$ plain form
4872 30402634 31503201 32283363 32796934 33680683 34803419 35424273 36210648 36788247 37476264
4863 37476264 38339493 39241162 40220556 40897747 41511392 42427404 43761527 45057628 46533811
4854 46533811 47791024 49306450 50688080 52127371 53608621 54836491 55998519 57516048
4846 57516048 58653741 59795150 60501743 60953771 61434152 61549047 61895789 61961157 61475664
4837 61475664 60854414 60515263 60311739 59908789 59292827 58836451 58338001 58108970 57569925
4828 57569925 57132182 57047997 56877475 56815644 56824595 56503368 56226956 55751741 55703272 55945394
4818 55945394 55749629 55307039 55077611 54978228 54592994 54101921 54011476 53945016 54014744 53927045
4808 53927045 53868332 54341986 54439825 54597656 55240735 55775857 56289511 56726808 57371697 58038211
4798E8038211M18584M52472O27120R25983N53905J125317J100991R60861J173075
4789F5376519J451595J863021J815663J435241J530462J748002J487810J623939
4781G8332252J975358J869893J616305J534913J421119J336673J244114J118684
4773I0449311P76514O10632M58235Q6908J90727K74602L10570O35973P48638P82248
4763I5324358M44468O96000N00570N72173O62181M47075k81301m60528l98640
4754I7506356n89623p51137j539714j790216j670050j693163j985449k145091
4746H5341913j983826j923022k331822k229560k353766k296571k155748j887937
4738F8179661j850896j233770q29598j300338j307580r16484r84777j011598j141173
$$ plain form
4798 58038211 58456795 58909267 59536387 60462370 61016275 62141592 63242583 64203444 65376519
4789 65376519 66828114 68691135 70506798 71942039 73472501 75220503 76708313 78332252
4781 78332252 80307610 82177503 83793808 85328721 86749840 88086513 89330627 90449311
4773 90449311 91225825 91836457 92294692 92381600 92572327 92846929 93157499 93793472 94542110 95324358
4763 95324358 95768826 96464826 96965396 97537569 98199750 98646825 98365524 97904996 97506356
4754 97506356 96916733 96165596 94625882 92835666 91165616 89472453 87487004 85341913
4746 85341913 83358087 81435065 79103243 76873683 74519917 72223346 70067598 68179661
4738 68179661 66328765 65094995 64265397 62965059 61657479 60740995 59756218 58744620 57603447
4729E7603447q66635j054417j345800j146327j159733j294966j310249j162867
4721D8262453j326114j123031j307436j143287j411224q13542j042565q14615
4713C9280639q22480q06413o7837l53640j38919o7659L00032P72405P26693J339360
4703D0162181J723674J322491M93041J1448N9413q2454j91588l76367p946N0240
4693D3164133J74330P3783L70816L09463M02434M01937L87810N66521M14494N03416
4683D6769137P58307Q94830Q11353P46203N91032O19642N89032O68664O71941
4674E3120141N00030M01142K17339N80570L1033k02571l15268m86533p34203p59651
4664E2352029n59835j059010j123776j111430q30263r98759q70062o32372p79152
$$ plain form
4729 57603447 56736812 55682395 54336595 53190268 52030535 50735569 49425320 48262453
4721 48262453 46936339 45813308 44505872 43362585 41951361 41137819 40095254 39280639
4713 39280639 38458159 37651746 37583909 37230269 37091350 37023691 37323723 38096128 38822821 40162181
4703 40162181 41885855 43208346 43701387 43712835 43772248 43689794 43498206 43121839 43113893 43164133
4693 43164133 43338463 43412246 43783062 44092525 44494959 44896896 45284706 45851227 46265721 46769137
4683 46769137 47527444 48422274 49233627 49979830 50570862 51190504 51779536 52448200 53120141
4674 53120141 53620171 54021313 54238652 54819222 54850255 54647684 54332416 53845883 53111680 52352029
4664 52352029 51792194 50733184 49609408 48497978 47667715 46668956 45798894 45166522 44387370
4655D4387370m81258l91749n12585m33636n70832p39813q20082o57861p50515
4646C9029039j049472o85006q16255p77764p79260r34475r21690p84433r60792
4637C1319892q62837o65623r85036r19832o40247k94611m18581p7419k08521K17782
4627B6464967M26268L97133L03306J12747L781J54100k71059k62959l28330n16468
4617B6483486r6307k08549n60312n60376m99398m05022l30129p55654n43246J96288
4607B2720781k29614l08393r4273j00986j0667J24870K96746L4146R5113N04106
4597B3031829O51784M63948O65462P13620O48847M77597N7666l90522l66048l33490
4587B5620693k44073k25325m41365n96059o56775n65989n07482m71580l53379
$$ plain form
4655 44387370 43906112 43514363 43001778 42568142 41997310 41257497 40437415 39779554 39029039
4646 39029039 37979567 37294561 36478306 35700542 34921282 33986807 33065117 32280684 31319892
4637 31319892 30457055 29791432 28806396 27886564 27246317 26951706 26533125 26455706 26247185 26464967
4627 26464967 26891235 27288368 27591674 27704421 27708202 27862302 27591243 27328284 26999954 26483486
4617 26483486 26387179 26178630 25618318 25057942 24558544 24153522 23823393 23067739 22524493 22720781
4607 22720781 22491167 22182774 22088501 21987515 21976848 22101718 22398464 22432610 22527723 23031829
4597 23031829 23683613 24147561 24813023 25526643 26175490 26653087 26710753 26320231 25954183 25620693
4587 25620693 25376620 25151295 24709930 24113871 23457096 22891107 22383625 21912045 21558666
4578B1558666m62378n72274p19870q04556o89211p23165l99412l70144q29225
4569A5988431m29395k47687n23881p8808k54786o0953r0382j08432o9765j6947
4559A4107395j307j82958l24110l02863M513l45551k47130l00054J08844l80619
4549A2136160l30697j08679m56323k11298l90905m28586j68529l03658j72942
4540I564543l26661P1983J0824j95732k48415j39392N549j46008p6618K15259
4530H735332l01299j6528n6769j18465p0083p9306K80322l9957Q2005p5712O519
4519H346059j03482l7238j07775L09289K62368J68944J28270N3774P3561j06998
4509H986772L38231M47927L15055M43937M33014K33251N01315N41826K01583K48950
$$ plain form
4578 21558666 21096288 20524014 19804144 18999588 18310377 17587212 17187800 16817656 15988431
4569 15988431 15559036 15311349 14787468 14708660 14453874 14392921 14302539 14194107 14124342 14107395
4559 14107395 14106088 13923130 13599020 13296157 13300670 12955119 12707989 12407935 12516779 12136160
4549 12136160 11805463 11696784 11240461 11029163 10638258 10209672 10041143 9737485 9564543
4540 9564543 9237882 9309865 9320689 9124957 8876542 8737150 8742699 8596691 8520073 8735332
4530 8735332 8434033 8417505 8360736 8242271 8172188 8092882 8373204 8333247 8415252 8339540 8346059
4519 8346059 8242577 8205339 8097564 8406853 8669221 8838165 8966435 9020209 9093770 8986772
4509 8986772 9325003 9772930 10087985 10531922 10964936 11198187 11699502 12241328 12442911 12691861
4499A2691861L47418K44067L28352O06774O34649J025344J036212O50648J15258
4490A7680583Q4807l76134l48501J65614L4054k15672p9894J02317L28140N13977
4480A7889291K69808N3329l86265k73032q5945K012j76154O6852L75710O96979
4470A8432585J030044P40071L7645m86419m96781p61083o07354n11455n99089
4461A6778164l47161m26114k13045m98367p05317l31778l57636l39500l68633
4452A3190613n61484m51599o43559l80450l31304k23993j24172l15391J44912
4443A0303573n9703k49801l69943r6629M27832j54886o3022j16909Q1467J6231
4433I718210l65999P0934J371M7041j81794o9089l7074J82310K1415q7066J62409
$$ plain form
4499 12691861 13039279 13283346 13611698 14218472 14853121 15878465 16914677 17565325 17680583
4490 17680583 17765390 17389256 17040755 17206369 17240423 17024751 16944857 17047174 17375314 17889291
4480 17889291 18159099 18212428 17826163 17553131 17467186 17469198 17293044 17359896 17735606 18432585
4470 18432585 19462629 20202700 20240345 19753926 19257145 18496062 17888708 17377253 16778164
4461 16778164 16431003 16004889 15791844 15293477 14588160 14256382 13898746 13559246 13190613
4452 13190613 12629129 12177530 11533971 11153521 10822217 10598224 10474052 10158661 10303573
4443 10303573 10243870 9994069 9624126 9527497 9955329 9800443 9737421 9620512 9701979 9718210
4433 9718210 9352211 9423145 9424516 9471557 9289763 9220674 9183600 9365910 9387325 9300259 9462668
4422I462668K68128j13029j39351K28322J73181j49829j92059J25242K33477n5151
4412I841599K40939J11367J2015J63856j6598p5924L11423L26607J89473j73168
4402A0931589J47763J72498O7152K10652K10237K45736J51216J68094j29541j77780
4392A1997616L17163R6873K54383L08300M21583L76807M97524L45421J46769M58269
4382A5220708M40626M88302J85518M60416M89358K41679L55947J29657K95905
4373A8308116N69725L26441L92860L29598L30971K82028L96383J29042K16194
4364B1281358Q2677L64131J61213L41683O82558P33916R32660R23542Q90932N14627
4354B6909297M97946P94143Q37997M77161K86124O22189O12704P15721P28810
$$ plain form
4422 9462668 9730796 9617767 9478416 9706738 9879919 9730090 9538031 9663273 9896750 9841599
4412 9841599 10082538 10193905 10205920 10369776 10353178 10277254 10588677 10915284 11104757 10931589
4402 10931589 11079352 11251850 11319002 11529654 11739891 11985627 12136843 12304937 12175396 11997616
4392 11997616 12314779 12411652 12666035 12974335 13395918 13772725 14270249 14615670 14762439 15220708
4382 15220708 15661334 16149636 16335154 16795570 17284928 17526607 17882554 18012211 18308116
4373 18308116 18877841 19204282 19597142 19926740 20257711 20539739 20936122 21065164 21281358
4364 21281358 21364035 21728166 21889379 22231062 22913620 23647536 24580196 25503738 26394670 26909297
4354 26909297 27407243 28201386 29039383 29516544 29802668 30424857 31037561 31753282 32482092
4345C2482092R17673P81149J222763J105258P51558R20415R41468M50739Q09403
4336D0382518P66967O87974R57266Q77706J345025J313833J029094J068294P67045
4327D9195722J008315N27130M24583M34626L17019M79332R39739P94988N84194
4318E4705648M51217J30703k39464n03933k47991n55546l32214j80890l26638
4309E2900892l29959k78742m28533n65699o23148o49637p59032l75437o73991
4300D8216714q61265n95263o46577n09294l47622k91032l051J59091J95285j37493
4290D5179493J27843O21746O96659N81829Q16005P06896M88476O96227O61339
4281E0576513N77129Q29281Q41611J191789J911680K073459K714614L261913K964599
$$ plain form
4345 32482092 33399765 34180914 35403677 36508935 37260493 38180908 39122376 39573115 40382518
4336 40382518 41149485 41837459 42794725 43672431 45017456 46331289 47360383 48428677 49195722
4327 49195722 50204037 50731167 51155750 51590376 51907395 52386727 53326466 54121454 54705648
4318 54705648 55156865 55287568 55048104 54544171 54296180 53740634 53408420 53227530 52900892
4309 52900892 52570933 52292191 51863658 51297959 50674811 50025174 49266142 48890705 48216714
4300 48216714 47355449 46760186 46113609 45604315 45256693 44965661 44962610 45121701 45316986 45179493
4290 45179493 45307336 45929082 46625741 47207570 48023575 48730471 49218947 49915174 50576513
4281 50576513 51153642 51982923 52824534 54016323 55928003 58001462 60716076 63977989 66942588
4272F6942588K789584K474610K808187K708194K613678K386337K118079J754939
4264H6596196J794798J608497J428533J548530J316302J008769J031793N20642
4256I6854060P85315Q86832L18643k99526o17130j222824j695619k024475k517651
4247I0467625k786970k825196k624353k331374k380731k573665k214605k164982
4239G0565749j666872j977862j854785j745874k134873k310457k194028j923056
4231E4757942j909794j934323j828489j913361j951230j547654j567113j373560
4223D0732418j405488j569399j379680j083292j013720r79133j019665o09043
4215C1672998m69770r40904n97703m73659l56165l68531n59679k97346l39832
$$ plain form
4272 66942588 69732172 72206782 75014969 77723163 80336841 82723178 84841257 86596196
4264 86596196 88390994 89999491 91428024 92976554 94292856 95301625 96333418 96854060
4256 96854060 97639375 98526207 98844850 98545324 97928194 96705370 95009751 92985276 90467625
4247 90467625 87680655 84855459 82231106 79899732 77519001 74945336 72730731 70565749
4239 70565749 68898877 66921015 65066230 63320356 61185483 58875026 56680998 54757942
4231 54757942 52848148 50913825 49085336 47171975 45220745 43673091 42105978 40732418
4223 40732418 39326930 37757531 36377851 35294559 34280839 33301706 32282041 31672998
4215 31672998 31203228 30262324 29664621 29190962 28834797 28466266 27906587 27609241 27269409
4206B7269409k61210k4904r8030j29477k06115J6820j53493l11512n09129j56547
4196B5435812N3342P6877k02254m12422l01525l41575k26145k3147l45805J10243
4186B3823401l75460K0611J15771l6645j32858k89116K00435j23559O4953K04327
4176B3471860j26098p2797J82597k11193J5486k3618j04406K8936K35972r7607
4166B3299132l5503j44599L3309J62676L45184L66471P5738J85100M6085J11383
4156B4444976M16682M78520M36246J10994K85735K12892K77168K73959L20941
4147B7258113L80219J07785R6528p4486K83771j72899J21621K16213k4582j24936
4137B8067347j3714J36051m2661K79786J71700K88570M89024Q1965P7085K43228
$$ plain form
4206 27269409 27008199 26983295 26885265 26755788 26549673 26566493 26413000 26101488 25592359 25435812
4196 25435812 25489154 25566031 25363777 24951355 24649830 24308255 24082110 24058963 23713158 23823401
4186 23823401 23447941 23468552 23584323 23547678 23414820 23125704 23326139 23202580 23267533 23471860
4176 23471860 23345762 23272965 23455562 23244369 23259855 23236237 23131831 23160767 23396739 23299132
4166 23299132 23263629 23119030 23152339 23315015 23660199 24026670 24102408 24287508 24333593 24444976
4156 24444976 24861658 25340178 25776424 25887418 26173153 26386045 26663213 26937172 27258113
4147 27258113 27638332 27746117 27842645 27768159 28051930 27879031 28000652 28216865 28192283 28067347
4137 28067347 28053633 28189684 28147023 28426809 28598509 28887079 29376103 29458068 29535153 29778381
4127B9778381M73420L41878K04244L31406M40154L86516N96198O71082N36939
4118C3760218N46999P71294Q73638J174387J408597J205463J340640J734033J714772
4109D4530041J976792K196513K358125L324787L575934L571172M254554M826412
4101G0614330N225937N829961O144963O604395P144685P023158P013212O787336
4093A22387977N973899N576717M288216L199291K035491L92501r36853k063023
4085A40854216l504273m500928m662163n450484n737806n417805m967471m454914
4077A02158372l577383k683872j762624n76372L23959J550686K255450L021629
4069A00709845L469368L784647M173606L620829L288456K550300K017167J344666
$$ plain form
4127 29778381 30251801 30593679 30797923 31129329 31569483 31955999 32552197 33223279 33760218
4118 33760218 34307217 35078511 35952149 37126536 38535133 39740596 41081236 42815269 44530041
4109 44530041 46506833 48703346 51061471 54386258 57962192 61533364 65787918 70614330
4101 70614330 75840267 81670228 87815191 94419586 101564271 108587429 115600641 122387977
4093 122387977 128361876 133938593 138226809 141426100 143461591 143854092 142917239 140854216
4085 140854216 137349943 132849015 128186852 122736368 116998562 111580757 106613286 102158372
4077 102158372 98580989 95897117 94134493 93558121 93882080 95432766 97688216 100709845
4069 100709845 104179213 107963860 112137466 115758295 119046751 121597051 123614218 124958884
4061A24958884J62455n41924j427250k691112l606535m007118m610298m898515
4053A03338587m992361m691552m688067m487509m375338m173523l609087k867594
4045F9453556k585607k350682k108276j700287j579359j499762j101183j012443
4037E5515957r96499r02173l22239j96659l15133n42067m13605l86053j70365
4028E1271164j06243m58285k70409n4726n5169k99525k55650M05698K80052M6060
4018E0502967N3656M90396M92556M48904P35531L25963L54558J092211P63502
4009E5260244R54868Q12960Q76963J208396J237680Q85011J317681J050766J375562
4000F4980131J599030J501943J656981J398023J664695K054113K307925J729862
$$ plain form
4061 124958884 125121339 124579415 123152165 120461053 116854518 112847400 108237102 103338587
4053 103338587 98346226 93654674 88966607 84479098 80103760 75930237 72321150 69453556
4045 69453556 66867949 64517267 62408991 60708704 59129345 57629583 56528400 55515957
4037 55515957 54519458 53617285 53295046 53098387 52783254 52241187 51827582 51441529 51271164
4028 51271164 51164921 50706636 50436227 50381501 50326332 50026807 49771157 50176855 50456907 50502967
4018 50502967 50556623 51047019 51539575 51988479 52724010 53049973 53404531 54496742 55260244
4009 55260244 56215112 57028072 57905035 59113431 60351111 61236122 62553803 63604569 64980131
4000 64980131 66579161 68081104 69738085 71136108 72800803 74854916 77162841 78892703
3992G8892703K112546J840007J755683J400370J484683J093474J195703J158422
3984I0933591J037641J383107J463683J650626K013569K450454K760255K681958
3976A06374884K739649K536200K168176J747808J848429J543465J359210J995444
3968A22313265J957322K361559K434425K635724K652324K373544K502429J852683
3960A41083275J753760R56785N30396k1869j88472j68665n91415m53889J38186
3951A43038092P15398N04494P81784P78951M10920K66805m4854m83439n95483
3942A45372668o16316n44973o21415n01997k35312P1702k16390J84056L83504
3933A43275527M16517N46268P71951R32480J294777J220637J063822L43772k6791
$$ plain form
3992 78892703 81005249 82845256 84600939 86001309 87485992 88579466 89775169 90933591
3984 90933591 91971232 93354339 94818022 96468648 98482217 100932671 103692926 106374884
3976 106374884 109114533 111650733 113818909 115566717 117415146 118958611 120317821 122313265
3968 122313265 124270587 126632146 129066571 131702295 134354619 136728163 139230592 141083275
3960 141083275 142837035 143793820 144324216 144302347 144113875 143945210 143353795 142899906 143038092
3951 143038092 143753490 144257984 145039768 145818719 146229639 146496444 146451590 145968151 145372668
3942 145372668 144756352 144211379 143589964 143087967 142852655 142924357 142707967 142892023 143275527
3933 143275527 143692044 144238312 145010263 145942743 147237520 148458157 149521979 149865751 149838960
3924A49838960K87151k5649k23529k82637l67215m02343l94549r5751n09910p61351
3914A47063177r82718j294882j620456j771534k076715k529899k673894k795125
3906A31317954k997517l122989k689878k558333k377499k342929j999837k159579
3898A11069393k481763k675902l007368l115173l352759l215225l162072l185885
3890H6873246k716391k863072k605162k608494k157255k040096k105901k019417
3882F7757458k155401k289210k179353j805578j767646j726143j473303j740888
3874E2619936j477383j376271j693559j363841j205668j099951j351679p30410
3866D2321174p65599l56793m30332o20805m86942k21805m8909l00670K46079n53
$$ plain form
3924 149838960 150126111 150100462 149876933 149594296 149227081 148824738 148430189 148334438 147824528 147063177
3914 147063177 146080459 144785577 143165121 141393587 139316872 136786973 134113079 131317954
3906 131317954 128320437 125197448 122507570 119949237 117571738 115228809 113228972 111069393
3898 111069393 108587630 105911728 102904360 99789187 96436428 93221203 90059131 86873246
3890 86873246 84156855 81293783 78688621 76080127 73922872 71882776 69776875 67757458
3882 67757458 65602057 63312847 61133494 59327916 57560270 55834127 54360824 52619936
3874 52619936 51142553 49766282 48072723 46708882 45503214 44403263 43051584 42321174
3866 42321174 41555575 41198782 40768450 40147645 39660703 39438898 39389989 39089319 39335398 39334845
3856C9334845j35140J06483n3769j26691k44377p5974k40166k36178l97549l27708
3846C7603776m21727l14845k5652j41251o7748J29249J93977N64452O84934Q3177
3836C8288342P3375P4427R7453K26031j08264l78600k58828q57471j021459r06168
3826C5228838j067095j308216j049581r11653j035803j089450j177083j071682
3818B6518275q69844o05039o80725p31666o34214o54280m19715N3745m0906p1078
3808B1864553O9956q2303M00474K42725O29456Q57523N93565N91042O21879O92421
3798B6481291Q58857P57819L63371O59660L70613K07059K42385J86248n2717l13021
3788B9761565L6828l28308n92327n86195o35133m04673o36096m16625k24484n12329
$$ plain form
3856 39334845 39199705 39306188 39252419 39125728 38881351 38805377 38565211 38329033 37931484 37603776
3846 37603776 37182049 36867204 36841552 36700301 36632553 36761802 36955779 37520231 38205165 38288342
3836 38288342 38361717 38436144 38533597 38759628 38651364 38272764 38013936 37156465 36135006 35228838
3826 35228838 34161743 32853527 31803946 30892293 29856490 28767040 27589957 26518275
3818 26518275 25648431 25043392 24362667 23631001 22996787 22342507 21922792 21976537 21935631 21864553
3808 21864553 21934509 21852206 22252680 22495405 23124861 23982384 24575949 25166991 25788870 26481291
3798 26481291 27340148 28097967 28461338 29120998 29491611 29698670 29941055 30127303 30074586 29761565
3788 29761565 29798393 29470085 28877758 28291563 27656430 27251757 26615661 26199036 25974552 25462223
3778B5462223p99436o38975o95452q05515m45631l97569m56635m71114k85293
3769B0466603k81642r7317p0178k64061l94934j99062q015k55285R7408L3454
3759A9026971r8250J54982P2367K71979J98641L53396Q45784J69753K51251N28481
3749B1775355M42360L05847R3756J39428M5369k077J39565n1054j49160J15708
3739B2855097J27527J71548L17208J72780L05510m8774l36040K05424k04033j94856
3729B3371391n12497m29306K6575k19723n74105m28004j77695q7468m37652k19708
3719B0311808L5827J19936J49235j0245r588P5085P6896J00633L23963J71276
3709B1344826M11872M40895L92862N53418M90432Q72278R20243J244455J417867
$$ plain form
3778 25462223 24662787 24023812 23328360 22522845 22077214 21679645 21223010 20751896 20466603
3769 20466603 20184961 20087644 20017466 19753405 19358471 19159409 19151394 18896109 18993517 19026971
3759 19026971 18928721 19083703 19156070 19428049 19626690 19980086 20825870 20995623 21246874 21775355
3749 21775355 22217715 22523562 22617318 22756746 22802115 22800038 22939603 22888549 22739389 22855097
3739 22855097 22982624 23154172 23471380 23644160 23949670 23900896 23564856 23770280 23566247 23371391
3729 23371391 22858894 22429588 22456163 22236440 21662335 21234331 21056636 20969168 20531516 20311808
3719 20311808 20347635 20467571 20616806 20606561 20596973 20672058 20748954 20849587 21173550 21344826
3709 21344826 21756698 22197593 22590455 23143873 23634305 24506583 25426826 26671281 28089148
3700B8089148J124040J300655J516745J901924J456213J343883J469101J498697
3692C9700406J192288R67507Q53446Q68859J094689R98303J159654P91172O95232
3683D8321556Q81393O74728Q31896Q54950L67706K58693M3631j5939l39758m72211
3673E1406645m19131k41319l33104l49311n39401l58028k53537k46417K7640J21441
3663D8815478N9539m38831j8938l323k11651l72476j6039l41884m07473l46395
3653D6718007k07431k68228l7098M02849K45930L20537Q93123P42656R59781R66802
3643E0736928R55642J219161J092986J085476J084263J045942Q60514P03848R80885
3634E9765645R01160J236865J114066J297179J455223J253539R57518P31564R19665
$$ plain form
3700 28089148 29213188 30513843 32030588 33932512 35388725 36732608 38201709 39700406
3692 39700406 40892694 41860201 42713647 43582506 44677195 45675498 46835152 47626324 48321556
3683 48321556 49202949 49877677 50709573 51564523 51932229 52190922 52234553 52218614 51878856 51406645
3673 51406645 50987514 50746195 50413091 50063780 49524379 49166351 48912814 48666397 48694037 48815478
3663 48815478 48875017 48436186 48417248 48413925 48202274 47829798 47813759 47471875 47064402 46718007
3653 46718007 46510576 46242348 46205250 46608099 46854029 47174566 48067689 48810345 49770126 50736928
3643 50736928 51692570 52911731 54004717 55090193 56174456 57220398 58080912 58784760 59765645
3634 59765645 60666805 61903670 63017736 64314915 65770138 67023677 67981195 68712759 69632424
3625F9632424M85107O88265O75267K35491J05919k0057L50019K91243j60466j41350
3615G2141862m4774o04098q46484j247769j642480j504076j520312j207090j503054
3606F2021725j658562j642408j467777j332665j168329j171187j064101j023381
3598E1493315p14683n75625p66910p22143p78897o64208o14321n53605p7518l09087
3588D5716318k2100j36228L40559M96851L27875Q07482Q72817K45187M38998P55887
3578D9843646L28171L48114R26347Q12857J181894J355947J105902J368723J558566
3569E8830167J529043J361284J523185J308403J426783J339373J214089J357926
3561F9890253J625411J672855J679202J840269J859951J246388R38748O20696
$$ plain form
3625 69632424 70117531 70805796 71481063 71716554 71822473 71802416 72152435 72443678 72283212 72141862
3615 72141862 72097088 71492990 70646506 69398737 67756257 66252181 64731869 63524779 62021725
3606 62021725 60363163 58720755 57252978 55920313 54751984 53580797 52516696 51493315
3598 51493315 50778632 50203007 49436097 48713954 47935057 47270849 46656528 46102923 46025405 45716318
3588 45716318 45694218 45557990 45898549 46395400 46723275 47530757 48403574 48648761 49087759 49843646
3578 49843646 50171817 50519931 51446278 52259135 53441029 54796976 55902878 57271601 58830167
3569 58830167 60359210 61720494 63243679 64552082 65978865 67318238 68532327 69890253
3561 69890253 71515664 73188519 74867721 76707990 78567941 79814329 80753077 81373773
3553H1373773k5535k39185m38653q74176j097779q48812j142196r72649o18406
3544G5116382o53863k82068k13336J3409J54698K51711N10278K43766O53183P76467
3534G6570627J194486J132172J088448R81035J256091J577200J526521J963310
3526H7289890K085079K381813K278731K246932J999708J536483J458503J365196
3518A02642335J346370J206969J099351J233731J047977R83888J039544M87240
3510A11087405N82271J022828L86260O02194O25178N21381O84008L11610K41376
3501A16064511j33037k21461m76954j137525j259055j448235j347852j672173
3493A08368219j357119j387499j404848j257696j356559q08882o82343q90623
$$ plain form
3553 81373773 81348238 81109053 80670400 79796224 78698445 77849633 76707437 75734788 75116382
3544 75116382 74462519 74180451 73967115 73980524 74135222 74386933 74897211 75140977 75794160 76570627
3534 76570627 77765113 78897285 79985733 80966768 82222859 83800059 85326580 87289890
3526 87289890 89374969 91756782 94035513 96282445 98282153 99818636 101277139 102642335
3518 102642335 103988705 105195674 106295025 107528756 108576733 109560621 110600165 111087405
3510 111087405 111669676 112692504 113078764 113680958 114306136 114827517 115511525 115823135 116064511
3501 116064511 115931474 115710013 115233059 114095534 112836479 111388244 110040392 108368219
3493 108368219 107011100 105623601 104218753 102961057 101604498 100795616 100113273 99222650
3485I9222650j190489j328185j068662j362129j510625j568996j337541q40933
3477H9015090p85600m34571j70040K51058O39859J018480J196529J816982K250270
3468I4798057K664241K908190L166553L350018L487281K736202J762865O52886
3460A15526293p28076j192097k661406k925891l111849l480503l511533l273356
3452I4641582l112559k978028k845364k504284k318881j942852j910890k200110
3444G4828614k055425j557740j656302j366105j206816j026409j254551j280271
3436F3424995j167589j222486j399069j220186p42457j206818r43596p88763j091372
3427E3642659j053659j017405j008051r01769r85628r84102p52112r58519q30888
$$ plain form
3485 99222650 98032161 96703976 95635314 94273185 92762560 91193564 89856023 89015090
3477 89015090 88229490 87794919 87624879 87875937 88515796 89534276 90730805 92547787 94798057
3468 94798057 97462298 100370488 103537041 106887059 110374340 113110542 114873407 115526293
3460 115526293 114798217 113606120 110944714 108018823 104906974 101426471 97914938 94641582
3452 94641582 91529023 88550995 85705631 83201347 80882466 78939614 77028724 74828614
3444 74828614 72773189 71215449 69559147 68193042 66986226 65959817 64705266 63424995
3436 63424995 62257406 61034920 59635851 58415665 57673208 56466390 55522794 54734031 53642659
3427 53642659 52589000 51571595 50563544 49661775 48676147 47692045 46939933 45981414 45150526
3418D5150526l95483n54344m77666n13528j05326m69705k58617J12818O1435J96250
3408D2746360M5874J12089M09217L64545r5751K17860O20797N77610N67962O25042
3398D6191605M91378O70357O60920M05063Q65210Q83845O33003j28260N79219
3389E1252340L15607p4434k83308k05137l3333N4790J77841M05035O31777M85326
3379E2726504N58813P98202N35503L93516M20888R64094N96239L38183K15846
3370E7547788L405n5138m99681n47457j202309j258557j242463j301859j714344
3361D9729385j500263j702318j565521j379237j111783j411690j264801j506794
3353C8286978j386638j306688j011117j107092j089350q85116o70107m38260o03663
$$ plain form
3418 45150526 44755043 44200699 43723033 43209505 43104179 42634474 42375857 42488675 42550110 42746360
3408 42746360 42792234 42904323 43313540 43678085 43582334 43800194 44420991 44998601 45566563 46191605
3398 46191605 46682983 47353340 48014260 48419323 49284533 50168378 50801381 50673121 51252340
3389 51252340 51567947 51493513 51210205 51005068 50971735 51026525 51204366 51609401 52241178 52726504
3379 52726504 53285317 54083519 54619022 55012538 55433426 56397520 56993759 57331942 57547788
3370 57547788 57551193 57496055 56996374 56448917 55246608 53988051 52745588 51443729 49729385
3361 49729385 48229122 46526804 44961283 43582046 42470263 41058573 39793772 38286978
3353 38286978 36900340 35593652 34582535 33475443 32386093 31500977 30830870 30392610 29788947
3344B9788947q1775k34590P0903J54165J35914L70068K61911N06060N05310K69113
3334C1746026N75361K82964M27986O9056J64121K83969P9392Q1240N1730J56125
3324C3917970J550q8642l04926k99488r3634m11895m54698k09792n6734k51465
3314C1748246o23008n23304r94871p42742p97801r32959j046427j037108r54961
3305B4095065j034211j050165j158802q33897r24042q89465p59687n73532o84468
3296A6186796k74222m50800m15208m38405k45392o2282L3078m99076m17256m3592
3286A3373641l03800Q4051l3711k18955l4627k15891j00645o0220l1270L26489
3276A2785062m849j68228j4439J10298K0874R7913k35011l4038p8415o0103O8844
$$ plain form
3344 29788947 29707172 29472582 29543485 29697650 29833564 30203632 30465543 30971603 31476913 31746026
3334 31746026 32321387 32604351 33032337 33101393 33265514 33549483 33628875 33710115 33761845 33917970
3324 33917970 33919520 33830878 33525952 33226464 33132830 32720935 32266237 32056445 31999711 31748246
3314 31748246 31125238 30601934 29607063 28864321 28066520 27133561 26087134 25050026 24095065
3305 24095065 23060854 22010689 20851887 20017990 19093948 18204483 17444796 16871264 16186796
3296 16186796 15912574 15461774 15046566 14608161 14362769 14300487 14333565 13834489 13417233 13373641
3286 13373641 13069841 13153892 13120181 12901226 12866599 12650708 12550063 12489843 12458573 12785062
3276 12785062 12780213 12611985 12597546 12707844 12728718 12826631 12591620 12557582 12479167 12419064 12487908
3265A2487908j50069R6109j08058k94771j16127N0285j05671J38045K16544J21029
3255A2335224k51615j44547R3309j66322J50983k1524J84812q8960j16741J07363
3245A2081982K8118J93707K62243m30037k01974J05403K41955K3198n4794J34656
3235A2384457L85761P6688J90134L63227K11711j12145R7335J21273J82114M49136
3225A4349691K44818J24242J20400J53455L19151K47479L81985M03519L89116
3216A6733856M94902J42895M81496M44623O6131j4419O50686M14200J58417M78061
3206B0050848K27040M68287Q35385R76629Q93671J099422J461080J433747J034227
3197B8480336N92937N22821o4996l02391m52499k53466k13488j84284j17689j60646
$$ plain form
3265 12487908 12337839 12433948 12325890 12031119 11914992 11965277 11859606 11997651 12214195 12335224
3255 12335224 12083609 11939062 12032371 11866049 12017032 11995508 12180320 12091360 11974619 12081982
3245 12081982 12110100 12303807 12566050 12136013 11934039 12039442 12281397 12304595 12249801 12384457
3235 12384457 12770218 12846906 13037040 13400267 13611978 13499833 13597168 13718441 13900555 14349691
3225 14349691 14594509 14718751 14839151 14992606 15311757 15559236 15941221 16344740 16733856
3216 16733856 17228758 17371653 17853149 18297772 18363903 18349484 19000170 19414370 19572787 20050848
3206 20050848 20277888 20746175 21581560 22558189 23451860 24551282 26012362 27446109 28480336
3197 28480336 29073273 29596094 29531098 29228707 28776208 28522742 28309254 28124970 28007281 27846635
3187B7846635k87888j68588j13512L84775J44405N6695M57121O04768M93037O98101
3177C0115549N17428N52784N70816N92878O98584P12309O55672R27047P69178
3168C6112245N99984J180301J019536J233022J137362J050818J498281J290981
3160D5122530J489851K238503K715803L011510L183877K972481K372451K320061
3152F5427067K909238L446252M728489O291858P231249Q037301O974443M436892
3144A09482789J979438N82992P608J29947J018201K422384M102503O322815Q413430
3135A34462107J0876362J2206057J2063034J0157321P595287O037497M323638
3128A97721303M067401N709766Q422379J1758071J5544030J8886435K0043761
$$ plain form
3187 27846635 27558747 27390159 27276647 27661422 27805827 27862522 28319643 28924411 29417448 30115549
3177 30115549 30632977 31185761 31756577 32349455 33048039 33760348 34416020 35343067 36112245
3168 36112245 36712229 37892530 38912066 40145088 41282450 42333268 43831549 45122530
3160 45122530 46612381 48850884 51566687 54578197 57762074 60734555 63107006 65427067
3152 65427067 68336305 71782557 76511046 82802904 90034153 98071454 105045897 109482789
3144 109482789 111462227 112045219 112052827 112182774 113200975 115623359 119725862 126048677 134462107
3135 134462107 145338469 157544526 169607560 179764881 187360168 193397665 197721303
3128 197721303 201788704 207498470 215920849 227678920 243222950 262109385 282153146
3121B82153146J7157167J2526932Q236519P123996P916374R616321J1759600J2656058
3113C69146113J0721081N612274L28685n046632r411798j3209618j6311666j9329220
3105C22499219k1638583k2114555k1545472j9898384j7159093j3852136j0867206
3098A95423790r012579q497208q071162p052582n133927k318961j04766J490791
3090A56723396P68337k134249n487686q149831r415461j0088202r928515r627871
3082A02659918q871663p818695o905937n885853m978588m417646l789592k922578
3074E7069366k480294k117851k268462k105396k228339j909755j902584j866699
3066D0189986j751218j548162j419346j655063j202568j318302j682755j063636
$$ plain form
3121 282153146 299310313 311837245 320073764 327197760 335114134 344730455 356490055 369146113
3113 369146113 379867194 385479468 385808153 380761521 371349723 358140105 341828439 322499219
3105 322499219 300860636 278746081 257200609 237302225 220143132 206290996 195423790
3098 195423790 186411211 177914003 169842841 162790259 157656332 155337371 155232605 156723396
3090 156723396 157491733 155357484 149869798 141719967 132304506 122216304 112287789 102659918
3082 102659918 93788255 85969560 79063623 73177770 68199182 63781536 59991944 57069366
3074 57069366 54589072 52471221 50202759 48097363 45869024 43959269 42056685 40189986
3066 40189986 38438768 36890606 35471260 33816197 32613629 31295327 29612572 28548936
3058B8548936o54510j000558j095960q39400o23457q72908j002879r17796o56765
3049B0884703n06991m43091o39217l61203n59421o42842m05071o43153k93773
3040A6389941l21801k32569l79968l51409k70186l82827k06314k91293k73653
3031A3679921m64379o93727m41872j05676m15720m23195j79915j59390j88457
3022A0607590k51481j58061l33678k63396k73153j69170N4377k36423o9877l17023
3012H589705l64581j66038r0872q7751o7063n1880k19444J2434m9091m73209j27429
3001F904781r9612k85676r2443J26347L251l78496j88264j38j85039k22734k60139
2990E321838o4633l26734j67295p8264j03429k7400J01616k98136Q382j72273
$$ plain form
3058 28548936 27894426 26893868 25797908 24958508 24335051 23462143 22459264 21541468 20884703
3049 20884703 20377712 19934621 19295404 18934201 18374780 17731938 17326867 16683714 16389941
3040 16389941 16068140 15835571 15455603 15104194 14834008 14451181 14244867 13953574 13679921
3031 13679921 13215542 12521815 12079943 11974267 11558547 11135352 10955437 10796047 10607590
3022 10607590 10356109 10198048 9864370 9600974 9327821 9158651 9213028 8976605 8906728 8589705
3012 8589705 8225124 8059086 7968214 7880463 7813400 7761520 7542076 7554510 7505419 7032210 6904781
3001 6904781 6805169 6519493 6427050 6553397 6556648 6178152 5989888 5989750 5804711 5581977 5321838
2990 5321838 5257205 4930471 4763176 4684912 4581483 4554083 4655699 4357563 4365945 4193672
2980D193672j143m749k57884n5134k0841J5235o0021l08777j80191j9659j40408
2969C160100J08341k30904l7393J93816j08181j13738J56629k27043j82603k95245
2959B423779j2893R1844k2101N1205O524j29655O3731r8207j30619j26867n4219
2948B062522r3012N9556k8323J94056r6619J215J0778j70225Q5848j4595j83266
2937A827935L0270R8831o2418p6326n1937k84477J46618p9451k69776J26366R3003
2926A498638J29949m9685m644j49833k16884J3131L74419j3822k31840j63183
2916A186246k900J85921Q5065j36218j6244p1612r9082J35926k75632j26308L39831
2905A204993n6698q1660L6791J59202j50949k31987J23663M7443l28382o2059
$$ plain form
2980 4193672 4192529 4187780 3929896 3874762 3853921 3869156 3809135 3500358 3320167 3300508 3160100
2969 3160100 3268441 3037537 3000144 3193960 3085779 2972041 3128670 2901627 2719024 2423779
2959 2423779 2410886 2502730 2480629 2531834 2538358 2408703 2472434 2374227 2243608 2116741 2062522
2948 2062522 1969510 2029066 2000743 2194799 2098180 2099395 2110173 1939948 2025796 2011201 1827935
2937 1827935 1858205 1957036 1894618 1818292 1766355 1481878 1628496 1549045 1279269 1405635 1498638
2926 1498638 1628587 1578902 1574258 1424425 1207541 1220672 1595091 1581269 1349429 1186246
2916 1186246 1183346 1369267 1454332 1318114 1301870 1230258 1131176 1267102 991470 865162 1204993
2905 1204993 1148295 1066635 1103426 1262628 1111679 879692 1003355 1050798 722416 660357
2895F60357r115J3067r2816L37380J42343l68646j46153L07381J29196j40974
2885H32020o1052J7577O860K5132K86610J6907j2413L6018L2428k72021j00714
2874H07352r445J34474N0638q4693k04769O0712K87297n0416N8413M2929j15968
2863I76524N0744K97427k22723J87013k10934K06039J00423m31284j87168L07733
2853A073794J81544J06772p8582J13634K66900p336M36367m18107k39563J55436
2843A590859J04604O2419J11575o3091J36121J55831K02716J4373K2969k9287
2833B309089N1987o7857L43713K2428k86020j5313J02354N6984k13942j76192
2823B127231j29585K00846j34973j72975J8845k6066j28333r1549L5230m8357
$$ plain form
2895 660357 651242 664309 571493 908873 1051216 682570 536417 843798 972994 832020
2885 832020 770968 788545 795405 820537 1107147 1124054 1111641 1147659 1180087 908066 807352
2874 807352 797907 932381 983019 898326 693557 754269 1041566 991150 1049563 1092492 976524
2863 976524 1027268 1324695 1101972 1288985 1078051 1284090 1384513 953229 766061 1073794
2853 1073794 1255338 1362110 1283528 1397162 1664062 1656726 2093093 1674986 1435423 1590859
2843 1590859 1695463 1757882 1869457 1806366 1942487 2098318 2301034 2315407 2338376 2309089
2833 2309089 2361076 2293219 2636932 2659360 2373340 2358027 2460381 2517365 2303423 2127231
2823 2127231 1997646 2198492 2063519 1890544 1909389 1883323 1754990 1663441 1698671 1650314
2813A650314p7602k12698K6968N3123K2121o1926j32053l6091l1575k0584O7806
2802A247803J28305j87564o7472n3296P8378k7191k66462r9212K1644n9411k87491
2791D28031j02521J74302J04231j33761j00273n0373Q6107J80083J91206j3178
2781G63854k79899m9443M8526J6134r6236O6395j15019p2496L9422J02239J99039
2770F22516k30685N5646J5679J5369K7559J04368q4870j88903k0908q2865K55527
2759D88433j09066K23181l3635j62322j26916j08179l4506J38460L2285j70132
2749A37603j20514o2430n839J32447n6899j70791J32207K66803R6094k38477j02162
2738H042m1183N1152p029n599L2410Q4801N1970m6407j26013q4767j22550K34966
$$ plain form
2813 1650314 1572712 1360014 1386982 1440105 1462226 1400300 1268247 1232156 1200581 1179997 1247803
2802 1247803 1376108 1188544 1121072 1067776 1146154 1118963 852501 753289 774933 715522 428031
2791 428031 325510 499812 604043 470282 370009 319636 405743 585826 777032 763854
2781 763854 483955 434512 483038 499172 402936 469331 354312 281816 321238 423477 622516
2770 622516 391831 447477 463156 478525 506084 610452 525582 336679 315771 232906 488433
2759 488433 379367 602548 568913 406591 279675 171496 136990 275450 307735 137603
2749 137603 17089 -45341 -51180 81267 24368 -146423 -14216 252587 348681 110204 8042
2738 8042 -33141 18011 10982 5383 37793 122594 174564 128157 2144 -82623 -205173 29793
2726B9793j68945j69957K47345O5563j3903O8680M6813j00140K2836j09130j16373
2715a97418K8992j10477o885j11424r0577L26841R8420K5207O1590J6623k02431
2704a61539m2883P8632M4560j14986q4117J05245L1056J1745k68081K0368J42254
2693b37746K53360K18071j15886k35652n5104K7304j99087p2438l5343K3880K83155
2682a45486n5879J4463Q2606j62651r2854L8599j8953L7820r2071K16377K32901
2671E4872j83412J39990j48819k6965k32397R1419K27272k58663R9440j26400
2661c63663q9749Q0198k203k43972K64097K2682J78716J97967j85614j37933j41496
2650d20970l70104K24786L27247j58920K5691m1924J78478k7306j98515J34330
$$ plain form
2726 29793 -139152 -309109 -61764 3799 -10104 58576 105389 5249 28085 -81045 -197418
2715 -197418 -168426 -278903 -285788 -397212 -487789 -160948 -62528 -37321 24269 40892 -161539
2704 -161539 -204422 -125790 -81230 -196216 -280333 -175088 -144032 -132287 -400368 -380000 -237746
2693 -237746 15614 233685 117799 -117853 -172957 -145653 -344740 -417178 -452521 -428641 -145486
2682 -145486 -201365 -186902 -104296 -266947 -359801 -321202 -340155 -302335 -394406 -178029 54872
2671 54872 -128540 11450 -137369 -164334 -396731 -305312 -78040 -336703 -237263 -363663
2661 -363663 -453412 -373214 -375417 -619389 -355292 -332610 -153894 44073 -141541 -279474 -420970
2650 -420970 -791074 -566288 -239041 -397961 -372270 -414194 -235716 -263022 -461537 -327207
2640c27207J71127M9818j09136K9375R7063J08716m1313J15947J15663k6558k00596
2629a7101k34138M7498j34274K81678j15627l18515n8577L72944m4865J17533
2619a03444l43555l1359K00646r2644j4963j04884L909l5159J1196K6057j0608
2608d94808j34485K45012L99279k09945N0438l1941j10198j34059P8737K21316
2598a20654n9425k7759j87407J21568K73058L5406k21196L32629L69397j11151
2588D04466J31284r0348k70381J3871L5415l710J16549j49881j10040j02260l51588
2577c76623J20813m8314M4143P9216m8752K1366N5517N5946m1047O8061L8845
2566c0829r1353J59748r1040N1962j68432J4868j2406J58622k19826m1803J68459
$$ plain form
2640 -327207 -156080 -106262 -215398 -186023 -88960 19756 -21557 94390 210053 183495 -17101
2629 -17101 -251239 -203741 -338015 -56337 -171964 -490479 -549056 -176112 -220977 -103444
2619 -103444 -446999 -478358 -277712 -370356 -385319 -490203 -486294 -521453 -510257 -484200 -494808
2608 -494808 -629293 -384281 14998 -194947 -144509 -176450 -286648 -420707 -341970 -120654
2598 -120654 -180079 -207838 -395245 -273677 -619 34787 -186409 146220 515617 404466
2588 404466 535750 445402 175021 188892 224307 220597 337146 187265 77225 -25035 -376623
2577 -376623 -255810 -304124 -259981 -180765 -229517 -208151 -152634 -96688 -137735 -69674 -30829
2566 -30829 -122182 37566 -53474 -1512 -169944 -155076 -167482 -8860 -228686 -270489 -102030
2555a02030j33273l7600k7404K07390J1612j89231j08872r1595o5018Q082O9300
2544d58639K34743k13975J59454J54805j0315L2649j0837j21056K5086K34208
2534B6123R2737J4406L4001K1529j34536r7131L33088j91429p4854k50433o1250
2523b87749K64207l30643J98818J1978L9429J45666p1508r705j9849k44556J35306
2512a68606P3659n4650J02299K12572o8356O6946m2725k36928J64305j60582n8340
2501a70406J56951j14925J8344M4447K35322K3332j37256j35780k48541J77633
2491a50879J15276m7026k10905K96887K89905j85094p3303J34852N924m0530l46820
2480b11713J78857J50651M2131Q051j66417L22093R0412J12076N759q6617j31911
$$ plain form
2555 -102030 -235303 -272903 -300307 -92917 -81305 -270536 -379408 -471003 -536021 -527939 -458639
2544 -458639 -223896 -437871 -278417 -123612 -133927 -101278 -112115 -233171 -208085 26123
2534 26123 118860 133266 167267 188796 54260 -42871 290217 98788 23934 -226499 -287749
2523 -287749 -23542 -354185 -155367 -143389 -103960 41706 -29802 -39507 -59356 -303912 -168606
2512 -168606 -94947 -149597 -47298 165274 96918 163864 121139 -115789 48516 -112066 -170406
2501 -170406 -13455 -128380 -110036 -65589 169733 193065 55809 -79971 -328512 -150879
2491 -150879 -35603 -82629 -293534 3353 293258 108164 34861 169713 175637 135107 -211713
2480 -211713 -32856 117795 159926 167977 1560 323653 414065 526141 531900 445283 313372
2469C13372L1527M7680j10997j1309m7059P5692l32771J31211K40046j1565J012
2458C26839O8530j83206J32895Q0860j27057j74868K47595J71099k24538q4499
2448B33650j05134J28597j8144p6044l391n2057l6923r9957r4924M25097m4816
2437B55954K07849j6652k09209O835l759K97100J19570j92350k01769J09847j11660
2426B61756r195J28710j14850J13087P5386K31660j04477k92061p4792K26553
2416D41777J93072P7696n9556J7245J36400K40753J00790n9430o019R2627o2031
2405A113324k47334P536J46798J26782L04j90458M7285P4031J80151j98203o1016
2394I99200J838Q7758p2440k06792J96532K05357J16945o1880j58911j05361O9111
$$ plain form
2469 313372 344899 392579 281582 270273 223214 298906 -33865 97346 337392 325827 326839
2458 326839 395369 212163 345058 425918 298861 123993 371588 542687 318149 233650
2448 233650 128516 257113 238969 162925 159534 107477 70554 -29403 -124327 300770 255954
2437 255954 463803 447151 237942 244777 241018 538118 657688 465338 263569 373416 261756
2426 261756 252561 381271 266421 379508 454894 686554 582077 290016 215224 441777
2416 441777 634849 712545 652989 670234 806634 1047387 1148177 1088747 1082728 1175355 1113324
2405 1113324 865990 873526 1020324 1147106 1147410 956952 1004237 1078268 1258419 1060216 999200
2394 999200 1001038 1088796 1016356 809564 1006096 1211453 1328398 1266518 1107607 1002246 1071357
2383A071357L03691K20630J03955j92722M14R3060J3367J42536R5466o707j57489
2372A687558J9716P2816L30062K07287J90552l9376K3763q487j17600K50139K31951
2361B848381N4306K1200J11938Q8105J07585k9090j9147K37432L45599P2933j22947
2350C716295L43987J57550K62488j0684L76107L81025O13722N87435M88613R42336
2340G858874J372033J193294J310677O33545Q72153P25884J166352J372928J621520
2331A8127260K749435L588599N119548Q901732J3636343J8610422K5383694K7801420
2323A23918453J2865819n083557q853339j1593600j4714511j4859456j3487252
2316F8192557j1799612j0981309j0441845p906992n330740l240642k043904j288731
$$ plain form
2383 1071357 1375048 1595678 1699633 1506911 1507325 1600385 1613752 1756288 1851754 1845047 1687558
2372 1687558 1707274 1780090 2110152 2317439 2507991 2468615 2492378 2483891 2366291 2616430 2848381
2361 2848381 2902687 2923887 3035825 3123930 3231515 3202425 3183278 3420710 3766309 3839242 3716295
2350 3716295 4060282 4217832 4480320 4469636 4845743 5226768 5840490 6427925 6916538 7858874
2340 7858874 9230907 10424201 11734878 12368423 13240576 13966460 15132812 16505740 18127260
2331 18127260 20876695 24465294 29584842 38486574 52122917 70733339 96117033 123918453
2323 123918453 136784272 131700715 122847376 111253776 96539265 81679809 68192557
2316 68192557 56392945 45411636 34969791 27062799 21732059 18491417 16447513 15158782
2308A5158782j418717j312504o63470q59009j114106p85227p77526q26321m81025
2299F920877n79021o46007m91690j72263m9394P2148m19000k70116L3151p5430
2289D323255j16161m56384m15828l11419j93662k26630J5699n0271j37063j86599
2279B244937j00250j33697J01778m869l4519r3486j05162J21106J56314j44240
2269B007912k52905n4164J08815j83627j21689K00275k07864J93431L6766j36647
2259A590303n8744k7481j01504J11059k30882m76917J17654m4279L14057j20710
2249A072556j73607j04497p081J02948j29231j30618J78656N9036q602j71118
2239F88442k39692R1514j88067j20585M9746J2888j77090j3948K95620o7689n9274
$$ plain form
2308 15158782 13740065 12427561 11764091 10905082 9790976 9005749 8228223 7401902 6920877
2299 6920877 6341856 5695849 5204159 5031896 4982502 5054650 4635650 4365534 4398685 4323255
2289 4323255 4207094 3750710 3334882 3023463 2829801 2603171 2618870 2568599 2431536 2244937
2279 2244937 2144687 2010990 2112768 2107899 2073380 1979894 1874732 1995838 2152152 2007912
2269 2007912 1755007 1700843 1809658 1626031 1504342 1704617 1496753 1690184 1726950 1590303
2259 1590303 1531559 1504078 1402574 1513633 1282751 805834 923488 879209 1193266 1072556
2249 1072556 898949 794452 787371 890319 761088 630470 809126 868162 859560 688442
2239 688442 448750 540264 352197 231612 281358 294246 117156 103208 398828 331139 271865
2228B71865J82188p9843J39168K12386m40903j01968r4680L8009n4746J40610
2218B12086K6567j45763K16636J00719J91027j81467j64737j21208K14143J8003
2208C66006M2564N2516j77550q2338p3949j60641j1727K05470j1598q9902l1974
2197B6877m666M3182P6570n0665L7725k76205n2009j0065j54573M9410O2603L48146
2185I6330N809l9587R855K0360K8026J11995j48696j95675j39386K0684K68735
2174C8450J6525j1361j88498j41690p2652m9064M2251j15359J26064J32004R4132
2163a29198p9303N1429k2615j84806o9684K78576q4469o2045K4541q3291k5510
2152c86375j84536o6846k4463K2160O2025J53964l738j06275J68673m8799K9905
$$ plain form
2228 271865 454053 374210 513378 725764 284861 182893 88213 126222 71476 212086
2218 212086 238653 92890 309526 410245 601272 419805 255068 133860 348003 366006
2208 366006 408570 461086 283536 201198 127249 -33392 -45119 160351 148753 58851 26877
2197 26877 22211 65393 141963 91298 129023 -147182 -199191 -209256 -363829 -314419 -251816 96330
2185 96330 102139 62552 72407 92767 120793 232788 84092 -111583 -250969 -230285 38450
2174 38450 54975 43614 -144884 -286574 -359226 -408290 -366039 -481398 -355334 -223330 -129198
2163 -129198 -208501 -157072 -179687 -364493 -434177 -155601 -240070 -302115 -277574 -360865 -386375
2152 -386375 -570911 -637757 -662220 -640060 -578035 -424071 -427809 -534084 -365411 -414210 -384305
2141c84305j13871J67362J28120L654Q6028L0259j23951q8383j98595L75816n791
2130a23657L6102K01171j34348j6288j08580j67706J53564n3984q0779j5170K166
2119c07509J10393j97814q4198J35255R2020j21811J15376n2781K2253J09590
2109a79226L1249j13424p2272j46056J07711M2847K20478j64978j21498n4696
2099d49865j35646J83483R2887M8904J11369j05935P3286R2073j97512j02831
2089c89787j84324O8401J45874l2910N7673N7250P7735j17827k7257j0882k29524
2078e85578k17705N58826K29073K9788j29176J5169l18504O7786k0019j1099J06423
2067b75016k2123m7894j3968J2897m3044j70327j16509n3187L30268L54402J6304
$$ plain form
2141 -384305 -498176 -330814 -202694 -199040 -113012 -82753 -206704 -295087 -493682 -117866 -123657
2130 -123657 -87555 113616 -20732 -37020 -145600 -313306 -159742 -213726 -294505 -309675 -307509
2119 -307509 -197116 -394930 -479128 -343873 -251853 -373664 -258288 -311069 -288816 -179226
2109 -179226 -147977 -261401 -333673 -479729 -372018 -329171 -108693 -273671 -395169 -449865
2099 -449865 -585511 -402028 -309141 -260237 -148868 -254803 -181517 -89444 -286956 -389787
2089 -389787 -574111 -505710 -359836 -392746 -335073 -277823 -200088 -317915 -345172 -356054 -585578
2078 -585578 -803283 -244457 -15384 14404 -114772 -99603 -418107 -350321 -370340 -381439 -275016
2067 -275016 -297139 -345033 -359001 -346104 -389148 -559475 -675984 -729171 -398903 -44501 -28197
2056b8197J98355R7042O6941k45530Q3571P2530M3656J00782k51537k53176p6370
2045a91933J02102k00041m70049J47856J84482K5523J59542O8537j42810j87264
2035e04055J92556j19873j32089J15025M1841P4968K19856K77909j59180J75501
2025A82459j22072l8697k05439K26220j00282l77760Q6780N5995p8512J23205
2015b48103p5403r9790j20472O3453k571o3682J32897k11459P9227j34838K3879
2004f56862k1992N5022P0057J61698N7769J43765l6898P4477l38163k14767j54177
1993h60071L7149M95278R2393o5751j92222J32063j09103R0737k3495K93694j6842
1982a26170k42238j73169J59992J54230j13279l3682J07333n343k7735q421j42535
$$ plain form
2056 -28197 170158 267200 334141 88611 172182 244712 288368 389150 137613 -115563 -191933
2045 -191933 -89831 -289872 -759921 -612065 -427583 -402060 -242518 -173981 -316791 -504055
2035 -504055 -311499 -431372 -563461 -448436 -406595 -331627 -111771 166138 6958 182459
2025 182459 60387 21690 -183749 42471 -57811 -435571 -348791 -292796 -371308 -248103
2015 -248103 -323506 -423296 -543768 -480315 -482886 -546568 -413671 -625130 -545903 -680741 -656862
2004 -656862 -678854 -623832 -553775 -392077 -334308 -190543 -227441 -152964 -491127 -705894 -860071
1993 -860071 -822922 -327644 -235251 -301002 -493224 -361161 -470264 -379527 -403022 -109328 -126170
1982 -126170 -368408 -541577 -381585 -227355 -340634 -374316 -266983 -272326 -300061 -308482 -451017
1971d51017J75527J75037l5672q3332l83982N882K16675J2052L18959J18302k16265
1960a47834k02220K18268N1098j72599J717j32258J7267K7112J28800M5075r2468
1949b58042j51008R8403K6309J34157J3010r1625j89859q5824J21171O5765k7618
1938c45161J15759q605m7835L6844j21107j00566k18052k5483Q9381J67265j28234
1927e85794P1442j39656J5082j5185J38295K63586L5473J84350J05324q6654k20957
1916b34694R2694j02754j42757j13875P2294J93239J01512p3698j20112J5962
1906c12189J8585P9788j99318j36722J19313O1189j02315n2435o8564k02340J36497
1895f58511L64932R0356j1k74207J25697j78963N4284K12599K737j85717J16854
$$ plain form
1971 -451017 -275490 -100453 -136125 -219457 -603439 -597557 -380882 -368830 -49871 68431 -147834
1960 -147834 -350054 -131786 -80688 -253287 -251570 -383828 -366561 -339449 -210649 -165574 -258042
1949 -258042 -409050 -310647 -284338 -150181 -137171 -228796 -418655 -504479 -383308 -317543 -345161
1938 -345161 -229402 -238007 -285842 -248998 -370105 -470671 -688723 -714206 -624825 -457560 -585794
1927 -585794 -514352 -654008 -638926 -654111 -515816 -252230 -216757 -32407 72917 -13737 -234694
1916 -234694 -142000 -244754 -387511 -501386 -429092 -235853 -134341 -208039 -328151 -312189
1906 -312189 -293604 -213816 -413134 -549856 -430543 -369354 -471669 -524104 -592668 -795008 -658511
1895 -658511 -293579 -203223 -203234 -477441 -351744 -530707 -476423 -263824 -261087 -446804 -329950
1884c29950J13647J23179j61282q8751p7337r1430l1300J51297J67421r0338K0323
1873b94521r1558L86577k36663p8604o2916J55405K72053l43605j63656J17051
1863c40437L2115L3194J90144k93966J4555J33281j7191l7846l4190N4842j58149
1852d23648o8105J64149j21706P4125L5588l42353n5170M2329J29263m0650M7742
1841e58436M0706j17255L0758K41938P7021k64795M8805K67361K38790j48565
1831a43672j87835O2762m1322K50492q2594P0630j01838k91735M4098J59718J32603
1820a28693k3155k43626n8677j06268j1323J18270J98753k001q7916P8078j13983
1809c80541m1266K05714J92187k80015k23130m6884j33307K01280N4504J26812
$$ plain form
1884 -329950 -216303 -93124 -254406 -343157 -420494 -511924 -543224 -391927 -224506 -314844 -294521
1873 -294521 -386079 498 -236165 -314769 -377685 -222280 49773 -293832 -457488 -340437
1863 -340437 -308322 -275128 -84984 -378950 -364395 -231114 -248305 -286151 -320341 -265499 -423648
1852 -423648 -491753 -327604 -449310 -375185 -339597 -681950 -737120 -694791 -565528 -606178 -558436
1841 -558436 -517730 -634985 -604227 -362289 -285268 -550063 -501258 -233897 4893 -143672
1831 -143672 -331507 -268745 -310067 -59575 -142169 -71539 -173377 -465112 -421014 -261296 -128693
1820 -128693 -151848 -395474 -454151 -560419 -571742 -453472 -254719 -256720 -344636 -266558 -380541
1809 -380541 -421807 -216093 -23906 -303921 -527051 -573935 -707242 -505962 -451458 -324646
1799c24646J84970j09358o1553k04668J92800J43974J89190l74524m5096Q7270
1789c21641j76431q637J63694Q8184m5047K88404K059r7731k08437o4266Q7510
1778b92339J80259o3162J9274p4674j02579r1825j77090K09012L40676k14769
1768b67217o4049L3137J31585J15136l19317K65062j95102q5065O9745J39806
1758a76279J0149j82780K50662k4137J2508j27814K10962k7482J2238K1320r5554
1747a16207k1540l18450J26724K30067M3026N4099l5898k60789j11838J35552
1737b75254Q7681M4548j43328J10682j17722p760J33359l05255j37106L14255
1727b95900j9697J7209J15370J15383M4107J23672j27473l23658n9854J63396
$$ plain form
1799 -324646 -139676 -249034 -310587 -515255 -322455 -178481 10709 -363815 -408911 -321641
1789 -321641 -498072 -506709 -343015 -254831 -299878 -11474 -9415 -107146 -315583 -379849 -292339
1778 -292339 -112080 -175242 -155968 -230642 -333221 -425046 -602136 -393124 -52448 -267217
1768 -267217 -331266 -298129 -166544 -51408 -370725 -105663 -300765 -385830 -316085 -176279
1758 -176279 -166130 -348910 -98248 -122385 -109877 -237691 -26729 -54211 -41973 -20653 -116207
1747 -116207 -137747 -456197 -329473 -99406 -56380 -2281 -38179 -298968 -410806 -275254
1737 -275254 -187573 -143025 -286353 -175671 -293393 -301153 -167794 -473049 -610155 -295900
1727 -295900 -315597 -298388 -183018 -67635 -23528 100144 -27329 -350987 -410841 -247445
1717b47445R8945j92265M2743o0323k5693N1063j52326J57150J05658j34383N0567
1706c06309j02451N6514L8823K22061j21155j14431k9782J97974N8039l6794R4988
1695d2523l22537J44N6347J83457m7444L1575M2885n197N2488q6177N3345K3684
1683e9953j26988m0384j22715J8855k2240O9636M02536k96594o9065k35792K34195
1672b48509R3484p4648K304j01660K27839J58484K6271n0062k63353n9060J11754
1661a77156o4368l45973L8104R3553K30265K1320k56265m628J18843P5100q5657
1650c56862p3442m0724O4798Q0889N4063J20858k2382k8017j38073k95747K26140
1639d08499L71367K3299j5674J87389k56317l39293J66159L23236l1337j42879
$$ plain form
1717 -247445 -148500 -340765 -298022 -358345 -384038 -332975 -485301 -328151 -222493 -356876 -306309
1706 -306309 -408760 -352246 -313423 -91362 -212517 -326948 -356730 -158756 -100717 -137511 -42523
1695 -42523 -365060 -364916 -308569 -125112 -172556 -140981 -98096 -103293 -50805 -136982 -83637 -59953
1683 -59953 -186941 -227325 -350040 -331185 -353425 -283789 118747 -177847 -246912 -482704 -248509
1672 -248509 -155025 -229673 -227369 -329029 -101190 57294 83565 33503 -229850 -288910 -177156
1661 -177156 -241524 -587497 -549393 -455840 -225575 -204255 -460520 -465148 -346305 -271205 -356862
1650 -356862 -430304 -471028 -406230 -325341 -271278 -150420 -172802 -200819 -338892 -634639 -408499
1639 -408499 -37132 -13833 -29507 157882 -98435 -437728 -271569 51667 20330 -122549
1629a22549j95685n7297p3544K02173O4361l7660P5185j91581L0102L02250j92972
1618a97217j74814p1039J68331O1412J27818j36888r3791L04190k17467l4086
1608b63551J61680J07373k86521j40027J91462P8211K9274m6534J34686O0589
1598B6642m6281O2098P357K091o5876k9667j99970j86299L92540j23153J09720
1587e0798j13963r9267L65012P844k29146J77134k40591j30676K73466l21941
1577c62926L18113M9384O5142j04390k81984J20592n9081J00724J4952j22411
1567b61885n8425r5067L2532M4615j01153J0887J2735J28795R4263Q7242L3506
1556g1955l1393j33939O5408j34054k37878K9838J35155Q6102J01970J48630J2465
$$ plain form
1629 -122549 -318234 -375531 -449075 -246902 -182541 -220201 -145016 -336597 -306495 -4245 -197217
1618 -197217 -372031 -443070 -274739 -213327 -85509 -222397 -316188 -11998 -229465 -263551
1608 -263551 -101871 5502 -281019 -421046 -229584 -151373 -122099 -168633 -33947 26642
1598 26642 -19639 42459 49816 51907 -13969 -43636 -243606 -429905 -37365 -160518 -50798
1587 -50798 -164761 -264028 100984 108828 -120318 56816 -183775 -314451 -40985 -362926
1577 -362926 -44813 4571 69713 -34677 -316661 -196069 -255150 -154426 -139474 -261885
1567 -261885 -320310 -415377 -382845 -338230 -439383 -428496 -415761 -286966 -192703 -105461 -71955
1556 -71955 -103348 -237287 -171879 -305933 -543811 -513973 -378818 -292716 -190746 -42116 -29651
1545b9651J5877r3300j02499k629J11617p0746j25483k3315J08140N001K76478
1534F9490k1630r7417k95543L06990k18613j31211R2044p1778P3145J89165J39922
1523C4564O513m0369k59856L1209p64j92811n8569K68688j27238J46067j11665
1512c04231k37610J19082M09294j56454l9803K48707k1786l07095j09329K76173
1502a23052j36697k558r216L7486j4429J05923J83261l47677J56695N4042o3757
1491a59979j5089k90198K2137L19899k25449O2408j7269J04368j06177K9183J08506
1480a67660K1012J55692m4982p2039k85686K51301k38290J42554O2233M3698j45560
1469b77727j51820J35700K9007J32473N1871K14000j21769k12399L6794K9043
$$ plain form
1545 -29651 -13774 -107074 -209573 -212202 -100585 -171331 -296814 -320129 -211989 -206988 69490
1534 69490 47860 -49557 -345100 -38110 -256723 -387934 -295890 -367668 -294523 -105358 34564
1523 34564 41077 708 -259148 -227939 -228703 -421514 -480083 -211395 -338633 -192566 -304231
1512 -304231 -541841 -422759 -13465 -169919 -209722 38985 17199 -289896 -399225 -123052
1502 -123052 -259749 -262307 -271523 -234037 -248466 -142543 40718 -306959 -150264 -96222 -159979
1491 -159979 -175068 -465266 -443129 -123230 -348679 -286271 -303540 -199172 -305349 -276166 -167660
1480 -167660 -146648 9044 -35938 -107977 -393663 -142362 -380652 -238098 -175865 -132167 -277727
1469 -277727 -429547 -293847 -264840 -132367 -80496 133504 11735 -200664 -163870 -134827
1459a34827q305l841K61137N4139j02030k17683p2560l53367J48650L44583j11635
1448a95739k0014K32171K674K6775m7498k03532R3979p9387L7882K28329R0704
1437A66344J6475J8602J218k60602j67378l402P1219o1724J36343M0748j36112
1426a78269L8774r3890J82943M2236L1439j25694Q5784j6212L0421j61333k80486
1415d44287o3100K30525J24274k21030m0440J73500J46804J95092l61654o7867
1405c28183M48674q714k28097M6268j55480q3641L22702J00254k48866J98391
1395F3308j42331j66015J33821j21421j81584J26520K79737k9784j61484M4428
1385a54805j3004j6620L1241N8525L2440l1866K06611k85406M0445k272K39539
$$ plain form
1459 -134827 -143132 -146973 114164 168303 66273 -151410 -223970 -577337 -428687 -84104 -195739
1448 -195739 -215753 16418 19092 45867 -1631 -205163 -111184 -190571 -152689 75640 166344
1437 166344 182819 201421 202639 -57963 -225341 -228743 -157524 -219248 -82905 -42157 -178269
1426 -178269 -139495 -233385 -50442 -8206 23233 -102461 -16677 -32889 -2468 -163801 -444287
1415 -444287 -507387 -276862 -152588 -373618 -414058 -240558 -93754 101338 -260316 -328183
1405 -328183 120491 111777 -116320 -70052 -225532 -309173 13529 113783 -135083 63308
1395 63308 -79023 -245038 -111217 -232638 -414222 -287702 -7965 -37749 -199233 -154805
1385 -154805 -167809 -184429 -153188 -94663 -62223 -94089 112522 -172884 -132439 -134711 104828
1374A04828p7749q6221r2102O7035M3250j79122J21320K2287o5100J04862j33285
1363a69997k80532l9028K417R0531J66714K2864l7417O3295K9962j48368k2130
1352c21689J77703K4239j09791O0934j4336l6451K39985o4747m2312J01250J44306
1341A59091j20658M1395l9487j1076r0634R2277K877n929k9205j89801J26425
1330f4725j45854j46980K72464l6871p4759K42103j12721j11023K57388M4797
1320A23819q0503j18707j78146L46613q2222j11504L08296j02001j20144r0825
1310a05324Q4832J61M4282o6644R948l26941J21084L08106k12681J54273J113
1299A2209j42471J03015J00990k2812o2454N8730m0685J20449r0017k53069K22365
$$ plain form
1374 104828 27079 -59142 -151244 -84209 -40959 -220081 -98761 -76474 -141574 -36712 -169997
1363 -169997 -450529 -489557 -487140 -396609 -229895 -207031 -244448 -181153 -151191 -299559 -321689
1352 -321689 -143986 -119747 -229538 -168604 -182940 -219391 20594 -44153 -86465 14785 159091
1341 159091 38433 79828 40341 29265 -61369 30908 33785 27856 -1349 -191150 -64725
1330 -64725 -210579 -357559 -85095 -121966 -196725 45378 -67343 -178366 79022 123819
1320 123819 43316 -75391 -253537 93076 10854 -100650 207646 105645 -14499 -105324
1310 -105324 -20492 -20331 23951 -42693 -32745 -359686 -238602 69504 -143177 11096 12209
1299 12209 -130262 -27247 73743 50931 -11523 47207 6522 126971 36954 -216115 6250
1288F250J593k88927J53879K46568k07567Q4247p5834J939n2564J38206k15532
1277b07742Q2877q4966j9835N3718J58492M8124n8712k8396P9056J2492l13939
1266b78831J7016J90439Q2028n4037K10975k53065J75756o3560j81078L7359N9246
1255e7752m2876k53425R5474J90060j62321q5889K04476k6834J51934k405Q9975
1244A00417j16287N4007j3054J14759r186j86659P5727l0695Q0320m3242j31201
1233a05094O9552r0124k9738J25610Q6580j7296R5375m2612N1922j75280K4781
1222f324k353l71139R5618K89096J44306j46535J30705j29389j35806k5630J17161
1211d0290Q3816n2715K10054O8832l47252j52033j2974L28721k6731J1091k3589
$$ plain form
1288 6250 7843 -281084 -127205 119363 -88204 -3957 -79791 -77852 -130416 7790 -207742
1277 -207742 -124865 -209831 -229666 -175948 -17456 30668 -28044 -56440 22616 35108 -278831
1266 -278831 -261815 -71376 10652 -43385 167590 -85475 90281 26721 -154357 -116998 -57752
1255 -57752 -100628 -354053 -258579 -68519 -230840 -316729 -112253 -139087 12847 10442 100417
1244 100417 -15870 38137 25083 139842 130656 -56003 19724 -10971 69349 26107 -105094
1233 -105094 -35542 -125666 -155404 -29794 56786 39490 134865 92253 144175 -31105 -6324
1222 -6324 -8677 -379816 -284198 4898 149204 2669 133374 3985 -131821 -157451 -40290
1211 -40290 43526 -9189 200865 269697 -77555 -229588 -242562 86159 59428 70519 46930
1200D6930K37528j55916k60676J09692j24534J79781j35731j09328J88591k15648
1190b39311J58127r3560O3774J1912j03404K7041m2499n2462R412K60971L3564
1179C3565J54614l039j31242k11392j46240Q371Q8498l307J43501L08235J3852
1168B55416k1574j18169j13674j73395j3832N8257J38461Q5006k00914Q064N6999
1157c9355K30644j15319j77055O4058j3712P3667m7125J20734j47709K3381K0515
1146g276k6513J09970l4629k05466R6472J81162j24530r2139P3337R2876R4511
1135A57775p1679j2135K7120j52723k0177r2704L4314j23439n6634K95837N88224
1124E73779j56773l25843J30240j92032k54286K45328k3029k00146p7970q8213
$$ plain form
1200 46930 284458 128542 -132134 -22442 -146976 32805 -102926 -212254 -23663 -239311
1190 -239311 -81184 -174744 -110970 -99058 -202462 -175421 -217920 -270382 -260970 1 33565
1179 33565 188179 185140 53898 -157494 -303734 -295363 -206865 -210172 -66671 241564 255416
1168 255416 233842 115673 1999 -171396 -185228 -126971 11490 96496 -104418 -96354 -39355
1157 -39355 191289 75970 -101085 -37027 -50739 22928 -24197 96537 -51172 -27791 -7276
1146 -7276 -33789 76181 41552 -163914 -67442 113720 -10810 -102949 -29612 63264 157775
1135 157775 86096 73961 101081 -51642 -71819 -164523 -130209 -253648 -310282 -14445 573779
1124 573779 417006 91163 221403 29371 -224915 20413 -2616 -202762 -280732 -368945
1114c68945j3235J90219J93938J55252j45520q8583k0736M5924L7552k21950M743
1103b31341M99597n2109j92720k27633m7326J89381N18474k21459m12076M3190
1093a34022J52207r0521M8690j05753l36506K73508K50244j57953P5474J6649
1083g983n8167J30965J62383K4457j07562j43233j2379L4831j23746J702q1440
1072a80172O2247k5562J53658j51182K98050Q8391l10113k9553k3187Q8801J0891
1061a7731k05680q8999K53021M52093l93805j42367L33225k6650n26752L78056
1051A4411O9685r8293Q8297k2272P0861l42738P0579J18076q527j38263k0147
1040a98331J58471Q6368P4288j80655n6894J34511j51381K80075P6107k06820
$$ plain form
1114 -368945 -382180 -191961 1977 157229 11709 -76874 -97610 -51686 -14134 -236084 -231341
1103 -231341 268256 216147 23427 -204206 -251532 -62151 456323 234864 -177212 -134022
1093 -134022 18185 -72336 -23646 -129399 -465905 -192397 57847 -100106 -24632 -7983
1083 -7983 -66150 64815 227198 251655 144093 860 -11519 23312 -100434 -98732 -180172
1072 -180172 -117925 -143487 10171 -141011 157039 245430 -64683 -94236 -117423 -28622 -17731
1061 -17731 -223411 -312410 -59389 392704 -1101 -143468 189757 163107 -363645 14411
1051 14411 84096 -14197 74100 51828 122689 -220049 -149470 -31394 -39921 -178184 -198331
1040 -198331 -39860 46508 120796 -59859 -116753 17758 -133623 146452 222559 15739
1030A5739J39599r2805O9839j02379m1743k9487M843J53280m0383q0377O1375
1019E7501J04471j51065R6115J92499o5637j72818K9051r2222k05878K31690N4953
1008G8660J62275j45854k45477R2810K28226p2274m8437j35716o2587P8948K3404
997d6022J60194k01698K64426L4125q7864j54574j61713k5467M52878J81327k3886
986C91726j06422k73625j15238J94478r006N9509j35365J43649Q3087J63463n2766
975C43490k26817o9456J97217o049p8519O6817l05386N7641l9234L2907p9180
964a06569J1109J98757j844J68312j21276n0423L28773j18874l41531l4113K91424
953B23745j40441j8772J0642M5264J66265q4015m5100J23518n291j8363P546K4739
$$ plain form
1030 15739 155338 62533 132372 29993 -11750 -41237 -36394 116886 76503 -3874 57501
1019 57501 161972 10907 107022 299521 233884 61066 90117 -2105 -207983 23707 78660
1008 78660 240935 95081 -150396 -57586 170640 98366 49929 -85787 -148374 -69426 -46022
997 -46022 114172 -87526 176900 211025 123161 -31413 -193126 -218593 234285 415612 391726
986 391726 285304 11679 -103559 90919 81913 141422 6057 149706 232793 396256 343490
975 343490 116673 47217 244434 238385 159866 226683 -78703 -21062 -60296 -27389 -106569
964 -106569 -95460 103297 101453 269765 148489 98066 426839 307965 -33566 -67679 223745
953 223745 83304 64532 75174 120438 286703 202688 157588 281106 275815 257452 264998 289737
941B89737j12323k23892l986O6827j94469n6782K83822o4722k83730K20451n1208
930a30275K84061J29039l38733k146J41424j10080k6372J55345k67739q4925J18703
919a31698J60735K47304j66005j44949L5134l1676J51966J25666j78283J13751
909A81945o4949k09706K988L01002N5481k9499q4297J68332j31487j70187L07312
898C26935o3649k06405q7661K11190j0934O2954J06436n3832j91304l18970j01524
887c26764J53543K00489k8453j67327J13504q640J53084o3701Q6597j04488j49728
876a41884J71262N0314n5502J51102K27950j84606j36684R4008q6966Q2593L680
865A75267J0419j42103k50253L3532Q0432J84810Q5093o3765j14735J10723O37
$$ plain form
941 289737 177414 -46478 -50464 16363 -178106 -234888 48934 -15788 -299518 -79067 -130275
930 -130275 153786 282825 -55908 -58054 83370 -26710 -53082 102263 -165476 -250401 -131698
919 -131698 29037 276341 110336 -34613 521 -31155 120811 246477 68194 181945
909 181945 116996 -92710 -89722 211280 266761 237262 152965 321297 189810 19623 326935
898 326935 263286 56881 -30780 180410 169476 232430 338866 285034 93730 -225240 -326764
887 -326764 -173221 27268 -1185 -168512 -55008 -63648 89436 25735 112332 7844 -141884
876 -141884 29378 79692 24190 175292 403242 218636 81952 175960 88994 171587 175267
865 175267 185686 43583 -206670 -173138 -92706 92104 177197 113432 -1303 109420 110057
854A10057l41773N4852J40909p3610L2971J33027P6220J61191K93667k01174k62913
843A23424j09766M5402j06842L23458j82441j36257K82968j93090l7349J30324
833A39831J57492k06214m9364K80325k18491J98210R1691j58174n4046o3681k36771
822a19192L81412J82129l51822K4158J3648K5576j40756N5420J00288j50376J22271
811A42756J29852l5712j03309k4115J66042l43250k6263J25076J9537j36790j4452
800a00628j66760R9734J71073J06738j40878P2571j5264M5173J91859J01960l61803
789C775J38869P8856k26014R5392K54876p4658k7790j86451J4788K11491m5449
778B37685m220K62242Q212k23057j76934k4160J46416l0893k9902J24504j84426
$$ plain form
854 110057 -231716 -176864 -35955 -109565 -76594 56433 132653 293844 587511 386337 123424
843 123424 13658 59060 -47782 275676 93235 -43022 239946 46856 9507 139831
833 139831 297323 91109 41745 322070 103579 301789 393480 235306 181260 117579 -119192
822 -119192 262220 444349 92527 116685 130333 155909 15153 70573 170861 20485 142756
811 142756 272608 236896 133587 109472 275514 -67736 -93999 31077 50614 -86176 -100628
800 -100628 -267388 -167654 3419 110157 -30721 41850 26586 71759 263618 365578 3775
789 3775 142644 221500 -4514 90878 345754 271096 243306 56855 71643 283134 237685
778 237685 233465 495707 503919 280862 103928 79768 226184 195291 165389 289893 105467
767A05467J8739l7181k19678R632J12180K60436l73788K50479J88651k49890j91696
756a26649R0936J11616J46927K9049j36507L6866J4481J21036j03911k75365J37779
745D6258M7447J79975N9925j16364k20898P4423j8823l1486j86252J59861K42736
734B36802K6166k5517J71794J3568j65538j81417J00599n9972m8070K43021J80
723C11616k64115J6585L2553r4279n7472j19334Q5979L70206j90825m29M8888
712A39373j41824k3750R1449K54083j02221M2873o736j05100L2033J07823j70430
701A17573k1565L9550m6156J17407j21687J01742k55705J85482K164q693P1611
690A81723J32454J45603n6704j7211j4777k92512M4780P9588k2132M3492j52975
$$ plain form
767 105467 124206 87025 -132653 -123021 -10841 249595 -124193 126286 314937 65047 -126649
756 -126649 -35713 75903 222830 251879 115372 152238 166719 287755 183844 -91521 46258
745 46258 93705 273680 333605 217241 -3657 70766 51943 20457 -165795 -5934 236802
734 236802 262968 237451 409245 422813 257275 75858 176457 116485 68415 311436 311616
723 311616 47501 64086 96639 2360 -55112 -174446 -88467 281739 90914 90485 139373
712 139373 -2451 -26201 65248 319331 217110 259983 253247 148147 180180 288003 117573
701 117573 96008 135558 89402 206809 85122 186864 -68841 116641 118805 110112 181723
690 181723 314177 459780 403076 385865 371088 78576 123356 202944 180812 224304 71329
679G1329K75795J04346j2880q554N1018j34184q9356j0048R1697l7727q8132o2087
667A51217m1942p6361K19675q0401k34683j29488J27669J19117p9916l833Q4026
656E5080l2532K01777o5508J28539O0420p546r1567m8988J1968K26765j71273
645B67135j63607P4677J47417j39055j47346K04408N1548j16741j7161j24119
635C7156J59926n7145J1032K47809J96378j08135j13870q7379j27920J06832k15439
624D9245J11951K73874j49151m4529J20027j00238j56727k10737j37966L11934
614F7683r090M1434K80948J25447J18600j04847j50342j28385k76154J63825k68185
603a39066O2519K28876O4131Q8146j50422J23674M2150j84291j4844M8279m8709
$$ plain form
679 71329 347124 451470 438590 430036 481054 346870 257514 247466 339163 301436 213304 151217
667 151217 109275 32914 252589 172188 -62495 -191983 -64314 54803 -25113 -28946 55080
656 55080 22548 224325 158817 287356 347776 340230 248663 199675 211643 438408 267135
645 267135 103528 178205 325622 186567 39221 243629 295177 178436 161275 37156
635 37156 197082 139937 150969 398778 595156 487021 373151 285772 157852 264684 49245
624 49245 161196 435070 285919 241390 361417 261179 104452 -106285 -244251 67683
614 67683 58593 100027 380975 506422 625022 520175 369833 241448 -34706 129119 -139066
603 -139066 -76547 152329 216460 304606 154184 277858 320008 135717 120873 169152 120443
592A20443K83404J6349k09888m0331K9748k46386J17636l6865N959K41257m11
581B80915l0365p598k12184K41870K22783j90823N8415J36242l5059l074l38936
570A22186R2302l4172N8445l00863P2237K62181N0064J1304r9233J2888o2538
559A84801N3193P0138n2604q0302K06383q306Q930k31752K2131P9794l7090M1183
547B56499j12903O7655j79346J27552m1762P8927j25571J02308L3732K3768O8358
536B99217j95984j43685M5180J1950o7206J35080R9490j09689l2300J20371N2717
525B15141l814J77591J43992p0904j45355N5981K02212j9085m8220j49703J12307
514D70143M6926J71540k07966j00922k72869k63783N07797O2065k92819P9557
$$ plain form
592 120443 403847 420196 210308 169977 199725 -46661 70975 34110 40069 281326 280915
581 280915 250550 242952 30768 272638 495421 304598 363013 499255 464196 461122 122186
570 122186 214488 180316 238761 -62102 10135 272316 322380 333684 234451 247339 184801
559 184801 237994 308132 255528 175226 381609 373303 382233 150481 172612 252406 215316 256499
547 256499 143596 211251 31905 159457 117695 196622 71051 173359 207091 230859 299217
536 299217 103233 -40452 4728 16678 -50528 84552 184042 74353 42053 162424 215141
525 215141 211327 388918 532910 462006 316651 372632 574844 555759 507539 357836 470143
514 470143 517069 688609 480643 379721 106852 -156931 350866 412931 120112 199669
504A99669J97585q5531k12562K93027L0641j22924J09347l0124j36788j53101
494H9239k7832L78158J67433k74705m14531P474J11334j78530L55684J99180Q9604
483E02508j11856p4943P051p5051J64923r0336j7149q0660k37890K45675j93573
472C8699N3453M0701m5856k3493j25249j17196p5887J10615J37478M28689k74608
461A47346k6985J0468J46391j5169P6839j62262j9151j19660k15949K31522k65292
450b11902O7167J83047N9578K24299j11581l27369K19060J85328M4984J0089J34404
439D77104J25298j91903l15863M3670j5014Q510Q9280j31074L3175J67289J54463
428D44935l05568P0944O6014J9514j43573j05337J40713O5688J33166r2715L3241
$$ plain form
504 199669 397254 311723 99161 392188 422829 299905 409252 379128 242340 89239
494 89239 61407 439565 606998 332293 -82238 -74764 36570 -141960 213724 412904 502508
483 502508 390652 315709 322760 247709 412632 322296 305147 224487 -13403 232272 38699
472 38699 92152 132853 86997 63504 -61745 -178941 -254828 -144213 -6735 421954 147346
461 147346 120361 130829 277220 262051 338890 176628 157477 37817 -178132 53390 -211902
450 -211902 -144735 38312 97890 322189 210608 -116761 102299 287627 332611 342700 477104
439 477104 602402 410499 94636 138306 123292 131802 221082 90008 123183 290472 444935
428 444935 139367 210311 276325 295839 152266 46929 187642 253330 386496 293781 327022
417C27022j26271j14158J47315Q3904j22839J15695J08907j60341J1995k34456
407C6773J99734J66236J41296j89824R5140J93141n3273O3954j21656l06241K01022
396D26302j40772k06816J23509Q169J287J68331j78534R5373J32247m94724K17835
385A52207Q9456K3552l4279R2249r4083J15177j14687J28619J44453l12642j11356
374G8666q6127K49924O4279j416J00207j83862M2090m8694K8739L58591R6541
363F98938q4448k37724k80414J40178K2125n0444n3653P0873k7878m3093m8133
352A06327l0417P4372p9196L41182K70653k13984N0762n6299k1529j24512J64508
341D81867n5910l38615J56870K75774n4553r6279n558N7156o6242Q5833K9699
$$ plain form
417 327022 200751 86593 233908 317812 194973 310668 419575 259234 271229 36773
407 36773 236507 402743 544039 354215 449355 642496 589223 653177 531521 225280 426302
396 426302 285530 78714 202223 210392 211679 380010 201476 296849 429096 -65628 152207
385 152207 241663 265215 230936 323185 229102 344279 229592 358211 502664 190022 78666
374 78666 -7461 242463 306742 305326 405533 221671 263761 215067 243806 602397 698938
363 698938 614490 376766 96352 236530 258655 208211 154558 225431 197553 154460 106327
352 106327 75910 150282 71086 412268 682921 468937 519699 463400 441871 317359 481867
341 481867 425957 87342 244212 519986 465433 369154 363596 420752 354510 440343 470042
330D70042L1198k0560j11921K26381l24259M4645l7605N6438J46203j14583j71211
319A94768K38548R2949K7024J41340n0780k06003K8002j89251k33733J13357J78102
308C34323K5263k14138K90542M8933k14796O9461q5950k10436J49573o674J40360
297C26461j78824J38391j31538k27117K4877K47215K95611r6802m3630J3761J11195
286D79600L4660q7334J17129N7365k39302k62554j1627J36247K90553j75369k152
275C37216j01473o7105J14217L1613J29156Q6823j48388j85940K15306j6480j37314
264B57631l6111j4726L4766l742J73234J08022j53022k3806J69535J69375k33333
253D47823o5029j21377k4733j42570K23338Q1361L29371j3049j17500L7720j32642
$$ plain form
330 470042 501240 480680 368759 595140 270881 315526 277921 334359 480562 365979 194768
319 194768 433316 526265 553289 694629 643849 437846 465848 276597 42864 156221 334323
308 334323 359586 145448 435990 484923 270127 339588 253638 43202 192775 186101 326461
297 326461 147637 286028 154490 -72627 -47750 199465 495076 398274 354644 368405 479600
286 479600 514260 426926 544055 601420 362118 99564 87937 224184 514737 339368 337216
275 337216 235743 168638 282855 314468 443624 530447 382059 196119 411425 394945 257631
264 257631 221520 206794 241560 237818 411052 519074 366052 342246 511781 681156 447823
253 447823 382794 261417 236684 94114 317452 398813 728184 715135 597635 635355 502713
242E02713n8378o136j66576j2548K5036k9625K2409j21452P5155L1978J47698
231D10274l4145J40929m9651k37583j57686m9363K36197l2432M7393j17046j18172
220C8715J79587j5681j47691K23838K53070q4833o2731j37509K7663K75134q0519
209D69043l0360J36751j37594J89992J90624j04479l26558J35456m3711k47204
199B31960l1648P4617r5843k07656K11922P9554R7295k7883Q8055l7782l3996
188C48595M5685p4037n9135K59520J57322l0743j04103j33923r7272l6425n5669
177B19815o3205J91747J78838Q3855q6212p3099j69409q011K68997j79148j56715
166B07453M5071J08261k7792p5153j53511J95567N3887N4213m0049r2029N85k12892
$$ plain form
242 502713 444335 438199 271623 259075 284111 254486 276895 155443 230598 262576 410274
231 410274 376129 517058 467407 229824 72138 22775 258972 226540 273933 156887 38715
220 38715 218302 202621 54930 278768 531838 447005 384274 246765 274428 549562 469043
209 469043 438683 575434 437840 627832 818456 713977 387419 522875 479164 231960
199 231960 200312 274929 179086 -28570 183352 262906 360201 332318 420373 382591 348595
188 348595 394280 320243 261108 520628 677950 647207 543104 409181 311909 275484 219815
177 219815 156610 348357 527195 611050 524838 451739 282330 274319 543316 364168 207453
166 207453 252524 360785 332993 257840 104329 299896 353783 407996 367947 275918 276503 63611
154F3611J3873J21038K07865l5118r0793R4741l01177p7733K60517N00084J65950
143I22858j88192P0171l14516q9729K8772L6978M7807R9328k68372p3579J74515
132D46041o6120j3338j72061j51110K71831j00245L7382Q3112J10252P120P229
121D60093j19284m1708J13039q1969P0619J71076R8406j69840j76121J87060r274
110E02097q9401q1854J51859L6720j79216J35598k6055m8987j95461l1224R6518
99B70594J42977J21474o2918q3263p2892J35054M3828J60516j02122l5633l9966
88D77649p8948J0137n4856J25679p4745J12017J21337o5206j53744k25379M5512
77B39453l5740n3962K8349J32588R3117j47873O3663R3716J1448L4249j62185
$$ plain form
154 63611 77484 198522 406387 371269 280476 375217 74040 -3693 256824 756908 922858
143 922858 734666 804837 490321 400592 429364 466342 514149 613477 345105 271526 446041
132 446041 379921 366583 194522 43412 315243 214998 252380 335492 445744 452864 460093
121 460093 340809 299101 412140 330171 400790 571866 670272 500432 324311 511371 502097
110 502097 412696 330842 482701 519421 340205 475803 449748 400761 205300 174076 270594
99 270594 413571 535045 472127 388864 315972 451026 494854 655370 553248 517615 477649
88 477649 398701 408838 353982 479661 404916 516933 638270 573064 419320 193941 239453
77 239453 203713 149751 178100 310688 403805 255932 319595 413311 424759 459008 296823
66B96823m4172J54883l1804j06305j9173O186m2707O0595J02620j01362j06011
55A69573K1363p098K20755r8361p3438R1245J16043L0906p5533P0396r993p48
43D55110k3651Q044J7617Q2405p3561n8785J09772J87632j6035k05786q1104K1975
31D23633j64398O5634N2587J01032n5910J03121P2243k19877k4800L5033R0847
$$ plain form
66 296823 252651 407534 375730 269425 250252 256438 213731 274326 376946 275584 169573
55 169573 190936 183838 404593 306232 232794 324039 440082 470988 395455 465851 455858 455110
43 455110 431459 439503 457120 539525 465964 407179 516951 704583 688548 482762 401658 423633
31 423633 259235 324869 377456 478488 422578 525699 597942 378065 353265 388298 479145
$$ [...]
##END NTUPLES=NMR SPECTRUM
##END=
