##TITLE=1H_TG-2413-A
 200.13Hz,CDCl3.
 8 sc
 21.8.2026
##JCAMPDX= 6.0         $$ Bruker NMR JCAMP-DX V2.0
##DATA TYPE= NMR SPECTRUM
##DATA CLASS= NTUPLES
##ORIGIN= UXNMR, Bruker Analytische Messtechnik GmbH
##OWNER= pz
$$ XWIN-NMR		Version 3.5
$$ Fri Aug 21 12:19:13 2026 Russian Standard Time (UT+4h)  she@DPX200
##.OBSERVE FREQUENCY= 200.1313
##.OBSERVE NUCLEUS= ^1H
##.ACQUISITION MODE= SIMULTANEOUS
##.ACQUISITION SCHEME= undefined
##.AVERAGES= 8
##.DIGITISER RES= 18
##SPECTROMETER/DATA SYSTEM= spect
##.PULSE SEQUENCE= zg30
##.SOLVENT NAME= CDCl3
##.SHIFT REFERENCE= (INTERNAL, CDCl3, 0, 15.488)
##AUDIT TRAIL= $$ (NUMBER, WHEN, WHO, WHERE, WHAT)
$$ ##TITLE= Audit trail, XWIN-NMR		Version 3.5
$$ ##JCAMPDX= 5.01
$$ ##ORIGIN= Bruker BioSpin GmbH
$$ ##OWNER= she
$$ F:/spectra/data/she/nmr/H-C/1/pdata/1/auditp.txt
$$ ##AUDIT TRAIL=  $$ (NUMBER, WHEN, WHO, WHERE, WHAT)
(   1,<2026-08-21 12:17:29.76 +0400>,<she>,<DPX200>,
      <created by zg, POWCHK disabled, PULCHK disabled
       configuration hash MD5:
       00 E9 B6 7A A2 85 ED C7 34 08 36 98 17 FE 4E 26
       data hash MD5: 16K
       66 50 05 35 80 22 71 F2 44 F3 56 29 70 52 02 D8>)
(   2,<2026-08-21 12:17:33.64 +0400>,<she>,<DPX200>,
      <Start of raw data processing
       efp BC_mod = 2 LB = 0.25 FT_mod = 6 PKNL = 1 PHC0 = -4508.281 PHC1 = 31.9923 SI = 16K 
       data hash MD5: 16K
       E2 A0 D1 A0 2A 87 35 32 DB 07 BB A1 DF 3B FC B8>)
(   3,<2026-08-21 12:18:15.48 +0400>,<she>,<DPX200>,
      <pk PHC0 = -69.68112 PHC1 = -22.6 
       data hash MD5: 16K
       CF A8 0C 8C A1 E5 B7 1E 5A F9 05 EB BB 24 2B 41>)
(   4,<2026-08-21 12:18:20.98 +0400>,<she>,<DPX200>,
      <abs ABSG = 5 
       data hash MD5: 16K
       F5 69 7D 12 EA DB 13 B8 FC 26 53 36 59 3A 12 5D>)
$$ ##END=
$$ 
$$ hash MD5
$$ E8 A0 5D 7C A4 55 4D B2 95 C5 AD 84 8E 7C 42 2F
##$RELAX= 
##$RELAX= 
##$RELAX= 
##$RELAX= 
##$RELAX= 
##$RELAX= 
$$ Bruker specific parameters
$$ --------------------------
##$DU= <F:/spectra>
##$EXPNO= 1
##$NAME= <H-C>
##$PROCNO= 1
##$TYPE= <nmr>
##$USER= <she>
##$AMP= (0..31)
100 100 100 100 100 100 100 100 100 100 100 100 100 100 100 100 100 100 
100 100 100 100 100 100 100 100 100 100 100 100 100 100 
##$AQSEQ= 0
##$AQ_mod= 1
##$AUNM= <au_zg>
##$AUTOPOS= <>
##$BF1= 200.13
##$BF2= 200.13
##$BF3= 200.13
##$BF4= 200.13
##$BF5= 200.13
##$BF6= 200.13
##$BF7= 200.13
##$BF8= 200.13
##$BYTORDA= 1
##$CFDGTYP= 0
##$CFRGTYP= 5
##$CHEMSTR= <none>
##$CNST= (0..31)
1 1 145 1 1 1 1 1 1 1 1 1 1 1 1 1 1 1 1 1 1 1 1 1 1 1 1 1 1 1 1 1 
##$CPDPRG= <>
##$CPDPRG1= <>
##$CPDPRG2= <>
##$CPDPRG3= <>
##$CPDPRG4= <mlev>
##$CPDPRG5= <mlev>
##$CPDPRG6= <mlev>
##$CPDPRG7= <mlev>
##$CPDPRG8= <mlev>
##$CPDPRGB= <>
##$CPDPRGT= <>
##$D= (0..31)
0 0.7 0 0 0 0 0 0 0 0 0 0.03 0 0 0 0 0 0 0 0 0 0 0 0 0 0 0 0 0 0 0 0 
##$DATE= 1787300249
##$DBL= (0..7)
120 120 120 120 120 120 120 120 
##$DBP= (0..7)
150 150 150 150 150 150 150 150 
##$DBP07= 0
##$DBPNAM0= <>
##$DBPNAM1= <>
##$DBPNAM2= <>
##$DBPNAM3= <>
##$DBPNAM4= <>
##$DBPNAM5= <>
$$ [...]
##$SUBNAM3= <"">
##$SUBNAM4= <"">
##$SUBNAM5= <"">
##$SUBNAM6= <"">
##$SUBNAM7= <"">
##$SUBNAM8= <"">
##$SUBNAM9= <"">
##$SW= 18.0517328524113
##$SWIBOX= (0..15)
0 0 2 0 0 0 0 0 0 0 0 0 0 0 0 0 
##$SW_h= 3612.71676300578
##$TD= 16384
##$TD0= 1
##$TE= 0
##$TE2= 300
##$TE3= 300
##$TEG= 300
##$TL= (0..7)
0 120 120 120 120 120 120 120 
##$TP= (0..7)
150 150 150 150 150 150 150 150 
##$TP07= 0
##$TPNAME0= <>
##$TPNAME1= <>
##$TPNAME2= <>
##$TPNAME3= <>
##$TPNAME4= <>
##$TPNAME5= <>
##$TPNAME6= <>
##$TPNAME7= <>
##$TPOAL= (0..7)
0.5 0.5 0.5 0.5 0.5 0.5 0.5 0.5 
##$TPOFFS= (0..7)
0 0 0 0 0 0 0 0 
##$TUNHIN= 0
##$TUNHOUT= 0
##$TUNXOUT= 0
##$USERA1= <user>
##$USERA2= <user>
##$USERA3= <user>
##$USERA4= <user>
##$USERA5= <user>
##$V9= 5
##$VALIST= <valist>
##$VCLIST= <CCCCCCCCCCCCCCC>
##$VD= 0
##$VDLIST= <DDDDDDDDDDDDDDD>
##$VPLIST= <PPPPPPPPPPPPPPP>
##$VTLIST= <TTTTTTTTTTTTTTT>
##$WBST= 1024
##$WBSW= 4
##$XGAIN= (0..3)
0 0 0 0 
##$XL= 0
##$YL= 0
##$YMAX_a= 251701
##$YMIN_a= -266270
##$ZGOPTNS= <>
##$ZL1= 120
##$ZL2= 120
##$ZL3= 120
##$ZL4= 120
##$ABSF1= 15.49568
##$ABSF2= -2.55617
##$ABSG= 5
##$ABSL= 3
##$ALPHA= 0
##$AQORDER= 0
##$ASSFAC= 0
##$ASSFACI= 0
##$ASSFACX= 0
##$ASSWID= 0
##$AUNMP= <proc_1d>
##$AZFE= 0.1
##$AZFW= 0.1
##$BCFW= 0
##$BC_mod= 2
##$BYTORDP= 0
##$COROFFS= 0
##$CY= -3
##$DATMOD= 1
##$DC= 0
##$DFILT= <>
##$DTYPP= 0
##$F1P= 0
##$F2P= 0
##$FCOR= 1
##$FTSIZE= 16384
##$FT_mod= 6
##$GAMMA= 0
##$GB= 0
##$INTBC= 1
##$INTSCL= 3.241238e-09
##$ISEN= 128
##$LB= 0.25
##$LEV0= 0
##$LPBIN= 0
##$MAXI= 10000
##$MC2= 0
##$MEAN= 0
##$ME_mod= 0
##$MI= 1.114404
##$NCOEF= 0
##$NC_proc= -6
##$NLEV= 6
##$NOISF1= 3.799351
##$NOISF2= 2.8
##$NSP= 0
##$NTH_PI= 0
##$NZP= 0
##$OFFSET= 15.48797
##$PC= 1
##$PHC0= -4577.962
##$PHC1= 9.3923
##$PH_mod= 1
##$PKNL= yes
##$PPARMOD= 0
##$PSCAL= 0
##$PSIGN= 0
##$REVERSE= no
##$SF= 200.130006750516
##$SI= 16384
##$SIGF1= 3
##$SIGF2= 2
##$SINO= 0.751879
##$SIOLD= 32768
##$SREGLST= <19F.Aceton>
##$SSB= 0
##$STSI= 16384
##$STSR= 0
##$SW_p= 3612.71676300578
##$SYMM= 0
##$S_DEV= 0
##$TDeff= 16384
##$TDoff= 0
##$TI= <>
##$TILT= no
##$TM1= 0
##$TM2= 0
##$TOPLEV= 0
##$USERP1= <user>
##$USERP2= <user>
##$USERP3= <user>
##$USERP4= <user>
##$USERP5= <user>
##$WDW= 1
##$XDIM= 16384
##$YMAX_p= 291035573
##$YMIN_p= -667467
$$ End of Bruker specific parameters
$$ ---------------------------------
##NTUPLES= NMR SPECTRUM
##VAR_NAME=  FREQUENCY,     SPECTRUM/REAL,   SPECTRUM/IMAG
##SYMBOL=    X,             R,               I
##VAR_TYPE=  INDEPENDENT,   DEPENDENT,       DEPENDENT
##VAR_FORM=  AFFN,          ASDF,            ASDF
##VAR_DIM=   16384,         16384,           16384
##UNITS=     HZ,            ARBITRARY UNITS, ARBITRARY UNITS
##FACTOR=    0.220516191357247, 1,           1
##FIRST=     3099.60761113214, 0,            0
##LAST=      -513.109151873636, 0,           0
##MIN=       -513.109151873636, -667467,     0
##MAX=       3099.60761113214, 291035573,    0
$$ Real data points
##PAGE= N=1
##DATA TABLE= (X++(R..R)), XYDATA
$$ [...]
$$ plain form
6073 3730438 3574885 3397219 3229381 3040017 2915998 2791891 2665253 2634130 2481262 2341197
6063 2341197 2386009 2218439 2088955 2154561 2037629 1851643 1908326 1858973 1741309 1687991
6053 1687991 1700055 1773224 1799408 1694382 1690902 1491348 1391978 1407441 1382843 1493062 1484565
6042 1484565 1392235 1465754 1437857 1341356 1251483 1253055 1300037 1260530 1088078 969908 1073822
6031 1073822 1100343 1129870 1114090 1032674 948390 910582 901334 934107 969562 962028 1021505 963111
6019 963111 826766 798934 795115 867639 712245 678496 837754 692555 790569 753262 627412
6008 627412 733445 818441 740255 677330 643504 720918 666910 642930 756697 758755 775824
5997 775824 766010 806627 815168 843705 838808 734102 757698 860217 901500 993620 1293605 1537977
$$ packed form
6073C730438j55553j77666j67838j89364j24019j24107j26638l1123j52868j40065
6063B341197M4812j67570j29484O5606j16932j85986N6683m9353j17664n3318
6053A687991J2064P3169K6184j05026l480j99554r9370J5463k4598J10219q497
6042A484565r2330P3519k7897r6501q9873J572M6982l9507j72452j18170J03914
6031A073822K6521K9527j5780q1416q4284l7808r248L2773L5455p534N9477n8394
6019I63111j36345k7832l819P2524j55394l3749J59258j45199R8014l7307j25850
6008F27412J06033Q4996p8186o2925l3826P7414n4008k3980J13767K058J7069
5997G75824r814M0617Q541K8537m897j04706K3596J02519M1283R2120K99985K44372
$$ plain form
5985 1537977 1711681 1818194 2040289 2209061 2176494 2036578 1890401 1754631 1642843 1511282
5975 1511282 1353445 1086751 1127454 1067492 1060708 992717 972923 933118 813142 727853 746110
5964 746110 664941 653951 693112 661938 661545 742159 696213 791137 945233 760116 678288 722283
5952 722283 789099 731024 767302 764899 880631 822907 869145 798025 762591 742612 902490
5941 902490 975740 1011051 1019746 982413 1002368 946241 909558 1059990 1008110 1022797 1007505 998491
5929 998491 1076807 1106398 1150018 1194953 1175372 1197805 1111281 1196043 1281288 1296237 1223187 1320121
5917 1320121 1355127 1444838 1415325 1486856 1450197 1263626 1394981 1450483 1561787 1583385 1515595
5906 1515595 1597677 1584249 1637682 1731398 1687556 1739202 1793396 1862679 1985276 2091681 2169038
$$ packed form
5985A537977J73704J06513K22095J68772l2567j39916j46177j35770j11788j31561
5975A511282j57837k66694M0703n9962o784o7991j9794l9805j19976q5289J8257
5964G46110q1169j0990L9161l1174l93Q0614m5946R4924J54096j85117q1828M3995
5952G22283O6816n8075L6278k403J15732n7724M6238p1120l5434j9979J59878
5941I02490P3250L5311Q695l7333J9955n6127l6683J50432n1880J4687j5292r014
5929I98491P8316K9591M3620M4935j9581K2433q6524Q4762Q5245J4949p3050R6934
5917A320121L5006Q9711k9513P1531l6659j86571J31355N5502J11304K1598o7790
5906A515595Q2082j3428N3433R3716m3842N1646N4194O9283J22597J06405P7357
$$ plain form
5895 2169038 2440829 2648913 2804204 3174166 3556396 4243379 4913131 5597832 6182239 6454289
5885 6454289 6707366 7076918 7705169 8816608 10427225 12309525 14050782 14811625 14605180
5876 14605180 13897575 13035226 11787147 10511086 9490190 8262965 7249032 6428283 5694471
5867 5694471 5228092 4985758 4668947 4415197 4325124 4272346 4203385 4064650 4130380 4134564 4263877
5856 4263877 4315853 4505827 4578965 4810798 5126770 5456663 5766304 6097476 6261285 6610673
5846 6610673 7059500 7613162 8115186 8764967 9517556 10258364 11143401 12089589 13121681
5837 13121681 14306585 15665460 17472788 19634514 22322858 25479665 29551530 35170125
5829 35170125 43275626 55880560 74791136 99738430 126368006 147479215 157624670
$$ packed form
5895B169038K71791K08084J55291L69962L82230O86983O69752O84701N84407K72050
5885F454289K53077L69552O28251J111439J610617J882300J741257P60843k06445
5876A4605180p07605q62349j248079j276061j020896j227225j013933q20749p33812
5867E694471m66379k42334l16811k53750r0073n2778o8961j38735O5730M184J29313
5856D263877N1976J89974P3138K31833L15972L29893L09641L31172J63809L49388
5846F610673M48827N53662N02024O49781P52589P40808Q85037R46188J032092
5837A3121681J184904J358875J807328K161726K688344L156807M071865N618595
5829C5170125Q105501J2604934J8910576K4947294K6629576K1111209J0145455
$$ plain form
5822 157624670 155202353 145477080 132720355 117513008 101443523 85646052 70436293
5815 70436293 56172903 43927724 34426861 27602671 22847810 19345941 16763496 14574921
5807 14574921 12675549 11304318 10152222 9359237 8681768 8071772 7578487 7317939 6862905
5798 6862905 6516043 6282969 6025692 5949982 5673888 5353141 5243769 5166780 5129467 4887640
5788 4887640 4786900 4593643 4366250 4253273 4128991 3840773 3664577 3623976 3443684 3269120
5778 3269120 3191213 3062003 3054959 2861609 2849684 2848398 2667673 2550820 2492147 2229925 2131781
5767 2131781 2138397 2184313 2104031 2039081 1951128 1873596 1963515 1873686 1776671 1710661 1671311 1658159
5755 1658159 1671352 1646760 1671307 1656864 1660128 1611479 1540813 1503589 1565292 1494419 1565643 1572760
$$ packed form
5822A57624670k422317r725273j2756725j5207347j6069485j5797471j5209759
5815G0436293j4263390j2245179r500863o824190m754861l501869k582445k188575
5807A4574921j899372j371231j152096p92985o77469o09996m93285k60548m55034
5798F862905l46862k33074k57277p5710k76094l20747j09372p6989l7313k41827
5788D887640j00740j93257k27393j12977j24282k88218j76196m0601j80292j74564
5778C269120p7907j29210p044j93350j1925j286j80725j16853n8673k62222r8144
5767B131781O616M5916q0282o4950q7953p7532Q9919q9829r7015o6010l9350j3152
5755A658159J3193k4592K4547j4443L264m8649p0666l7224O1703p0873P1224P117
$$ plain form
5743 1572760 1438615 1420399 1438676 1455048 1340400 1216751 1238257 1292385 1289634 1197849 1127042
5732 1127042 1133336 1232729 1078385 1062931 1085897 1099244 1016778 938678 975635 1011938 1040081
5721 1040081 1037360 1114196 1059449 1041219 1092287 1054771 931450 929098 1021924 1019596 983516 936877
5709 936877 1041211 990900 957554 1074491 1032424 955615 922807 1013048 954128 955966 909451
5698 909451 968557 949005 1235697 1205449 1315314 1309127 1250857 1346476 1454021 1493771 1559857
5687 1559857 1605121 1695076 1850958 2065707 2088136 2298251 2554115 2676323 2995972 3411542
5677 3411542 3937336 4538795 5155974 5814235 6506961 7103853 7594595 7663519 7853654 8061690
5667 8061690 8110286 7981217 8019161 8081012 8225077 8250435 8150261 8205039 7819383 7257351
$$ packed form
5743A572760j34145j8216J8277J6372j14648j23649K1506N4128k751r1785p0807
5732A127042O294R9393j54344j5454K2966J3347q2466p8100L6957L6303K8143
5721A040081k721P6836n4747j8230N1068l7516j23321k352R2826k328l6080m6639
5709I36877J04334n0311l3346J16937m2067p6809l2808R0241n8920J838m6515
5698I09451N9106j9552K86692l0248J09865o187n8270R5619J07545L9750O6086
5687A559857M5264Q9955J55882K14749K2429K10115K55864J22208L19649M15570
5677C411542N25794O01459O17179O58261O92726N96892M90742O8924J90135K08036
5667H061690M8596j29069L7944O1851J44065K5358j00174N4778l85656n62032
$$ plain form
5657 7257351 6741001 6046919 5412483 4891791 4340943 3804363 3358140 2958353 2681138 2436706
5647 2436706 2172853 1954666 1761424 1551538 1502803 1405186 1427276 1293724 1156741 1186885
5637 1186885 1166826 1047277 1082271 968782 1037953 908222 792825 712116 668597 656913 689390
5626 689390 624473 745746 782822 689550 656943 726111 634837 450286 390484 494435 595678
5615 595678 573348 529416 445178 534355 610897 479257 337147 329873 497311 570990 409605
5604 409605 374227 318279 344900 429433 491783 509318 455227 330654 325646 447646 460618
5593 460618 326211 279193 474878 458225 438165 443389 370801 390314 518931 499059 341969
5582 341969 351161 427085 345517 139532 153464 236184 295772 312057 288518 91734 152670
$$ packed form
5657G257351n16350o94082o34436n20692n50848n36580m46223l99787k77215k44432
5647B436706k63853k18187j93242k09886m8735r7617K2090j33552j36983L0144
5637A186885k0059j19549L4994j13489O9171j29731j15397q0709m3519j1684L2477
5626F89390o4917J21273L7076r3272l2607O9168r1274j84551n9802J03951J01243
5615E95678k2330m3932q4238Q9177P6542j31640j42110p274J67438P3679j61385
5604D09605l5378n5948K6621Q4533O2350J7535n4091j24573n008J22000J2972
5593D60618j34407m7018J95685j6653k0060N224p2588J9513J28617j9872j57090
5582C41969R192P5924q1568k05985J3932Q2720N9588J6285k3539j96784O0936
$$ plain form
5571 152670 220389 375702 458717 353381 368069 266433 233148 154063 73774 255606 239199
5560 239199 214111 259144 258070 276513 317454 201021 134004 149485 279722 249880 326479
5549 326479 399976 323140 327899 414067 350861 360884 345987 297888 355927 321826 244866 228405
5537 228405 182491 207408 233559 179184 235286 329947 201650 139632 192737 128269 95943
5526 95943 42965 -27693 -6045 46348 220134 244075 79859 182976 149464 236633 175161
5515 175161 146805 138751 69773 70803 167429 224815 172619 240818 215943 171118 203536 242126
5503 242126 390144 441553 357215 337994 303909 281730 311666 357214 212535 247478 320080
5492 320080 393789 534429 700789 806778 924363 873094 870679 811832 791018 661320 589993
$$ packed form
5571A52670O7719J55313Q3015j05336J4688j01636l3285p9085q0289J81832j6407
5560B39199k5088M5033j074J8443M0941j16433o7017J5481J30237k9842P6599
5549C26479P3497p6836M759Q6168o3206J0023j4897m8099N8039l4101p6960j6461
5537B28405m5914K4917K6151n4375N6102R4661j28297o2018N3105o4468l2326
5526I5943n2978p0658K1648N2393J73786K3941j64216J03117l3512Q7169o1472
5515A75161k8356q054o8978J030R6626N7386n2196O8199k4875m4825L2418L8590
5503B42126J48018N1409q4338j9221l4085k2179K9936M5548j44679L4943P2602
5492C20080P3709J40640J66360J05989J17585n1269k415n8847k0814j29698p1327
$$ plain form
5481 589993 507237 285246 299992 269176 119301 236895 301368 300964 174277 270931 335429
5470 335429 348218 375156 309830 306950 110516 95055 16426 35568 168639 9499 55363
5459 55363 1179 -74571 176367 68446 96404 7891 60812 112063 73145 113061 217303
5448 217303 176522 88754 111491 183878 74684 180397 199042 130254 183299 38912 46718
5437 46718 57305 87979 108821 18264 -20147 -15218 91989 71363 104754 108509 77031 -6586
5425 -6586 20930 107510 108108 205169 334421 299707 166133 218471 119769 -27171 47995 7190
5413 7190 82241 76472 40342 -33498 49862 39344 51432 -38119 -68287 130615 154585 85477
5401 85477 -68056 -29365 6683 138334 43160 83063 121938 -38974 -62833 31657 161496
$$ packed form
5481E89993q2756k21991J4746l0816j49875J17594O4473m04j26687R6654O4498
5470C35429J2789K6938o5326k880j96434j5461p8629J9142J33071j59140M5864
5459E5363n4184p5750K50938j07921K7958q8513N2921N1251l8918L9916J04242
5448B17303m0781q7768K2737P2387j09194J05713J8645o8788N3045j44387P806
5437D6718J0587L0674K0842r0557l8411M929J07207k0626L3391L755l1478q3617
5425f586K7516Q6580N98R7061J29252l4714j33574N2338r8702j46940P5166m0805
5413G190P5051n769l6130p3840Q3360j0518J2088q9551l0168J98902K3970o9108
5401H5477j53533L8691L6048J31651r5174L9903L8875j60912k3859R4490J29839
$$ plain form
5390 161496 214457 171768 235824 75662 1908 95160 81486 151949 214753 156182 216324
5379 216324 105494 48119 119190 147302 192177 72456 -46172 -125532 22213 93185 140133
5368 140133 126465 87522 89030 181171 216331 120804 107741 35746 -52604 -82349 -28291 93281
5356 93281 200890 117821 51114 14872 25262 80658 14303 78291 65628 -26858 1147 21973
5344 21973 79759 99491 111727 214570 125771 26662 46337 184023 177387 86201 80878 157236
5332 157236 42669 105881 99617 5820 10727 29909 47852 35590 30160 -121872 -178051 -18152
5320 -18152 130601 61439 81514 48584 -17912 48603 239861 143079 -25557 -56960 5603
5309 5603 61472 134598 95763 128404 43921 3352 107770 155599 189051 137771 81537 49520
$$ packed form
5390A61496N2961m2689O4056j60162p3754R3252j3674P0463O2804n8571O0142
5379B16324j10830n7375P1071K8112M4875j19721j18628p9360J47745P0972M6948
5368A40133j3668l8943J508R2141L5160r5527j3063p1995q8350k9745N4058J21572
5356I3281J07609q3069o6707l6242J0390N5396o6355O3988j2663r2486K8005K0826
5344B1973N7786J9732J2236J02843q8799r9109J9675J37686o636r1186n323P6358
5332A57236j14567O3212o264r3797M907J9182J7943j2262n430j52032n6179J59899
5320a8152J48753o9162K0075l2930o6496O6515J91258r6782j68636l1403O2563
5309E603N5869P3126l8835L2641q4483m0569J04418M7829L3452n1280n6234l2017
$$ plain form
5297 49520 32302 72774 24245 93253 103788 -644 -12316 122250 134628 5203 22891
5286 22891 37407 -19575 44592 81704 23102 -20315 137559 60782 -24213 -80144 -85293 -90185
5274 -90185 8577 137222 24186 -40604 13915 85418 90315 89873 241679 236167 49358 56614
5262 56614 116088 87882 81438 170644 56161 138612 108674 53911 42569 73896 101819 81220
5250 81220 -90168 90139 89627 -100851 -102229 -50816 37653 50744 98670 -1680 -92788 -114509
5238 -114509 30231 62062 180656 45680 17290 44263 180750 217403 83352 19601 -75123
5227 -75123 -91203 -158087 -105810 -26667 38630 -32099 -113089 -140892 -69484 -53555 29389 53845
5215 53845 16263 48697 41775 -19862 -17231 64516 98457 109313 18540 -31309 -107089 -45806
$$ packed form
5297D9520j7218M0472m8529O9008J0535j04432j1672J34566J2378j29425J7688
5286B2891J4516n6982O4167L7112n8602m3417J57874p6777q4995n5931n149m892
5274i0185R8762J28645j13036o4790N4519P1503M897m42J51806n512j86809P256
5262E6614N9474k8206o444Q9206j14483Q2451k9938n4763j1342L1327K7923k0599
5250H1220j71388J80307n12j90478j378N1413Q8469J3091M7926j00350r1108k1721
5238a14509J44740L1831J18594j34976k8390K6973J36487L6653j34051o3751r4724
5227g5123j6080o6884N2277P9143O5297p0729q0990k7803P1408J5929Q2944K4456
5215E3845l7582L2434o922o1637K631Q1747L3941J0856r0773m9849p5780O1283
$$ plain form
5203 -45806 91314 92466 -12253 104880 115406 -2027 -13361 -13227 95456 -10881 4366
5192 4366 158655 73164 -118392 15250 19930 81567 4335 129946 307133 244102 184663
5181 184663 163650 141086 65139 54036 177061 239852 76460 23018 121067 129822 170459
5170 170459 113303 126115 127418 141486 223890 69146 82129 110995 120888 186578 7805 -82595
5158 -82595 -10868 -8665 181922 117320 -33693 -21844 62719 -42691 21180 27107 81575 120476
5146 120476 86559 252074 243591 214629 163620 168551 64418 92220 133142 220599 163794 301363
5134 301363 352481 285933 212804 192309 108115 55184 114022 188443 241151 241790 296037 276913
5122 276913 266592 154241 84491 137147 206969 212132 169031 173846 256866 247848 182646 251484
$$ packed form
5203d5806J37120J152j04719J17133J0526j17433j1334J34J08683j06337J5247
5192D366J54289q5491j91556J33642M680O1637p7232J25611J77187o3031n9439
5181A84663k1013k2564p5947j1103J23025O2791j63392n3442R8049Q755M0637
5170A70459n7156J2812J303J4068Q2404j54744J2983K8866R893O5690j78773r0400
5158h2595P1727K203J90587o4602j51013J1849Q4563j05410O3871N927N4468L8901
5146A20476l3917J65515q483k8962n1009M931j04133K7802M0922Q7457n6805J37569
5134C01363N1118o6548p3129k0495q4194n2931N8838P4421N2708O39N4247j9124
5122B76913j0321j12351o9750N2656O9822N163m3101M815Q3020r018o5202O8838
$$ plain form
5110 251484 129910 131730 139029 118864 175107 135620 200599 195297 52122 157878 215348 263819
5098 263819 361147 270607 184886 237978 292827 220253 355758 215014 283670 375714 306288
5087 306288 311763 390604 335399 248614 295743 272354 296184 309788 314854 262076 181248 144625
5075 144625 33937 208926 335307 334260 180161 250036 299463 247183 212259 204121 208844
5064 208844 142476 41302 3579 92584 158516 106210 164519 135916 158538 107174 155410
5053 155410 199477 362541 347751 290072 354947 414322 441846 410379 366590 297357 369331
5042 369331 412927 445497 332165 327372 466403 405213 420930 282070 188827 327273 224644
5031 224644 275260 262816 208152 152179 131808 191284 258619 233774 190506 227590 80278
$$ packed form
5110B51484j21574J820P299k0165N6243l9487O4979n302j43175J05756N7470M8471
5098B63819R7328r0540q5721N3092N4849p2574J35505j40744O8656R2044o9426
5087C06288N475P8841n5205q6785M7129k3389K3830J3604N066n2778q0828l6623
5075A44625j10688J74989J26381j047j54099O9875M9427n2280l4924q138M723
5064B08844o6368j01174l7723Q9005O5932n2306N8309k8603K2622n1364M8236
5053A55410M4067J63064j4790n7679O4875N9375K7524l1467m3789o9233P1974
5042C69331M3596L2570j13332m793J39031o1190J5717j38860r3243J38446j02629
5031B24644N0616j2444n4664n5973k0371N9476O7335k4845m3268L7084j47312
$$ plain form
5020 80278 98908 140215 149777 145790 243958 256390 223017 78506 174745 295086 257483 439590
5008 439590 378020 420972 404639 377283 262705 209360 152495 165899 193121 323688 289189
4997 289189 382745 451790 488571 471399 295801 248964 319916 254143 232874 314930 404446
4986 404446 405549 395190 320995 268932 269882 361196 469052 376332 433433 497295 469977 437976
4974 437976 439708 598205 387665 244848 332212 355136 509300 502435 506126 397251 423899
4963 423899 506202 481364 519426 599240 680206 651402 606548 622730 597803 534745 492002 392512
4951 392512 541431 420081 476013 451541 424224 473374 471285 474744 535695 517351 514769 509540
4939 509540 619055 727012 653815 761232 804471 765718 754597 688639 658443 733258 834675
$$ packed form
5020H0278J8630M1307R562l987R8168J2432l3373j44511R6239J20341l7603J82107
5008D39590o1570M2952j6333k7356j14578n3345n6865J3404K7222J30567l4499
4997B89189R3556O9045L6781j7172j75598m6837P0952o5773k1269Q2056Q9516
4986D04446J103j0359p4195n2063R50R1314J07856r2720N7101O3862k7318l2001
4974D37976J732J58497k10540j42817Q7364K2924J54164o865L691j08875K6648
4963D23899Q2303k4838L8062P9814Q0966k8804m4854J6182k4927o3058m2743r9490
4951C92512J48919j21350N5932k4472k7317M9150k089L459O0951j8344k582n229
4939E09540J09515J07957p3197J07417M3239l8753j1121o5958l0196P4815J01417
$$ plain form
4928 834675 778515 760025 719957 667971 722649 782183 726134 612094 692028 739522 805499
4917 805499 785566 872617 880251 911934 848075 846086 981359 984875 964368 1001780 921262 934218
4905 934218 998142 1046932 1119076 1194941 1166174 1156723 1284849 1307005 1281169 1290137 1411090 1555432
4893 1555432 1609830 1630612 1561570 1594298 1670910 1762254 1906972 2048467 2068237 2196997 2342512
4882 2342512 2450964 2545759 2623496 2633417 2846352 2967154 3112090 3285522 3339717 3357959 3312727
4871 3312727 3405263 3578369 3740935 3818187 4010321 4189669 4306099 4493231 4689277 4942576
4861 4942576 5175277 5446274 5645103 5984107 6245833 6504707 6868211 7304999 7718008 8129930
4851 8129930 8527025 8908606 9246191 9732139 10250731 10829982 11474560 11913001 12521937 12983001
$$ packed form
4928H34675n6160j8490m0068n1986N4678N9534n6049j14040P9934M7494O5977
4917H05499j9933Q7051P634L1683o3859j989J35273L516k0507L7412q0518J2956
4905I34218O3924M8790P2144P5865k8767r451J28126K2156k5836Q968J20953J44342
4893A555432N4398K0782o9042L2728P6612R1344J44718J41495J9770J28760J45515
4882B342512J08452R4795P7737R921K12935J20802J44936J73432N4195J8242m5232
4871C312727R2536J73106J62566P7252J92134J79348J16430J87132J96046K53299
4861D942576K32701K70997J98829L39004K61726K58874L63504M36788M13009M11922
4851H129930L97095L81581L37585M85948N18592N79251O44578M38441O08936M61064
$$ plain form
4841 12983001 13528659 13987831 14286431 14680124 15080060 15477338 15719495 15996470 16375202
4832 16375202 16877061 17258330 17675884 18176464 18610772 19108414 19676181 20196583 20717393
4823 20717393 21386437 22134239 22713478 23469106 24333530 25080054 25787872 26578713 27328372
4814 27328372 28095533 28902911 29783721 30525068 31092468 31474112 31516093 31402092 31113086 30711516
4804 30711516 30308831 29833661 29283260 28881159 28298107 27805963 27410341 26964930 26527198
4795 26527198 26121575 25504904 25066780 24432183 23920868 23230626 22663059 22118881 21451077
4786 21451077 20972915 20349435 19736526 19163208 18700679 17978313 17287635 16665262 15970671
4777 15970671 15355830 14814018 14193240 13731632 13287094 12653622 12244013 11663547 11162146
$$ packed form
4841A2983001N45658M59172K98600L93693L99936L97278K42157K76975L78732
4832A6375202N01859L81269M17554N00580M34308M97642N67767N20402N20810
4823B0717393O69044P47802N79239P55628Q64424P46524P07818P90841P49659
4814B7328372P67161Q07378Q80810P41347N67400L81644M1981j14001k89006m01570
4804C0711516m02685m75170n50401m02101n83052m92144l95622m45411m37732
4795B6527198m05623o16671m38124o34597n11315o90242n67567n44178o67804
4786B1451077m78162o23480o12909n73318m62529p22366o90678o22373o94591
4777A5970671o14841n41812o20778m61608m44538o33472m09609n80466n01401
$$ plain form
4768 11162146 10673755 10310064 9947281 9589856 9378328 9097618 8815919 8525030 8245527
4759 8245527 8012449 7638754 7370479 7201631 6989203 6913890 6688623 6560168 6514442 6522378
4749 6522378 6326733 6177360 6227569 6187576 6211264 6140933 6044939 6078012 6069857 6053054 6081460
4738 6081460 6056346 6140604 6097873 6088036 6024319 6124725 6260210 6274341 6337813 6359101 6481406
4727 6481406 6682895 7028477 7305975 7575887 7836659 8254358 8642451 9042696 9414041 9885310
4717 9885310 10606546 11307409 11887919 12660707 13394397 14030022 14789741 15429627 16046108 16713109
4707 16713109 17212855 17658796 18224685 18815923 19363776 19932429 20572414 21262122 21952556
4698 21952556 22593622 23267127 23847646 24513848 25210790 25820251 26235041 26770317 27377664
$$ packed form
4768A1162146m88391l63691l62783l57425k11528k80710k81699k90889k79503
4759H245527k33078l73695k68275j68848k12428p5313k25267j28455m5726P936
4749F522378j95645j49373N0209l9993K3688p0331r5994L3073q155j6803K8406
4738F081460k5114Q4258m2731r837o3717J00406J35485J4131O3472K1288J22305
4727F481406K01489L45582K77498K69912K60772M17699L88093M00245L71345M71269
4717I885310P21236P00863N80510P72788P33690O35625P59719O39886O16481O67001
4707A6713109M99746M45941N65889N91238N47853N68653O39985O89708O90434
4698B1952556O41066O73505N80519O66202O96942O09461M14790N35276O07347
$$ plain form
4689 27377664 27846758 28430007 29160327 29861183 30395066 30778931 30776173 30620367 30528413 30240009
4679 30240009 29709217 29090512 28524188 27738042 26685014 25764210 25095516 24367905 23523979
4670 23523979 22711151 21801416 20910712 20019847 19238009 18491546 18012260 17443669 16883682
4661 16883682 16541432 16122354 15676591 15311736 15048891 14695996 14304525 13981548 13550770
4652 13550770 12951614 12463372 11956105 11316336 10808973 10234590 9558886 8912231 8198390
4643 8198390 7652309 7221034 6695009 6143387 5811095 5383687 5162799 4875995 4587538 4338956
4633 4338956 4045535 3861712 3754687 3735371 3563376 3471390 3203119 3124964 3043915 2911672
4623 2911672 2798485 2694788 2587800 2582879 2577231 2316410 2357676 2483561 2345324 2308045 2234035
$$ packed form
4689B7377664M69094N83249P30320P00856N33883L83865k758j55806r1954k88404
4679C0240009n30792o18705n66324p86146j053028r20804o68694p27611q43926
4670B3523979q12828r09735q90704q90865p81838p46463m79286n68591n59987
4661A6883682l42250m19078m45763l64855k62845l52895l91471l22977m30778
4652A3550770n99156m88242n07267o39769n07363n74383o75704o46655p13841
4643H198390n46081m31275n26025n51622l32292m27408k20888k86804k88457k48582
4633D338956k93421j83823j07025j9316j71995r1986k68271p8155q1049j32243
4623B911672j13187j03697j06988m921n648k60821M1266J25885j38237l7279p4010
$$ plain form
4612 2234035 2077292 2061561 2003532 1944269 1915329 1830119 1810410 1686112 1672349 1675625 1640713
4601 1640713 1493922 1653084 1656447 1680573 1668561 1561857 1628356 1653978 1611905 1566524 1573510
4590 1573510 1496757 1512575 1500856 1435728 1465180 1347818 1342556 1327359 1470638 1559846 1552863
4579 1552863 1424372 1262098 1280342 1293382 1437158 1283873 1340344 1341933 1431404 1390779 1428319
4568 1428319 1254020 1129093 1218503 1167503 1169235 1129620 1061520 1104891 1216784 1199262 1247443
4557 1247443 1271544 1245080 1202810 1334726 1392186 1294948 1307863 1346034 1392403 1343545 1338259
4546 1338259 1392082 1478617 1315951 1301169 1234264 1296786 1356567 1322426 1295454 1343455 1377245
4535 1377245 1340777 1508342 1602411 1493532 1433589 1497025 1628275 1587089 1628842 1543659 1551448
$$ packed form
4612B234035j56743j5731n8029n9263k8940q5210j9709j24298j3763L276l4912
4601A640713j46791J59162L363K4126j2012j06704O6499K5622m2073m5381O986
4590A573510p6753J5818j1719o5128K9452j17362n262j5197J43279Q9208o983
4579A552863j28491j62274J8244J3040J43776j53285N6471J589Q9471m0625L7540
4568A428319j74299j24927Q9410n1000J732l9615o8100M3371J11893j7522M8181
4557A247443K4101k6464m2270J31916N7460r7238J2915L8171M6369m8858n286
4546A338259N3823Q6535j62666j4782o6905O2522N9781l4141k6972M8001L3790
4535A377245l6468J67565R4069j08879n9943O3436J31250m1186M1753q5183P789
$$ plain form
4524 1551448 1481458 1646225 1841515 1790888 1813600 1776362 1781472 1771036 1815919 1865909 1876672
4513 1876672 1816391 1830441 1580899 1660544 1798647 1746568 1770263 1999326 2132690 2152112 2174313
4502 2174313 2278737 2362346 2416398 2346984 2433224 2670492 2904321 3093563 3341368 3478944
4492 3478944 3711084 4199941 4788630 5290491 5981281 6952756 8217891 9895816 11693023
4483 11693023 13240689 14327883 15248717 15891146 16338839 16657205 17231679 18382577 20235393
4474 20235393 22963903 26069933 28376730 29497378 29338928 28108776 26480655 24768257
4466 24768257 23043481 21589535 20316096 19323939 18546899 17771826 16953758 16024042 14824174
4457 14824174 13610611 12359208 11148531 9985984 8800640 7751190 6720484 6029298
$$ packed form
4524A551448o9990J64767J95290n0627K2712l7238N110j0436M4883M9990J0763
4513A876672o0281J4050k49542P9645J38103n2079K3695K29063J33364J9422K2201
4502B174313J04424Q3609N4052o9414Q6240K37268K33829J89242K47805J37576
4492C478944K32140M88857N88689N01861O90790R71475J265135J677925J797207
4483A1693023J547666J087194R20834O42429M47693L18366N74474J150898J852816
4474B0235393K728510L106030K306797J120648j58450j230152j628121j712398
4466B4768257j724776j453946j273439r92157p77040p75073q18068r29716j199868
4457A4824174j213563j251403j210677j162547j185344j049450j030706o91186
$$ plain form
4449 6029298 5489927 5015402 4699268 4337334 4084515 3779597 3619894 3509501 3363060 3162232
4439 3162232 3058345 3013538 2893576 2742575 2608329 2596839 2510360 2491053 2427789 2303176
4429 2303176 2236837 2201988 2187548 2241522 2083092 2062060 1994192 2009561 2026076 2173555 2194707
4418 2194707 2140785 2216738 2241978 2103620 2105601 2073489 2113504 2090076 2132137 2167351 2136798
4407 2136798 2132383 2046160 2081375 2117344 2161057 2116292 2139749 2242530 2314270 2274425 2312181
4396 2312181 2347213 2309262 2373329 2475987 2317901 2346677 2365076 2323236 2394505 2459954 2630239
4385 2630239 2922612 2853344 3010696 3162776 2939386 2838630 2952055 3097096 3256020 3476581
4375 3476581 3420150 3550837 3622258 3798648 3991996 4084582 4386287 4549164 4794854 5082135
$$ packed form
4449F029298n39371m74525l16134l61934k52819l04918j59703j10393j46441k00828
4439C162232j03887m4807j19962j51001j34246j1490q6479j9307o3264j24613
4429B303176o6339l4849j4440N3974j58430k1032o7868J5369J6515J47479K1152
4418B194707n3922P5953K5240j38358J981l2112M0015k3428M2061L5214l0553
4407B136798m415q6223L5215L5969M3713m4765K3457J02781P1740l9845L7756
4396B312181L5032l7951O4067J02658j58086K8776J8399m1840P1269O5449J70285
4385B630239K92373o9268J57352J52080k23390j00756J13425J45041J58924K20561
4375C476581n6431J30687P1421J76390J93348R2586L01705J62877K45690K87281
$$ plain form
4365 5082135 5352554 5778175 6184607 6658564 6931259 7160923 7505958 7766496 7970650 8157343
4355 8157343 8383570 8667152 8863951 9216562 9807398 10425151 11095547 11785896 12561368 13095015
4345 13095015 13500612 13980728 14415576 14630558 14820724 15113852 15527731 16024304 16305196
4336 16305196 16720363 17433875 18263567 19174648 19895084 20530674 21020615 21161805 20939878
4327 20939878 20717110 20245018 19549874 19093047 18842157 18720632 18782976 18778369 18964000 19167345
4317 19167345 19091570 18718048 18188545 17640662 16931918 16201686 15608770 14905776 14287473 13634663
4307 13634663 13241623 13019848 12697432 12405251 12276857 11930395 11596501 11229947 10761254
4298 10761254 10562915 10158714 9820486 9592462 9387702 9196618 9071018 8924276 8735099
$$ packed form
4365E082135K70419M25621M06432M73957K72695K29664L45035K60538K04154J86693
4355H157343K26227K83582J96799L52611N90836O17753O70396O90349P75472N33647
4345A3095015M05597M80116M34848K14982J90166K93128M13879M96573K80892
4336A6305196M15167P13512Q29692R11081P20436O35590M89941J41190k21927
4327B0939878k22768m72092o95144m56827k50890j21525O2344m607J85631K03345
4317A9167345p5775l73522n29503n47883p08744p30232n92916p02994o18303o52810
4307A3634663l93040k21775l22416k92181j28394l46462l33894l66554m68693
4298A0761254j98339m04201l38228k28024k04760j91084j25600j46742j89177
$$ plain form
4289 8735099 8653819 8591416 8451560 8477061 8579950 8776136 8720253 8902463 9267879 9635257
4279 9635257 9961356 10498986 10943007 11446601 12191130 12911013 13920242 15062294 16407500
4270 16407500 18316230 20369687 22643964 25358106 28339192 31478685 34869472 37970195
4262 37970195 40904582 43667812 45751307 47295833 48317980 48736833 48497116 47969704 47035898
4253 47035898 45949875 44802319 43844734 42796345 41967827 41243755 40348956 39548377 38795318
4244 38795318 37789274 36560320 35152992 33380318 31477294 29481870 27224715 25067125
4236 25067125 22787825 20538042 18435309 16552038 14960932 13456880 12039775 10821502
4228 10821502 9943671 9013138 8489295 7904045 7236097 6864024 6493916 6162668 5882492
$$ packed form
4289H735099q1280o2403j39856K5501J02889J96186n5883J82210L65416L67378
4279I635257L26099N37630M44021N03594P44529P19883J009229J142052J345206
4270A6407500J908730K053457K274277K714142K981086L139493L390787L100723
4262C7970195K934387K763230K083495J544526J022147M18853k39717n27412r33806
4253D7035898j086023j147556r57585j048389q28518p24072q94799q00579p53059
4244C8795318j006044j228954j407328j772674j903024j995424k257155k157590
4236B5067125k279300k249783k102733j883271j591106j504052j417105j218273
4228A0821502q77831r30533n23843n85250o67948l72073l70108l31248k80176
$$ plain form
4219 5882492 5724783 5620234 5453878 5316243 5031813 4905770 4716434 4592982 4483928 4399619
4209 4399619 4375150 4443415 4336168 4072823 4070390 4036391 3939719 3728436 3732234 3713510 3649343
4198 3649343 3692908 3631430 3641450 3670123 3529392 3486363 3596528 3673756 3598453 3454796 3449229
4187 3449229 3480131 3475684 3478470 3349706 3300445 3246508 3095298 3073401 3044237 3028714 3015839
4176 3015839 2849723 2904912 3042232 3105927 3196099 3106012 3008389 3110236 3093150 3068952 3130562
4165 3130562 3112473 2989620 2974276 3053640 3190678 3199396 3333145 3301467 3060909 3071608 3071779
4154 3071779 3030819 3029670 3068083 3134735 3145442 3133503 3204933 3332811 3275978 3387793 3506735
4143 3506735 3514694 3532273 3567168 3713771 3743862 3805397 3816235 3953846 4087350 4217315 4210535
$$ packed form
4219E882492j57709j04549j66356j37635k84430j26043j89336j23452j09054q4309
4209D399619k4469O8265j07247k63345k433l3999r6672k11283L798j8724o4167
4198C649343M3565o1478J0020K8673j40731m3029J10165P7228p5303j43657n567
4187C449229L0902m447K786j28764m9261n3937j51210k1897k9164j5523j2875
4176C015839j66116N5189J37320O3695R0172r0087r7623J01847j7086k4198O1610
4165C130562j8089j22853j5344P9364J37038Q718J33749l1678k40558J0699J71
4154C071779m0960j149L8413O6652J0707j1939P1430J27878n6833J11815J18942
4143C506735P959J7579L4895J46603L0091O1535J0838J37611J33504J29965o780
$$ plain form
4132 4210535 4226015 4427967 4483482 4527620 4579504 4704950 4935855 5058841 5133489 5367424
4122 5367424 5425087 5485756 5580997 5659029 5790476 5874642 5992891 6150881 6308670 6431367
4112 6431367 6659886 6805871 7093431 7369647 7789279 8040629 8237405 8496227 8897402 9181111
4102 9181111 9494776 9881528 10229423 10728434 11338039 11735686 12245913 12996797 13812126 14749991
4092 14749991 15775300 17028934 18564970 20370916 22364480 24485415 27067948 30314957
4084 30314957 34115666 38677192 44082786 50389108 57601792 66209568 75637196 86018767
4076 86018767 96792509 107518184 117685508 126511855 133295894 137846797 139856608 138797891
4068 138797891 135086503 128995736 121010173 111672988 101531899 90919412 80560557 70861582
$$ packed form
4132D210535J5480K01952N5515M4138N1884J25446K30905J22986P4648K33935
4122E367424N7663O0669R5241P8032J31447Q4166J18249J57990J57789J22697
4112F431367K28519J45985K87560K76216M19632K51350J96776K58822M01175K83709
4102I181111L13665L86752L47895M99011O09605L97647N10227P50884Q15329R37865
4092A4749991J025309J253634J536036J805946J993564K120935K582533L247009
4084C0314957L800709M561526N405594O306322P212684Q607776R427628J0381571
4076H6018767J0773742J0725675J0167324Q826347O784039M550903K009811j058717
4068A38797891l711388o090767p985563r337185j0141089j0612487j0358855r698975
$$ plain form
4060 70861582 61862094 53985971 47065424 40967972 35768882 31411652 27908990 24799488
4052 24799488 22277128 20271917 18416336 16926106 15748991 14602136 13734856 13071870
4044 13071870 12444840 11872141 11395525 11042860 10739800 10285829 9861361 9521059 9281930
4035 9281930 9014274 8928140 8810129 8637827 8393095 8226108 7998152 7910273 7951881 7829424
4025 7829424 7803913 7696830 7670120 7588275 7471919 7394042 7346223 7376873 7535037 7535468 7494738
4014 7494738 7475399 7577886 7474537 7474592 7597587 7711550 7850301 7871075 7921981 8144060 8217271
4003 8217271 8371554 8576378 8837749 9008186 9250688 9492365 9789193 10079197 10318334 10529746
3993 10529746 10798984 11015457 11289524 11512917 11742024 12236464 12804960 13252462 13727362
$$ packed form
4060G0861582q999488p876123o920547o097452n199090m357230l502662l109502
4052B4799488k522360k005211j855581j490230j177115j146855q67280o62986
4044A3071870o27030n72699m76616l52665l03060m53971m24468l40302k39129
4035I281930k67656q6134j18011j72302k44732j66987k27956q7879M1608j22457
4025G829424k5511j07083k6710q1845j16356p7877m7819L0650J58164M31m0730
4014G494738j9339J02487j03349N5J22995J13963J38751K0774N0906K22079P3211
4003H217271J54283K04824K61371J70437K42502K41677K96828K90004K39137K11412
3993A0529746K69238K16473K74067K23393K29107M94440N68496M47502M74900
$$ plain form
3984 13727362 14214651 14370081 14538020 14820268 15087067 15219289 15236245 15367376 15815728 16059396
3974 16059396 16636534 17128925 17605691 18315738 18925992 19702376 20516942 21451371 22469326
3965 22469326 23401778 24349375 25546312 26829308 28254277 29675690 31091593 32438444
3957 32438444 33641345 34676025 35551380 36368450 36923122 37546853 38305254 39270591 40583934
3948 40583934 42211846 43829872 45504753 47182235 48675346 49953147 50679692 50999593
3940 50999593 51088325 51505903 52154357 52913871 53963574 55546525 57600267 59944609 62175384
3931 62175384 64176245 65455485 65945251 65576172 64349746 62685639 60559615 58362793
3923 58362793 55985832 53868184 52021046 50715064 49651598 49046521 48478531 47846761 46850522
$$ packed form
3984A3727362M87289J55430J67939K82248K66799J32222J6956J31131M48352K43668
3974A6059396N77138M92391M76766P10047O10254P76384Q14566R34429J017955
3965B2469326R32452R47597J196937J282996J424969J421413J415903J346851
3957C2438444J202901J034680Q75355Q17070N54672O23731P58401R65337J313343
3948D0583934J627912J618026J674881J677482J493111J277801P26545L19901
3940E0999593Q8732M17578O48454P59514J049703J582951K053742K344342K230775
3931F2175384K000861J279240M89766l69079j226426j664107k126024k196822
3923E8362793k376961k117648j847138j305982j063466o05077n67990o31770r96239
$$ plain form
3914 46850522 45670821 44219219 42572995 40840625 39168677 37561134 35952705 34509876
3906 34509876 33247965 32324682 31467295 30551006 29631830 28680168 27610458 26495706 25121046
3897 25121046 23918821 22803065 21472949 20200625 19035202 17660401 16611549 15692011
3889 15692011 14756639 14002462 13205392 12733462 12210352 11823526 11432040 10973047 10709268
3880 10709268 10552685 10293219 10092659 9935684 9821844 9688800 9500901 9438774 9366044 9180709
3870 9180709 9082886 8936729 8829462 8653257 8626414 8650294 8418955 8314200 8190113 8212350
3860 8212350 8180029 8185417 8334621 8370229 8429674 8731355 8809018 8866898 8990350 9102531 9172438
3849 9172438 9188441 9083469 9135658 9131261 9140752 8980070 9009458 9072617 9102554 9221322 9165060
$$ packed form
3914D6850522j179701j451602j646224j732370j671948j607543j608429j442829
3906C4509876j261911r23283q57387r16289r19176r51662j069710j114752j374660
3897B5121046j202225j115756j330116j272324j165423j374801j048852r19538
3889A5692011r35372p54177p97070m71930n23110l86826l91486m58993k63779
3880A0709268j56583k59466k00560j56975j13840j33044j87899o2127p2730j85335
3870I180709r7823j46157j07267j76205k6843K3880k31339j04755j24087K2237
3860H212350l2321N388J49204L5608N9445L01681P7663N7880J23452J12181O9907
3849I172438J6003j04972N2189m397R491j60682K9388O3159K9937J18768n6262
$$ plain form
3838 9165060 9297983 9442192 9513071 9551079 9503857 9681797 9746759 9708950 9820479 9965800
3828 9965800 10121035 10259834 10395460 10726666 11154876 11634271 12313168 13097305 14023370 15048054
3818 15048054 16485759 18150716 19970441 22290993 24646477 27126802 29622300 31941957
3810 31941957 34029972 35589724 36390765 36284096 35322390 33789623 31697341 29229543 26558897
3801 26558897 24011295 21681106 19372448 17319112 15617313 14117744 12986096 11955124
3793 11955124 10903644 10230887 9714884 9151292 8799697 8504341 8085146 7769565 7581977
3784 7581977 7360949 7097962 7045071 6904794 6703925 6584893 6523977 6433033 6249550 6124064
3774 6124064 6028065 5946735 5784109 5614562 5523167 5410041 5370714 5155107 4929769 4885577
$$ packed form
3838I165060J32923J44209P0879L8008m7222J77940O4962l7809J11529J45321
3828I965800J55235J38799J35626L31206M28210M79395O78897P84137R26065J024684
3818A5048054J437705J664957J819725K320552K355484K480325K495498K319657
3810C1941957K088015J559752Q01041j06669r61706j532767k092282k467798k670646
3801B6558897k547602k330189k308658k053336j701799j499569j131648j030972
3793A1955124j051480o72757n16003n63592l51595k95356m19195l15581j87588
3784G581977k21028k62987n2891j40277k00869j19032o0916r0944j83483j25486
3774F124064r5999q1330j62626j69547r1395j13126l9327k15607k25338m4192
$$ plain form
3764 4885577 4916644 4811936 4793832 4900255 4734792 4604999 4680164 4560162 4425977 4363352
3754 4363352 4288155 4264837 4273971 4105309 4195236 4244337 4257078 4237147 4202315 4152914 4084255
3743 4084255 4225150 4265027 4169866 4105945 4118917 4111478 4131732 3976509 3896534 3980947 4043606
3732 4043606 4174392 4099634 3992607 4106955 4162312 4153305 4244686 4113092 4112907 4195743 4175745
3721 4175745 4176322 4195770 4208165 4346986 4432017 4430574 4479265 4400274 4593837 4779047 4882773
3710 4882773 4910577 5044878 5135412 5417230 5494743 5562733 5633858 5814838 5834454 5922773 6083283
3699 6083283 6131737 6247243 6489580 6702647 6768804 6993636 7257149 7700004 8107594 8629666
3689 8629666 9070890 9688019 10443158 11153847 11818233 12600279 13320301 13901610 14398695 14863130
$$ packed form
3764D885577L1067j04708j8104J06423j65463j29793P5165j20002j34185o2625
3754D363352p5197k3318R134j68662Q9927M9101J2741j9931l4832m9401o8659
3743D084255J40895L9877r5161o3921J2972p439K0254j55223p9975Q4413O2659
3732D043606J30786p4758j07027J14348N5357r007R1381j31594j85Q2836j9998
3721D175745N77J9448J2395J38821Q5031j443M8691p8991J93563J85210J03726
3710D882773K7804J34301R0534K81818P7513O7990P1125J80980J9616Q8319J60510
3699F083283M8454J15506K42337K13067O6157K24832K63513M42855M07590N22072
3689H629666M41224O17129P55139P10689O64386P82046P20022N81309M97085M64435
$$ plain form
3679 14863130 15460869 15900822 16326199 16941184 17420464 18001672 18444033 18896659 19171073
3670 19171073 19197308 19315525 19376529 19139412 18896972 18512460 18376638 18155777 17818453 17589710
3660 17589710 17525440 17429116 17304171 17136415 16806881 16394628 15946645 15584801 15264444 14919300
3650 14919300 14630749 14378617 14235655 14094389 13832116 13737234 13711314 13707263 13546754 13525899
3640 13525899 13762677 14017270 14427754 14925298 15503183 16340445 17494121 18916609 20254469
3631 20254469 21872198 23471143 25082807 26776435 28532841 30156285 32062032 33970572
3623 33970572 35544853 36877506 38015374 38999153 39707812 40103622 40432509 40687700 40537639
3614 40537639 40166429 39668877 39020462 37994881 36916898 35872787 34864110 34013819 33128410
$$ packed form
3679A4863130N97739M39953M25377O14985M79280N81208M42361M52626K74414
3670A9171073K6235J18217O1004k37117k42440l84512j35822k20861l37324k28743
3660A7589710o4270r6324j24945j67756l29534m12253m47983l61844l20357l45144
3650A4919300k88551k52132j42962j41266k62273r4882k5920m051j60509k0855
3640A3525899K36778K54593M10484M97544N77885Q37262J153676J422488J337860
3631B0254469J617729J598945J611664J693628J756406J623444J905747J908540
3623C3970572J574281J332653J137868R83779P08659L95810L28887K55191j50061
3614D0537639l71210m97552o48415j025581j077983j044111j008677q50291q85409
$$ plain form
3605 33128410 32060293 30956522 29931035 28655378 27268630 25874137 24460434 22928343
3597 22928343 21644158 20361758 19176850 18136700 17275572 16396415 15463368 14517650 13695008
3588 13695008 12929344 12298924 11801342 11337558 10913389 10537413 10344256 10155257 10112474 9936253
3578 9936253 9821526 9941930 9953051 9891294 10070642 10252641 10179210 10290015 10529631 10665321
3568 10665321 10800078 11062803 11232660 11653887 12481342 13289718 14085264 14602186 14895140
3559 14895140 14762492 14574248 14445451 13992534 13859124 13606042 13340008 13238684 13213623 13210845
3549 13210845 13378006 13761661 14038074 14541869 15209287 15931413 16749226 17732386 18713968
3540 18713968 19834495 21136256 22545060 23963438 25545463 27198145 29065643 31022771
$$ packed form
3605C3128410j068117j103771j025487j275657j386748j394493j413703j532091
3597B2928343j284185j282400j184908j040150q61128q79157r33047r45718q22642
3588A3695008p65664o30420m97582m63784m24169l75976j93157j88999m2783j76221
3578I936253j14727J20404J1121o1757J79348J81999p3431J10805K39616J35690
3568A0665321J34757K62725J69857M21227Q27455Q08376P95546N16922K92954
3559A4895140j32648j88244j28797m52917j33410k53082k66034j01324k5061k778
3549A3210845J67161L83655K76413N03795O67418P22126Q17813R83160R81582
3540A8713968J120527J301761J408804J418378J582025J652682J867498J957128
$$ plain form
3532 31022771 33088137 35209124 37112881 38856625 40356130 41607303 42582847 43217718
3524 43217718 43625885 43876543 44079332 44241607 44437125 44438563 44364513 44410568 44205755 43808576
3514 43808576 43322617 42590257 41839466 41033525 39989266 38967463 37932173 36957098 36290372
3505 36290372 35763345 35492109 35264603 35166729 35321873 35543305 35896598 36241405 36656494 37243824
3495 37243824 37892551 38450500 39097025 39645284 40233355 40890665 41489851 42309312 43337659
3486 43337659 44490466 45860801 47685108 49565494 51619489 53729772 55685626 57321374
3478 57321374 58957748 60256791 61390292 62399508 63192431 63934935 64768498 65408029 65978600
3469 65978600 66350208 66350667 65880771 64790396 63274472 61197085 58749783 56222527 53751915
$$ packed form
3532C1022771K065366K120987J903757J743744J499505J251173R75544O34871
3524D3217718M08167K50658K02789J62275J95518J438p4050M6055k04813l97179
3514D3808576m85959p32360p50791q05941j044259j021803j035290r75075o66726
3505C6290372n27027k71236k27506r7874J55144K21432L53293L44807M15089N87330
3495C7243824O48727N57949O46525N48259N88071O57310N99186Q19461J028347
3486D3337659J152807J370335J824307J880386K053995K110283J955854J635748
3478E7321374J636374J299043J133501J009216P92923P42504Q33563O39531N70571
3469F5978600L71608M59m69896j090375j515924k077387k447302k527256k470612
$$ plain form
3460 53751915 51165250 48572536 46181810 43871173 41823317 39820561 38121913 36821180
3452 36821180 35576632 34600268 33846879 33418353 32999853 32793574 32783640 32797091 32728405 32582559
3442 32582559 32617753 32728753 32978184 33471203 33902794 34461845 34622945 34570597 34220035 33641985
3432 33641985 32700575 31662840 30696444 29622747 28596884 27464965 26167681 25121606
3424 25121606 23956167 22833094 21723313 20366842 19332095 18287147 17262080 16408124
3416 16408124 15605902 15024189 14354597 13950639 13740742 13621756 13518864 13424598 13451615 13333876
3406 13333876 13081898 13033740 13169383 13074931 12905299 12943514 13051481 13303009 13651034 14015067
3396 14015067 14591860 15269875 16122015 17297389 18517919 19855024 21450574 23144122 24911024
$$ packed form
3460E3751915k586665k592714k390726k310637k047856k002756j698648j300733
3452C6821180j244548r76364p53389m28526m18500k06279r934J3451o8686j45846
3442C2582559L5194J11000K49431M93019M31591N59051J61100n2348l50562n78050
3432C3641985r41410j037735r66396j073697j025863j131919j297284j046075
3424B5121606j165439j123073j109781j356471j034747j044948j025067q53956
3416A6408124q02222n81713o69592m03958k09897j18986j02892r4266K7017j17739
3406A3333876k51978m8158J35643r4452j69632L8215J07967K51528L48025L64033
3396A4015067N76793O78015Q52140J175374J220530J337105J595550J693548J766902
$$ plain form
3387 24911024 26601947 28247734 29491992 30600745 31397550 31653127 31569985 30946587 29974048
3378 29974048 28759581 27107669 25360461 23670631 21916918 20081187 18387261 16739304
3370 16739304 15320269 14142515 13092563 12082865 11346321 10645819 10014461 9516340 9107154
3361 9107154 8695432 8548116 8254325 8058654 7797542 7616517 7569881 7448234 7398896 7368102
3351 7368102 7347558 7214867 7161875 7174490 7341768 7335320 7400157 7510494 7716314 7993447 8229052
3340 8229052 8429669 8889189 9349929 9863615 10419508 11107956 11848591 12645439 13347130 14027457
3330 14027457 14795894 15524922 16103014 16451557 16562584 16661321 16445876 16155006 15673998 15000705
3320 15000705 14393859 13617811 12848424 11993461 11163808 10477944 9791852 9150113 8527587
$$ packed form
3387B4911024J690923J645787J244258J108753P96805K55577q3142o23398r72539
3378B9974048j214467j651912j747208j689830j753713j835731j693926j647957
3370A6739304j419035j177754j049952j009698p36544p00502o31358m98121m09186
3361I107154m11722j47316k93791j95671k61112j81025m6636j21647m9338l0794
3351G368102k0544j32691n2992J2615J67278o448O4837J10337K05820K77133K35605
3340H229052K00617M59520M60740N13686N55893O88448P40635P96848P01691O80327
3330A4027457P68437P29028N78092L48543J11027R8737k15445k90870m81008o73293
3320A5000705o06846p76048p69387q54963q29653o85864o86092o41739o22526
$$ plain form
3311 8527587 7985739 7442480 7040017 6542529 6257503 6083272 5805341 5727985 5470555 5277504
3301 5277504 5135380 5109895 5033308 5024817 5048805 4946133 4909458 4999604 4782089 4784064 4689477
3290 4689477 4663533 4678374 4644110 4648943 4632006 4657004 4579279 4626993 4609094 4587372 4499758 4466796
3278 4466796 4522733 4561677 4496617 4559637 4602125 4513632 4466526 4526393 4533437 4566689 4610111 4724173
3266 4724173 4799657 4681770 4704854 4741874 4781860 4619803 4643564 4841003 4813127 4764181 4787399
3255 4787399 4795991 4742103 4805468 4824880 4920864 5090442 5100117 5180495 5304095 5272672 5286591
3244 5286591 5363686 5410242 5521190 5654392 5655286 5739591 5833835 5946788 6203537 6391514 6519759
3233 6519759 6753421 7036326 7274030 7538066 7887617 8240478 8553515 8908469 9122617 9429174
$$ packed form
3311H527587n41848n43259m02463m97488k85026j74231k77931p7356k57430j93051
3301E277504j42124k5485p6587q491K3988j02672l6675R0146k17515J975r4587
3290D689477k5944J4841l4264M833j6937K4998p7725M7714j7899k1722q7614l2962
3278D466796N5937L8944o5060O3020M2488q8493m7106N9867P044L3252M3422J14062
3266D724173P5484j17887K3084L7020L9986j62057K3761J97439k7876m8946K3218
3255D787399Q592n3888O3365J9412R5984J69578R675Q0378J23600l1423J3919
3244E286591P7095M6556J10948J33202Q94Q4305R4244J12953K56749J87977J28245
3233F519759K33662K82905K37704K64036L49551L52861L13037L54954K14148L06557
$$ plain form
3223 9429174 9578453 9740956 9765849 9826229 9880123 9949161 9866604 9719315 9557765 9297917
3213 9297917 9227662 9089007 9009303 8790119 8814470 8786123 8623788 8855478 9012615 9292134
3203 9292134 9553260 9763582 9980721 10182323 10582368 11012548 11520236 12162464 12918261 13555550
3193 13555550 14333901 15334687 16372722 17065689 17742684 18363382 18653824 18709155 18797271
3184 18797271 18682225 18639080 18431194 18292814 18218949 18036828 17945141 17658679 17433934 17347114
3174 17347114 17504262 17729705 17893114 18255169 18713512 19040896 19448200 19815710 20159933
3165 20159933 20733893 21455939 22184585 23163374 24175576 25324521 26455633 27577936 28805722
3156 28805722 30069727 31490292 32881547 34242057 35511330 36815487 37938320 39185551
$$ packed form
3223I429174J49279J62503K4893O0380N3894O9038q2557j47289j61550k59848
3213I297917p0255j38655p9704k19184K4351k8347j62335K31690J57137K79519
3203I292134K61126K10322K17139K01602M00045M30180N07688O42228P55797O37289
3193A3555550P78351J000786J038035O92967O76995O20698K90442N5331Q8116
3184A8797271j15046m3145k07886j38380p3865j82121r1687k86462k24745q6820
3174A7347114J57148K25443J63409L62055M58343L27384M07304L67510L44223
3165B0159933N73960P22046P28646R78789J012202J148945J131112J122303J227786
3156B8805722J264005J420565J391255J360510J269273J304157J122833J247231
$$ plain form
3148 39185551 40439113 41671559 43216899 44888529 46836059 48998182 51610579 54857235
3140 54857235 58694533 63262388 68740561 75397875 83774170 94462197 108411043 126618144
3132 126618144 149999124 178611164 210953467 243155168 269866747 286616622 291035573
3125 291035573 284122004 268610874 247505584 223280889 197816211 172760997 148947252
3118 148947252 127608065 109357810 94570069 82763025 73327915 65915197 60024556
3111 60024556 55364231 51656227 48740806 46507062 44888368 43872170 43506746 43622694
3103 43622694 44591129 46311072 48558381 51040693 52813104 53464914 52836907 50861950 48226407
3094 48226407 45093371 41638082 38148342 34791491 31453815 28624537 26333867 24287973
$$ packed form
3148C9185551J253562J232446J545340J671630J947530K162123K612397L246656
3140E4857235L837298M567855N478173O657314Q376295J0688027J3948846J8207101
3132A26618144K3380980K8612040L2342303L2201701K6711579J6749875M418951
3125B91035573o913569j5511130k1105290k4224695k5464678k5055214k3813745
3118A48947252k1339187j8250255j4787741j1807044r435110p412718n890641
3111F0024556m660325l708004k915421k233744j618694j016198l65424J15948
3103D3622694R68435J719943K247309K482312J772411O51810o28007j974957k635543
3094D8226407l133036l455289l489740l356851l337676k829278k290670k045894
$$ plain form
3086 24287973 22727694 21322281 20264433 19487399 18720192 18104544 17534530 17040444 16445165
3077 16445165 15955513 15417087 15047573 14612749 14121260 13676311 13156996 12925498 12392566
3068 12392566 11830954 11626789 11218493 10713569 10266251 9882735 9655968 9449971 9110216
3059 9110216 8810016 8647955 8410859 8220661 8129991 7958211 7670679 7560882 7400154 7241810
3049 7241810 7203791 6988328 6851822 6688994 6525016 6487678 6329289 6053923 5953386 5933868
3039 5933868 5808686 5662643 5468143 5297339 5199583 5101039 4970283 4816096 4812528 4733766
3029 4733766 4525975 4606012 4471543 4273373 4301489 4134534 4024644 4015786 3943386 3850874 3754728
3018 3754728 3715895 3545959 3553413 3599215 3476735 3378754 3349537 3323081 3344504 3321705 3149718
$$ packed form
3086B4287973j560279j405413j057848p77034p67207o15648n70014m94086n95279
3077A6445165m89652n38426l69514m34824m91489m44949n19315k31498n32932
3068A2392566n61612k04165m08296n04924m47318l83516k26767k05997l39755
3059I110216l00200j62061k37096j90198r0670j71780k87532j09797j60728j58344
3049G241810l8019k15463j36506j62828j63978l7338j58389k75366j00537j9518
3039E933868j25182j46043j94500j70804r7756r8544j30756j54187l568p8762
3029D733766k07791Q0037j34469j98170K8116j66955j09890q858p2400r2512r6146
3018C754728l8833j69936P454M5802j22480r7981k9217k6456K1423k2799j71987
$$ plain form
3007 3149718 3091595 3079029 2999889 2993637 2903572 2806982 2646016 2716841 2708357 2646702 2584234 2624182
2995 2624182 2599304 2449843 2450135 2439448 2434571 2374959 2201528 2094134 2129974 2102292 2150106
2984 2150106 2024203 2062721 2146325 2063013 2024212 2023998 2023044 1942352 1973617 1814249 1729075 1685393
2972 1685393 1583412 1455113 1461387 1439669 1434832 1491681 1508927 1443507 1441214 1420854 1291054
2961 1291054 1260218 1303025 1410023 1354470 1447899 1498308 1364699 1258225 1279760 1278701 1257673
2950 1257673 1317883 1387557 1380672 1531366 1576278 1445774 1344615 1279695 1308154 1437877 1348332
2939 1348332 1326326 1283388 1305698 1374803 1384256 1254269 1262576 1363898 1246273 1112877 995615
2928 995615 1016604 1081309 1168906 1090830 1119555 939334 948942 937079 998156 1116776 953163
$$ packed form
3007C149718n8123j2566p9140o252r0065r6590j60966P0825q484o1655o2468L9948
2995B624182k4878j49461K92j0687m877n9612j73431j07394L5840k7682M7814
2984B150106j25903L8518Q3604q3312l8801k14r54q0692L1265j59368q5174m3682
2972A685393j01981j28299O274k1718m837N6849J7246o5420k293k0360j29800
2961A291054l0836M2807J06998n5553R3429N0409j33609j06474K1535j059k1028
2950A257673O0210O9674o885J50694M4912j30504j01159o4920K8459J29723q9545
2939A348332k2006m2938K2310O9105R453j29987Q307J01322j17625j33396j17262
2928I95615K0989O4705Q7597p8076K8725j80221R608j1863O1077J18620j63613
$$ plain form
2917 953163 897103 923009 978642 865161 840047 878088 937083 1014862 1072032 879012 878522 865873
2905 865873 923049 969399 1032345 1048095 1084855 1139505 1163469 1113027 1117436 1063727 1026513 1142971
2893 1142971 1034802 1069169 1140453 1152088 1152310 1231899 1147977 1106497 1090787 989410 1075443
2882 1075443 1110534 1214355 1176086 1261628 1392305 1367572 1416181 1488859 1517658 1650074 1689792
2871 1689792 1657221 1833923 1869871 1818380 1890011 1870427 1744519 1860815 1977701 2055872 1875754
2860 1875754 1885672 1996968 2059013 2030072 2047375 2066012 2201060 2333829 2461776 2605015 2798901
2849 2798901 3018303 3196427 3386484 3733164 3889918 3941993 4077682 4106027 4167364 4128730
2839 4128730 4001433 3927303 3949440 3743910 3663549 3657833 3722425 3569897 3421048 3380799 3183883
$$ packed form
2917I53163n6060K5906N5633j13481k5114L8041N8995P7779N7170j93020m90j2649
2905H65873N7176M6350O2946J5750L6760N4650K3964n0442M409n3709l7214J16458
2893A142971j08169L4367P1284J1635K22P9589q3922m1480j5710j01377Q6033
2882A075443L5091J03821l8269Q5542J30677k4733M8609P2678K8799J32416L9718
2871A689792l2571J76702L5948n1491P1631j9584j25908J16296J16886P8171j80118
2860A875754R918J11296O2045k8941J7303J8637J35048J32769J27947J43239J93886
2849B798901K19402J78124J90057L46680J56754N2075J35689K8345O1337l8634
2839D128730j27297p4130K2137k05530q0361n716O4592j52528j48849m0249j96916
$$ plain form
2828 3183883 3211671 3280280 3248510 3207686 3191021 3070892 3054898 3122100 3045018 3159733 3161105
2817 3161105 3301635 3502235 3675073 3744153 3929332 4138353 4233759 4305755 4302702 4340414 4250648
2806 4250648 4288332 4260741 3995416 3779752 3641187 3565644 3511766 3425252 3318596 3233394 3219231
2795 3219231 3165002 3108222 2884551 2930002 2961202 2794396 2738185 2853097 2763804 2646832 2613943
2784 2613943 2647254 2613184 2521707 2613224 2689352 2718739 2924404 3018270 3160507 3345307 3287036
2773 3287036 3246848 3176397 3049191 2833275 2749008 2623353 2471511 2215023 1937337 1853947
2763 1853947 1939841 1709726 1720648 1660798 1586294 1686040 1686504 1668540 1525299 1555292 1439521
2752 1439521 1366738 1342268 1188069 1182597 1199679 1168088 1179717 1188998 1229247 1186111 1078175
$$ packed form
2828C183883K7788O8609l1770m0824j6665j20129j5994O7202p7082J14715J372
2817C161105J40530K00600J72838O9080J85179K09021R5406P1996l053L7712q9766
2806D250648L7684k7591k65325k15664j38565p5543n3878q6514j06656q5202j4163
2795C219231n4229n6780k23671M5451L1200j66806n6211J14912q9293j16972l2889
2784B613943L3311l4070r1477R1517P6128K9387K05665R3866J42237J84800n8271
2773C287036m0188p0451j27206k15916q4267j25655j51842k56488k77686q3390
2763A853947Q5894k30115J0922n9850p4504R9746M64j7964j43241K9993j15771
2752A439521p2783k4470j54199n472J7082l1591J1629R281M0249m3136j07936
$$ plain form
2741 1078175 1199081 1189907 1092590 1129872 1238162 1183628 1081769 1131785 1045481 1035652 882282
2730 882282 718045 663279 692656 584439 624158 661266 616053 545964 568214 504123 476433
2719 476433 539338 559055 512549 496015 434548 424275 457437 320430 389196 258426 166403
2708 166403 207305 133379 160999 220846 268173 191451 125648 176837 94297 192597 226290 168732
2696 168732 75451 100570 115818 76869 246482 310249 308170 329101 158594 156758 243662 212499
2684 212499 240641 328477 206381 160169 141539 90570 62298 87988 144311 148842 247185 176845
2672 176845 70342 -30810 -39083 47192 37840 18583 1189 146508 154725 126408 173844 149249
2660 149249 109843 21310 134765 190583 102749 123439 142872 156027 240810 129323 77342
$$ packed form
2741A078175J20906r174r7317L7282J08290n4534j01859N0016q6304r829j53370
2730H82282j64237n4766K9377j08217L9719L7108m5213p0089K2250o4091k7690
2719D76433O2905J9717m6506j6534o1467j0273L3162j37007O8766j30770r2023
2708A66403M0902p3926K7620N9847M7327p6722o5803N1189q2540R8300L3693n7558
2696A68732r3281K5119J5248l8949J69613O3767k079K0931j70507j836Q6904l1163
2684B12499K8142Q7836j22096m6212j8630n0969k8272K5690N6323M531R8343p0340
2672A76845j06503j01152q273Q6275r352j9257j7394J45319Q217k8317M7436k4595
2660A49249l9406q8533J13455N5818q7834K0690J9433J3155Q4783j11487n1981
$$ plain form
2649 77342 78909 -3220 -10633 93264 113988 78223 56850 206028 116578 32377 135793 187435
2637 187435 140448 98259 72326 -31650 50442 26328 10785 83456 194484 156627 50470
2626 50470 19791 -58906 -54421 -3732 -58976 73876 144778 -29012 -59714 -23938 65938 11527
2614 11527 17021 23491 35864 109231 105069 83398 14831 -36492 -22451 162525 207788 271056
2602 271056 296555 296608 404192 349502 364434 413786 444575 462858 371548 363097 394935 382468
2590 382468 302473 352187 333914 189868 136140 85792 59877 123305 32995 25357 77713 2196
2578 2196 -27004 -36544 -61401 86346 140827 76994 -1081 42164 83637 -25152 -43688 155965
2566 155965 5142 59250 196464 185944 169358 78564 67757 -16129 -22601 55304 84278
$$ packed form
2649G7342J567q2129p413J03897K0724l5765k1373J49178q9450q4201J03416N1642
2637A87435m6987m2189k5933j03976Q2092k4114j5543P2671J11028l7857j06157
2626E0470l0679p8697M485N0689n5244J32852P0902j73790l0702L5776Q9876n4411
2614A1527N494O470J2373P3367m162k1671o8567n1323J4041J84976M5263O3268
2602B71056K5499N3J07584n4690J4932M9352L0789J8283r1310q451L1838j2467
2590C82468p9995M9714j8273j44046n3728n0348k5915O3428r0310p638N2356p5517
2578B196k9200r540k4857J47747N4481o3833p8075M3245M1473j08789j8536J99653
2566A55965j50823N4108J37214j0520j6586r0794j0807q3886o472P7905K8974
$$ plain form
2555 84278 83461 108325 138887 137731 239847 221913 134294 78177 44013 183148 84482 67474
2543 67474 68150 -10711 -34849 88168 -12898 23347 139024 17577 81076 181752 181324 150887
2531 150887 94193 119139 119478 136445 138204 101954 52656 -7999 19838 161580 80660 -39133
2519 -39133 -76848 -104334 -96159 21758 91573 114225 102605 47323 27209 66668 -14055 45063
2507 45063 93497 175327 159735 90999 102873 122195 113970 46714 6060 70926 108122 115099
2495 115099 110477 152198 77253 111697 45732 143059 285395 101765 142687 129796 87967
2484 87967 69464 160613 128611 240753 392464 292996 228849 278085 270338 186181 202556 128640
2472 128640 165053 132908 117403 203217 253725 251063 317753 145986 90336 64175 114443 109394
$$ packed form
2555H4278q17K4864L0562j156J02116j7934q7619n6117l4164J39135r8666j7008
2543F7474O76p8861k4138J23017j01066L6245J15677j21447O3499J00676m28l0437
2531A50887n6694K4946L39J6967J759l6250m9298o0655K7837J41742q0920j19793
2519c9133l7715k7486Q175J17917O9815K2652j1620n5282k0114L9459q0723N9118
2507D5063M8434Q1830j5592o8736J1874J9322q225o7256m0654O4866L7196O977
2495A15099m622M1721p4945L4444o5965R7327J42336j83630M0922j2891m1829
2484H7967j8503R1149l2002J12142J51711r9468o4147M9236p747q4157J6375p3916
2472A28640L6413l2145j5505Q5814N0508k662O6690j71767n5650k6161N0268n049
$$ plain form
2460 109394 82883 176449 118993 184441 141863 167135 148350 170647 98881 234760 171931
2449 171931 155633 116147 167057 137344 124907 179953 208400 197778 108976 130561 351738
2438 351738 402752 339579 342669 281028 227788 251930 219689 232659 285239 310415 308830 272232
2426 272232 227520 263977 343031 442340 395055 350427 263711 260631 364029 434849 341700 282184
2414 282184 475895 418127 368330 504289 469793 410692 305314 401487 560944 548087 519555
2403 519555 554859 683689 484300 586690 623475 494822 464684 566776 554060 606285 738776
2392 738776 792446 860814 816706 750279 694700 586299 566587 739074 832521 890770 876617
2381 876617 855830 881578 957987 827252 895377 996406 1072360 1148254 1168578 1208616 1345910
$$ packed form
2460A09394k6511R3566n7456O5448m2578K5272j8785K2297p1766J35879o2829
2449A71931j6298l9486N0910k9713j2437N5046K8447j0622q8802K1585K21177
2438C51738N1014o3173L090o1641n3240K4142l2241J2970N2580K5176j585l6598
2426B72232m4712L6457P9054R9309m7285m4628q6716l080J03398P0820r3149n9516
2414B82184J93711n7768m9797J35959l4496n9101j05378R6173J59457j2857k8532
2403E19555L5304J28830j99389J02390L6785j28653l0138J02092j2716N2225J32491
2392G38776N3670O8368m4108o6427n5579j08401j9712J72487R3447N8249j4153
2381H76617k0787K5748P6409j30735O8125J01029P5954P5894K0324M0038J37294
$$ plain form
2370 1345910 1392187 1176150 1140282 1186974 1283752 1404452 1399175 1328346 1489295 1648978 1803663
2359 1803663 1832727 1916132 1993912 2124045 2312396 2462571 2651457 2877356 3231085 3601170
2349 3601170 3940083 4261382 5023134 5919391 6689283 7220697 7756235 8185861 8591516 9296933
2339 9296933 10256969 11392885 12956909 15152157 18236864 23494282 32599298 45783823
2331 45783823 60823555 73564634 80338409 79127856 72791677 65628721 57673793 49324429
2323 49324429 41479717 33968681 26605546 20433441 15770043 12692252 10795949 9778793
2315 9778793 9026521 8354628 7442425 6671588 6065867 5544542 5163674 4712021 4347844 3924515
2305 3924515 3561526 3280951 3121427 2917198 2803252 2718803 2500551 2433728 2323955 2317819
$$ packed form
2370A345910M6277k16037l5868M6692R6778J20700n277p0829J60949J59683J54685
2359A803663K9064Q3405P7780J30133J88351J50175J88886K25899L53729L70085
2349C601170L38913L21299P61752Q96257P69892N31414N35538M29626M05655P05417
2339I296933R60036J135916J564024K195248L084707N257418R105016J3184525
2331D5783823J5039732J2741079O773775j210553o336179p162956p954928q349364
2323D9324429p844712p511036p363135o172105m663398l077791j896303j017156
2315I778793p52272o71893r12203p70837o05721n21325l80868m51653l64177m23329
2305C924515l62989k80575j59524k04229j13946q4449k18252o6823j09773o136
$$ plain form
2295 2317819 2208461 2154632 2085046 2073040 2080748 1840497 1753577 1727697 1591302 1508672 1480270
2284 1480270 1389457 1381734 1427825 1338658 1173391 1177026 1074526 1029047 1037230 942129 996235 1046700
2272 1046700 1067016 971170 823680 784930 835927 768424 635863 637147 560615 505862 660073
2261 660073 675150 735094 878314 857923 784485 882258 823474 780809 808174 628769 564970
2250 564970 646888 684806 543628 442925 396486 442965 361335 325225 407187 407465 405501 489400
2238 489400 461520 406768 375841 444557 428055 427349 422537 328478 298603 244881 184433 352843
2226 352843 466668 473599 376962 396346 361774 285965 303482 277392 202347 200309 131329 163738
2214 163738 266707 347108 354162 362656 294097 369148 305724 86023 78927 268526 335537 248692
$$ packed form
2295B317819j09358n3829o9586j2006P708k40251q6920k5880j36395q2630k8402
2284A480270r0813p723M6091q9167j65267L635j02500m5479Q183r5101N4106N0465
2272A046700K0316r5846j47490l8750N0997o7503j32561J284p6532n4753J54211
2261F60073J5077N9944J43220k0391p3438R7773n8784m2665K7365j79405o3799
2250E64970Q1918L7918j41178j00703m6439M6479q1630l6110Q1962K78j964Q3899
2238D89400k7880n4752l0927O8716j6502p06m812r4059k9875n3722o0448J68410
2226C52843J13825O931r6637J9384l4572p5809J7517k6090p5045k038o8980L2409
2214A63738J02969Q0401P054Q494o8559P5051o3424k19701p096J89599O7011q6845
$$ plain form
2202 248692 239636 305508 298860 328861 319306 288911 217795 258902 337712 231776 245990 269458
2190 269458 184285 66389 99420 105950 149716 166947 207106 310672 231264 100563 256184
2179 256184 313311 217007 114695 150451 100293 53900 216696 55554 77004 42350 -4050
2168 -4050 -99462 -138071 91793 107539 78079 176117 169574 180909 159329 39885 74787 38933
2156 38933 33707 70693 54885 59648 95860 172975 197757 216740 168436 131970 144920 193096
2144 193096 112133 118733 79832 -58800 32848 40894 63386 17777 59049 137783 98322 174371
2132 174371 132099 -9162 39412 -15282 -155776 -213131 -55399 -55218 29561 93841 126329
2121 126329 34878 82093 43427 -41147 48930 144011 56104 41552 -10794 -72100 -57172 98150
$$ packed form
2202B48692r056O5872o648L0001r555l0395p1116M1107P8810j05936J4214K3468
2190B69458q5173j17896L3031O530M3766J7231M0159J03566p9408j30701J55621
2179B56184N7127r6304j02312L5756n0158m6393J62796j61142K1450l4654m6400
2168d050r5412l8609K29864J5746k9460R8038o543J1335k1580j19444L4902l5854
2156C8933n226L6986j5808M763L6212P7115K4782J8983m8304l6466J2950M8176
2144A93096q0963O600l8901j38632R1648Q046K2492m5609M1272P8734l9461P6049
2132A74371m2272j41261M8574n4694j40494n7355J57732J81Q4779O4280L2488
2121A26329r1451M7215l8666q4574R0077R5081q7907j4552n2346o1306J4928J55322
$$ plain form
2109 98150 190006 28684 -23073 -53774 -142058 -125008 -354 110175 73526 89991 40051
2098 40051 167375 94157 18661 36174 -13528 28000 59505 -33605 -45381 21159 -33950 -96757
2086 -96757 -25266 -9684 -92032 -88916 -76102 -125029 -189759 -210828 -180614 -146685 -137382 14510
2074 14510 79550 18709 38466 138977 94312 40970 -81992 3524 81594 83356 71553 234849
2062 234849 381693 243983 202803 267004 310555 228437 175795 250975 272500 306842 207799
2051 207799 2113 -126973 -31097 49649 -73331 -184857 -99000 -67848 96805 191292 117348
2040 117348 94175 33070 -28887 29825 -3200 -28075 39311 95753 -6050 -80603 -32229
2029 -32229 41407 30115 53714 58468 158293 142052 170848 182944 10028 97358 12556 -53798
$$ packed form
2109I8150R1856j61322n1757l0701q8284J7050J24654J10529l6649J6465m9940
2098D0051J27324p3218p5496J7513m9702M1528L1505r3110j1776O6540n5109o2807
2086i6757P1491J5582q2348L116J2814m8927o4730k1069L0214L3929R303J51892
2074A4510O5040o0841J9757J00511m4665n3342j22962Q5516P8070J762j1803J63296
2062B34849J46844j37710m1180O4201M3551q2118n2642P5180K1525L4342r9043
2051B07799k05686j29086R5876Q0746j22980j11526Q5857L1152J64653R4487p3944
2040A17348k3173o1105o1957N8712l3025k4875O7386N6442j01803p4553M8374
2029c2229P3636j1292K3599M754R9825j6241K8796J2096j72916Q7330q4802o6354
$$ plain form
2017 -53798 -67559 -137999 -102336 -138437 -40472 -50824 -28021 69709 19248 -40499 -5108 -17127
2005 -17127 -15124 -1946 64261 5828 -69448 2466 31329 -3152 64793 79744 69026 77128
1993 77128 132003 -5734 -1414 15753 92745 84173 -6968 1107 -63263 82071 166554 193312
1981 193312 59632 -12875 -485 106896 74762 71891 -38962 27849 26803 -34151 -68964
1970 -68964 -58311 -32075 52287 129717 -49273 -148352 -146213 -111885 -78620 -36876 -91856 -62869
1958 -62869 -84307 -167716 -206486 -189309 -202462 -142764 39559 88148 149776 62301 95303 31265
1946 31265 113617 78344 157404 146502 34510 86828 87368 25431 -35112 4845 52072 20340
1934 20340 63012 128167 34039 110444 -26710 -153749 -181514 -131292 -64650 -69261 -71519 -70657
$$ packed form
2017e3798j3761p0440L5663l6101R7965j0352K2803R7730n0461n9747L5391j2019
2005a7127K003J3178O6207n8433p5276P1914K8863l4481O7945J4951j0718Q102
1993G7128N4875j37737M320J7167P6992q572r1141Q075o4370J45334Q4483K6758
1981A93312j33680p2507J2390J07381l2134k871j10853O6811j046o0954l4813
1970f8964J0653K6236Q4362P7430j78990r9079K139L4328L3265M1744n4980K8987
1958f2869k1438q3409l8770J7177j3153N9698J82323M8589O1628q7475L3002o4038
1946C1265Q2352l5273P9060j0902j11992N2318N40o1937o0543L9957M7227l1732
1934B0340M2672O5155r4128P6405j37154j27039k7765N0222O6642m611k258Q62
$$ plain form
1922 -70657 -44386 10559 -34466 -142844 84390 134136 38303 -33885 -163904 -62481 -142533
1911 -142533 -56240 -71702 -4791 82784 48114 120466 80508 90068 16896 -17485 -85675 -261978
1899 -261978 -300260 -259127 -85664 -15373 111438 53323 15291 -26056 -16986 55269 -101947
1888 -101947 -19456 -65990 -81071 -78375 -197754 -133027 -163153 -132883 7641 17439 -77205 10181
1876 10181 -126932 -204364 -75885 -38194 47665 25013 107505 55193 72306 100916 5793
1865 5793 -39313 51180 48199 26147 -85606 -199246 -161554 -17454 69174 17173 49274 -37844
1853 -37844 -180479 -25936 -5669 -65611 -84442 -92644 20465 7703 36414 23023 -28437
1842 -28437 -13343 -10094 7636 57070 140552 108345 63551 -173811 -174927 -90726 -87908 -84049
$$ packed form
1922g0657K6271N4945m5025j08378K27234M9746r5833p2188j30019J01423q0052
1911a42533Q6293j5462O6911Q7575l4670P2352l9958R560p3172l4381o8190j76303
1899b61978l8282M1133J73463P0291J26811n8115l8032m1347R070P2255j57216
1888a01947Q2491m6534j5081K696j19379O4727l0126L0270J40524R798r4644Q7386
1876A0181j37113p7432J28479L7691Q5859k2652Q2492n2312J7113K8610r5123
1865E793m5106R0493k981k2052j11753j13640L7692J44100Q6628n2001L2101q7118
1853c7844j42635J54543K0267n9942j8831q202J13109j2762K8711j3391n1460
1842b8437J5094L249J7730M9434Q3482l2207m4794k37362j116Q4201K818L859
$$ plain form
1830 -84049 -27293 -49231 7970 71523 -31266 -45826 -2656 15998 70275 88004 -17954
1819 -17954 -28207 -28834 54198 -105597 -211836 -85312 -17466 -25628 -63747 13242 49433 -61091
1807 -61091 -3888 76759 38564 47041 81867 -40342 -67500 17659 88632 -1656 -7785 27159
1795 27159 32211 96728 89706 86333 -10543 40176 70515 140285 83792 -34844 -22180 24446
1783 24446 24954 133679 142016 134190 102490 37627 31953 39929 67683 -12574 -6975 -29831 -121312
1770 -121312 -128461 -97261 -65050 81023 22820 85687 32450 -59781 -6820 28340 -125973
1759 -125973 -23788 -63814 -42483 43713 -13153 -6933 -35901 -72731 -190982 -162227 -146023
1748 -146023 -58884 -50548 -21181 15212 -104588 -82567 -34907 -69161 -118139 -116400 -138498 -93967
$$ packed form
1830h4049N6756k1938N7201O3553j02789j4560M3170J8654N4277J7729j05958
1819a7954j0253o27Q3032j59795j06239J26524O7846q162l8119P6989L6191j10524
1807f1091N7203Q0647l8195Q477L4826j22209k7158Q5159P0973r0288o129L4944
1795B7159N052O4517p022l373r6876N0719L0339O9770n6493j18636J2664M6626
1783B4446N08J08725Q337p826l1700o4863n674P976K7754q0257N599k2856r1481
1770a21312p149L1200L2211J46073n8203O2867n3237r2231N2961L5160j54313
1759a25973J02185m0026K1331Q6196n6866O220k8968l6830j18251K8755J6204
1748a46023Q7139Q336K9367L6393j19800K2021M7660l4254m8978J739k2098M4531
$$ plain form
1736 -93967 -51603 -56033 -42460 54860 37965 49193 42561 20000 15935 -35299 -18788 -11982 69448
1723 69448 -17674 -16774 34326 -12126 11319 85280 91952 74880 20815 -7992 -43921 -92323
1711 -92323 -66816 -85942 -138571 -169766 -95829 -17753 -68744 17748 76014 24009 51912 33988
1699 33988 43303 -60788 38009 22777 33384 96808 -63109 -74108 9011 -19231 32286 49672
1687 49672 -14747 -49101 -92996 48293 53630 -31620 -75401 -19703 -42266 15592 -46465 -85329
1675 -85329 -109621 -78086 -59971 -99407 -166334 -127266 -148975 -280660 -222779 34204 7853
1664 7853 -69198 -12458 -17843 12174 -69626 -182228 -157426 -160522 -167085 -107537 -16140 -22228 -40237
1651 -40237 54185 19265 -6382 9706 -28319 -105847 -59495 -176702 -142729 -49940 -4747 -59647
$$ packed form
1736i3967M2364m430J3573R7320j6895J1228o632k2561m065n1234J6511O806Q1430
1723F9448q7122R00N1100m6452K3445P3961O672j7072n4065k8807l5929m8402
1711i2323K5507j9126n2629l1195P3937P8076n0991Q6492N8266n2005K7903j7924
1699C3988R315j04091R8797j5232J0607O3424j59917j0999Q3119k8242N1517J7386
1687D9672o4419l4354m3895J41289N337q5250m3781N5698k2563N7858o2057l8864
1675h5329k4292L1535J8115l9436o6927L9068k1709j31685N7881K56983k6351
1664G853p7051N6740n385L0017q1800j12602K4802l096o563N9548R1397o088j8009
1651d0237R4422l4920k5647J6088l8025p7528M6352j17207L3973R2789M5193n4900
$$ plain form
1639 -59647 -67292 -17024 91425 164221 -5377 840 58898 19413 64191 -30359 -112176 -81100
1627 -81100 -35180 -73297 -72532 25425 -62554 27580 35456 -113391 -121135 13741 100803 113738
1615 113738 92471 20699 -15264 -14808 -72118 16293 -6621 -26646 -112872 10043 30898 26269
1603 26269 -41677 7980 44044 30750 124530 200225 165453 31553 -15621 -24492 47234 -16324
1591 -16324 -455 -20782 -31663 -39617 -94669 -159030 -206009 -191208 -278091 -305979 -273076 -247617
1579 -247617 -100361 -12966 -21426 -165475 -198761 -153410 -37681 17197 63995 2144 -23186
1568 -23186 21434 37624 24043 110608 72777 -93425 -178215 -129598 -58090 -92570 -163111 -212595
1556 -212595 -202728 -95887 -70320 -147263 -184986 -84307 -75049 -147273 -69226 -8481 -50648 -36364
$$ packed form
1639e9647p645N0268J08449P2796j69598O217N8058l9485M4778r4550q1817L1076
1627h1100M5920l8117P65R7957q7979R0134P876j48847p744J34876Q7062J2935
1615A13738k1267p1772l5963M56n7310Q8411k2914k0025q6226J22915K0855m629
1603B6269o7946M9657L6064j3294R3780P5695l4772j33900m7174q871P1726o3558
1591a6324J5869k0327j0881p954n5052o4361m6979J4801q6883k7888L2903K5459
1579b47617J47256Q7395q460j44049l3286M5351J15729N4878M6798o1851k5330
1568b3186M4620J6190j3581Q6565l7831j66202q4790M8617P1508l4480p0541m9484
1556b12595R867J06841K5567p6943l7723J00679R258p2224P8047O0745m2167J4284
$$ plain form
1544 -36364 -88675 10654 -45301 66268 -3097 -107422 -38393 9558 -9123 -6647 80767 66131
1532 66131 149181 103127 80905 -39078 -143701 -13557 74012 78891 -13268 -58796 66036
1521 66036 -56452 -29739 47034 -71083 -90248 40109 -53743 -78227 -71553 40510 -28671
1510 -28671 30376 163171 21977 -91420 -261357 -249897 -172858 -44665 36626 -48856 -71758
1499 -71758 -44677 -4238 -90580 -138775 83436 23824 -17608 7912 9159 -3641 37331 63272
1487 63272 -30988 15815 23663 -1419 78223 -3876 -157391 -47179 -30547 -26413 38331 23077
1475 23077 73486 4883 56684 43117 -55872 12068 -35775 -108401 2645 -50200 -113561 -76707
1463 -76707 -31488 92450 -6934 57415 16803 -114006 -76777 -33377 -113882 -43567 172692
$$ packed form
1544c6364n2311R9329n5955J11569o9365j04325O9029M7951j8681K476Q7414j4636
1532F6131Q3050m6054k2222j19983j04623J30144Q7569M879r2159m5528J24832
1521F6036j22488K6713P6773j18117j9165J30357r3852k4484O674J12063o9181
1510b8671N9047J32795j41194j13397j69937J1460P7039J28193Q1291q5482k2902
1499g1758K7081M0439q6342m8195K22211n9612m1432K5520J247j2800M0972K5941
1487F3272r4260M6803P848k5082P9642q2099j53515J10212J6632M134O4744j5254
1475B3077N0409o8603N1801j3567r8989O7940m7843p2626J11046n2845o3361L6854
1463g6707M5219J23938r9384O4349m0612j30809L7229M3400q0505P0315K16259
$$ plain form
1452 172692 85182 8795 -48436 6071 36890 -22830 -68936 50617 29769 -26218 2893
1441 2893 122126 54086 -45147 -82876 -35894 -57584 -48347 39657 38957 193046 105027 8113
1429 8113 -61556 -15320 -52099 -139551 -43909 27185 7638 72481 114829 44869 -101450 -113442
1417 -113442 -127326 -33217 27933 61449 -80295 -88684 -93386 -22719 -90188 -163282 -40322 -28212
1405 -28212 -50351 -88540 -102476 -2853 -7999 -92967 -121390 -144775 -34820 52441 -88548 -186780
1393 -186780 -56380 10848 -19566 5418 40503 13143 -143131 -43192 -111846 8993 49021
1382 49021 -63805 -99064 -97876 -97066 17207 77613 39279 3453 -115541 -18339 -58501 -21484
1370 -21484 -59248 24857 -2875 -104730 -140582 -109428 -81470 -22662 -132603 -96143 -104041 -165757
$$ packed form
1452A72692q7510p6387n7231N4507L0819n9720m6106J19553k0848n5987K9111
1441B893J19233o8040r9233l7729M6982k1690R237Q8004p00J54089q8019r6914
1429H113o9669M6236l6779q7452R5642P1094j9547O4843M2348o9960j46319j1992
1417a13442j3884R4109O1150L3516j41744q389m702P0667o7469p3094J22960J2110
1405b8212k2139l8189j3936R9623n146q4968k8423k3385J09955Q7261j40989r8232
1393a86780J30400O7228l0414K4984L5085k7360j56274R9939o8654J20839M0028
1382D9021j12826l5259J188Q10J14273O0406l8334l5826j18994R7202m0162L7017
1370b1484l7764Q4105k7732j01855l5852L1154K7958N8808j09941L6460p898o1716
$$ plain form
1358 -165757 -121879 73839 -40151 -129681 -150897 -115426 -21898 10167 -32359 -9349 -78384
1347 -78384 -61557 -56878 -154297 -156431 -105803 -15958 -62536 -83708 -253460 -248560 -165032 -70419
1335 -70419 -14266 -42379 -50800 -60975 35325 76319 -10766 -89424 -232561 -190070 -78971 -6793
1323 -6793 -53987 887 56623 -772 15141 -46649 -155997 -106446 11750 -63455 -96955 -72705
1311 -72705 -65335 -29831 -132226 -205046 -62207 47130 119935 91248 87268 29426 55812 -43877
1299 -43877 1127 -24417 -40336 -45646 52704 173330 177465 153178 151305 199715 140431 114450
1287 114450 74996 54419 92865 252170 135563 5182 -120817 -173293 -151076 -162192 -155504
1276 -155504 -198509 -136454 -122050 -127829 69626 -18599 -12229 -74276 -5225 -35523 -56875 -31935
$$ packed form
1358a65757M3878J95718j13990q9530k1216L5471R3528L2065m2526K3010o9035
1347g8384J6827M679r7419k134N0628Q9845m6578k1172j69752M900Q3528R4613
1335g0419N6153k8113q421j0175R6300M0994q7085p8658j43137M2491J11099P2178
1323f793m7194N4874N5736n7395J5913o1790j09348M9551J18196p5205l3500K4250
1311g2705P370L5504j02395p2820J42839J09337P2805k8687l980n7842K6386r9689
1299d3877M5004k5544j5919n310R8350J20626M135k4287j873M8410n9284k5981
1287A14450l9454k0577L8446J59305j16607j30381j25999n2476K2217j1116O688
1276a55504m3005O2055J4404n779J97455q8225O370o2047O9051l0298k1352K4940
$$ plain form
1264 -31935 -97606 -122562 -72648 -41307 -63058 -160221 406 8927 -34104 61449 109165 153406
1252 153406 97555 147457 63931 -10172 -148564 -79508 -42755 19189 26795 -71758 -50490 -15893
1240 -15893 4813 -9379 2429 79102 17666 -96808 -145517 -175823 -92495 52414 -15677
1229 -15677 44 -12753 113387 118917 101307 35162 33586 69081 -67642 -177118 -90241 -79688
1217 -79688 -14310 56528 -72110 -110525 -36998 26546 56925 60643 -14054 -15952 61164 35122
1205 35122 -43595 46745 -66320 -106218 -49493 -24632 -693 35567 67413 48042 64254 78890
1193 78890 17789 45364 -65901 -53324 92276 105406 64607 55264 -34030 -28225 -139870 -8585
1181 -8585 98192 106271 -20302 5950 -5341 34831 -2199 -117597 50126 97964 185378
$$ packed form
1264c1935o5671k4956M9914L1341k1751r7163J60627Q521m3031R5553M7716M4241
1252A53406n5851M9902q3526p4103j38392O9056L6753O1944P606r8553K1268L4597
1240a5893K0706j4192J1808P6673o1436j14474m8709l0306Q3328J44909o8091
1229a5677J5721j2797J26140N530j7610o6145j576L5495j36723j09476Q6877J0553
1217g9688O5378P0838j28638l8415P3527O3544L0379L718p4697j898P7116k6042
1205C5122p8717R0340j13065l9898N6725K4861K3939L6260L1846j9371J6212J4636
1193G8890o1101K7575j11265J2577J45600J3130m0799r343q9294N805j11645J31285
1181h585J06777Q079j26573K6252j1291M0172l7030j15398J67723M7838Q7414
$$ plain form
1170 185378 -74106 -155129 -96214 -47780 -64457 -83136 -48954 -48195 -31590 69443 23928 629
1158 629 19861 -45460 -22735 -64663 -154358 -34624 132903 75542 -39585 -66228 -25687 11502
1146 11502 -56410 34434 142250 185733 84790 23138 158068 208726 148826 38722 81179
1135 81179 57023 91299 -46197 30638 1177 61951 88282 62336 141914 62414 39322 -3090
1123 -3090 45975 48013 -113071 19787 69116 135530 94723 -52939 91645 116273 115463 25355
1111 25355 23986 -29285 -97334 -10550 -27688 -126932 -67463 -110971 -41606 -71708 -163079 -104456
1099 -104456 -95281 -18160 80583 43560 36416 59868 113478 46652 57955 28731 79966 67721
1087 67721 -18408 -97241 -100257 -59830 -104421 -50428 95172 18024 50155 79917 11802 10564
$$ packed form
1170A85378k59484q1023N8915M8434j6677j8679L4182P59J6605J01033m5515k3299
1158F29J9232o5321K2725m1928q9695J19734J67527n7361j15127k6643M0541L7189
1146A1502o7912R0844J07816M3483j00943o1652J34930N0658n9900j10104M2457
1135H1179k4156L4276j37496P6835k9461O0774K6331k5946P9578p9500k3092m2412
1123c090M9065K038j61084J32858M9329O6414m0807j47662J44584K4628q10r0108
1111B5355j369n3271o8049Q6784j7138r9244N9469m3508O9365l0102r1371N8623
1099a04456R175P7121R8743l7023p144K3452N3610o6826J1303k9224N1235j2245
1087F7721q6129p8833l016M0427m4591N3993J45600p7148L2131K9762o8115j238
$$ plain form
1075 10564 60058 98777 142553 50321 -76417 -17841 -19389 -49376 -30239 -28000 -32904 35670
1063 35670 47900 -66003 -22042 -47095 -80206 -9280 -158136 -178852 -63519 69187 10867
1052 10867 -52428 -165127 -280080 -223361 -257820 -188518 -104627 27844 51391 21740 62114
1041 62114 188868 199683 97684 55899 30819 -36772 -107093 18201 86993 66988 11545
1030 11545 54452 -3597 -33542 -111871 -21029 29733 38889 95243 77657 -66515 -105652 -96480
1018 -96480 -17952 -5374 -127091 -84665 6460 -10337 -151622 -98173 -10629 39961 -128540
1007 -128540 -195556 -198501 -144246 -28554 -12919 -4865 -14296 -824 -75784 -98593 -78841 66429
995 66429 20145 18875 6723 -7474 57360 15124 42644 -73756 -86544 -157253 -106784 77074
$$ packed form
1075A0564M9494L8719M3776r2232j26738N8576j548k9987J9137K239m904O8574
1063C5670J2230j13903M3961k5053l3111P0926j48856k0716J15333J32706n8320
1052A0867o3295j12699j14953N6719l4459O9302Q3891J32471K3547k9651M0374
1041F2114J26754J0815j01999m1785k5080o7591p0321J25294O8792k0005n5443
1030A1545M2907n8049k9945p8329R0842N0762R156N6354j7586j44172l9137R172
1018i6480P8528J2578j21717M2426R1125j6797j41285N3449Q7544N0590j68501
1007a28540o7016k945N4255J15692J5635Q054r431J3472p4960k2809J9752J45270
995F6429m6284j270j2152j4197O4834m2236K7520j16400j2788p0709N0469J83858
$$ plain form
983 77074 153733 191281 166199 108648 -33090 -215905 -225859 -13525 87794 69863 -20675
972 -20675 38642 -8559 76138 80012 227499 293597 189426 13653 1508 135731 119895
961 119895 81176 53624 41435 -11980 -60153 -48108 -52333 -78363 -47379 -58063 80925 114521
949 114521 138140 3244 -4234 -1055 -24489 -45405 91309 201499 100267 62842 124134
938 124134 152058 118242 81480 -54172 -93182 31561 92085 58168 -7766 71401 150310
927 150310 173650 29376 7402 165711 134163 73625 178784 87063 106516 110704 -25739
916 -25739 -91467 -43241 -26755 -87829 -23546 -59190 132939 26508 -39823 76459 -12050
905 -12050 -31601 50805 33520 -139184 -141223 -119200 -147084 -7531 -62328 -158327 -147365 -107857
$$ packed form
983G7074P6659L7548k5082n7551j41738j82815r954K12334J01319j7931r0538
972b0675N9317m7201Q4697L874J47487O6098j04171j75773j2145J34223j5836
961A19895l8719k7552j2189n3415m8173J2045m225k6030L0984j0684J38988L3596
949A14521K3619j34896p478L179k3434k0916J36714J10190j01232l7425O1292
938A24134K7924l3816l6762j35652l9010J24743O0524l3917o5934P9167P8909
927A50310K3340j44274k1974J58309l1548o0538J05159r1721J9453M188j36443
916b5739o5728M8226J6486o1074O4283l5644J92129j06431o6331J16282q8509
905a2050j9551Q2406j7285j72704k039K2023k7884J39553n4797r5999J0962L9508
$$ plain form
893 -107857 -58598 -73403 -14144 -83550 -138303 -38861 40382 113105 91623 979 7311 -2663
881 -2663 -20622 -39386 2315 114657 40439 122600 49206 36653 102015 34610 -12118 -22148
869 -22148 24107 3710 -12675 105518 205823 93531 82549 100967 -10033 86289 73240
858 73240 -56898 4026 -17377 -102524 5599 -4429 -85771 -230439 -255666 -239439 -170495
847 -170495 -69856 -8505 15694 87358 228747 80320 18423 -88731 43562 90243 2374
836 2374 -117029 -106190 -43943 -58463 -76691 -64768 40952 19633 44230 -374 -43608 -85140
824 -85140 -130934 -59226 -177115 -108774 -20679 -37603 5029 -22941 -67168 -66259 -88659 -114785
812 -114785 -57968 49548 47704 -75108 -28707 -85007 -30121 45383 103291 190768 122342 55047
$$ packed form
893a07857M9259j4805N9259o9406n4753R9442P9243P2723k1482r0644O332r974
881b663j7959j8764M1701J12342p4218Q2161p3394j2553O5362o7405m6728j0030
869b2148M6255k0397j6385J18193J00305j12292j0982J8418j11000R6322j3049
858G3240j30138O0924k1403q5147J08123j0028q1342j44668k5227J6227O8944
847a70495J00639O1351K4199P1664J41389j48427o1897j07154J32293M6681q7869
836B374j19403J0839O2247j4520j8228J1923J05720k1319K4597m4604m3234m1532
824h5140m5794P1708j17889O8341Q8095j6924M2632k7970m4227R09k2400k6126
812a14785N6817J07516j844j22812M6401n6300N4886P5504N7908Q7477o8426o7295
$$ plain form
800 55047 -81540 -56736 -55550 -9125 36829 94385 6925 -99483 -68666 53138 177113
789 177113 211873 68902 104725 38733 -70736 -42013 -62820 -36321 97245 175230 27743
778 27743 -89389 120503 148778 -11522 -71000 -42286 -82853 2354 -41535 41170 94410
767 94410 28816 57749 -49915 85335 70297 65352 33039 27630 25546 -13399 93225 108686
755 108686 -58772 -111548 -51494 -35840 -84899 41661 146418 76620 11565 41781 47231
744 47231 22512 6722 84071 45903 19582 54943 77582 18980 -17294 31157 46101 -32820
732 -32820 -24947 -59819 22675 23467 29358 -137618 -134863 -41760 63057 24879 -18625 79063 147140
719 147140 77760 79324 84332 114119 155255 131059 113667 16542 -98856 -45989 -29880 44194
$$ packed form
800E5047j36587K4804J186M6425M5954N7556q7460j06408L0817J21804J23975
789A77113L4760j42971L5823o5992j09469K8723k0807K6499J33566P7985j47487
778B7743j17132K09892K8275j60300n9478K8714m0567Q5207m3889Q2705N3240
767I4410o5594K8933j07664J35250j5038m945l2313n409k084l8945J06624J5461
755A08686j67458n2776O0054J5654m9059J26560J04757o9798o5055L0216N450
744D7231k4719j5790P7349l8168k6321L5361K2639n8602l6274M8451J4944p8921
732c2820P873l4872Q2494P92N891j66976K755R3103J04817l8178m3504R7688O8077
719A47140o9380J564N008K9787M1136k4196j7392r7125j15398N2867J6109P4074
$$ plain form
707 44194 130270 99529 46251 59029 143197 130435 125125 45595 21465 -95591 -80687 -31422
695 -31422 41109 29013 38498 -56272 -116107 -29570 -42239 -56557 -113298 -128055 13358 62823
683 62823 1909 26322 44747 51477 -28404 -14199 13057 -38972 -80179 -67809 -95268 -231969
671 -231969 -233107 -202741 -122291 -118763 -134376 -77138 44287 132174 -7085 -50572 -11963 -51935
659 -51935 -34283 16207 64407 10857 -7375 -14777 66013 180366 154653 98873 116084 57022
647 57022 -2187 -18429 -3996 23495 -131431 -172104 -87716 -79769 26688 78701 164610 102730
635 102730 -84533 -166768 -111430 -31059 109801 -31661 55570 -22306 -91929 111876 -75
624 -75 -230187 -220600 -118424 -46652 -12005 -9745 -8651 -20951 -82113 -58603 -173367 -11164
$$ packed form
707D4194Q6076l0741n3278J2778Q4168j2762n310p9530k4130j17056J4904M9265
695c1422P2531j2096R485r4770n9835Q6537j2669j4318n6741j4757J41413M9465
683F2823o0914K4413J8425O730p9881J4205K7256n2029m1207J2370k7459j36701
671b31969j138L0366Q0450L528j5613N7238J21425Q7887j39259m3487L8609l9972
659e1935J7652N0490M8200n3550j8232p402Q0790J14353k5713n5780J7211n9062
647E7022n9209j6242J4433K7491j54926m0673Q4388P947J06457N2013Q5909o1880
635A02730j87263q2235N5338Q0371J40860j41462Q7231p7876o9623K03805j11951
624g5k30112R587J02176P1772L4647K260J094j2300o1162K3510j14764J62203
$$ plain form
612 -11164 175236 85047 29511 144722 140912 22651 7206 -56916 -213104 -259398 -60469
601 -60469 74684 71896 67419 164889 75124 -68633 -56989 -33746 6537 -92062 -203590 -123215
589 -123215 -54476 -3396 68766 89358 -23657 -137907 -127919 15128 440 33348 -22536
578 -22536 66370 80152 129522 16693 8742 -35464 -76676 -329 -72124 -46221 -91767 -63803
566 -63803 -90967 -41195 94812 96384 -42789 -32011 62884 -89019 -84387 -62729 -65929 -15625
554 -15625 15408 -46353 -11395 -61776 -42509 -12120 93955 211789 176732 66175 113596
543 113596 -54011 -208828 -77216 -99031 -116428 -149181 -113155 -48106 29202 122430 17215
532 17215 4804 -62927 -74540 -77043 -65318 -5607 -43493 -29662 26271 -42788 -181170 -75226
$$ packed form
612a1164J86400r0189n5536J15211l810j18261j5445o4122j56188m6294J98929
601f0469J35153k788m477R7470q9765j43757J1644K3243M0283r8599j11528Q0375
589a23215O8739N1080P2162K0592j13015j14250R988J43047j4688L2908n5884
578b2536Q8906J3782M9370j12829p951m4206m1212P6347p1795K5903m5546K7964
566f3803k7164M9772J36007J572j39173J0778R4895j51903M632K1658l200N0304
554a5625L1033o1761L4958n0381J9267L0389J06075J17834l5057j10557M7421
543A13596j67607j54817J31612k1815j7397l2753L6026O5049P7308R3228j05215
532A7215j2411o7731j1613k503J1725N9711l7886J3831N5933o9059j38382J05944
$$ plain form
520 -75226 -117606 -66946 -65674 54568 42442 -62013 -88831 -27743 95704 21807 2030 32850
508 32850 -23852 -32786 -8528 -71701 -84053 5051 22313 46647 98281 45440 -55464 -18563
496 -18563 52606 -48008 -107306 -395 -164402 -86494 41275 64751 145175 130447 154733
485 154733 43181 124347 202465 65713 260 53407 59124 -52554 30516 153012 178178
474 178178 175548 58889 -8409 -77611 -206605 -141909 3286 -17893 57166 -2428 -106263
463 -106263 2148 -21292 -45191 -35926 57567 23054 -47384 -2349 -62968 30535 162046 101917
451 101917 -91186 -143996 -89955 -18382 -14142 51372 92882 43591 107214 81864 21527 54104
439 54104 -22186 -98434 -21879 75227 -62195 17352 66701 92030 148235 -23141 27546 74577
$$ packed form
520g5226m2380N0660J272J20242j2126j04455k6818O1088J23447p3897j9777L0820
508C2850n6702q934K4258o3173j2352Q9104J7262K4334N1634n2841j00904L6901
496a8563P1169j00614n9298J06911j64007P7908J27769K3476Q0424j4728K4286
485A54733j11552Q1166P8118j36752o5453N3147N717j11678Q3070J22496K5166
474A78178k630j16659o7298o9202j28994O4696J45195k1179P5059n9594j03835
463a06263J08411k3440k3899R265R3493l4513p0438M5035o0619R3503J31511o0129
451A01917j93103n2810N4041P1573M240O5514M1510m9291O3623k5350o0337L2577
439E4104p6290p6248P6555R7106j37422P9547M9349K5329N6205j71376N0687M7031
$$ plain form
427 74577 71837 89061 138849 202814 192663 128785 -13362 -145160 -70815 40661 -78647
416 -78647 -89670 -17286 74405 103881 93069 169937 140669 28113 -60179 -17675 49070 8858
404 8858 -56328 -63567 -124350 -155408 -113126 -69215 51247 114294 93136 18402 -6411 69537
392 69537 26213 -66962 -1276 41637 -19861 -47159 94661 155581 45380 88759 47090 13799
380 13799 -13124 -92486 14182 129439 21433 -64125 -74158 24592 65329 -45131 -76538
369 -76538 56390 30075 59380 88758 -113291 -133900 44050 36574 16457 -61565 -18112 59148
357 59148 37474 20 -4290 144221 142837 -10467 -83040 -205515 -63917 52996 14830
346 14830 -45505 -51669 37772 17223 -8454 -58142 28743 65726 31334 -30487 -21774 20581
$$ packed form
427G4577k740J7224M9788O3965j0151o3878j42147j31798P4345J11476j19308
416g8647j1023P2384R1691K9476j0812P6868k9268j12556q8292M2504O6745m0212
404H858o5186p239o0783l1058M2282M3911J20462O3047k1158p4734k4813P5948
392F9537m3324r3175O5686M2913o1498k7298J41820O0920j10201M3379m1669l3291
380A3799k6923p9362J06668J15257j08006q5558j0033R8750M0737j10460l1407
369g6538J32928k6315K9305K9378k02049k0609J77950p476k0117p8022M3453P7260
357E9148k1674l7454m310J48511j384j53304p2573j22475J41598J16913l8166
346A4830o0335o164Q9441k0549k5677m9688Q6885L6983l4392o1821Q713M2355
$$ plain form
334 20581 100178 6490 -50898 -51627 -22919 -135393 -41371 -62173 -130108 -76621 -81658 -20808
322 -20808 -22718 198661 206179 106107 -29677 -69666 -78686 -38111 37017 -78001 -138405 -83641
310 -83641 -15548 14298 34351 196583 107337 54750 92094 -73625 -232788 -121559 -81779
299 -81779 -477 100794 55944 -2325 -44723 -12506 -3833 61511 83098 29057 20202 30554
287 30554 66363 -105374 -63825 -16136 -62195 56770 7430 96184 30322 92261 52498 -102133
275 -102133 86284 86098 -34642 -36052 15892 77873 -72943 -53179 -48695 -13993 -42328 88091
263 88091 104104 937 -61555 -72471 -25894 63993 -52417 4148 25377 -33789 -13532 -14683
251 -14683 -79223 -120071 -93674 -67729 -170296 -67510 32093 67527 113705 64423 66977 110117
$$ packed form
334B0581P9597r3688n7388p29K8708j12474R4022k0802o7935N3487n037O0850
322b0808j910K21379P518j00072j35784l9989r020M0575P5128j15018o0404N4764
310h3641O8093K9846K0053J62232q9246n2587L7344j65719j59163J11229L9780
299h1779Q1302J01271m4850n8269m2398L2217Q673O5344K1587n4041q855J0352
287C0554L5809j71737M1549M7689m6059J18965m9340Q8754o5862O1939l9763j54631
275a02133J88417j86j20740j410N1944O1981j50816J9764M484L4702k8335J30419
263H8091J6013j03167o2492j0916M6577Q9887j16410N6565K1229n9166K0257j151
251a4683o4540m0848K6397K5945j02567J02786R9603L5434M6178m9282K554M3140
$$ plain form
239 110117 72716 -27591 2514 74917 93838 45102 -9576 71630 110040 60311 10458 -145112
227 -145112 -211573 -65993 -107335 -146275 -110748 -122377 23661 20216 -9194 85086 179559 120162
215 120162 15856 59914 75518 79088 78020 -100628 -82603 -179627 -40940 37961 108193 -1063
203 -1063 -28192 -33022 -58123 -52714 47672 3641 -18660 -8623 -22953 -20983 -40485 -43713 -51721
190 -51721 -18010 -95515 -158867 -95000 -59196 -113868 -45175 66222 104023 -5123 -34298 75598
178 75598 74777 -6074 -122415 -133922 -17584 90862 -62118 -88971 -32892 -42907 -19112 -81697
166 -81697 26709 117878 -35004 11550 14407 -9329 -58254 -66141 -16663 -6788 83694 49880
154 49880 25499 68897 121571 70164 -55989 9149 -23616 75479 167450 -3625 -45429 -58261
$$ packed form
239A10117l7401j00307L0105P2403J8921m8736n4678Q1206L8410m9729m9853j55570
227a45112o6461J45580m1342l8940L5527j1629J46038l445k9410R4280R4473n9397
215A20162j04306M4058J5604L570j068j78648J8025r7024J38687P8901P0232j09256
203a063k7129m830k5101N409J00386m4031k2301J0037j4330J970j9502l228q008
190e1721L3711p7505o3352O3867L5804n4672O8693J11397L7801j09146k9175J09896
178G5598q21q0851j16341j1507J16338J08446j52980k6853N6079j0015K3795o2585
166h1697J08406R1169j52882M6554K857k3736m8925p887M9478R875R0482l3814
154D9880k4381M3398N2674n1407j26153O5138l2765R9095R1971j71075m1804j2832
$$ plain form
142 -58261 19438 67264 135702 176024 121555 35941 -24913 -26451 -19776 -35896 49236 35242
130 35242 22073 -33443 24693 57149 -61408 21621 1254 -39104 -67669 -98989 -34668 -20272
118 -20272 68158 156797 158267 103601 58007 -40124 35382 -24831 -43147 -37509 17798 -7203
106 -7203 32731 -94593 -150003 -57295 -90699 -36290 -72076 -75260 33434 45417 -1695 -148248
94 -148248 -158140 -90675 23586 28280 -31872 -19968 -3504 -39973 -147704 -60963 38513 165548
82 165548 52520 -141829 -169442 2851 74081 53836 74187 108134 -3371 -14744 81090
71 81090 144300 110976 14993 69626 40206 22096 18049 -50387 -59967 -74576 -42071 -8547 67101
58 67101 59167 30455 -73378 -125057 18493 45690 -88585 -76546 -27944 -56544 -108813 -137499
$$ packed form
142e8261P7699M7826O8438M0322n4469q5614o0854j538O675j6120Q5132j3994
130C5242j3169n5516N8136L2456j18557Q3029k0367m0358k8565l1320O4321J4396
118b0272Q8430Q8639J470n4666m5594r8131P5506o0213j8316N638N5307k5001
106g203L9934j27324n5410R2708l3404N4409l5786l184J08694J1983m7112j46553
94a48248r892O7465J14261M694o0152J1904J6464l6469j07731Q6741R9476J27035
82A65548j13028j94349k7613J72293P1230k0245K0351L3947j11505j1373R5834
71H1090O3210l3324r5983N4633k9420j8110m047o8436r580j4609L2505L3524P5648
58F7101p934k8712j03833n1679J43550K7197j34275J2039M8602k8600n2269k8686
$$ plain form
46 -137499 11153 9644 -15825 -9071 -91466 -4029 -34241 -53251 -40405 -51478 33211 -2904
34 -2904 2239 -1667 75585 68408 96965 105847 49309 -76590 -37547 -44182 -37048 -2436 23281
21 23281 -5148 15675 69917 -19216 -79493 -117597 -71179 -14009 32459 83636 -48470 -85698
9 -85698 -42863 -51676 45098 10584 95559 -5848 -1023 66100 15626
0 15626
$$ packed form
46a37499J48652j509k5469O754q2395Q7437l0212j9010J2846j1073Q4689l6115
34b904N143l906P7252p177K8557Q882n6538j25899L9043o635P134L4612K5717
21B3281k8429K0823N4242q9133o0277l8104M6418N7170M6468N1177j32106l7228
9h5698M2835q813R6774l4514Q4975j01407M825O7123n0474
0A5626
$$ Imaginary data points
##PAGE= N=2
##DATA TABLE= (X++(I..I)), XYDATA
$$ plain form
16383 -1143444 -1124921 -1020249 -1015918 -1051183 -1054167 -1013149 -1060935 -986608 -995092 -1056540 -1078539 -932637
16371 -932637 -910634 -982255 -882002 -840500 -802880 -782495 -847792 -819911 -828025 -815879 -816176 -739332
16359 -739332 -626856 -651061 -649762 -663172 -636334 -643043 -660583 -663926 -601165 -610683 -541363 -513409
16347 -513409 -493612 -494194 -482272 -472053 -402544 -402973 -359802 -353983 -350050 -361667 -438189 -389869 -340462
16334 -340462 -370192 -496979 -380092 -250289 -179848 -251649 -209596 -208026 -239017 -131252 -35110
16323 -35110 -104231 -229123 -189225 -158610 -113435 -130372 -58718 -35974 27717 34953 -57337 -13364
16311 -13364 115281 108533 -6820 8883 70351 89623 104603 51884 37523 67819 54075
16300 54075 126093 144155 99171 171267 206764 230073 157001 175687 198342 159431 175072 160836
$$ packed form
16383a143444J8523J04672M331l5265k984M1018m7786P4327q484o1448k1999J45902
16371i32637K2003p1621J00253M1502L7620K0385o5297K7881q114J2146k97P6844
16359g39332J12476k4205J299j3410K6838o709j7540l343O2761r518O9320K7954
16347e13409J9797n82J1922J0219O9509m29M3171N819L933j1617p6522M8320M9407
16334c40462k9730j26787J16887J29803P0441p1801M2053J570l0991J07765R6142
16323c5110o9121j24892L9898L0615M5175j6937P1654K2744O3691P236r2290M3973
16311a3364J28645o748j15353J5703O1468J9272J4980n2719j4361L0296j3744
16300E4075P2018J8062m4984P2096L5497K3309p3072J8686K2655l8911J5641j4236
$$ plain form
16288 160836 209955 267742 296191 252631 240017 302767 339368 342330 388737 382174 349629 356820
16276 356820 382296 464922 496607 497774 469787 402998 420524 552692 440066 422894 474480
16265 474480 426754 484241 486302 500156 453413 481082 595866 623264 630935 623426 541977 581077
16253 581077 571812 585648 641500 519673 533074 659560 572047 547445 674322 694985 681516
16242 681516 720929 732676 598495 675907 738729 770453 754943 774756 876094 891425 820643
16231 820643 784917 759700 749573 935746 1025319 978202 831859 733701 787967 798402 768325
16220 768325 853735 804471 760812 765106 830156 936785 820432 858727 995711 945160 941259
16209 941259 930510 1009438 1032800 926208 892921 832078 860845 845497 902274 881225 921154
$$ packed form
16288A60836M9119N7787K8449m3560j2614O2750L6601K962M6407o563l2545P191
16276C56820K5476Q2626L1685J167k7987o6789J7526J32168j12626j7172N1586
16265D74480m7726N7487K061J3854m6743K7669J14784K7398P671p509q1449L9100
16253E81077r265J3836N5852j21827J3401J26486q7513k4602J26877K0663j3469
16242F81516L9413J1747j34181P7412O2822L1724j5510J9813J01338J5331p0782
16231H20643l5726k5217j0127J86173Q9573m7117j46343r8158N4266J0435l0077
16220G68325Q5410m9264m3659M294O5050J06629j16353L8295J36984n0551l901
16209I41259j0749P8928K3362j06592l3287o0843K8767j5348N6777k1049L9929
$$ [...]
##END NTUPLES=NMR SPECTRUM
##END=
