##TITLE=1H_TG-2413-1
 200.13Hz, DMSO+CCl4.
 8 sc
4.8.2026
##JCAMPDX= 6.0         $$ Bruker NMR JCAMP-DX V2.0
##DATA TYPE= NMR SPECTRUM
##DATA CLASS= NTUPLES
##ORIGIN= UXNMR, Bruker Analytische Messtechnik GmbH
##OWNER= pz
$$ XWIN-NMR		Version 3.5
$$ Tue Aug  4 13:13:51 2026 Russian Standard Time (UT+4h)  she@DPX200
##.OBSERVE FREQUENCY= 200.1313
##.OBSERVE NUCLEUS= ^1H
##.ACQUISITION MODE= SIMULTANEOUS
##.ACQUISITION SCHEME= undefined
##.AVERAGES= 8
##.DIGITISER RES= 18
##SPECTROMETER/DATA SYSTEM= spect
##.PULSE SEQUENCE= zg30
##.SOLVENT NAME= DMSO
##.SHIFT REFERENCE= (INTERNAL, DMSO, 0, 15.5023)
##AUDIT TRAIL= $$ (NUMBER, WHEN, WHO, WHERE, WHAT)
$$ ##TITLE= Audit trail, XWIN-NMR		Version 3.5
$$ ##JCAMPDX= 5.01
$$ ##ORIGIN= Bruker BioSpin GmbH
$$ ##OWNER= she
$$ F:/spectra/data/she/nmr/H-C/1/pdata/1/auditp.txt
$$ ##AUDIT TRAIL=  $$ (NUMBER, WHEN, WHO, WHERE, WHAT)
(   1,<2026-08-04 13:11:49.90 +0400>,<she>,<DPX200>,
      <created by zg, POWCHK disabled, PULCHK disabled
       configuration hash MD5:
       00 E9 B6 7A A2 85 ED C7 34 08 36 98 17 FE 4E 26
       data hash MD5: 16K
       8A 4D 70 72 6A CD DB 26 1F 5D 6E D8 25 9E 6C A4>)
(   2,<2026-08-04 13:11:52.35 +0400>,<she>,<DPX200>,
      <Start of raw data processing
       efp BC_mod = 2 LB = 0.25 FT_mod = 6 PKNL = 1 PHC0 = -4216.948 PHC1 = 8.3923 SI = 16K 
       data hash MD5: 16K
       EC 2C BA BF C1 91 F1 EC BA 5B B9 98 3F B5 AF 35>)
(   3,<2026-08-04 13:12:10.18 +0400>,<she>,<DPX200>,
      <pk PHC0 = -9.167201 PHC1 = 10.4 
       data hash MD5: 16K
       1A 28 C8 94 79 BE 04 E1 A0 09 A1 D4 99 B4 4A 82>)
(   4,<2026-08-04 13:12:13.64 +0400>,<she>,<DPX200>,
      <abs ABSG = 5 
       data hash MD5: 16K
       DB 36 0D 3D 9A 6E 63 B1 DD B2 C0 F8 F1 71 37 FA>)
$$ ##END=
$$ 
$$ hash MD5
$$ EF 10 B4 49 60 F6 31 EF EF 54 18 66 49 ED 9A DD
##$RELAX= 
##$RELAX= 
##$RELAX= 
##$RELAX= 
##$RELAX= 
##$RELAX= 
$$ Bruker specific parameters
$$ --------------------------
##$DU= <F:/spectra>
##$EXPNO= 1
##$NAME= <H-C>
##$PROCNO= 1
##$TYPE= <nmr>
##$USER= <she>
##$AMP= (0..31)
100 100 100 100 100 100 100 100 100 100 100 100 100 100 100 100 100 100 
100 100 100 100 100 100 100 100 100 100 100 100 100 100 
##$AQSEQ= 0
##$AQ_mod= 1
##$AUNM= <au_zg>
##$AUTOPOS= <>
##$BF1= 200.13
##$BF2= 200.13
##$BF3= 200.13
##$BF4= 200.13
##$BF5= 200.13
##$BF6= 200.13
##$BF7= 200.13
##$BF8= 200.13
##$BYTORDA= 1
##$CFDGTYP= 0
##$CFRGTYP= 5
##$CHEMSTR= <none>
##$CNST= (0..31)
1 1 145 1 1 1 1 1 1 1 1 1 1 1 1 1 1 1 1 1 1 1 1 1 1 1 1 1 1 1 1 1 
##$CPDPRG= <>
##$CPDPRG1= <>
##$CPDPRG2= <>
##$CPDPRG3= <>
##$CPDPRG4= <mlev>
##$CPDPRG5= <mlev>
##$CPDPRG6= <mlev>
##$CPDPRG7= <mlev>
##$CPDPRG8= <mlev>
##$CPDPRGB= <>
##$CPDPRGT= <>
##$D= (0..31)
0 0.7 0 0 0 0 0 0 0 0 0 0.03 0 0 0 0 0 0 0 0 0 0 0 0 0 0 0 0 0 0 0 0 
##$DATE= 1785834709
##$DBL= (0..7)
120 120 120 120 120 120 120 120 
##$DBP= (0..7)
150 150 150 150 150 150 150 150 
##$DBP07= 0
##$DBPNAM0= <>
##$DBPNAM1= <>
##$DBPNAM2= <>
##$DBPNAM3= <>
##$DBPNAM4= <>
##$DBPNAM5= <>
$$ [...]
##$SUBNAM3= <"">
##$SUBNAM4= <"">
##$SUBNAM5= <"">
##$SUBNAM6= <"">
##$SUBNAM7= <"">
##$SUBNAM8= <"">
##$SUBNAM9= <"">
##$SW= 18.0517328524113
##$SWIBOX= (0..15)
0 0 2 0 0 0 0 0 0 0 0 0 0 0 0 0 
##$SW_h= 3612.71676300578
##$TD= 16384
##$TD0= 1
##$TE= 0
##$TE2= 300
##$TE3= 300
##$TEG= 300
##$TL= (0..7)
0 120 120 120 120 120 120 120 
##$TP= (0..7)
150 150 150 150 150 150 150 150 
##$TP07= 0
##$TPNAME0= <>
##$TPNAME1= <>
##$TPNAME2= <>
##$TPNAME3= <>
##$TPNAME4= <>
##$TPNAME5= <>
##$TPNAME6= <>
##$TPNAME7= <>
##$TPOAL= (0..7)
0.5 0.5 0.5 0.5 0.5 0.5 0.5 0.5 
##$TPOFFS= (0..7)
0 0 0 0 0 0 0 0 
##$TUNHIN= 0
##$TUNHOUT= 0
##$TUNXOUT= 0
##$USERA1= <user>
##$USERA2= <user>
##$USERA3= <user>
##$USERA4= <user>
##$USERA5= <user>
##$V9= 5
##$VALIST= <valist>
##$VCLIST= <CCCCCCCCCCCCCCC>
##$VD= 0
##$VDLIST= <DDDDDDDDDDDDDDD>
##$VPLIST= <PPPPPPPPPPPPPPP>
##$VTLIST= <TTTTTTTTTTTTTTT>
##$WBST= 1024
##$WBSW= 4
##$XGAIN= (0..3)
0 0 0 0 
##$XL= 0
##$YL= 0
##$YMAX_a= 437107
##$YMIN_a= -450571
##$ZGOPTNS= <>
##$ZL1= 120
##$ZL2= 120
##$ZL3= 120
##$ZL4= 120
##$ABSF1= 15.50009
##$ABSF2= -2.55176
##$ABSG= 5
##$ABSL= 3
##$ALPHA= 0
##$AQORDER= 0
##$ASSFAC= 0
##$ASSFACI= 0
##$ASSFACX= 0
##$ASSWID= 0
##$AUNMP= <proc_1d>
##$AZFE= 0.1
##$AZFW= 0.1
##$BCFW= 0
##$BC_mod= 2
##$BYTORDP= 0
##$COROFFS= 0
##$CY= -3
##$DATMOD= 1
##$DC= 0
##$DFILT= <>
##$DTYPP= 0
##$F1P= 0
##$F2P= 0
##$FCOR= 1
##$FTSIZE= 16384
##$FT_mod= 6
##$GAMMA= 0
##$GB= 0
##$INTBC= 1
##$INTSCL= 3.241238e-09
##$ISEN= 128
##$LB= 0.25
##$LEV0= 0
##$LPBIN= 0
##$MAXI= 10000
##$MC2= 0
##$MEAN= 0
##$ME_mod= 0
##$MI= 1.114404
##$NCOEF= 0
##$NC_proc= -5
##$NLEV= 6
##$NOISF1= 3.799351
##$NOISF2= 2.8
##$NSP= 0
##$NTH_PI= 0
##$NZP= 0
##$OFFSET= 15.50229
##$PC= 1
##$PHC0= -4226.115
##$PHC1= 18.7923
##$PH_mod= 1
##$PKNL= yes
##$PPARMOD= 0
##$PSCAL= 0
##$PSIGN= 0
##$REVERSE= no
##$SF= 200.130003885162
##$SI= 16384
##$SIGF1= 3
##$SIGF2= 2
##$SINO= 0.751879
##$SIOLD= 32768
##$SREGLST= <19F.Aceton>
##$SSB= 0
##$STSI= 16384
##$STSR= 0
##$SW_p= 3612.71676300578
##$SYMM= 0
##$S_DEV= 0
##$TDeff= 16384
##$TDoff= 0
##$TI= <>
##$TILT= no
##$TM1= 0
##$TM2= 0
##$TOPLEV= 0
##$USERP1= <user>
##$USERP2= <user>
##$USERP3= <user>
##$USERP4= <user>
##$USERP5= <user>
##$WDW= 1
##$XDIM= 16384
##$YMAX_p= 303504148
##$YMIN_p= -347380
$$ End of Bruker specific parameters
$$ ---------------------------------
##NTUPLES= NMR SPECTRUM
##VAR_NAME=  FREQUENCY,     SPECTRUM/REAL,   SPECTRUM/IMAG
##SYMBOL=    X,             R,               I
##VAR_TYPE=  INDEPENDENT,   DEPENDENT,       DEPENDENT
##VAR_FORM=  AFFN,          ASDF,            ASDF
##VAR_DIM=   16384,         16384,           16384
##UNITS=     HZ,            ARBITRARY UNITS, ARBITRARY UNITS
##FACTOR=    0.220516191357247, 1,           1
##FIRST=     3102.47331230601, 0,            0
##LAST=      -510.24345069977, 0,            0
##MIN=       -510.24345069977, -347380,      0
##MAX=       3102.47331230601, 303504148,    0
$$ Real data points
##PAGE= N=1
##DATA TABLE= (X++(R..R)), XYDATA
$$ [...]
$$ plain form
6118 387446 393855 431920 435513 468743 461072 461907 469959 458057 466111 454873 479435 516073 476219
6105 476219 455284 485336 521190 495194 514797 512755 495935 511629 507157 466150 448167 437912
6093 437912 436686 496583 509817 576517 577705 547400 574274 623420 625714 607924 621608 610799
6081 610799 623849 630660 623941 615815 683194 700474 732517 799671 744900 729153 682635 680319
6069 680319 734439 715957 620144 677169 691472 756759 746298 681421 618967 641637 625274 604582
6057 604582 568887 557365 613829 546227 604731 565987 573209 565786 546182 571497 549520 495671
6045 495671 513060 517325 535129 532407 594114 520743 489092 459978 472190 494674 528855 544511
6033 544511 546193 592261 540728 505889 468298 531630 463056 460448 501034 472296 498971 542825
$$ packed form
6118C87446O409L8065L593L3230p671Q35Q052j1902Q054j1238K4562L6638l9854
6105D76219k0935L0052L5854k5996J9603k042j6820J5694m472m1007j7983j0255
6093D37912j226N9897J3234O6700J188l0305K6874M9146K294j7790J3684j0809
6081F10799J3050O811o719q126O7379J7280L2043O7154n4771j5747m6518k316
6069F80319N4120j8482r5813N7025J4303O5287j0461o4877o2454K2670j6363k0692
6057F04582l5695j1522N6464o7602N8504l8744P222p423j9604K5315k1977n3849
6045D95671J7389M265J7804k722O1707p3371l1651k9114J2212K2484L4181J5656
6033E44511J682M6068n1533l4839l7591O3332o8574k608M0586k8738K6675M3854
$$ plain form
6021 542825 534297 558749 516476 543008 542766 475709 545207 559149 580845 602527 591506 556554
6009 556554 572841 576823 566140 592700 589626 595731 589989 583780 600419 601172 650577 719855 651748
5996 651748 631176 633838 675931 656762 631726 710743 751360 749696 688383 731972 764474 728230
5984 728230 743530 752344 763193 795132 798392 819766 861524 842271 865738 871516 873156 989532
5972 989532 1022398 1006124 1012909 1057968 1072785 1069516 1088123 1081714 1009620 1020715 1062775 1032452
5960 1032452 1106450 1130200 1215088 1234729 1259897 1285726 1323277 1314835 1382021 1502596 1536474
5949 1536474 1614876 1680928 1820301 1881999 1896643 1945941 1959817 2016788 2045320 2052803 2048275 2027599
5937 2027599 2017175 2102545 2117128 2075259 2068789 2047244 2043204 1909903 1809978 1714997 1628604 1618920
$$ packed form
6021E42825q528K4452m2273K6532k42o7057O9498J3942K1696K1682j1021l4952
6009E56554J6287L982j0683K6560l074O105n742o209J6639P53M9405O9278o8107
5996F51748k0572K662M2093j9169k5036P9017M0617j664o1313M3589L2502l6244
5984G28230J5300Q814J0849L1939L260K1374M1758j9253K3467N778J640J16376
5972I89532L2866j6274O785M5059J4817l269J8607o409p2094J1095M2060l0323
5960A032452P3998K3750Q4888J9641K5168K5829L7551q442O7186J20575L3878
5949A536474P8402O6052J39373O1698J4644M9298J3876N6971K8532P483m528k0676
5937B027599j0424Q5370J4583m1869o470k1545m040j33301r9925r4981q6393r684
$$ plain form
5925 1618920 1566887 1416831 1395420 1338286 1260685 1274196 1282181 1282645 1246143 1194568 1238135 1253917
5913 1253917 1224454 1214933 1272137 1360165 1305633 1296947 1326139 1306149 1278590 1296144 1324947 1345666
5901 1345666 1390313 1395240 1404582 1484304 1459505 1499666 1527210 1527161 1625115 1632760 1617106 1658202 1750273
5888 1750273 1745157 1728811 1739994 1789220 1820097 1862398 1902406 1934879 1988168 2016539 2079267 2106742
5876 2106742 2127213 2196553 2201795 2200595 2222249 2307167 2359542 2349098 2441957 2558660 2652367 2812177
5864 2812177 2836621 2859201 2911722 2888954 2923240 2964461 3019888 3092704 3124781 3186797 3286648
5853 3286648 3326744 3408504 3423862 3447025 3536879 3588267 3654740 3687650 3813299 4002873 4197205
5842 4197205 4398830 4661904 5153437 5729297 6334826 6823984 7105519 7085860 6977865 6826709
$$ packed form
5925A618920n2033j50056k1411n7134p7601J3511P985M64l6502n1575M3567J5782
5913A253917k9463r521N7204Q8028n4532q686K9192j9990k7559J7554K8803K0719
5901A345666M4647M927R342P9722k4799M0161K7544m9R7954P645j5654M1096R2071
5888A750273n116j6346J1183M9226L0877M2301M0008L2473N3289K8371O2728K7475
5876B106742K0471O9340N242j200K1654Q4918N2375j0444R2859J16703R3707J59810
5864B812177K4444K2580N2521k2768L4286M1221N5427P2816L2077O2016R9851
5853C286648M0096Q1760J5358K3163Q9854N1388O6473L2910J25649J89574J94332
5842D197205K01625K63074M91533N75860O05529M89158K81535j9659j07995j51156
$$ plain form
5832 6826709 6509131 6172051 5730217 5320984 4957527 4589881 4285547 4043539 3894690 3776391
5822 3776391 3658644 3655441 3703084 3701389 3788634 3884579 4069909 4341598 4624873 4968675 5548765
5811 5548765 6293427 7330546 8754018 10376990 11928644 13019089 13565345 13618783 13445957
5802 13445957 12870180 12055936 10969365 9799837 8681771 7660412 6673671 5826709 5262474
5793 5262474 4833952 4393185 4127182 3974730 3801247 3650917 3534486 3489706 3412018 3390951
5783 3390951 3306008 3185339 3091223 3052796 3001394 2866761 2764188 2785420 2683542 2599036 2548906
5772 2548906 2561032 2628005 2715136 2803618 2971590 3179995 3457554 3801238 4161116 4682157
5762 4682157 5450498 6926728 9351497 12594891 15941219 18011848 18645826 18199570 17805732
$$ packed form
5832F826709l17578l37080m41834m09233l63457l67646l04334k42008j48849j18299
5822C776391j17747l203M7643j695Q7245R5945J85330K71689K83275L43802N80090
5811E548765P44662J037119J423472J622972J551654J090445N46256N3438j72826
5802A3445957n75777q14244j086571j169528j118066j021359r86741q46962n64235
5793E262474m28522m40767k66003j52452j73483j50330j16431m4780p7688k1067
5783C390951q4943j20669r4116l8427n1402j34633j02573K1232j01878q4506n0130
5772B548906J2126O6973Q7131Q8482J67972K08405K77559L43684L59878N21041
5762D682157P68341J476230K424769L243394L346328K070629O33978m46256l93838
$$ plain form
5753 17805732 16876565 15077810 13121510 11057280 9221318 7644930 6312719 5248932
5745 5248932 4486531 3992603 3562903 3328161 3164724 2978002 2747927 2593645 2480821 2391019
5735 2391019 2236923 2069501 2022945 1955434 1963003 1882420 1827090 1771890 1695787 1703798 1673320
5724 1673320 1704716 1699790 1640676 1608849 1584178 1550944 1491437 1502109 1535385 1569726 1554540 1538591
5712 1538591 1447363 1527976 1492318 1539862 1457663 1436413 1417506 1463793 1472705 1435853 1471500 1406248
5700 1406248 1388557 1513873 1498772 1392453 1427405 1420882 1373154 1370616 1380234 1450488 1434979 1441628
5688 1441628 1462635 1444656 1447152 1470795 1514401 1458526 1442371 1464820 1473805 1550461 1645108 1640025
5676 1640025 1594856 1589953 1621368 1597346 1582935 1639979 1658757 1712306 1765132 1829629 1881162 1926495
$$ packed form
5753A7805732r29167j798755j956300k064230j835962j576388j332211j063787
5745E248932p62401m93928m29700k34742j63437j86722k30075j54282j12824q9802
5735B391019j54096j67422m6556o7511P569q0583n5330n5200p6103Q011l0478
5724A673320L1396m926n9114l1827k4671l3234n9507J0672L3276L4341j5186j5949
5712A538591r1228Q0613l5658M7544q2199k1250j8907M6287Q912l6852L5647o5252
5700A406248j7691J25316j5101j06319L4952o523m7728k538R618P0254j5509O649
5688A441628K1007j7979K496K3643M3606n5875j6155K2449Q985P6656R4647n083
5676A640025m5169m903L1415k4022j4411N7044J8778N3549N2826O4497N1533M5333
$$ plain form
5664 1926495 1864272 1833000 1838614 1773507 1773821 1746972 1671174 1668322 1754106 1857124 1842990 1794951
5652 1794951 1791649 1780762 1848758 1769511 1685400 1653573 1602046 1580816 1584793 1495892 1439148 1385983
5640 1385983 1377857 1333089 1308300 1334842 1373431 1377505 1380241 1348023 1383606 1412311 1412551 1369727
5628 1369727 1351368 1358465 1358885 1328126 1368813 1383734 1400455 1485799 1501240 1421147 1340197 1290865
5616 1290865 1337868 1315270 1298670 1247051 1200767 1221100 1291589 1278451 1280497 1331481 1301571 1315364
5604 1315364 1251250 1227625 1234523 1303574 1239069 1295842 1246384 1246459 1319187 1359194 1394152 1339872
5592 1339872 1339945 1289361 1273732 1301206 1302929 1325560 1422985 1354879 1344747 1360226 1302272 1240859
5580 1240859 1223018 1308341 1373490 1336151 1313759 1310098 1335056 1341486 1381867 1293568 1340171 1401484
$$ packed form
5664A926495o2223l1272N614o5107L14k6849p5798k852Q5784J03018j4134m8039
5652A794951l302j0887O7996p9247q4111l1827n1527k1230L977q8901n6744n3165
5640A385983q126m4768k4789K6542L8589M074K736l2218L5583K8705K40m2824
5628A369727j8359P097M20l0759M0687J4921J6721Q5344J5441q0093q0950m9332
5616A290865M7003k2598j6600n1619m6284K0333P0489j3138K046N0984k9910J3793
5604A315364o4114k3625O898O9051o4505N6773m9458P5P2728M0007L4958n4280
5592A339872P3n0584j5629K7474J723K2631R7425o8106j0132J5479n7954o1413
5580A240859j7841Q5323O5149l7339k2392l661K4958O430M0381q8299M6603O1313
$$ plain form
5568 1401484 1337525 1389984 1346500 1312652 1331938 1345529 1379723 1372281 1420571 1398968 1356927 1375777
5556 1375777 1392978 1417123 1420829 1390288 1352734 1367761 1363700 1381380 1417916 1449754 1441630 1493930
5544 1493930 1493771 1532744 1490781 1506145 1505877 1570379 1547592 1523890 1503105 1533192 1532540 1583479 1612615
5531 1612615 1558761 1570497 1606036 1589630 1599260 1631802 1622468 1725505 1802446 1790037 1742744 1680446
5519 1680446 1668466 1623914 1609604 1627392 1697596 1683596 1631950 1658828 1671075 1730166 1737556 1776502
5507 1776502 1795555 1749943 1793679 1851788 1824043 1893669 1936137 1864397 1899031 1850266 1838815
5496 1838815 1902470 1953351 1969200 1910170 1910865 1946682 2010310 1954219 1953806 1928744 1917956 2003030
5484 2003030 2057391 2021656 2029154 1992838 1984830 2052473 2130069 2153057 2194447 2152677 2164856 2226870
$$ packed form
5568A401484o3959N2459m3484l3848J9286J3591L4194p442M8290k1603m2041J8850
5556A375777J7201K4145L706l0541l7554J5027m061J7680L6536L1838q124N2300
5544A493930j59L8973m1963J5364k68O4502k2787k3702k0785L0087o52N0939K9136
5531A612615n3854J1736L5539j6406R630L2542r334J03037P6941j2409m7293o2298
5519A680446j1980m4552j4310J7788P0204j4000n1646K6878J2247N9091P390L8946
5507A776502J9053m5612M3736N8109k7745O9626M2468p1740L4634m8765j1451
5496A838815O3655N0881J5849n9030O95L5817O3628n6091m13k5062j0788Q5074
5484B003030N4361l5735P498l6316q008O7643P7596K2988M1390m1770J2179O2014
$$ plain form
5472 2226870 2237683 2305523 2351981 2427473 2395196 2362137 2409718 2444633 2459777 2479187 2503196
5461 2503196 2496303 2391005 2419147 2520844 2453687 2444044 2443083 2481195 2479509 2538249 2571945 2584592
5449 2584592 2577414 2650149 2702537 2650025 2641554 2665998 2712434 2699527 2769726 2843113 2836612 2935451
5437 2935451 3014245 3071158 3088716 3101908 3167790 3147923 3134587 3116261 3067595 3102025 3071898
5426 3071898 3128099 3171489 3186488 3274182 3263479 3287768 3309579 3346444 3330951 3373712 3415096
5415 3415096 3490751 3543362 3599163 3581031 3557617 3603576 3702079 3744872 3790885 3865432 3896465
5404 3896465 3928800 4024198 4049823 4104216 4119139 4135038 4190506 4188508 4264667 4340409 4369475 4378856
5392 4378856 4444001 4490143 4531347 4647208 4721171 4787118 4873295 4889047 4925839 4959754 5091693
$$ packed form
5472B226870J0813O7840M6458P5492l2277l3059M7581L4915J5144J9410K4009
5461B503196o893j05298K8142J01697o7157r643r61L8112j686N8740L3696J2647
5449B584592p178P2735N2388n2512q471K4444M6436j2907P0199P3387o501R8839
5437B935451P8794N6913J7558J3192O5882j9867j3336j8326m8666L4430l0127
5426C071898N6201M3390J4999Q7694j0703K4289K1811L6865j5493M2761M1384
5415C415096P5655N2611N5801j8132k3414M5959R8503M2793M6013P4547L1033
5404C896465L2335R5398K5625N4393J4923J5899N5468j998P6159P5742K9066R381
5392D378856O5145M6142M1204J15861P3963O5947Q6177J5752L6792L3915J31939
$$ plain form
5381 5091693 5129849 5198636 5270590 5276333 5348641 5406276 5484827 5578063 5618203 5732841 5834969
5370 5834969 5881073 6014552 6049625 6127848 6276432 6322432 6424174 6492625 6597671 6615809 6655720
5359 6655720 6792279 6915012 7035073 7156819 7288732 7365061 7448579 7558441 7666508 7789079
5349 7789079 7947763 8081842 8092302 8218781 8365673 8544505 8659434 8786876 9010200 9082286
5339 9082286 9220424 9376911 9552039 9671734 9826086 9951573 10126077 10220129 10354914 10574653
5329 10574653 10809281 10936104 11029146 11149460 11323892 11449578 11502205 11629985 11833268 11979897
5319 11979897 12123583 12258404 12406557 12499278 12589854 12718482 12769197 12898852 12983405 12997968
5309 12997968 13115370 13223851 13280606 13395838 13396138 13454274 13577750 13598137 13619603 13656568 13703931
$$ packed form
5381E091693L8156O8787P1954N743P2308N7635P8551R3236M0140J14638J02128
5370E834969M6104J33479L5073P8223J48584M6000J01742O8451J05046J8138L9911
5359F655720J36559J22733J20061J21746J31913P6329Q3518J09862J08067J22571
5349G789079J58684J34079J0460J26479J46892J78832J14929J27442K23324P2086
5339I082286J38138J56487J75128J19695J54352J25487J74504R4052J34785K19739
5329A0574653K34628J26823R3042J20314J74432J25686N2627J27780K03283J46629
5319A1979897J43686J34821J48153R2721R0576J28628N0715J29655Q4553J4563
5309A2997968J17402J08481N6755J15232L00N8136J23476K0387K1466L6965M7363
$$ plain form
5298 13703931 13701841 13699707 13684284 13576076 13564256 13551614 13503393 13491718 13428399 13358510 13324325
5287 13324325 13202239 13117034 13000815 12934083 12813703 12654209 12558942 12439886 12354187 12276657
5277 12276657 12168933 12045480 11897215 11782820 11666076 11581257 11446918 11305488 11200388 11068531
5267 11068531 10912874 10781794 10692780 10602486 10500847 10322571 10210220 10132613 10045556 9885120
5257 9885120 9750745 9667540 9552500 9435874 9312760 9192462 9131077 9018676 8909082 8816040
5247 8816040 8751850 8760369 8611812 8467867 8421369 8363381 8296661 8195387 8197312 8106728 8038387
5236 8038387 7948899 7880947 7840989 7743904 7631932 7568210 7532750 7490051 7494513 7371046 7356179
5225 7356179 7319805 7347219 7325278 7305156 7244934 7104710 7044315 7092019 7100171 7017184 6957310
$$ packed form
5298A3703931k090k134j5423j08208j1820j2642m8221j1675o3319o9889l4185
5287A3324325j22086q5205j16219o6732j20380j59494r5267j19056q5699p7530
5277A2276657j07724j23453j48265j14395j16744q4819j34339j41430j05100j31857
5267A1068531j55657j31080q9014r0294j01639j78276j12351p7607q7057j60436
5257I885120j34375q3205j15040j16626j23114j20298o1385j12401j09594r3042
5247H816040o4190Q519j48557j43945m6498n7988o6720j01274J925r0584o8341
5236H038387q9488o7952l9958r7085j11972o3722l5460m2699M462j23467j4867
5225G356179l6374K7414k1941k0122o0222j40224o0395M7704Q152q2987n9874
$$ plain form
5214 6957310 6978554 6888223 6825308 6867773 6887613 6834035 6826604 6820930 6849541 6815269 6759738 6763903
5202 6763903 6744131 6724978 6742630 6732838 6755194 6732653 6714348 6698611 6664236 6685399 6658520 6736133
5190 6736133 6771880 6758809 6720106 6751831 6682590 6721971 6767916 6747975 6747838 6757789 6749270 6803676
5178 6803676 6853588 6790035 6831750 6866534 6872173 6906259 6933529 6910476 6960360 7013903 7006869 7059788
5166 7059788 7042797 7011501 7052677 7157145 7105156 7136849 7165704 7299607 7340936 7341717 7453563
5155 7453563 7510305 7515554 7486448 7527857 7570095 7565720 7603394 7717626 7754107 7758135 7809455 7841212
5143 7841212 7919501 7964258 7929808 8004067 8074618 8186467 8216368 8269190 8354071 8407485 8455840
5132 8455840 8435035 8486849 8506353 8605069 8689756 8712162 8802199 8865510 8947309 8953128 9019299 9128035
$$ packed form
5214F957310K1244r0331o2915M2465J9840n3578p431n674K8611l4272n5531M165
5202F763903j9772j9153J7652r792K2356k2541j8305j5737l4375K1163k6879P7613
5190F736133L5747j3071l8703L1725o9241L9381M5945j9941j37R951q519N4406
5178F803676M9912o3553M1715L4784N639L4086K7270k3053M9884N3543p034N2919
5166G059788j6991l1296M1176J04468n1989L1693K8855J33903M1329P81J11846
5155G453563N6742N249k9106M1409M2238m375L7674J14232L6481M028N1320L1757
5143G841212P8289M4757l4450P4259P0551J11849K9901N2822Q4881N3414M8355
5132H455840k0805N1814J9504R8716Q4687K2406R0037O3311Q1799N819O6171J08736
$$ plain form
5120 9128035 9190776 9196551 9258691 9346200 9371702 9429758 9498558 9599725 9646940 9718317 9816813
5109 9816813 9909454 9941315 9989818 9997713 10111006 10206978 10244670 10254406 10296348 10346501 10433132 10459863
5097 10459863 10504937 10672069 10759440 10842788 10934657 10966559 10999187 11102225 11132092 11247278 11357821
5086 11357821 11413325 11456579 11472065 11530678 11657988 11743487 11764639 11846995 11922281 11947907 12015572
5075 12015572 12042658 12113819 12232549 12269584 12316283 12409511 12452585 12535201 12518084 12641491 12675687
5064 12675687 12717303 12759325 12731739 12811896 12880241 12877658 12863366 12911012 12972902 12953709 13001205
5053 13001205 13007497 13049370 13032503 13066018 13108837 13124083 13135011 13157074 13145553 13140422 13176416 13179694
5041 13179694 13173061 13221210 13247410 13213388 13210229 13179778 13214584 13271741 13331897 13294741 13201170 13232794
$$ packed form
5120I128035O2741N775O2140Q7509K5502N8056O8800J01167M7215P1377R8496
5109I816813R2641L1861M8503P895J13293R5972L7692R736M1942N0153Q6631K6731
5097A0459863M5074J67132Q7371Q3348R1869L1902L2628J03038K9867J15186J10543
5086A1357821N5504M3254J5486N8613J27310Q5499K1152Q2356P5286K5626O7665
5075A2015572K7086P1161J18730L7035M6699R3228M3074Q2616j7117J23407L4196
5064A2675687M1616M2022k7586Q0157O8345k583j4292M7646O1890j9193M7496
5053A3001205O292M1873j6867L3515M2819J5246J0928K2063j1521n131L5994L278
5041A3179694o633M8149K6200l4022l159l0451L4806N7157O0156l7156r3571L1624
$$ plain form
5029 13232794 13254286 13219635 13246033 13162849 13140679 13158127 13099302 13033792 13053807 13025994 12956736
5018 12956736 12929786 12921110 12889382 12863464 12810322 12712624 12626505 12578113 12611008 12610360 12640249 12581812
5006 12581812 12484902 12395713 12286687 12329561 12277582 12198828 12117464 12039905 12010031 11978574 11941154
4995 11941154 11938191 11938833 12001068 12020751 11985185 11960670 11956172 11862239 11753061 11591155 11470054
4984 11470054 11388085 11277550 11147599 11046624 10859332 10728954 10625930 10506950 10407373 10400262
4974 10400262 10302365 10214755 10184622 10130350 10005496 9950752 9874455 9743914 9668262 9600182 9555227
4963 9555227 9467922 9409487 9342724 9319533 9190997 9075016 8964610 8944440 8910067 8806804 8763865
4952 8763865 8670279 8562889 8487045 8394245 8340774 8295248 8247831 8222284 8103225 8035836 8004074
$$ packed form
5029A3232794K1492l4651K6398q3184k2170J7448n8825o5510K0015k7813o9258
5018A2956736k6950q676l1728k5918n3142r7698q6119m8392L2895o48K9889n8437
5006A2581812r6910q9189j09026M2874n1979p8754q1364p7559k9874l1457l7420
4995A1941154k963O42O2235J9683l5566k4515m498r3933j09178j61906j21101
4984A1470054q1969j10535j29951j00975j87292j30378j03024j18980r9577p111
4974A0400262r7897q7610l0133n4272j24854n4744p6297j30541p5652o8080m4955
4963I555227q7305n8435o6763k3191j28536j15981j10406k0170l4373j03263m2939
4952H763865r3586j07390p5844r2800n3471m5526m7417k5547j19059o7389l1762
$$ plain form
4941 8004074 7980357 7926861 7787192 7704169 7664286 7642988 7624166 7608336 7485546 7397800 7294412
4930 7294412 7216541 7187364 7156496 7126658 7050191 6928535 6944847 6902804 6770109 6705360 6651133
4919 6651133 6615566 6536963 6550059 6504892 6412009 6345141 6367987 6371099 6297357 6252081 6178768 6116626
4907 6116626 6045462 6024419 6071947 6082179 5986437 5924055 5901103 5801206 5710168 5751938 5716243
4896 5716243 5649491 5596028 5585307 5537371 5478879 5462105 5397829 5425729 5397358 5380054 5380621 5348856
4884 5348856 5304746 5201030 5183640 5127239 5131995 5111075 5131046 5116879 5102290 5076134 5063708
4873 5063708 5038475 5064776 5064917 5025167 5020750 4944349 4907484 5012283 5037744 5030610 4987523 4962748
4861 4962748 4988607 5072650 5170339 5182751 5162701 5132038 5249828 5360519 5396978 5465449 5587251
$$ packed form
4941H004074k3717n3496j39669q3023l9883k1298j8822j5830j22790q7746j03388
4930G294412p7871k9177l0868k9838p6467j21656J6312m2043j32695o4749n4227
4919F651133l5567p8603J3096m5167r2883o6868K2846L112p3742m5276p3313o2142
4907F116626p1164k1043M7528J0232r5742o2382k2952r9897r1038M1770l5695
4896E716243o6752n3463j0721m7936n8492j6774o4276K7900k8371j7304N67l1765
4884E348856m4110j03716j7390n6401M756k0920J9971j4167j4589k6156j2426
4873E063708k5233K6301J41l9750m417p6401l6865J04799K5461p134m3087k4775
4861D962748K5859Q4043R7689J2412k0050l0663J17790J10691L6459O8471J21802
$$ plain form
4850 5587251 5639961 5701036 5762067 5792453 5799089 5777447 5732750 5646183 5574973 5586315 5551195 5584984
4838 5584984 5685233 5735675 5810731 5972795 6075481 6250971 6436465 6634304 6964155 7317655
4828 7317655 7715561 8264307 9102445 10598363 12688585 15251159 17293538 18275863 18331847
4819 18331847 18167000 17966384 16919462 15516191 14162941 12897385 11628797 10588473
4811 10588473 9737263 9043205 8605889 8396357 8251377 8048537 7984041 7886576 7759411 7643548
4801 7643548 7544534 7505559 7457112 7321618 7196142 7091945 7079325 7008078 6912888 6779408 6641701
4790 6641701 6574840 6422751 6303724 6306792 6276626 6154900 6112714 6107587 6057841 5989866 5899091
4779 5899091 5916599 5855453 5839350 5799690 5765216 5679172 5717228 5776199 5754209 5750069 5775979 5848530
$$ packed form
4850E587251N2710O1075O1031L0386O636k1642m4697q6567p1210J1342l5120L3789
4838E584984J00249N0442P5056J62064J02686J75490J85494J97839L29851L53500
4828G317655L97906N48746Q38138J495918K090222K562574K042379R82325N5984
4819A8331847j64847k00616j046922j403271j353250j265556j268588j040324
4811A0588473q51210o94058m37316k09532j44980k02840o4496r7465j27165j15863
4801G643548r9014l8975m8447j35494j25476j04197j2620p1247r5190j33480j37707
4790F641701o6861j52089j19027L068l0166j21726m2186n127m9746o7975r0775
4779E899091J7508o1146j6103l9660l4474q6044L8056N8971k1990m140K5910P2551
$$ plain form
4767 5848530 5828968 5801514 5743108 5784719 5780083 5789714 5854419 5882556 5879142 5886116 5874681 5853432
4755 5853432 5872544 5881011 5886508 5986815 5987326 5991144 5998227 6089259 6170758 6224388 6303981 6359962
4743 6359962 6335860 6317843 6341966 6374666 6346707 6344136 6314932 6274013 6248385 6148471 6115418 6045103
4731 6045103 5891348 5782696 5648151 5595562 5443914 5283950 5209320 5165703 5108862 4968887
4721 4968887 4858093 4715933 4610833 4522595 4445858 4448275 4400877 4285614 4223413 4202396 4153941
4710 4153941 4100752 4038848 3984199 3838311 3768031 3672516 3560335 3457567 3393061 3348930 3247004
4699 3247004 3197866 3085704 3028800 2974165 2946340 2948305 2838354 2724770 2646725 2542307 2507335
4688 2507335 2439466 2493020 2510887 2413151 2467694 2437626 2361928 2361256 2331333 2310663 2286001 2227460
$$ packed form
4767E848530j9562k7454n8406M1611m636R631O4705K8137l414O974j1435k1249
4755E853432J9112Q467N497J00307N11L818P083R1032Q1499N3630P9593N5981
4743F359962k4102j8017K4123L2700k7959k571k9204m0919k5628r9914l3053p0315
4731F045103j53755j08652j34545n2589j51648j59964p4630m3617n6841j39975
4721D968887j10794j42160j05100q8238p6737K417m7398j15263o2201k1017m8455
4710D153941n3189o1904n4649j45888p0280r5515j12181j02768o4506m4131j01926
4699C247004m9138j12162n6904n4635k7825J965j09951j13584p8045j04418l4972
4688B507335o7869N3554J7867r7736N4543l0068p5698o72k9923k0670k4662n8541
$$ plain form
4676 2227460 2247774 2281360 2299136 2288763 2251425 2229731 2229768 2220373 2189407 2203577 2225020 2247025
4664 2247025 2207649 2238446 2227623 2208787 2179930 2153488 2143017 2197398 2216584 2208032 2145707 2142358
4652 2142358 2149698 2139967 2152444 2186618 2238422 2233139 2158729 2147382 2268239 2287602 2259990 2264828
4640 2264828 2270585 2349144 2381712 2416518 2453331 2562517 2657812 2744575 2905418 3087705 3393554
4629 3393554 3856677 4596678 5350184 5867999 6096150 6116516 6093493 5849305 5525869 5142615
4619 5142615 4820022 4500956 4206201 3990076 3892203 3901608 4049513 4314959 4579912 4889259
4609 4889259 5266278 5547822 5814192 6182848 6471206 6859975 7302963 7903036 8491874 8973200
4599 8973200 9285434 9604959 9845096 10124004 10530926 11041498 11576790 12058425 12286948 12280677
$$ packed form
4676B227460K0314L3586J7776j0373l7338k1694L7r395l0966J4170K1443K2005
4664B247025l9376L0797j0823j8836k8857k6442j0471N4381J9186q552o2325l349
4652B142358P340r731J2477L4174N1804n283p4410j1347J20857J9363k7612M838
4640B264828N757P8559L2568L4806L6813J09186R5295Q6763J60843J82287L05849
4629C393554M63123P40001P53506N17815K28151K0366k3023k44188l23436l83254
4619E142615l22593l19066k94755k16125r7873R405J47905K65446K64953L09347
4609D889259L77019K81544K66370L68656K88358L88769M42988O00073N88838M81326
4599H973200L12234L19525K40137K78908M06922N10572N35292M81635K28523o271
$$ plain form
4589 12280677 12119608 11914643 11699212 11552128 11447123 11296315 11033902 10685068 10246788
4580 10246788 9811627 9366316 8889656 8457398 8016352 7627840 7211549 6741322 6317179
4571 6317179 5930705 5490622 5136768 4783901 4409922 4091408 3821914 3609027 3445003 3348450
4561 3348450 3226334 3134491 3086543 3017325 3005333 3018514 2990973 2919662 2886965 2942402 2943704
4550 2943704 2958211 2998747 3050383 3059967 3098634 3202843 3281872 3260482 3309832 3360252 3416749
4539 3416749 3514789 3624948 3736628 3868232 3968394 4166301 4489563 4771390 5195517 5619265
4529 5619265 6173372 6850819 7775714 9036469 10582845 12263752 13997175 15612357 17054057
4520 17054057 18206306 19215875 20302288 21444726 22734154 24211334 25905341 27745534
$$ packed form
4589A2280677j61069k04965k15431j47084j05005j50808k62413l48834m38280
4580A0246788m35161m45311m76660m32258m41046l88512m16291m70227m24143
4571F317179l86474m40083l53854l52867l73979l18514k69494k12887j64024r6553
4561C348450j22116r1843m7948o9218j1992J3181k7541p1311l2697N5437J302
4550B943704J4507M0536N1636R584L8667J04209P9029k1390M9350N0420N6497
4539C416749R8040J10159J11680J31604J00162J97907L23262K81827M24127M23748
4529E619265N54107O77447R24895J260755J546376J680907J733423J615182J441700
4520A7054057J152249J009569J086413J142438J289428J477180J694007J840193
$$ plain form
4512 27745534 29394489 30548021 31068852 31026733 30526276 29655722 28472762 27253722 26039358
4503 26039358 24805159 23772935 22649692 21392681 20082246 18729980 17261294 15754971
4495 15754971 14255584 12675404 11191151 9799523 8594797 7540570 6680411 5937311
4487 5937311 5378431 4885867 4507898 4138909 3880269 3672881 3414948 3188741 3032840 2921481
4477 2921481 2785360 2603639 2487101 2404637 2332589 2282623 2195141 2075538 2047658 2015699 1901055
4466 1901055 1941293 1903126 1828713 1798198 1733960 1668115 1645996 1669133 1654874 1598672 1603297 1521417
4454 1521417 1526613 1491975 1452558 1425181 1457118 1415901 1395457 1369565 1310762 1355950 1384534 1324895
4442 1324895 1241845 1257396 1301335 1268859 1275832 1267352 1254922 1282891 1303395 1230440 1184717 1261017
$$ packed form
4512B7745534J648955J153532N20831m2119n00457q70554j182960j219040j214364
4503B6039358j234199j032224j123243j257011j310435j352266j468686j506323
4495A5754971j499387j580180j484253j391628j204726j054227q60159p43100
4487E937311n58880m92564l77969l68989k58640k07388k57933k26207j55901j11359
4477B921481j36121j81721j16538q2464p2048m9966q7482j19603k7880l1959j14644
4466A901055M0238l8167p4413l0515o4238o5845k2119K3137j4259n6202M625q1880
4454A521417N196l4638l9417k7377L1937m1217k0444k5892n8803M5188K8584n9639
4442A324895q3050J5551M3939l2476O973q480j2430K7969K0504p2955m5723P6300
$$ plain form
4430 1261017 1197261 1192250 1156564 1128281 1172707 1207443 1151656 1146495 1153731 1169132 1146117 1097484
4418 1097484 1090193 1109274 1106560 1121999 1168038 1120694 1142870 1175040 1155432 1166208 1202183 1245304
4406 1245304 1253654 1188166 1162057 1163503 1185849 1198488 1214269 1219920 1217184 1266927 1248767 1235034
4394 1235034 1245421 1220679 1244843 1216571 1251382 1248721 1237915 1202442 1186858 1196354 1242965 1260024
4382 1260024 1218066 1157549 1265988 1349195 1314998 1317688 1315937 1244408 1232422 1326213 1338885 1349971
4370 1349971 1348400 1368791 1426815 1410282 1407794 1473898 1467492 1449992 1519534 1533058 1467362 1461071
4358 1461071 1448757 1482921 1525493 1542671 1504808 1508877 1559467 1613668 1600774 1650274 1668590 1701206
4346 1701206 1702260 1634177 1625586 1600890 1661644 1654183 1642868 1690127 1754290 1697707 1676771 1755136
$$ packed form
4430A261017o3756n011l5686k8283M4426L4736n5787n161P236J5401k3015m8633
4418A097484p291J9081k714J5439M6039m7344K2176L2170j9608J0776L5975M3121
4406A245304Q350o5488k6109J446K2346J2639J5781N651k736M9743j8160j3733
4394A235034J0387k4742K4164k8272L4811k661j0806l5473j5584R496M6611J7059
4382A260024m1958o0517J08439Q3207l4197K690j751p1529j1986R3791J2672J1086
4370A349971j571K0391N8024j6533k488O6104o406j7500O9542J3524o5696o291
4358A461071j2314L4164M2572J7178l7863M069N0590N4201j2894M9500J8316L2616
4346A701206J054o8083q591k4696O0754p461j1315M7259O4163n6583k0936P8365
$$ plain form
4334 1755136 1761721 1762033 1740368 1721423 1706389 1646640 1642504 1690663 1714975 1777842 1864908 1803381
4322 1803381 1818214 1795926 1775346 1806082 1777306 1843376 1837005 1833028 1927897 2006622 2020340 2060100
4310 2060100 2080652 2121954 2073696 2035043 2126470 2222443 2255184 2301673 2354033 2416474 2450136
4299 2450136 2531717 2604454 2685152 2713130 2777548 2808891 2836308 2825666 2863076 2905789 2966217
4288 2966217 3063357 3217898 3299693 3320189 3401675 3424810 3503236 3578719 3665444 3773824 3837733
4277 3837733 3955308 4046011 4155869 4271187 4401061 4548623 4691966 4816251 4916455 5136031
4267 5136031 5309105 5467071 5608534 5767253 5945107 6238086 6518305 6749023 7020837 7395800
4257 7395800 7753788 8154769 8472382 8744031 9042243 9345349 9567117 9843071 10120699 10511516
$$ packed form
4334A755136O585L12k1665j8945j5034n9749m136M8159K4312O2867Q7066o1527
4322A803381J4833k2288k0580L0736k8776O6070o371l977R4869P8725J3718L9760
4310B060100K0552M1302m8258l8653R1427R5973L2741M6489N2360O2441L3662
4299B450136Q1581P2737Q0698K7978O4418L1343K7417j0642L7410M2713O0428
4288B966217R7140J54541Q1795K0496Q1486K3135P8426P5483Q6725J08380O3909
4277C837733J17575R0703J09858J15318J29874J47562J43343J24285J00204K19576
4267E136031J73074J57966J41463J58719J77854K92979K80219K30718K71814L74963
4257G395800L57988M00981L17613K71649K98212L03106K21768K75954K77628L90817
$$ plain form
4247 10511516 10998568 11452036 11986572 12545988 13137682 13685526 14152165 14557540 14860791
4238 14860791 15113101 15280720 15388824 15513001 15719748 15964452 16259541 16711435 17128701
4229 17128701 17576906 18085118 18433686 18654710 18699879 18654950 18478986 18100538 17718614 17327401
4219 17327401 17024260 16756604 16589159 16489071 16456399 16338914 16216025 16035511 15773380 15372160
4209 15372160 14832967 14189814 13489963 12868778 12236946 11647649 11188247 10763739 10328249
4200 10328249 9983221 9636343 9263342 8995176 8551775 8113556 7718736 7177718 6705218
4191 6705218 6339037 5980424 5619324 5294520 4906363 4638207 4414155 4234012 4008363 3793838
4181 3793838 3602087 3441234 3248439 3097895 2929044 2768321 2674244 2567869 2469232 2389075
$$ packed form
4247A0511516M87052M53468N34536N59416N91694N47844M66639M05375L03251
4238A4860791K52310J67619J08104J24177K06747K44704K95089M51894M17266
4229A7128701M48205N08212L48568K21024M5169m4929j75964l78448l81924l91213
4219A7327401l03141k67656j67445j00088l2672j17485j22889j80514k62131m01220
4209A5372160n39193o43153o99851o21185o31832n89297m59402m24508m35490
4200A0328249l45028l46878l73001k68166m43401m38219l94820n41018m72500
4191F705218l66181l58613l61100l24804l88157k68156k24052j80143k25649k14525
4181C793838j91751j60853j92795j50544j68851j60723r4077j06375r8637q0157
$$ plain form
4171 2389075 2300256 2170142 2041211 1925594 1940762 1915687 1859484 1850696 1767625 1676191 1670075
4160 1670075 1634087 1538757 1583227 1583384 1556587 1522304 1495896 1531710 1505296 1416691 1424078 1430449
4148 1430449 1392953 1428948 1402307 1377538 1378815 1424775 1453529 1463418 1401532 1350957 1350793 1357382
4136 1357382 1263749 1254198 1261875 1271765 1251652 1255944 1323574 1273801 1211460 1257589 1262105 1254680 1217727
4123 1217727 1193989 1223849 1228683 1234236 1205012 1226496 1230237 1211365 1204020 1185611 1213313 1254500
4111 1254500 1263722 1269349 1226433 1180882 1142895 1143907 1172880 1136619 1206662 1218402 1121818 1174407
4099 1174407 1155915 1187626 1166946 1210200 1175396 1212154 1168244 1171386 1259481 1250150 1207531 1227356
4087 1227356 1276195 1281651 1322081 1268258 1316813 1314383 1261481 1295667 1334926 1308372 1366407 1415725
$$ packed form
4171B389075q8819j30114j28931j15617J5168k5075n6203q788q3071r1434o116
4160A670075l5988r5330M4470J57k6797l4283k6408L5814k6414q8605P387O371
4148A430449l7496L5995k6641k4769J277M5960K8754R889o1886n0575j64O589
4136A357382r3633r551P677R890k0113M292O7630m9773o2341M6129M516p425l6953
4123A217727k3738K9860M834N553k9224K1484L741j8872p345j8409K7702M1187
4111A254500R222N627m2916m5551l7987J012K8973l6261P0043J1740r6584N2589
4099A174407j8492L1711k0680M3254l4804L6758m3910L142Q8095r331m2619J9825
4087A227356M8839N456M0430n3823M8555k430n2902L4186L9259k6554N8035M9318
$$ plain form
4075 1415725 1399540 1369986 1410765 1401313 1451098 1505884 1558508 1517241 1529536 1518337 1508128 1543364
4063 1543364 1518150 1545559 1634792 1709997 1709331 1752979 1809493 1858303 1947432 1992387 2002360 2066618
4051 2066618 2098314 2111799 2218504 2227651 2278561 2331604 2311140 2373433 2448141 2494957 2442428
4040 2442428 2432170 2493271 2478783 2427502 2500416 2502189 2505725 2466640 2440379 2452945 2549735 2614100
4028 2614100 2667924 2747705 2745056 2715094 2782247 2833682 2891103 2991887 3028054 3018218 2956292 2931890
4016 2931890 2928379 2954595 2976355 2925949 2822099 2844545 2890828 2880086 2847082 2891991 2895561 2862972
4004 2862972 2792626 2790625 2861182 2905092 2938231 2933749 2876243 2956720 3044676 3037017 3030512 3103987
3992 3103987 3172255 3280831 3315944 3343457 3440281 3498990 3616874 3725093 3752980 3863097 4058022
$$ packed form
4075A415725j6185k9554M0779r452M9785N4786N2624m1267J2295j1199j0209L5236
4063A543364k5214K7409Q9233P5205o66M3648N6514M8810Q9129M4955R973O4258
4051B066618L1696J3485J06705R147N0910N3043k0464O2293P4708M6816n2529
4040B442428j0258O1101j4488n1281P2914J773L536l9085k6261J2566R6790O4365
4028B614100N3824P9781k649k9962O7153N1435N7421J00784L6167r836o1926k4402
4016B931890l511K6216K1760n0406j03850K2446M6283j0742l3004M4909L570l2589
4004B862972p0346k001P0557M3910L3139m482n7506Q0477Q7956p659o505P3475
3992C103987O8268J08576L5113K7513R6824N8709J17884J08219K7887J10117J94925
$$ plain form
3981 4058022 4182438 4212021 4230594 4429315 4516526 4561025 4643432 4758386 4843136 4934785 5054522
3970 5054522 5201171 5257928 5479190 5661292 5823065 6009015 6148356 6369157 6598987 6783451
3960 6783451 6946825 7204023 7430234 7615806 7788305 7914680 8042709 8229994 8360256 8506959
3950 8506959 8677486 8921417 9201078 9557766 10091410 10500072 10724360 10825775 10751967 10760018
3940 10760018 10664890 10484006 10241515 10000297 9842983 9623800 9423223 9290002 9129384 8944807
3930 8944807 8789832 8666353 8654330 8543374 8382183 8244286 8183046 8087243 8000632 7871500
3920 7871500 7729707 7678523 7599015 7677397 7777668 7919193 8102941 8130571 8086166 7910070
3910 7910070 7666263 7434064 7103918 6762509 6415372 6051709 5750233 5406614 5106586 4846990
$$ packed form
3981D058022J24416K9583J8573J98721Q7211M4499Q2407J14954Q4750R1649J19737
3970E054522J46649N6757K21262J82102J61773J85950J39341K20801K29830J84464
3960F783451J63374K57198K26211J85572J72499J26375J28029J87285J30262J46703
3950H506959J70527K43931K79661L56688N33644M08662K24288J01415p3808Q051
3940A0760018r5128j80884k42491k41218j57314k19183k00577j33221j60618j84577
3930H944807j54975j23479j2023j10956j61191j37897o1240r5803q6611j29132
3920G871500j41793n1184p9508P8382J00271J41525J83748K7630m4405j76096
3910G910070k43807k32199l30146l41409l47137l63663l01476l43619l00028k59596
$$ plain form
3900 4846990 4665129 4447951 4219756 4096996 4025530 3889215 3762868 3698164 3637423 3525627
3890 3525627 3425803 3342065 3260809 3206505 3147555 3096243 3007555 3022394 3016350 2965389 2898047 2870764
3878 2870764 2806751 2772794 2776647 2756364 2673472 2606399 2512942 2504908 2523734 2505836 2476644 2403730
3866 2403730 2375353 2394003 2362257 2314416 2302020 2308911 2283646 2168854 2142019 2096420 2075538
3855 2075538 2038031 1960174 1961762 1967366 1942614 1946825 1965719 1897341 1908542 1931622 1873631 1834730
3843 1834730 1832626 1850737 1798946 1748224 1823483 1774401 1778881 1781264 1743669 1837230 1881445 1847260
3831 1847260 1818666 1830873 1844508 1899088 1878726 1891553 1865086 1850699 1831488 1845984 1901868
3820 1901868 1927829 1956032 1945271 1919772 1943424 1964650 2019889 2075772 2123982 2261379 2319383
$$ packed form
3900D846990j81861k17178k28195j22760p1466j36315j26347o4704o0741j11796
3890C525627r9824q3738q1256n4304n8950n1312q8688J4839o044n0961o7342k7283
3878B870764o4013l3957L853k0283q2892o7073r3457q034J8826j7898k9192p2914
3866B403730k8377J8650l1746m7841j2396O891k5265j14792k6835m5599k0882
3855B075538l7507p7857J588N604k4752M211J8894o8378J1201K3080n7991l8901
3843A834730k104J8111n1791n0722P5259m9082M480K383l7595R3561M4215l4185
3831A847260k8594J2207J3635N4580k0362J2827k6467j4387j9211J4496N5884
3820A901868K5961K8203j0761k5499K3652K1226N5239N5883M8210J37397N8004
$$ plain form
3809 2319383 2341110 2413598 2479483 2574389 2624216 2643230 2618580 2629267 2693603 2709122 2678737
3798 2678737 2689987 2733629 2727956 2802971 2806290 2794872 2822186 2791089 2743305 2772141 2759439 2744974
3786 2744974 2738434 2680924 2637380 2585897 2547229 2557394 2569259 2564902 2554194 2544350 2562472 2543493
3774 2543493 2582863 2556575 2598374 2667331 2655014 2619214 2618276 2704739 2798513 2896595 2923057 2978499
3762 2978499 3089060 3207836 3315111 3542446 3724058 3880996 4103077 4397199 4559265 4780398
3752 4780398 5053835 5290074 5523224 5757674 5977912 6108003 6178736 6267245 6421412 6502249
3742 6502249 6591937 6608461 6610799 6592679 6613082 6591067 6473758 6454630 6342998 6323780 6290878
3731 6290878 6262423 6242369 6154218 6155841 6150792 6138281 6196231 6202370 6224386 6241675 6253923 6295491
$$ packed form
3809B319383K1727P2488O5885R4906M9827J9014k4650J0687O4336J5519l0385
3798B678737J1250M3642n673P5015L319j1418K7314l1097m7784K8836j2702j4465
3786B744974o540n7510m3544n1483l8668J0165J1865m357j0708r844J8122j8979
3774B543493L9370k6288M1799O8957j2317l5800r38Q6463R3774R8082K6462N5442
3762B978499J10561J18776J07275K27335J81612J56938K22081K94122J62066K21133
3752D780398K73437K36239K33150K34450K20238J30091P0733Q8509J54167Q0837
3742F502249Q9688J6524K338j8120K0403k2015j17309j9128j11632j9218l2902
3731F290878k8455k0054q8151J623n049j2511N7950O139K2016J7289J2248M1568
$$ plain form
3719 6295491 6274884 6316415 6317385 6364371 6278140 6294369 6311301 6320314 6363185 6419694 6413682 6395154
3707 6395154 6398442 6421792 6443644 6508446 6560008 6601412 6587967 6611458 6579094 6562363 6591143 6545305
3695 6545305 6522199 6445512 6320461 6298570 6351592 6224321 6136869 6154156 6094658 6010131 5950610
3684 5950610 5895845 5806988 5813722 5831387 5775423 5797250 5739433 5700234 5740139 5716562 5681822 5685374
3672 5685374 5727988 5701107 5753587 5808103 5846883 5864054 5890648 5950138 5948794 6040345 6044180 6135263
3660 6135263 6250267 6364458 6524929 6619356 6749668 6892345 7008054 7178267 7363072 7610222
3650 7610222 7893613 8226257 8539323 8838663 9284142 9736407 10279182 10951645 11622460 12485699
3640 12485699 13542232 14780275 16160959 17776579 19662487 21846816 24160638 26684003
$$ packed form
3719F295491k0607M1531R70M6986q6231J6229J6932R013M2871N6509o012j8528
3707F395154L288K3350K1852O4802N1562M1404j3445K3491l2364j6731K8780m5838
3695F545305k3106p6687j25051k1891N3022j27271q7452J7287n9498q4527n9521
3684E950610n4765q8857O734J7665n5964K1827n7817l9199L9905k3577l4740L552
3672E685374M2614k6881N2480N4516L8780J7171K6594N9490j344R1551L835R1083
3660F135263J15004J14191J60471R4427J30312J42677J15709J70213J84805K47150
3650G610222K83391L32644L13066K99340M45479M52265N42775O72463O70815Q63239
3640A2485699J056533J238043J380684J615620J885908K184329K313822K523365
$$ plain form
3632 26684003 29478216 32283851 34955887 37528783 39837630 41847807 43495946 44784407
3624 44784407 45651233 46199143 46514005 46686333 46817665 46853659 46927830 47106865 47340514 47517335
3614 47517335 47517800 47421788 47114604 46421654 45292335 43866466 42095736 40009464 37757404
3605 37757404 35334195 32930008 30606496 28342162 26224982 24179189 22354747 20787478
3597 20787478 19436197 18328823 17256797 16432775 15648171 14895821 14271960 13658557 13044281
3588 13044281 12594523 12131492 11724170 11375756 11075676 10857433 10657330 10472717 10353087
3579 10353087 10274564 10106433 10014333 9971351 9864828 9781413 9728297 9663584 9703807 9734928 9697678
3568 9697678 9707133 9737959 9906424 10013736 10247563 10492961 10750033 10923037 10990449 11152375
$$ packed form
3632B6684003K794213K805635K672036K572896K308847K010177J648139J288461
3624D4784407Q66826N47910L14862J72328J31332L5994P4171J79035K33649J76821
3614D7517335M65r6012l07184o92950j129319j425869j770730k086272k252060
3605C7757404k423209k404187k323512k264334k117180k045793j824442j567269
3597B0787478j351281j107374j072026q24022p84604p52350o23861o13403o14276
3588A3044281m49758m63031m07322l48414l00080k18243k00103j84613j19630
3579A0353087p8523j68131r2100m2982j06523q3415n3116o4713M0223L1121l7250
3568I697678R455L0826J68465J07312K33827K45398K57072J73004O7412J61926
$$ plain form
3558 11152375 11150369 11109031 11151420 11164999 11159285 11257266 11186322 11244307 11382392 11473590 11637443
3547 11637443 11785844 12031965 12249030 12470936 12782654 13087118 13408532 13793164 14291791
3538 14291791 14785702 15304792 15868797 16496567 17044164 17561379 18168383 18659188 19148133
3529 19148133 19569136 19921135 20233357 20562289 20863595 21182376 21460752 21767697 22069547
3520 22069547 22469845 22790386 22998667 23307633 23542191 23695701 23785172 23893103 23977014 23949206
3510 23949206 23911826 23983613 24001591 24069487 24231275 24363522 24595711 24939155 25272177 25647675
3500 25647675 26130468 26671017 27193792 27821712 28583844 29299060 30030725 30922640 31907423
3491 31907423 32896483 33885222 34952716 36072507 37278143 38593125 40145489 41981062
$$ packed form
3558A1152375k006m1338M2389J3579n714R7981p0944N7985J38085R1198J63853
3547A1637443J48401K46121K17065K21906L11718L04464L21414L84632M98627
3538A4291791M93911N19090N64005O27770N47597N17215O07004M90805M88945
3529A9148133M21003L51999L12222L28932L01306L18781K78376L06945L01850
3520B2069547M00298L20541K08281L08966K34558J53510Q9471J07931Q3911k7808
3510B3949206l7380P1787J7978O7896J61788J32247K32189L43444L33022L75498
3500B5647675M82793N40549N22775O27920P62132P15216P31665Q91915R84783
3491C1907423R89060R88739J067494J119791J205636J314982J552364J835573
$$ plain form
3483 41981062 44113664 46585596 49443083 52756466 56490369 60547896 64866997 69363724
3475 69363724 73801740 78206224 82392063 86244067 89739892 92965166 95871113 98434693
3467 98434693 100814015 102883886 104676461 106250758 107500525 108436900 109067299 109255470 109179521
3458 109179521 108599934 107589187 106189407 104401698 102298519 99972198 97569869 95005721
3450 95005721 92370199 89904608 87761361 85839168 84235240 83192179 82745532 82779904 83268018
3441 83268018 84082743 85125279 86421320 87705408 88992679 90141741 91057112 91708314 92031077
3432 92031077 92060373 91760719 91171948 90381501 89447501 88387863 87305049 86280279 85311465
3423 85311465 84353826 83454209 82532953 81680326 80698235 79513974 78164673 76613327 74811219
$$ packed form
3483D1981062K132602K471932K857487L313383L733903M057527M319101M496727
3475F9363724M438016M404484M185839L852004L495825L225274K905947K563580
3467I8434693K379322K069871J792575J574297J249767R36375O30399J88171p5949
3458A09179521n79587j010747j399780j787709k103179k326321k402329k564148
3450I5005721k635522k465591k143247j922193j603928j043061m46647L4372M88114
3441H3268018Q14725J042536J296041J284088J287271J149062R15371O51202L22763
3432I2031077K9296k99654n88771p90447r34000j059638j082814j024770r68814
3423H5311465r57639q99617r21256q52627r82091j184261j349301j551346j802108
$$ plain form
3414 74811219 72675954 70241981 67418387 64362266 61143100 57765238 54294818 50801393
3406 50801393 47409880 44193446 41145228 38298949 35740551 33415466 31394709 29553994
3398 29553994 27816217 26245138 24918069 23679635 22529465 21499760 20502596 19660016
3390 19660016 18904177 18214228 17608417 17108757 16687104 16325685 16019760 15749746 15537644
3381 15537644 15407561 15238765 15153608 15131627 14982951 14884892 14933975 15038145 15212111 15430704
3371 15430704 15643496 15984359 16317467 16637541 16985300 17245519 17628847 17998742 18193269
3362 18193269 18406347 18393316 18394112 18350083 18130785 17834966 17554750 17227604 16964156 16706001
3352 16706001 16498744 16377756 16264280 16018055 15863676 15849735 15792768 15756941 15711740 15655892
$$ packed form
3414G4811219k135265k433973k823594l056121l219166l377862l470420l493425
3406E0801393l391513l216434l048218k846279k558398k325085k020757j840715
3398B9553994j737777j571079j327069j238434j150170j029705r97164q42580
3390A9660016p55839o89949o05811m99660m21653l61419l05925k70014k12102
3381A5537644j30083j68796q5157k1981j48676r8059M9083J04170J73966K18593
3371A5430704K12792L40863L33108L20074L47759K60219L83328L69895J94527
3362A8193269K13078j3031P96m4029k19298k95819k80216l27146k63448k58155
3352A6706001k07257j20988j13476k46225j54379j3941n6967l5827m5201n5848
$$ plain form
3342 15655892 15612851 15660325 15624192 15593405 15495328 15401216 15349706 15103961 14831631 14616688 14243691
3331 14243691 13879052 13590284 13350729 13131655 12870395 12647620 12600252 12556283 12567368 12619388
3321 12619388 12812310 13219701 13736420 14416143 15268010 16429423 18022622 19872761 22062856
3312 22062856 24872077 28178540 31982421 36272353 40890939 45868618 51009283 56117255
3304 56117255 60972570 65290710 68780083 71395785 72793671 72983375 72044870 69967200
3296 69967200 66867569 63061701 58694912 53906678 48936573 44139575 39484060 35201825
3288 35201825 31320344 27753073 24644468 21979364 19698940 17618269 15885149 14361441
3280 14361441 13035522 11941948 11063483 10147922 9450083 8893170 8411042 8040395 7707204
$$ packed form
3342A5655892m3041M7474l6133l0787r8077r4112n1510k45745k72330k14943l72997
3331A4243691l64639k88768k39555k19074k61260k22775m7368m3969J1085N2020
3321A2619388J92922M07391N16719O79723Q51867J161413J593199J850139K190095
3312B2062856K809221L306463L803881M289932M618586M977679N140665N107972
3304E6117255M855315M318140L489373K615702J397886J89704r38505k077670
3296F9967200l099631l805868m366789m788234m970105m796998m655515m282235
3288C5201825l881481l567271l108605k665104k280424k080671j733120j523708
3280A4361441j325919j093574q78465r15561o97839n56913m82128l70647l33191
$$ plain form
3271 7707204 7348879 7030958 6798570 6611954 6403322 6139659 5889034 5695549 5560685 5372971
3261 5372971 5288834 5207204 5112658 4980715 4858988 4735382 4670295 4599828 4546807 4475097 4411903
3250 4411903 4305253 4261330 4324145 4317053 4234897 4163739 4217633 4192806 4097958 4079396 4052439
3239 4052439 4004688 3970336 3935844 3846114 3699532 3664974 3497203 3342960 3150579 3080911 3004464
3228 3004464 2889714 2854252 2786294 2679355 2663986 2656910 2605551 2697019 2758885 2748862 2758786
3217 2758786 2796284 2810210 2753862 2846788 2937367 2925119 2957470 3028799 3000774 3112329 3147247
3206 3147247 3124813 3181317 3248950 3345757 3323033 3301483 3357389 3367071 3410465 3471965 3515354 3611746
3194 3611746 3613125 3695733 3740768 3776818 3776855 3801005 3836611 3882183 3949902 3998764 4047174 4117401
$$ packed form
3271G707204l58325l17921k32388j86616k08632k63663k50625j93485j34864j87714
3261E372971q4137q1630r4546j31943j21727j23606o5087p0467n3021p1710o3194
3250D411903j06650m3923O2815p092q2156p1158N3894k4827r4848j8562k6957
3239D052439m7751l4352l4492q9730j46582l4558j67771j54243j92381o9668p6447
3228C004464j14750l5462o7958j06939j5369p076n1359R1468O1866j0023R924
3217B758786L7498J3926n6348R2926R0579j2248L2351P1329k8025J11555L4918
3206C147247k2434N6504O7633R6807k2724k1550N5906R682M3394O1500M3389R6392
3194C611746J379Q2608M5035L6050L7K4150L5606M5572O7719M8862M8410P0227
$$ plain form
3182 4117401 4145275 4154399 4241417 4251514 4252276 4271747 4308701 4298549 4308451 4292459 4377755 4390651
3170 4390651 4376334 4417698 4469025 4595319 4681444 4741848 4824031 4896839 5052321 5166144 5342522
3159 5342522 5517174 5708803 5994926 6205658 6517758 6815085 7170954 7604302 8192969 8844746
3149 8844746 9712969 10690816 11674917 12559668 13180941 13555838 13794190 13783580 13590325 13237664
3139 13237664 12877181 12505550 12161637 11903585 11666611 11478570 11499128 11640852 11960667 12394595
3129 12394595 12845691 13327549 13662287 13925692 14202964 14410340 14555119 14689692 14774737 14825418
3119 14825418 14942210 15199791 15490838 15861728 16178328 16553332 16874433 17226338 17632530
3110 17632530 18056766 18536359 19011348 19720738 20567242 21609136 22924771 24583947 26680653
$$ packed form
3182D117401K7874R124Q7018J0097P62J9471L6954j0152R902j5992Q5296J2896
3170D390651j4317M1364N1327J26294Q6125O0404Q2183P2808J55482J13823J76378
3159E342522J74652J91629K86123K10732L12100K97327L55869M33348N88667O51777
3149H844746Q68223R77847R84101Q84751O21273L74897K38352j0610j93255l52661
3139A3237664l60483l71631l43913k58052k36974j88041K0558J41724L19815M33928
3129A2394595M51096M81858L34738K63405K77272K07376J44779J34573Q5045N0681
3119A4825418J16792K57581K91047L70890L16600L75004L21101L51905M06192
3110A7632530M24236M79593M74989P09390Q46504J041894J315635J659176K096706
$$ plain form
3101 26680653 29139087 31913821 34728386 37257311 39282307 40690208 41380213 41424899 41034066
3092 41034066 40190936 39096601 37860407 36829012 36005890 35737701 35989852 36894303 38807472
3083 38807472 41630603 45359263 49789402 54785390 60382830 67106194 75681454 87269048
3075 87269048 103792881 127672755 160513651 200503976 241499028 275152216 295900138
3068 295900138 303504148 301108772 290281204 270935941 245277051 216525277 187564792
3061 187564792 160313191 135772424 114429662 96836015 82860061 72031739 63403712
3054 63403712 56346004 50412277 45140063 40543386 36528550 32978465 29874129 27162774
3046 27162774 24870906 22968131 21270468 19742523 18399762 17204478 16268118 15405696
$$ packed form
3101B6680653K458434K774734K814565K528925K024996J407901O90005M4686l90833
3092D1034066q43130j094335j236194j031395q23122k68189K52151R04451J913169
3083C8807472K823131L728660M430139M995988N597440O723364Q575260J1587594
3075H7269048J6523833K3879874L2840896L9990325M0995052L3653188K0747922
3068B95900138P604010k395376j0827568j9345263k5658890k8751774k8960485
3061A87564792k7251601k4540767k1342762j7593647j3975954j0828322q628027
3054F3403712p057708n933727n272214m596677m014836l550085l104336k711355
3046B7162774k291868j902775j697663j527945j342761j195284r36360q62422
$$ plain form
3038 15405696 14665279 14027930 13485290 12902140 12378555 11921390 11495974 11113544 10663412
3029 10663412 10239536 9841554 9383602 9084829 8762753 8526490 8338140 8100593 8044402 7837238
3019 7837238 7610951 7488451 7290175 7047435 6823142 6578446 6325937 6048084 5783927 5577113
3009 5577113 5403664 5308918 5117163 4920185 4821489 4710862 4599550 4429041 4311566 4218685
2999 4218685 4065332 3936222 3878551 3755347 3582914 3452536 3313179 3196679 3081811 3059593
2989 3059593 2996943 2936005 2890412 2898252 2890645 2870186 2899244 2848832 2847916 2817474 2804320 2798574
2977 2798574 2819750 2733826 2699430 2671301 2591649 2527698 2596538 2568690 2501034 2366603 2358322
2966 2358322 2324746 2291245 2225230 2199430 2171199 2044949 1963463 1896148 1769910 1673829 1705237
$$ packed form
3038A5405696p40417o37349n42640n83150n23585m57165m25416l82430m50132
3029A0663412m23876l97982m57952k98773l22076k36263j88350k37547n6191k07164
3019G837238k26287j22500j98276k42740k24293k44696k52509k77853k64157k06814
3009E577113j73449r4746j91755j96978r8696j10627j11312j70509j17475r2881
2999D218685j53353j29110n7671j23204j72433j30378j39357j16500j14868k2218
2989C059593o2650o0938m5593P840p607k0459K9058n0412r16l0442j3154n746
2977B798574K1176q5924l4396k8129p9652o3951O8840k7848o7656j34431q281
2966B358322l3576l3501o6015k5800k8231j26250q1486o7315j26238r6081L1408
$$ plain form
2955 1705237 1660361 1564211 1473622 1473271 1471933 1399236 1308788 1305823 1327216 1208085 1179260 1124506
2943 1124506 1067880 1059181 1061590 1120880 1147180 1077699 1027957 995481 899225 859656 862790 876437
2931 876437 787456 811554 807787 818076 793265 767954 796677 808374 855901 901423 869423 904372
2919 904372 897177 918475 922604 927949 1007245 988927 969195 989162 1039429 1004593 1029295 996046
2907 996046 1026550 1047581 929788 889732 900024 919030 840335 868996 840946 826005 776150
2896 776150 719592 759732 809023 815936 758742 762113 745312 778739 738410 649049 616110 551406
2884 551406 613267 641647 636752 604841 569645 608965 590998 541402 521093 542429 491620 442360
2872 442360 374888 326763 330876 260602 251854 239500 303397 317583 295917 336964 386253 375269
$$ packed form
2955A705237m4876r6150r0589l51j338p2697r0448k965K1393j19131k8825n4754
2943A124506n6626q699K409N9290K6300o9481m9742l2476r6256l9569L134J3647
2931H76437q8981K4098l767J0289k4811k5311K8723J1697M7527M5522l2000L4949
2919I04372p195K1298M129N345P9296j8318j9732J9967N0267l4836K4702l3249
2907I96046L0504K1031j17793m0056J0292J9006p8695K8661k8050j4941m9855
2896G76150n6558M0140M9291O913n7194L371j6801L3427m0329q9361l2939o4704
2884E51406O1861K8380m895l1911l5196L9320j7967m9596k0309K1336n0809m9260
2872D42360o7472m8125M113p0274q748j2354O3897J4186k1666M1047M9289j0984
$$ plain form
2860 375269 375967 321942 338138 421777 332726 292480 205130 259603 283795 320368 295888 308884
2848 308884 318385 366029 336005 297288 416045 437920 357574 345208 382868 383543 443894 440512
2836 440512 456161 463640 384709 341497 314041 234004 246831 216948 194079 229832 242851 261313
2824 261313 254086 239095 277207 290633 283023 297194 334791 360335 335799 298054 351403 434431
2812 434431 379133 370057 374514 347628 302879 253319 256451 220017 239547 240843 303638 379106
2800 379106 386185 342761 289011 256233 361640 418618 426531 566982 645583 721362 891305
2789 891305 1083404 1270710 1442537 1572393 1596757 1526698 1559467 1423420 1248193 1128760
2779 1128760 941169 847401 723500 680090 551605 414153 330740 334482 320155 251358 252126
$$ packed form
2860C75269O98n4025J6196Q3639q9051m0246q7350N4473K4192L6573k4480J2996
2848C08884R501M7644l0024l8717J18757K1875q0346j2366L7660O75O0351l382
2836D40512J5649P479p8931m3212k7456q0037J2827k9883k2869L5753J3019J8462
2824B61313p227j4991L8112J3426p610J4171L7597K5544k4536l7745N3349Q3028
2812D34431n5298r076M457k6886m4749m9560L132l6434J9530J296O2795P5468
2800C79106P079m3424n3750l2778J05407N6978P913J40451P8601P5779J69943
2789H91305J92099J87306J71827J29856K4364p0059L2769j36047j75227j19433
2779A128760j87591r3768j23901m3410j28485j37452q3413L742j4327o8797P68
$$ plain form
2768 252126 222771 265281 235202 213140 255832 295895 256172 202485 169897 245775 206641 173986
2756 173986 210739 198061 264113 282617 280976 266292 219644 193159 209164 167626 193923 179515
2744 179515 114355 142359 181727 186420 112089 106696 132394 167618 175785 92074 101298 178759
2732 178759 195527 203228 114698 79594 121550 140189 117825 101837 169902 163504 167147 165742
2720 165742 129101 123668 150097 134604 168150 147394 137435 177779 141966 237939 256689 184233
2708 184233 194589 111504 152544 195492 133748 148071 201036 242001 167750 139373 181508 171843
2696 171843 138684 138255 187284 157100 133824 141398 68821 21409 4532 41388 38876 10620
2684 10620 -21749 -7719 -21383 -33639 -9132 -11345 -14403 11557 -20669 31727 99096 82093
$$ packed form
2768B52126k9355M2510l0079k2062M2692M0063l9723n3687l2588P5878l9134l2655
2756A73986L6753j2678O6052J8504j641j4684m6648k6485J6005m1538K6297j4408
2744A79515o5160K8004L9368M693p4331n393K5698L5224Q167q3711R224P7461
2732A78759J6768P701q8530l5104M1956J8639k2364j5988O8065o398L643j405
2720A65742l6641n433K6429j5493L3546k0756r959M0344l5813R5973J8750p2456
2708A84233J0356q3085M1040M2948o1744J4323N2965M0965p4251k8377M2135r665
2696A71843l3159m29M9029l0184k3276P574p2577m7412j6877L6856k512k8256
2684A0620l2369J4030j3664j2256K4507k213l058K5960l2226N2396O7369j7003
$$ plain form
2672 82093 70904 43314 54939 35484 -19567 -19541 99813 97539 42532 27597 58209 115196
2660 115196 112122 99531 139291 56517 38160 61117 10387 25721 -8046 3506 -16521 -18733
2648 -18733 4182 43626 148026 108265 76518 75133 7396 44991 51458 56906 35031 68723
2636 68723 27555 7448 19448 62674 44457 50418 76016 19955 47508 20453 44325 79383
2624 79383 25736 28983 23427 -23715 15567 35130 67878 92457 106641 86662 -4293 -40889
2612 -40889 -7048 22751 25274 -2644 36045 -24187 7113 -44766 -18002 -442 22544 54769
2600 54769 38817 53672 41859 72125 94402 60968 39268 17903 27314 61552 51723 86751
2588 86751 84693 95748 129392 244390 287140 356183 372750 418927 454817 467031 445613 376667
$$ packed form
2672H2093j1189k7590J1625j9455n5051K6J19354k274n5007j4935L0612N6987
2660A15196l074j2591L9760q2774j8357K2957n0730J5334l3767J1552k0027k212
2648a8733K2915L9444J04400l9761l1747j385o7737L7595O467N448k1875L3692
2636F8723m1168k0107J2000M3226j8217N961K5598n6061K7553k7055K3872L5058
2624G9383n3647L247n556m7142L9282J9563L2748K4579J4184j9979r0955l6596
2612d0889L3841K9799K523k7918L8689o0232L1300n1879K6764J7560K2986L2225
2600E4769j5952J4855j1813L0266K2277l3434k1700k1365R411L4238r829L5028
2588H6751k058J1055L3644J14998M2750O9043J6567M6177L5890J2214k1418o8946
$$ plain form
2576 376667 363958 299907 210186 182643 246535 209655 135157 130109 143195 88494 79635 95989
2564 95989 71786 64792 91028 135452 120622 40311 4776 70337 70064 38168 31098 9546 10616
2551 10616 103077 107543 83641 44556 -8901 -10127 -10425 1825 -11499 -61370 -88196 -84476 -24131
2538 -24131 -58031 -71957 -40670 -119863 -52824 11736 33707 54902 93771 33128 4084 -935
2526 -935 28373 43027 -34822 -19886 -28505 46390 5852 -36824 43982 56352 28281 22588 33079
2513 33079 107211 118523 63977 57291 83704 38232 9376 19909 39868 62767 16562 53702
2501 53702 -28918 -51215 -34891 37665 74351 101541 121691 162158 138150 37992 -27985 -46306
2489 -46306 19312 44097 -4532 -47876 -10806 -32658 21737 16274 59417 109152 111738 81934
$$ packed form
2576C76667j2709o4051q9721k7543O3892l6880p4498n048J3086n4701q859J6354
2564I5989k4203o994K6236M4424j4830q0311l5535O5561k73l1896p070k1552J070
2551A0616R2461M466k3902l9085n3457j226k98J2250j3324m9871k6826L720O0345
2538b4131l3900j3926L1287p9193O7039O4560K1971K1195L8869o0643k9044n019
2526i35K9308J4654p7849J4936q619P4895m0538m2676Q0806J2370k8071n693J0491
2513C3079P4132J1312n4546o686K6413m5472k8856J0533J9959K2899m6205L7140
2501E3702q2620k2297J6324P2556L6686K7190K0150M0467k4008j00158o5977j8321
2489d6306O5618K4785m8629m3344L7070k1852N4395n463M3143M9735K586k9804
$$ plain form
2477 81934 -11922 -36112 -13114 -16002 63546 28376 -16273 -20114 25642 25160 37881 7068 58797
2464 58797 78373 78945 126281 134611 119431 153993 254063 174833 127223 141877 186548 214352
2452 214352 260942 212969 200785 238239 224984 210452 209435 179649 185021 160003 173624 205382
2440 205382 193578 213498 220981 204195 180360 177957 220157 198686 191331 209181 237449 222374
2428 222374 198168 195743 270941 234325 226700 150953 166543 154397 202509 252486 144826 103062
2416 103062 160965 186478 207499 195823 158722 175392 163293 223027 230734 179553 183253 182161
2404 182161 230705 334504 290174 284263 306333 291846 280347 366942 336004 322535 383093 438119
2392 438119 468645 511422 469215 416283 430131 462956 449668 490499 507484 580313 589012 557412
$$ packed form
2477H1934r3856k4190K2998k888P9548l5170m4649l841M5756m82J2721l0813N1729
2464E8797J9576N72M7336Q330j5180L4562J00070p9230m7610J4654M4671K7804
2452B14352M6590m7973j2184L7454j3255j4532j017k9786N372k5018J3621L1758
2440B05382j1804J9920P483j6786k3835k403M2200k1471p355J7850K8268j5075
2428B22374k4206k425P5198l6616p625p5747J5590j2146M8112M9977j07660m1764
2416A03062N7903K5513K1021j1676l7101J6670j2099N9734P707n1181L700j092
2404A82161M8544J03799m4330n911K2070j4487j1499Q6595l0938j3469O0558N5026
2392D38119L0526M2777m2207n2932J3848L2825j3288M0831J6985P2829Q699l1600
$$ plain form
2380 557412 473172 479616 554978 550452 575724 603205 662752 720156 734006 670924 687356 675107
2368 675107 715854 751428 763997 753545 751842 748096 707912 821789 863495 885760 999322 1043353
2356 1043353 1036911 1049359 1029880 1108517 1141954 1156783 1176637 1220882 1282102 1378252 1410002 1467834
2344 1467834 1631665 1740890 1721952 1869024 1955327 1943213 1948558 2124445 2208024 2283470 2489591
2333 2489591 2862252 3329653 3850325 4272750 4600490 4962887 5436275 6006076 6630599 7340273
2323 7340273 8320512 9690024 11725437 14863299 20989754 31013566 44775986 58522348
2315 58522348 66689485 68884134 67103339 66424292 62966451 55718748 47843320 39928583
2307 39928583 33062542 27041207 21697743 17402619 14451886 12640987 11583849 10697445
$$ packed form
2380E57412q4240O444P5362m526K5272K7481N9547N7404J3850o3082J6432j2249
2368F75107M0747L5574J2569j0452j703l746m0184J13877M1706K2265J13562M4031
2356A043353o442J2448j9479P8637L3437J4829J9854M4245O1220R6150L1750N7832
2344A467834J63831J09225j8938J47072Q6303j2114N345J75887Q3579P5446K06121
2333B489591L72661M67401N20672M22425L27740L62397M73388N69801O24523P09674
2323G340273R80239J369512K035413L137862O126455J0023812J3762420J3746362
2315E8522348Q167137K194649j780795o79047l457841p247703p875428p914737
2307C9928583o866041o021335n343464m295124k950733j810899j057138q86404
$$ plain form
2299 10697445 9787799 8907716 8211015 7444971 6727568 6040093 5436775 4925837 4482473
2290 4482473 4105178 3702009 3375883 3198959 3003900 2815475 2621759 2564923 2472409 2382947
2280 2382947 2291655 2292134 2218664 2131201 2049697 1952555 1936128 1808063 1745068 1670944 1571844 1532208
2268 1532208 1450100 1506258 1461390 1462943 1450188 1364425 1342390 1308021 1237880 1160017 1080248 1037517
2256 1037517 1019252 998190 983637 1046712 1014071 921511 861360 836109 849802 808873 810137 790493
2244 790493 713101 705825 736586 701413 622675 614611 587152 628079 603495 554167 530829 568925
2232 568925 504778 539248 563874 535106 579654 529874 522520 537649 599810 653616 649028 592187
2220 592187 525761 498463 471893 420798 450981 490141 480698 476194 454246 464070 445610 434730
$$ packed form
2299A0697445r09646q80083o96701p66044p17403o87475o03318n10938m43364
2290D482473l77295m03169l26126j76924j95059j88425j93716n6836r2514q9462
2280B382947r1292M79p3470q7463q1504r7142j6427j28065o2995p4124r9100l9636
2268A532208q2108N6158m4868J553j2755q5763k2035l4369p0141p7863p9769m2731
2256A037517j8265k1062j4553O3075l2641r2560o0151k5251J3693m0929J264j9644
2244G90493p7392p276L0761l5173p8738q064k7459M0927k4584m9328k3338L8096
2232E68925o4147L4470K4626k8768M4548m9780p354J5129O2161N3806m588n6841
2220E92187o6426k7298k6570n1095L0183L9160r443m504k1948R824j8460j0880
$$ plain form
2208 434730 451411 454660 452567 434618 386072 401086 356294 348282 350678 356756 378145 300103 311506
2195 311506 311726 299662 201265 205037 221292 184960 189972 152487 159248 153883 149525 168721 143363
2182 143363 115319 113194 130743 154333 157179 133514 99481 119495 148681 210686 136026 117007
2170 117007 177134 117907 184019 220166 213395 233716 181580 121326 157023 112380 182917 221659
2158 221659 156253 174521 241284 213280 148581 131911 179479 175449 162464 164057 150442 182030
2146 182030 140819 109888 98018 70389 122625 150422 117218 179233 207477 165959 183803 192207
2134 192207 187297 145008 102011 111091 122733 153476 165929 163132 148869 132544 122897 72681
2122 72681 59482 120047 105838 130451 123054 94287 107433 46944 39191 -21327 14760 2914
$$ packed form
2208D34730J6681L249k093j7949m8546J5014m4792q012K396O078K1389p8042J1403
2195C11506K20j2064r8397L772J6255l6332N012l7485O761n365m358J9196k5358
2182A43363k8044k125J7549K3590K846k3665l4033K0014K9186O2005p4660j9019
2170A17007O0127n9227O6112L6147o771K0321n2136o0254L5697m4643P0537L8742
2158B21659o5406J8268O6763k8004o4699j6670M7568m030j2985J593j3615L1588
2146A82030m1211l0931j1870k7629N2236K7797l3204O2015K8244m1518J7844Q404
2134A92207m910m2289m2997R080J1642L0743J2453k797j4263j6325r647n0216
2122G2681j3199O0565j4209K4613p397k8767J3146o0489p753o0518L6087j1846
$$ plain form
2110 2914 28186 82444 65499 47269 -48325 -81 55397 90542 87206 751 6531 23273
2098 23273 43756 47391 40842 10483 -64762 -33878 -24392 64118 84868 134482 143961 151816 131895
2085 131895 100050 113228 10389 6579 46325 78812 102804 100292 93826 98375 88092 47757
2073 47757 19453 18078 -15606 2382 29760 49774 38399 69931 103149 104569 41253 -9518
2061 -9518 49283 62289 38848 20425 53133 35003 50159 39253 43386 112781 98014 148455
2049 148455 207296 249849 300508 315618 354659 362181 384525 359636 258387 236874 234147 235087
2037 235087 182990 89855 69979 42835 87629 113964 86596 102238 106359 46404 -1478 32293
2025 32293 68800 72001 93121 65919 52813 82468 53135 20338 5062 34187 540 2669
$$ packed form
2110B914K5272N4258j6945j8230r5594M8244N5478L5145l336q6455N780J6742
2098B3273K0483L635o549l0359p5245L0884R486Q8510K0750M9614R479P855j9921
2085A31895l1845J3178j02839l810L9746L2487K3992k512o466M549j0283m0335
2073D7757k8304j375l3684J7988K7378K0014j1375L1532L3218J420o3316n0771
2061i518N8801J3006k3441j8423L2708j8130J5156j0906M133O9395j4767N0441
2049A48455N8841M2553N0659J5110L9041P522K2344k4889j01249k1513k727R40
2037B35087n2097r3135j9876k7144M4794K6335k7368J5642M121n9955m7882L3771
2025C2293L6507L201K1120k7202j3106K9655k9333l2797j5276K9125l3647K129
$$ plain form
2013 2669 78870 149540 50641 57994 27528 906 62259 2590 32688 55917 86600 137264
2001 137264 53610 10329 38438 816 2239 111887 124469 46600 105833 49959 -22493 -37883
1989 -37883 16519 69214 83781 31720 -4909 39075 110942 44179 -11362 47847 57119 14156
1977 14156 6854 1394 43185 58998 35512 44873 12857 90270 69998 9561 -14259 9090
1965 9090 11752 5016 53742 45684 24765 34092 50733 15397 5629 -17274 -25871 -42610 -39847
1952 -39847 -81580 -38329 9438 1507 6923 6010 52690 22693 803 34390 47941 12748 -15565
1939 -15565 -61253 -8795 32664 -35087 -87408 -38919 28743 -18244 4758 -24560 -64617 687
1927 687 6347 -17665 12341 -12103 -51487 -38176 -31749 -15431 36220 37398 53871 7221 -2082
$$ packed form
2013B669P6201P0670r8899P353l0466k6622O1353n9669L0098K3229L0683N0664
2001A37264q3654m3281K8109l7622J423J09648J2582p7869N9233n5874p2452j5390
1989c7883N4402N2695J4567n2061l6629M3984P1867o6763n5541N9209R272m2963
1977A4156p302n460M1791J5813k3486R361l2016P7413k0272o0437k3820K3349
1965I090K662o736M8726q058k0919R327J6641l5336r768k2903q597j6739K763
1952c9847m1733M3251M7767p931N416r13M6680k9997k1890L3587J3551l5193k8313
1939a5565m5688N2458M1459o7751n2321M8489O7662m6987K3002k9318m0057O5304
1927F87N660k4012L0006k4444l9384J3311O427J6318N1651J178J6473m6650r303
$$ plain form
1914 -2082 10027 4094 23212 -10321 -18930 -37526 14412 18358 34164 7284 -3754 28534 -1570
1901 -1570 -42386 -57193 -21665 -30666 -2282 20948 23254 3487 -4113 12773 44408 82784 67572
1888 67572 25693 25211 36203 -14583 25265 11445 70704 52691 1714 -65063 -34891 -83121
1876 -83121 -88892 44856 51475 -14633 -48022 -18077 11965 34721 45273 9603 3997 -21433
1864 -21433 8242 26345 -35629 -42338 5963 -35099 -14859 46434 70987 34282 31942 590
1852 590 -8158 -32998 -125084 -70297 -39600 -45270 -63527 -35099 -17613 -13839 -31035 92 -37608
1839 -37608 -13361 -12249 24365 12845 -30396 -14468 27239 35182 14709 9315 17575 27130 3866
1826 3866 -21488 -75537 -12392 66536 -25736 -33354 -34086 -25576 -64861 -23063 -43455 -14317 46354
$$ packed form
1914b082J2109n933J9118l3533q609j8596N1938L946J5806k6880j1038L2288l0104
1901a570m0816j4807L5528r001K8384K3230K306j9767p600J6886L1635L8376j5212
1888F7572m1879m82J0992n0786L9848j3820N9259j8013n0977o6777L0172m8230
1876h3121n771J33748O619o6108l3389K9945L0042K2756J0552l5670n606k5430
1864b1433K9675J8103o1974o709M8301m1062K0240O1293K4553l6705k340l1352
1852E90q748k4840r2086N4787L0697n670j8257K8428J7486L774j7196L1127l7700
1839c7608K4247J112L6614j1520m3241J5928M1707P943k0473n394Q260R555k3264
1826C866k5354n4049O3145P8928r2272p618p32Q510l9285M1798k0392K9138O0671
$$ plain form
1813 46354 73727 54975 -9054 3546 -2472 -16175 -1386 63444 23982 4995 3091 2294 54021
1800 54021 73831 31181 52139 69205 91446 119218 92536 62302 18572 -80105 -89745 -42473
1788 -42473 -3401 15781 18416 26773 1914 -68956 -32346 67444 27672 -2210 -66562 -73293
1776 -73293 -19981 24963 -15698 -28341 3779 4569 -2507 -61023 -77276 -80461 -52520 -30628 -87528
1763 -87528 -83010 -59872 -45757 1153 -18582 -28995 -76508 -49554 -17284 37437 3644 -108873
1751 -108873 -51702 12023 -401 -31574 -106476 -56797 20390 -29650 -21676 -38389 42539 -31112
1739 -31112 -19886 35324 -33016 22900 77451 41993 -4866 1298 11189 -52678 -91625 -34916
1727 -34916 -19663 -7706 -22192 471 -65921 -39199 -6555 17007 62332 72050 36653 35812
$$ packed form
1813D6354K7373j8752o4029J2600o018j3703J4789O4830l9462j8987j904p97N1727
1800E4021J9810m2650K0958J7066K2241K7772k6682l0234m3730r8677r640M7272
1788d2473L9072J9182K635Q357k4859p0870L6610R9790l9772k9882o4352o731
1776g3293N3312M4944m0661j2643L2120P90p076n8516j6253l185K7941K1892n6900
1763h7528M518K3138J4115M6910j9735j0413m7513K6954L2270N4721l3793j12517
1751a08873N7171O3725j2424l1173p4902M9679P7187n0040P974j6713Q0928p3651
1739c1112J1226N5210o8340N5916N4551l5458m6859O164R891o3867l8947N6709
1727c4916J5253J1957j4486K2663o6392K6722L2644K3562M5325R718l5397q41
$$ plain form
1715 35812 25275 42262 51607 17796 -25334 -16438 -12474 50374 39262 2388 -38768 -14511
1703 -14511 1804 42752 43895 23241 801 -43266 -43689 -41391 -27456 -22471 -39598 -107088 -42170
1690 -42170 -5443 4653 -7219 -37963 -39132 -76367 -39082 -38771 -2420 3680 -92792 -37000 -51473
1677 -51473 -80006 -69170 -10925 -2173 53350 61737 95325 31134 -8402 22960 45053 86897
1665 86897 74319 43343 22335 -26499 -30087 -76925 -43299 3808 26949 31213 57437 60921
1653 60921 27718 13474 -34087 5584 -7990 11737 73017 29312 70392 62932 21009 31387
1641 31387 -16128 -49152 -3405 518 -63875 -55543 -27675 -31817 -14884 -70196 -93216 -4555
1629 -4555 22846 -1584 -47715 -11 70721 53315 570 -10207 -45003 -57505 -7159 21924
$$ packed form
1715C5812j0537J6987R345l3811m3130Q896L964O2848j1112l6874m1156K4257
1703a4511J6315M0948J143k0654k2440m4067m23K298J3935M985j7127o7490O4918
1690d2170L6727J0096j1872l0744j169l7235L7285L11L6351O100r6472N5792j4473
1677e1473k8533J0836N8245Q752N5523Q387L3588o4191l9536L1362K2093M1844
1665H6897j2578l0976k1008m8834l588m6838L3626M7107K3141M264K6224L484
1653F0921l3203j4244m7561L9671j3574J9727O1280m3705M1080p460m1923J0378
1641C1387m7515l3024M5747L923o4393Q332K7868m142J6933n5312k3020Q8661
1629d555K7401k4430m6131M7704P0732j7406n2745j0777l4796j2502N0346K9083
$$ plain form
1617 21924 6618 29597 42117 -13387 -1389 5120 -44942 -27805 -80966 -54579 -43963 -72353
1605 -72353 -62278 -72300 -90754 -95957 -107464 -79518 -48526 3774 39603 -23467 -72649 -31618
1593 -31618 30397 23553 -10984 35161 3206 -77885 -43164 23305 64422 4431 66719 49117
1581 49117 4488 47541 26097 29 10925 14550 -29953 -42847 -23325 13403 -17113 11520
1569 11520 -65772 -63531 18202 49672 34683 51056 2949 -16202 48618 70467 58428 39117
1557 39117 3763 -17153 39053 55674 35961 71624 98132 100499 113809 81321 75387 23628
1545 23628 -39230 -37902 -32787 -35113 -45681 -8050 -2324 41634 32379 -25827 28635 6327 16418
1532 16418 4434 5654 24875 13420 30769 -37473 -107391 -106481 -53302 -19675 -18357 -11476 -8228
$$ packed form
1617B1924j5306K2979J2520n5504J1998O509n0062J7137n3161K6387J0616k8390
1605g2353J0075j0022j8454n203j1507K7946L0992N2300L5829o3070m9182M1031
1593c1618O2015o844l4537M6145l1955q1091L4721O6469M1117n9991O2288j7602
1581D9117m4629M3053k1444k6068J0896L625m4503j2894J9522L6728l0516K8633
1569A1520p7292K241Q1733L1470j4989J6373m8107j9151O4820K1849j2039j9311
1557C9117l5354k0916N6206J6621j9713L5663K6508K367J3310l2488n934n1759
1545B3628o2858J328N115k326j0568L7631N726M3958r255n8206N4462k2308J0091
1532A6418j1984J220J9221j1455J7349o8242o9918R10N3179L3627J318O881L248
$$ plain form
1519 -8228 -27354 -28795 38105 -13871 -11106 40985 48058 34971 37309 67285 81719 -8074 -37062
1506 -37062 -64835 -7122 5756 -38826 38935 23183 -22434 -44077 -36592 7767 -10 -50381
1494 -50381 -58788 -18646 -7690 -51617 -72266 -61230 -79729 -82039 -68107 -48697 5525 -17381
1482 -17381 -15195 33521 14457 2896 -52569 -10433 -26542 -30809 1936 2289 58405 68885 57936
1469 57936 43000 37658 -10401 -45168 -75770 -35967 27883 -19312 -49292 -22074 40506 19587
1457 19587 -10369 32835 10252 28790 36035 24175 -8834 -13186 12123 1330 39651 60167
1445 60167 28817 -20549 -10457 43489 62546 23264 -27171 31130 58260 -14435 -77353 -47294
1433 -47294 -31823 -11297 55342 2683 -21459 34123 43758 23255 -16606 45763 49372 9472
$$ packed form
1519h228j9126j441O6900n1976K765N2091P073j3087K338K9976J4434q9793k8988
1506c7062k7773N7713J2878m4582P7761j5752m5617k1643P485M4359p777n0371
1494e0381q407M0142J0956m3927k0649J1036j8499k310J3932J9410N4222k2906
1482a7381K186M8716j9064j1561n5465M2136j6109m267L2745L53N6116J0480j0949
1469E7936j4936n342m8059l4767l0602L9803O3850m7195k9980K7218O2580k0919
1457A9587k9956M3204k2583J8538P245j1860l3009m352K5309j0793L8321K0516
1445F0167l1350m9366J0092N3946J9057l9282n0435N8301K7130p2695o2918L0059
1433d7294J5471K0526O6639n2659k4142N5582R635k0503l9861O2369L609l9900
$$ plain form
1421 9472 416 -29181 -58077 -19998 62322 -7555 53678 61864 96184 158684 57733 11377
1409 11377 44744 54246 83061 50930 12838 8333 -32035 -21516 -21567 -48900 7929 117 -72706
1396 -72706 -42256 -54772 -84042 -32444 1257 -78460 -93551 -47381 -9595 -3624 22615 50170
1384 50170 8876 -5775 -19820 5312 56579 35536 -2657 5841 33049 -30059 60573 40448
1372 40448 7920 16200 15324 -27696 -44676 2283 52787 62178 38271 2518 18700 -34259 -30905
1359 -30905 29220 31608 46987 7497 -729 50787 72497 52940 72263 54087 -18768 -5533
1347 -5533 14078 2769 24376 28115 56075 61670 17785 52513 16491 -7523 49294 18079
1335 18079 -6827 29702 -6528 -23972 -9759 -49229 -84668 -42618 -64211 -55718 -13175 -87930
$$ packed form
1421I472r056k9597k8896L8079Q2320o9877O1233Q186L4320O2500j00951m6356
1409A1377L3367R502K8815l2131l8092m505m0368J0519n1k7333N6829p812p2823
1396g2706L0450j2516k9270N1598L3701p9717j5091M6170L7786N971K6239K7555
1384E0170m1294j4651j4045K5132N1267k1043l8193Q498K7208o3108R0632k0125
1372D0448l2528Q280q76m3020j6980M6959N0504R391k3907l5753J6182n2959L354
1359c0905O0125K388J5379l9490q226N1516K1710j9557J9323j8176p2855J3235
1347e533J9611j1309K1607L739K7960N595m3885L4728l6022k4014N6817l1215
1335A8079k4906L6529l6230j7444J4213l9470l5439M2050k1593Q493M2543p4755
$$ plain form
1323 -87930 -131455 -111147 -69487 -24593 -24021 -1263 81091 65767 50365 37201 73856 91160
1311 91160 102297 53269 23305 4236 -45964 -93849 -124852 -85435 -1123 5098 17863 21425
1299 21425 -8673 18197 45161 3542 27731 14960 -14908 -7956 54026 65499 -13118 -68161
1287 -68161 -18540 19729 22195 -14857 5301 -8586 -37255 -30522 -13015 4017 32604 43932
1275 43932 82275 40385 51502 20137 -43137 -22685 -11224 17847 -44609 -69559 -68948 -87158
1263 -87158 28820 54254 4850 45796 34700 31884 -7893 -10328 -36236 -85250 -85421 -50542
1251 -50542 -29902 -10989 2493 3073 51243 -25668 -47137 -14321 43149 -10390 -45330 -30420
1239 -30420 -14165 44312 31777 11762 -34801 -46186 -5659 -37144 34302 71943 24003 31296
$$ packed form
1323h7930m3525K0308M1660M4894N72K2758Q2354j5324j5402j3164L6655J7304
1311I1160J1137m9028k9964j9069n0200m7885l1003L9417Q4312O221J2765L562
1299B1425l0098K6870K6964m1619K4189j2771k9868O952O1982J1473p8617n5043
1287f8161M9621L8269K466l7052K0158j3887k8669O733J7507J7032K8587J1328
1275D3932L8343m1890J1117l1365o3274K0452J1461K9071o2456k4950O11j8210
1263h7158J15978K5434m9404M0946j1096k816l9777k435k5908m9014j71L4879
1251e0542K0640J8913J3482N80M8170p6911k1469L2816N7470n3539l4940J4910
1239c0420J6255N8477j2535k0015m6563j1385M0527l1485P1446L7641m7940P293
$$ plain form
1227 31296 14151 81406 69381 41409 14961 -6741 -18730 -5349 -41201 -42026 -53250 -14189
1215 -14189 24359 3277 11520 -297 -7424 25567 98011 39734 -1117 68063 -17010 -37726
1203 -37726 -15039 48148 49449 64901 16499 -33591 -1846 -11365 -10212 19472 -31151 -72278
1191 -72278 26404 85674 -14585 19017 -1640 2446 7566 -46263 -48406 -52318 -35727 33080
1179 33080 60391 20148 15948 29142 35780 54142 22376 5721 -23309 -95302 -83339 -77078
1167 -77078 -67513 -7893 29387 -34616 -67644 4504 65118 78328 106266 80660 9446 3229
1155 3229 40096 72208 25031 19123 30903 26892 36259 6771 30964 18566 10996 -38502 -15126
1142 -15126 -17092 -5397 -40165 3568 -20313 -46294 1141 17087 14855 18515 60725 -200
$$ packed form
1227C1296j7145O7255j2025k7972k6448k1702j1989J3381l5852q25j1224L9061
1215a4189L8548k1082Q243j1817p127L2991P2444n8277m0851O9180q5073k0716
1203c7726K2687O3187J301J5452m8402n0090L1745r519J153K9684n0623m1127
1191g2278R8682N9270j00259L3602k0657M086N120n3829k143l912J6591O8807
1179C3080K7311m0243m200J3194O638J8362l1766j6655k9030p1993J1963O261
1167g7078R565N9620L7280o4003l3028P2148O0614J3210K7938k5606p1214o217
1155C229L6867L2112m7177n908J1780m011R367k9488K4193j2398p570m9498K3376
1142a5126j966J1695l4768M3733k3881k5981M7435J5946k232L660M2210o0925
$$ plain form
1130 -200 32294 79680 76702 64870 40374 819 -25985 -78170 40297 36538 -56999 -97877
1118 -97877 -51685 -57837 -47846 -78445 -16647 15781 -21455 666 -47118 -22929 20630 29085
1106 29085 9032 -3685 -46404 -1753 -473 -264 -42787 3109 -4629 -6458 -43239 -41647 -67548
1093 -67548 -373 21813 -32229 -24332 -28313 -80366 -73774 -63767 -33208 -58078 -67550 -1957 -3733
1080 -3733 2164 5384 -42608 -78855 -39041 65099 32308 -25474 -31706 -52280 -65732 -99604
1068 -99604 -50550 -23623 -38568 -8793 -55447 -18305 26692 -44615 -68290 -53645 -13070 -33810
1056 -33810 -23522 14125 37981 57498 39082 48222 62665 32653 -48156 -56562 -62129 1165
1044 1165 90469 59416 34089 -11181 -4031 6762 52985 71474 75447 49163 4531 42531
$$ packed form
1130b00L2494M7386k978j1832k4496l9555k6804n2185J18467l759r3537m0878
1118i7877M6192o152R991l0599O1798L2428l7236K2121m7784K4189M3559Q455
1106B9085k0053j2717m2719M4651J280K09m2523M5896p738j829l6781J592k5901
1093f7548O7175K2186n4042P897l981n2053O592J0007L0559k4870r472O5593j776
1080c733N897L220m7992l6247L9814J04140l2791n7782o232k0574j3452l3872
1068i9604M9054K6927j4945K9775m6654L7142M4997p1307k3675J4645M0575k0740
1056c3810J0288L7647K3856J9517j8416R140J4443l0012q0809q406n567O3294
1044A165Q9304l1053k5327m5270P150J0793M6223J8489L973k6284m4632L8000
$$ plain form
1032 42531 76988 30987 -12925 -42054 -38882 -26015 -40974 -10074 7146 -51622 -53793 -23240
1020 -23240 -2164 -10491 71051 58396 2323 -2505 189 6204 -29300 -2583 7242 -9122 -14921
1007 -14921 -8407 17957 60131 91356 75741 50841 46886 -6488 -85348 -37723 32783 31911 14508
994 14508 -29198 -17594 22857 74025 105227 74842 42724 3083 26301 864 -45192 -32912
982 -32912 52152 43699 83762 101686 41060 13854 -3016 31293 76224 3830 7279 62000
970 62000 57377 7704 9696 41702 -260 42464 -4646 -44085 32945 81726 58954 26530
958 26530 -27019 18476 49180 25990 25460 -30031 -13824 -17292 -4983 -57148 -51979 25438 -15332
945 -15332 -28635 -43719 -29323 65655 27630 -30404 10569 59841 45401 55174 15629 -1172
$$ packed form
1032D2531L4457m6001m3912k9129L172J2867j4959L0900J7220n8768k171L0553
1020b3240K1076q327Q1542j2655n6073m828K694O015l5504K6717R825j6364n799
1007a4921O514K6364M2174L1225j5615k4900l955n3374p8860M7625P0506q72j7403
994A4508m3706J1604M0451N1168L1202l0385l2118l9641K3218k5437m6056J2280
982c2912Q5064q453M0063J7924o0626k7206j6870L4309M4931p2394L449N4721
970F2000m623m9673J992L2006m1962M2724m7110l9439P7030M8781k2772l2424
958B6530n3549M5495L0704k3190n30n5491J6207l468J2309n2165N169P7417m0770
945a5332j3303j5084J4396R4978l8025n8034M0973M9272j4440R773l9545j6801
$$ plain form
933 -1172 14192 -4530 -36380 -47924 -41505 1937 41676 36251 -3341 -11658 75203 117469 21344
920 21344 7260 8566 -41530 36853 -26813 -51295 -71167 -34009 -39258 -410 31275 29268 -51071
907 -51071 -8905 74271 -4441 -53411 -79170 -73554 37483 52645 7275 12171 -14173 -5569
895 -5569 -2001 -30559 2542 18905 8876 -28327 39743 32588 -68512 -56459 -40768 -11176
883 -11176 -53951 -29596 6943 -1302 -12232 -46348 -144020 -103831 -37154 -29981 -51912 -37647
871 -37647 -11293 -21826 -24654 52803 30345 6671 42 10749 19385 -29309 -52073 -46336 -54373
858 -54373 -51031 8430 -17536 -20656 -14813 26954 33194 -7843 -659 17805 14579 9833 -7044
845 -7044 38060 5476 -20971 -41888 10908 -78056 -124708 -71141 -10834 15583 -31905 -45576
$$ packed form
933a172J5364j8722l1850j1544O419M3442L9739n425l9592q317Q6861M2266r6125
920B1344j4084J306n0096P8383o3666k4482j9872L7158n249L8848L1685k007q0339
907e1071M2166Q3176p8712m8970k5759N616J11037J5162m5370M896k6344Q604
895e569L568k8558L3101J6363j0029l7203O8070p155j01100J2053J5691K9592
883a1176m2775K4355L6539q245j0930l4116r7672M0189O6677P173k1931J4265
871c7647K6354j0533k828P7457k2458k3674o629J0707Q636m8694k2764N737q037
858e4373L342N9461k5966l120N843M1767O240m1037P184J8464l226m746j6877
845g044M5104l2584k6447k0917N2796q8964m6652N3567O0307K6417m7488j3671
$$ plain form
833 -45576 -33453 14382 -37763 -22106 -9774 -12762 -1813 4257 42288 13688 -41135 -68714
821 -68714 -46640 -14147 -30392 219 7734 10550 38545 -30572 -34430 -51200 -19486 21586 30085
808 30085 -15505 -40447 -10840 1231 1288 27065 17700 -19213 -9263 -5570 36398 -3601 -35542
795 -35542 -65492 30412 102335 41201 -47018 -38778 -11015 -20766 -66967 -18623 -10040 -65929 -18371
782 -18371 31049 -33755 -56152 -59525 -20910 -45045 -56204 8790 50243 45919 -10978 -29629
770 -29629 -52577 -94027 -46286 17212 75335 40400 19267 15099 -3065 -12457 -17784 -19064 -47733
757 -47733 61442 95369 45796 289 26904 30531 -10734 20305 44614 -3663 -21217 22748
745 22748 29033 -49922 -22031 -2462 -66812 -5326 -25638 1328 7761 -98163 -71650 -14718
$$ packed form
833d5576J2123M7835n2145J5657J2332k988J0949O070L8031k8600n4823k7579
821f8714K2074L2493j6245L0611P515K816K7995o9117l858j6770L1714M1072Q499
808C0085m5590k4942K9607J2071N7K5777r365l6913R950L693M1968l9999l1941
795c5542k9950R5904P1923o1134q8219Q240K7763r751m6201M8344Q583n5889M7558
782a8371M9420o4804k2397l373L8615k4135j1159O4994M1453m324n6897j8651
770b9629k2948m1450M7741O3498N8123l4935k1133m168j8164r392n327j280k8669
757d7733J09175L3927m9573m5507K6615L627m1265L1039K4309m8277j7554M3965
745B2748O285p8955K7891J9569o4350O1486k0312K6966O433j05924K6513N6932
$$ plain form
733 -14718 64122 44943 7474 7439 -2865 1187 -26921 -118529 -15714 -8863 9444 -1039 -12041
720 -12041 -37314 -42794 -24865 -83769 -55387 -23596 -60407 -55246 -6492 -29491 2974 -1686 -16385
707 -16385 -84542 -12418 -23665 -40365 4955 8318 -23027 -2306 -3048 14617 9331 62054 52049
694 52049 38712 -15587 -16294 16131 -18760 -16951 -49681 -14709 -18961 -31074 -34292 -54832 5451
681 5451 17662 -57231 -65270 -42077 -18285 -7455 32495 -47973 -122917 -54704 5499 -8620
669 -8620 -11222 28112 30994 59976 31925 16988 -7669 14554 30940 24166 12391 -98735 -77095
656 -77095 -43343 -37405 -63172 -18179 18384 -36413 -24599 6897 -40614 -12190 -35408 7370
644 7370 -29311 -60846 -59053 -23250 15341 6536 1594 -32547 -41848 17449 574 -12304 16954
$$ packed form
733a4718P8840j9179l7469l5j0304M052k8108r1608J02815O851J8307j0483j1002
720a2041k5273n480J7929n8904K8382L1791l6811N161M8754k2999L2465m660j4699
707a6385o8157P2124j1247j6700M5320L363l1345K0721p42J7665n286N2723j0005
694E2049j3337n4299p07L2425l4891J809l2730L4972m252j2113l218k0540O0283
681E451J2211p4893q039K3193K3792J0830L9950q0468p4944O8213O0203j4119
669h620k602L9334K882K8982k8051j4937k4657K2223J6386o774j1775j11126K1640
656g7095L3752N938k5767M4993L6563n4797J1814L1496m7511K8424k3218M2778
644G370l6681l1535J793L5803L8591q805m942l4141r301N9297j6875j2878K9258
$$ plain form
631 16954 64821 43695 31123 58512 40939 42507 15774 17841 15330 15189 18874 32242 -14143
618 -14143 -24714 -34770 -24592 -41679 -34393 39773 76598 66634 48581 2238 -14072 -20829 -26739
605 -26739 -24441 -62029 -69793 13675 23878 -20154 -30028 16508 18429 41380 3933 -46709 -73277
592 -73277 -107196 -37119 9840 14484 -27177 6661 73018 19269 14882 78671 83558 95812 6834
579 6834 65013 46597 27155 4016 40759 29179 13325 45990 19279 -6492 -12023 22696
567 22696 -28335 -4320 -38147 -9911 16572 -40353 -4632 -19179 13234 -9247 -20898 5801
555 5801 -62001 -55966 -45549 -28194 -69225 -40640 -38682 -32676 -1002 -3843 -47520 -72225 -5976
542 -5976 -63961 -113180 -62895 -13050 516 -40602 -43264 -16175 -18722 -47997 21451 39812 20493
$$ packed form
631A6954M7867k1126j2572K7389j7573J568k6733K067k511j41L685J3368m6385
618a4143j0571j0056J0178j7087P286P4166L6825r964j8053m6343j6310o757n910
605b6739K298l7588p764Q3468J0203m4032r874M6536J921K2951l7447n0642k6568
592g3277l3919P0077M6959M644m1661L3838O6357n3749m387O3789M887J2254q8978
579F834N8179j8416j9442k3139L6743j1580j5854L2665k6711k5771n531L4719
567B2696n1031K4015l3827K8236K6483n6925L5721j4547L2413k2481j1651K6699
555E801o7802O035J0417J7355m1031K8585J958O006L1674k841m3677k4705O6249
542e976n7985m9219N0285M9845J3566m1118k662K7089k547k9275O9448J8361j9319
$$ plain form
529 20493 -34030 -68088 -57598 -51143 -55077 -27085 6317 23496 -31440 17929 34686 54752
517 54752 34338 25240 44290 29478 51980 87717 -3339 -64293 -17409 5925 -837 -22699
505 -22699 3904 28052 -49035 -34731 21522 53874 68440 83965 19810 -19408 -40923 -42805
493 -42805 -12066 10107 13273 48349 91062 37518 68993 62502 64935 53490 64806 61351 14975
480 14975 1605 40511 -6886 9484 308 -2676 2855 -9609 13764 33509 -65327 -34423 -10815
467 -10815 1973 -45650 -23084 35123 66456 50055 -10587 -16395 28909 41588 -20656 -3135
455 -3135 22230 785 8754 21146 7509 35293 6663 4434 -26945 -23123 32496 20510 46485
442 46485 -13454 -10192 -22329 10881 -27772 -40570 61221 32198 -32245 -37077 -36741 -11613 1583
$$ packed form
529B0493n4523l4058J0490O455l934K7992L3402J7179n4936M9369J6757K0066
517E4752k0414r098J9050j4812K2502L5737r1056o0954M6884K3334o762k1862
505b2699K6603K4148p7087J4304N6253L2352J4566J5525o4155l9218k1515j882
493d2805L0739K2173L166L5076M2713n3544L1475o491K433j1445J1316l455m6376
480A4975j3370L8906m7397J6370r176k984N531j2464K3373J9745r8836L0904K3608
467a0815J2788m7623K2566N8207L1333j6401o0642n808M5304J2679o2244J7521
455c135K5365k1445P969J2392j3637K7784k8630k229l1379L822N5619j1986K5975
442D6485n9939L262j2137L3210l8653j2798J01791k9023o4443m832L36K5128J3196
$$ plain form
429 1583 -57654 -62400 -24838 4351 31362 70370 3623 -15875 -57567 34892 41680 -40950 -3751
416 -3751 53876 84262 24925 -82570 -103230 -45400 -39671 -40463 -74580 -81093 -51875 18829 -18903
403 -18903 -34293 43744 -50904 -37853 -18370 -41734 -49381 -7400 -16563 -6008 -6883 -69457 -80575
390 -80575 -28508 12323 -40860 -71728 -38712 -67659 -76079 -1352 55124 47148 1538 -43878
378 -43878 -42632 -169 -27705 -87954 -72444 -35909 -44577 -33926 -30651 -40086 -118727 -66222 -48096
365 -48096 -64505 -32878 -46648 -15208 -24055 -29310 -26164 41529 61131 -11356 -53213 -81666 -69347
352 -69347 -99199 -88870 11117 47947 58121 17771 -10338 4479 3741 14275 -551 8307 33738
339 33738 -2156 -56694 -108132 -116505 -42837 -24866 -54856 -52005 -52610 -711 20225 -10678 18386
$$ packed form
429A583n9237m746L7562K9189K7011L9008o6747j9498m1692R2459O788q2630L7199
416c751N7627L0386n9337j07495k0660N7830N729p92l4117o513K9218P0704l7732
403a8903j5390P8037r4648J3051J9483k3364p647M1981r163J0555q75o2574j1118
390h0575N2067M0831n3183l0868L3016k8947q420P4727N6476p976m5610m5416
378d3878J246M2463k7536o0249J5510L6535q668J0651L275r435p8641N2505J8126
365d8096j6409L1627j3770L1440q847n255L146O7693J9602p2487m1857k8453J2319
352f9347k9852J0329R9987L6830J0174m0350k8109J4817p38J0534j4826Q858K5431
339C3738l5894n4538n1438q373P3668J7971k9990K851o05N1899K0936l0903K9064
$$ plain form
326 18386 6745 -4353 -42735 -62246 -69727 -30027 -29317 -65063 -56718 -38082 -16511 28755 14567
313 14567 -52574 -54076 -47636 -55714 -87084 -67929 -77784 -15858 46909 12239 12414 -15375 7107
300 7107 -9299 -23028 -25985 3291 -10867 -68326 -9735 -10327 -55700 -47623 -32101 19275 22763
287 22763 9931 -37767 -88973 -11458 12657 -50353 -81005 394 -51817 -105783 -49058 -35661
275 -35661 -70017 -118731 -49643 -50542 -46140 -50762 -18641 -37444 -72997 -8184 8908 -18766 -13748
262 -13748 4523 -38419 -59640 -71288 -39658 -32945 -57826 -77597 -51773 -68959 -4983 15877
250 15877 26577 -10533 12691 38380 -16371 -49460 -51327 -62074 -75100 -47508 -28604 6383
238 6383 -13706 -31448 -23189 -6174 35110 -21454 -89292 -44358 -4148 -9443 -17977 -39492 -470
$$ packed form
326A8386j1641j1098l8382j9511p481L9700P10l5746Q345J8636K1571M5266j4188
313A4567o7141j502O440q078l1370J9155r855O1926O2767l4670J75k7789K2482
300G107j6406j3729k957K9276j4158n7459N8591n92m5373Q077J5522N1376L488
287B2763j2832m7698n1206P7515K4115o3010l0652Q1399n2211n3966N6725J3397
275c5661l4356m8714O9088q99M402m622L2121j8803l5553O4813J7092k7674N018
262a3748J8271m2942k1221j1648L1630O713k4881j9771K5824j7186O3976K0860
250A5877J0700l7110K3224K5689n4751l3089j867j0747j3026K7592J8904L4987
238F383k0089j7742Q259J7015M1284n6564o7838M4934M0210n295q534k1515L9022
$$ plain form
225 -470 372 22423 -41485 -78585 -75702 -76736 -63730 -47806 -32934 4728 6264 -83479 -116913
212 -116913 -44988 -23986 -15773 32833 26006 -59542 15010 66817 -476 -1493 -22133 -41167
200 -41167 -81819 -43317 -36273 23973 -19559 -3930 -45537 -31440 -61700 -55092 34648 43324 68562
187 68562 58752 75239 45232 -21650 36380 20833 -20827 -22963 -6709 -130 -16932 -22688 -27910
174 -27910 -36708 -6551 -2089 -22892 -55825 41549 14482 -71132 7461 -46300 -42182 -37516 -32316
161 -32316 -53040 -50831 -26896 -33672 -25441 -71813 -48591 -34976 -16613 19019 8730 -17315 -35897
148 -35897 -34683 -9377 20377 59908 55967 348 -20647 -33818 -71919 -42210 -42623 -60354 -20817
135 -20817 -5809 -19524 -26782 -62867 -71101 -32816 -56703 -80030 -22181 7543 -34088 27984
$$ packed form
225d70Q42K2051o3908l7100K883j034J3006J5924J4872L7662J536q9743l3434
212a16913P1925K1002Q213M8606o827q5548P4552N1807o7293j017k0640j9034
200d1167m0652L8502P044O0246m3532J5629m1607J4097l0260O608Q9740Q676K5238
187F8562r810J6487l0007o6882N8030j5547m1660k136J6254O579j6802n756n222
174b7910q798L0157M462k0803l2933R7374k7067q5614P8593n3761M118M666N200
161c2316k0724K209K3935o776Q231m6372K3222J3615J8363L5632j0289k6045j8582
148c5897J214K5306K9754L9531l941n5619k0995j3171l8101K9709m13j7731L9537
135b0817J5008j3715p258l6085q234L8285k3887k3327N7849K9724m1631O2072
$$ plain form
123 27984 -6930 -10751 19139 20948 -9294 -43247 -94598 -54660 -34294 -50293 -56321 -69293 -62832
110 -62832 -94616 -67695 -29370 25774 26687 -47051 6872 9355 -14245 -20415 5848 -34858 -75312
97 -75312 -70600 -53735 -9683 -1233 55047 17077 20789 23239 -30127 -78405 -83793 -90988 -40099
84 -40099 -56991 -55179 -12497 -21028 -53118 -44021 -6199 44057 45316 15779 -9015 -29391 -5894
71 -5894 -16086 -24387 60789 21279 11490 -27516 -43112 -69527 -37034 -24522 -54295 -6321 -7461
58 -7461 -23519 1080 60833 -26470 -33921 -56172 -70730 -21183 -13490 -56770 -54031 -58430 -12900
45 -12900 -3913 29758 15210 -36403 -1274 8941 23188 17400 36909 41129 -45789 16031 -3632
32 -3632 -33073 72 10669 7272 19776 37494 14765 -47280 -17214 -32525 -75541 -66385 -25326
$$ packed form
123B7984l4914l821K9890J809l0242l3953n1351L9938K0366j5999o028j2972O461
110f2832l1784K6921L8325N5144R13p3738N3923K483k3600o170K6263m0706m0454
97g5312M712J6865M4052Q450N6280l7970L712K450n3366m8278n388p195N0889
84d0099j6892J812M2682q531l2090R097L7822N0256J259k9537k4794k0376K3497
71e894j0192q301Q5176l9510r789l9006j5596k6415L2493J2512k9773M7974j140
58g461j6058K4599N9753q7303p451k2251j4558M9547P693m3280K739m399M5530
45a2900Q987L3671j4548n1613L5129J0215J4247n788J9509M220q6918O1820j9663
32c632k9441L3145J0597l397J2504J7718k2729o2045L0066j5311m3016R156M1059
$$ plain form
19 -25326 6724 10084 -40713 -28379 -43572 -31236 -43441 -35919 -43827 -44710 -15638 4565 -13577
6 -13577 -32334 11995 -7401 -24020 -37662 -3679
0 -3679
$$ packed form
19b5326L2050L360n0797J2334j5193J2336j2205P522p908q83K9072K0203j8142
6a3577j8757M4329j9396j6619j3642L3983
0c679
$$ Imaginary data points
##PAGE= N=2
##DATA TABLE= (X++(I..I)), XYDATA
$$ plain form
16383 -877931 -924587 -892470 -874408 -847615 -811301 -830574 -833139 -813084 -794575 -782487 -733107 -761331
16371 -761331 -720560 -725333 -728444 -703189 -682352 -654135 -680997 -699525 -680536 -639756 -618512 -617861
16359 -617861 -631847 -609106 -598324 -562657 -578672 -577765 -551282 -522900 -533180 -577720 -556974 -498591
16347 -498591 -487342 -496303 -437407 -456203 -462704 -422820 -417413 -406282 -397160 -382689 -363193 -314501
16335 -314501 -286683 -320613 -326495 -326406 -348280 -340237 -343752 -292725 -240979 -209953 -202897 -210214 -177196
16322 -177196 -181244 -201314 -162987 -159080 -164229 -135416 -149516 -122244 -127253 -143069 -94865 -73075
16310 -73075 -114407 -83547 -77266 -2697 -19581 3024 14230 68659 80076 64760 65631 89447
16298 89447 89934 44228 74954 94762 90472 85819 152045 163657 156576 160047 172956 156096 160909
$$ packed form
16383h77931m6656L2117J8062K6793L6314j9273k565K0055J8509J2088M9380k8224
16371g61331M0771m773l111K5255K0837K8217k6862j8528J8989M0780K1244O51
16359f17861j3986K2741J0782L5667j6015R07K6483K8382j0280m4540K0746N8383
16347d98591J1249q961N8896j8796o501L9884N407J1131R122J4471J9496M8692
16335c14501K7818l3930n882Q9k1874Q043l515N1027N1746L1026P056p317L3018
16322a77196m048k0070L8327L907n149K8813j4100K7272n009j5816M8204K1790
16310g3075m1332L0860O281P4569j6884K2605J1206N4429J1417j5316Q71K3816
16298H9447M87m5706L0726J9808m290m653O6226J1612p081L471J2909j6860M813
$$ plain form
16285 160909 164413 186460 204246 212613 234242 279247 248635 281103 291532 303389 292887 292204
16273 292204 332906 346272 372235 378682 372703 332552 345364 348563 347260 383806 407487 375882
16261 375882 376725 364702 383308 368898 382816 411080 436935 454224 520800 494444 413312 418915
16249 418915 463236 524721 500609 493135 515017 521706 536000 479767 424093 466720 505510 502472
16237 502472 585100 586779 553635 595179 620226 597732 594586 605555 633573 618766 590468 570322
16225 570322 542617 543652 561476 582968 644879 650580 615871 654505 637873 620386 667246 712441
16213 712441 682003 682291 692333 631770 622828 702034 722761 739823 723004 751549 781603 807468
16201 807468 833290 799565 706249 752610 803531 774261 803374 736881 738373 758845 727259 721549
$$ packed form
16285A60909L504K2047J7786Q367K1629M5005l0612L2468J0429J1857j0502o83
16273B92204M0702J3366K5963O447n979m0151J2812L199j303L6546K3681l1605
16261C75882Q43j2023J8606j4410J3918K8264K5855J7289O6576k6356q1132N603
16249D18915M4321O1485k4112p474K1882O689J4294n6233n5674M2627L8790l038
16237E02472Q2628J679l3144M1544K5047k2494l146J0969K8018j4807k8298k0146
16225E70322k7705J035J7824K1492O1911N701l4709L8634j6632j7487M6860M5195
16213G12441l0438K88J0042o0563q942P9206K0727J7062j6819K8545L0054K5865
16201H07468K5822l3725r3316M6361N0921k9270K9113o6493J492K0472l1586n710
$$ plain form
16189 721549 769075 770161 749177 774056 760384 764944 790865 799158 819638 830453 774504 808631
16177 808631 830383 839919 839328 827987 849269 819061 797243 893920 850632 810784 847916 904539
16165 904539 915156 832641 851700 920492 941610 890598 903851 897126 899576 958011 937913 946742
16153 946742 926210 892589 882453 864797 858573 843493 900162 901224 974429 1016495 917567 876590
16141 876590 876675 858888 926192 1007335 988658 934287 931699 951988 966396 941723 913732 885879
16129 885879 874696 891393 944118 927848 946087 969173 1010829 990078 972331 980716 907903 957863
16117 957863 965931 1031278 1043646 1009611 968206 934882 904991 948354 972352 935663 940670 971585
16105 971585 1025281 1019960 990850 968180 933585 990762 1049947 1020464 945967 1000938 1052564 1029275
$$ packed form
16189G21549M7526J086k0984K4879j3672M560K5921Q293K0480J0815n5949L4127
16177H08631K1752R536n91j1341K1282l0208k1818R6677m3288l9848L7132N6623
16165I04539J0617q2515J9059O8792K1118n1012J3253o725K450N8435k0098Q829
16153I46742k0532l3621j0136j7656o224j5080N6669J062P3205M2066r8928m0977
16141H76590Q5j7787O7304Q1143j8677n4371k588K0289J4408k4673k7991k7853
16129H85879j1183J6697N2725j6270J8239K3086M1656k0751j7747Q385p2813M9960
16117I57863Q068O5347J2368l4035m1405l3324k9891M3363K3998l6689N007L0915
16105I71585N3696n321k9110k2670l4595N7177N9185k9483p4497N4971N1626k3289
$$ plain form
16093 1029275 976766 966853 973962 1052953 992066 984105 998052 1002712 979440 943193 974617 997421
16081 997421 995684 995389 1026106 1013414 1056694 1081464 1083673 1005787 970487 992950 1037532 996348
16069 996348 995504 1013360 1054613 1037203 1010627 1014326 1006545 948204 1006143 1013977 978559 971279 945010
16056 945010 970776 946049 968417 994730 1017875 1002554 1004736 996017 1005883 1054294 1007839 1024995
$$ packed form
16093A029275n2509r913P109P8991o0887p961J3947M660k3272l6247L1424K2804
16081I97421j737k95L0717j2692M3280K4770K209p7886l5300K2463M4582m1184
16069I96348q44J7856M1253j7410k6576L699p781n8341N7939P834l5418p280k6269
16056I45010K5766k4727K2368K6313K3145j5321K182q719R866M8411m6455J7156
$$ [...]
##END NTUPLES=NMR SPECTRUM
##END=
